lucene-dev mailing list archives

Site index · List index
Message view « Date » · « Thread »
Top « Date » · « Thread »
From Policeman Jenkins Server <jenk...@thetaphi.de>
Subject [JENKINS] Lucene-Solr-master-Windows (32bit/jdk1.8.0_144) - Build # 7185 - Still Unstable!
Date Wed, 21 Feb 2018 22:41:21 GMT
Build: https://jenkins.thetaphi.de/job/Lucene-Solr-master-Windows/7185/
Java: 32bit/jdk1.8.0_144 -server -XX:+UseParallelGC

8 tests failed.
FAILED:  junit.framework.TestSuite.org.apache.lucene.index.TestBackwardsCompatibility

Error Message:
Could not remove the following files (in the order of attempts):    C:\Users\jenkins\workspace\Lucene-Solr-master-Windows\lucene\build\backward-codecs\test\J1\temp\lucene.index.TestBackwardsCompatibility_8CA250ACC9E4E7EA-001\2.9.4-cfs-001: java.nio.file.DirectoryNotEmptyException: C:\Users\jenkins\workspace\Lucene-Solr-master-Windows\lucene\build\backward-codecs\test\J1\temp\lucene.index.TestBackwardsCompatibility_8CA250ACC9E4E7EA-001\2.9.4-cfs-001 

Stack Trace:
java.io.IOException: Could not remove the following files (in the order of attempts):
   C:\Users\jenkins\workspace\Lucene-Solr-master-Windows\lucene\build\backward-codecs\test\J1\temp\lucene.index.TestBackwardsCompatibility_8CA250ACC9E4E7EA-001\2.9.4-cfs-001: java.nio.file.DirectoryNotEmptyException: C:\Users\jenkins\workspace\Lucene-Solr-master-Windows\lucene\build\backward-codecs\test\J1\temp\lucene.index.TestBackwardsCompatibility_8CA250ACC9E4E7EA-001\2.9.4-cfs-001

	at __randomizedtesting.SeedInfo.seed([8CA250ACC9E4E7EA]:0)
	at org.apache.lucene.util.IOUtils.rm(IOUtils.java:329)
	at org.apache.lucene.util.TestRuleTemporaryFilesCleanup.afterAlways(TestRuleTemporaryFilesCleanup.java:216)
	at com.carrotsearch.randomizedtesting.rules.TestRuleAdapter$1.afterAlways(TestRuleAdapter.java:31)
	at com.carrotsearch.randomizedtesting.rules.StatementAdapter.evaluate(StatementAdapter.java:43)
	at com.carrotsearch.randomizedtesting.rules.StatementAdapter.evaluate(StatementAdapter.java:36)
	at org.apache.lucene.util.TestRuleAssertionsRequired$1.evaluate(TestRuleAssertionsRequired.java:53)
	at org.apache.lucene.util.TestRuleMarkFailure$1.evaluate(TestRuleMarkFailure.java:47)
	at org.apache.lucene.util.TestRuleIgnoreAfterMaxFailures$1.evaluate(TestRuleIgnoreAfterMaxFailures.java:64)
	at org.apache.lucene.util.TestRuleIgnoreTestSuites$1.evaluate(TestRuleIgnoreTestSuites.java:54)
	at com.carrotsearch.randomizedtesting.rules.StatementAdapter.evaluate(StatementAdapter.java:36)
	at com.carrotsearch.randomizedtesting.ThreadLeakControl$StatementRunner.run(ThreadLeakControl.java:368)
	at java.lang.Thread.run(Thread.java:748)


FAILED:  junit.framework.TestSuite.org.apache.lucene.codecs.blockterms.TestVarGapFixedIntervalPostingsFormat

Error Message:
Could not remove the following files (in the order of attempts):    C:\Users\jenkins\workspace\Lucene-Solr-master-Windows\lucene\build\codecs\test\J1\temp\lucene.codecs.blockterms.TestVarGapFixedIntervalPostingsFormat_BD8CC6CCD6388876-001\testPostingsEnumReuse-001: java.nio.file.AccessDeniedException: C:\Users\jenkins\workspace\Lucene-Solr-master-Windows\lucene\build\codecs\test\J1\temp\lucene.codecs.blockterms.TestVarGapFixedIntervalPostingsFormat_BD8CC6CCD6388876-001\testPostingsEnumReuse-001    C:\Users\jenkins\workspace\Lucene-Solr-master-Windows\lucene\build\codecs\test\J1\temp\lucene.codecs.blockterms.TestVarGapFixedIntervalPostingsFormat_BD8CC6CCD6388876-001: java.nio.file.DirectoryNotEmptyException: C:\Users\jenkins\workspace\Lucene-Solr-master-Windows\lucene\build\codecs\test\J1\temp\lucene.codecs.blockterms.TestVarGapFixedIntervalPostingsFormat_BD8CC6CCD6388876-001 

Stack Trace:
java.io.IOException: Could not remove the following files (in the order of attempts):
   C:\Users\jenkins\workspace\Lucene-Solr-master-Windows\lucene\build\codecs\test\J1\temp\lucene.codecs.blockterms.TestVarGapFixedIntervalPostingsFormat_BD8CC6CCD6388876-001\testPostingsEnumReuse-001: java.nio.file.AccessDeniedException: C:\Users\jenkins\workspace\Lucene-Solr-master-Windows\lucene\build\codecs\test\J1\temp\lucene.codecs.blockterms.TestVarGapFixedIntervalPostingsFormat_BD8CC6CCD6388876-001\testPostingsEnumReuse-001
   C:\Users\jenkins\workspace\Lucene-Solr-master-Windows\lucene\build\codecs\test\J1\temp\lucene.codecs.blockterms.TestVarGapFixedIntervalPostingsFormat_BD8CC6CCD6388876-001: java.nio.file.DirectoryNotEmptyException: C:\Users\jenkins\workspace\Lucene-Solr-master-Windows\lucene\build\codecs\test\J1\temp\lucene.codecs.blockterms.TestVarGapFixedIntervalPostingsFormat_BD8CC6CCD6388876-001

	at __randomizedtesting.SeedInfo.seed([BD8CC6CCD6388876]:0)
	at org.apache.lucene.util.IOUtils.rm(IOUtils.java:329)
	at org.apache.lucene.util.TestRuleTemporaryFilesCleanup.afterAlways(TestRuleTemporaryFilesCleanup.java:216)
	at com.carrotsearch.randomizedtesting.rules.TestRuleAdapter$1.afterAlways(TestRuleAdapter.java:31)
	at com.carrotsearch.randomizedtesting.rules.StatementAdapter.evaluate(StatementAdapter.java:43)
	at com.carrotsearch.randomizedtesting.rules.StatementAdapter.evaluate(StatementAdapter.java:36)
	at org.apache.lucene.util.TestRuleAssertionsRequired$1.evaluate(TestRuleAssertionsRequired.java:53)
	at org.apache.lucene.util.TestRuleMarkFailure$1.evaluate(TestRuleMarkFailure.java:47)
	at org.apache.lucene.util.TestRuleIgnoreAfterMaxFailures$1.evaluate(TestRuleIgnoreAfterMaxFailures.java:64)
	at org.apache.lucene.util.TestRuleIgnoreTestSuites$1.evaluate(TestRuleIgnoreTestSuites.java:54)
	at com.carrotsearch.randomizedtesting.rules.StatementAdapter.evaluate(StatementAdapter.java:36)
	at com.carrotsearch.randomizedtesting.ThreadLeakControl$StatementRunner.run(ThreadLeakControl.java:368)
	at java.lang.Thread.run(Thread.java:748)


FAILED:  junit.framework.TestSuite.org.apache.lucene.codecs.simpletext.TestSimpleTextStoredFieldsFormat

Error Message:
Could not remove the following files (in the order of attempts):    C:\Users\jenkins\workspace\Lucene-Solr-master-Windows\lucene\build\codecs\test\J0\temp\lucene.codecs.simpletext.TestSimpleTextStoredFieldsFormat_BD8CC6CCD6388876-001\index-SimpleFSDirectory-001: java.nio.file.AccessDeniedException: C:\Users\jenkins\workspace\Lucene-Solr-master-Windows\lucene\build\codecs\test\J0\temp\lucene.codecs.simpletext.TestSimpleTextStoredFieldsFormat_BD8CC6CCD6388876-001\index-SimpleFSDirectory-001    C:\Users\jenkins\workspace\Lucene-Solr-master-Windows\lucene\build\codecs\test\J0\temp\lucene.codecs.simpletext.TestSimpleTextStoredFieldsFormat_BD8CC6CCD6388876-001: java.nio.file.DirectoryNotEmptyException: C:\Users\jenkins\workspace\Lucene-Solr-master-Windows\lucene\build\codecs\test\J0\temp\lucene.codecs.simpletext.TestSimpleTextStoredFieldsFormat_BD8CC6CCD6388876-001 

Stack Trace:
java.io.IOException: Could not remove the following files (in the order of attempts):
   C:\Users\jenkins\workspace\Lucene-Solr-master-Windows\lucene\build\codecs\test\J0\temp\lucene.codecs.simpletext.TestSimpleTextStoredFieldsFormat_BD8CC6CCD6388876-001\index-SimpleFSDirectory-001: java.nio.file.AccessDeniedException: C:\Users\jenkins\workspace\Lucene-Solr-master-Windows\lucene\build\codecs\test\J0\temp\lucene.codecs.simpletext.TestSimpleTextStoredFieldsFormat_BD8CC6CCD6388876-001\index-SimpleFSDirectory-001
   C:\Users\jenkins\workspace\Lucene-Solr-master-Windows\lucene\build\codecs\test\J0\temp\lucene.codecs.simpletext.TestSimpleTextStoredFieldsFormat_BD8CC6CCD6388876-001: java.nio.file.DirectoryNotEmptyException: C:\Users\jenkins\workspace\Lucene-Solr-master-Windows\lucene\build\codecs\test\J0\temp\lucene.codecs.simpletext.TestSimpleTextStoredFieldsFormat_BD8CC6CCD6388876-001

	at __randomizedtesting.SeedInfo.seed([BD8CC6CCD6388876]:0)
	at org.apache.lucene.util.IOUtils.rm(IOUtils.java:329)
	at org.apache.lucene.util.TestRuleTemporaryFilesCleanup.afterAlways(TestRuleTemporaryFilesCleanup.java:216)
	at com.carrotsearch.randomizedtesting.rules.TestRuleAdapter$1.afterAlways(TestRuleAdapter.java:31)
	at com.carrotsearch.randomizedtesting.rules.StatementAdapter.evaluate(StatementAdapter.java:43)
	at com.carrotsearch.randomizedtesting.rules.StatementAdapter.evaluate(StatementAdapter.java:36)
	at org.apache.lucene.util.TestRuleAssertionsRequired$1.evaluate(TestRuleAssertionsRequired.java:53)
	at org.apache.lucene.util.TestRuleMarkFailure$1.evaluate(TestRuleMarkFailure.java:47)
	at org.apache.lucene.util.TestRuleIgnoreAfterMaxFailures$1.evaluate(TestRuleIgnoreAfterMaxFailures.java:64)
	at org.apache.lucene.util.TestRuleIgnoreTestSuites$1.evaluate(TestRuleIgnoreTestSuites.java:54)
	at com.carrotsearch.randomizedtesting.rules.StatementAdapter.evaluate(StatementAdapter.java:36)
	at com.carrotsearch.randomizedtesting.ThreadLeakControl$StatementRunner.run(ThreadLeakControl.java:368)
	at java.lang.Thread.run(Thread.java:748)


FAILED:  junit.framework.TestSuite.org.apache.lucene.store.TestRAFDirectory

Error Message:
Could not remove the following files (in the order of attempts):    C:\Users\jenkins\workspace\Lucene-Solr-master-Windows\lucene\build\misc\test\J0\temp\lucene.store.TestRAFDirectory_F00FE6292F19E3DB-001\testByte-001: java.nio.file.DirectoryNotEmptyException: C:\Users\jenkins\workspace\Lucene-Solr-master-Windows\lucene\build\misc\test\J0\temp\lucene.store.TestRAFDirectory_F00FE6292F19E3DB-001\testByte-001 

Stack Trace:
java.io.IOException: Could not remove the following files (in the order of attempts):
   C:\Users\jenkins\workspace\Lucene-Solr-master-Windows\lucene\build\misc\test\J0\temp\lucene.store.TestRAFDirectory_F00FE6292F19E3DB-001\testByte-001: java.nio.file.DirectoryNotEmptyException: C:\Users\jenkins\workspace\Lucene-Solr-master-Windows\lucene\build\misc\test\J0\temp\lucene.store.TestRAFDirectory_F00FE6292F19E3DB-001\testByte-001

	at __randomizedtesting.SeedInfo.seed([F00FE6292F19E3DB]:0)
	at org.apache.lucene.util.IOUtils.rm(IOUtils.java:329)
	at org.apache.lucene.util.TestRuleTemporaryFilesCleanup.afterAlways(TestRuleTemporaryFilesCleanup.java:216)
	at com.carrotsearch.randomizedtesting.rules.TestRuleAdapter$1.afterAlways(TestRuleAdapter.java:31)
	at com.carrotsearch.randomizedtesting.rules.StatementAdapter.evaluate(StatementAdapter.java:43)
	at com.carrotsearch.randomizedtesting.rules.StatementAdapter.evaluate(StatementAdapter.java:36)
	at org.apache.lucene.util.TestRuleAssertionsRequired$1.evaluate(TestRuleAssertionsRequired.java:53)
	at org.apache.lucene.util.TestRuleMarkFailure$1.evaluate(TestRuleMarkFailure.java:47)
	at org.apache.lucene.util.TestRuleIgnoreAfterMaxFailures$1.evaluate(TestRuleIgnoreAfterMaxFailures.java:64)
	at org.apache.lucene.util.TestRuleIgnoreTestSuites$1.evaluate(TestRuleIgnoreTestSuites.java:54)
	at com.carrotsearch.randomizedtesting.rules.StatementAdapter.evaluate(StatementAdapter.java:36)
	at com.carrotsearch.randomizedtesting.ThreadLeakControl$StatementRunner.run(ThreadLeakControl.java:368)
	at java.lang.Thread.run(Thread.java:748)


FAILED:  junit.framework.TestSuite.org.apache.solr.cloud.DistribCursorPagingTest

Error Message:
Could not remove the following files (in the order of attempts):    C:\Users\jenkins\workspace\Lucene-Solr-master-Windows\solr\build\solr-core\test\J0\temp\solr.cloud.DistribCursorPagingTest_853BBA7F98D3D950-001\control-001\configsets\_default\conf: java.nio.file.DirectoryNotEmptyException: C:\Users\jenkins\workspace\Lucene-Solr-master-Windows\solr\build\solr-core\test\J0\temp\solr.cloud.DistribCursorPagingTest_853BBA7F98D3D950-001\control-001\configsets\_default\conf    C:\Users\jenkins\workspace\Lucene-Solr-master-Windows\solr\build\solr-core\test\J0\temp\solr.cloud.DistribCursorPagingTest_853BBA7F98D3D950-001\control-001\configsets\_default: java.nio.file.DirectoryNotEmptyException: C:\Users\jenkins\workspace\Lucene-Solr-master-Windows\solr\build\solr-core\test\J0\temp\solr.cloud.DistribCursorPagingTest_853BBA7F98D3D950-001\control-001\configsets\_default    C:\Users\jenkins\workspace\Lucene-Solr-master-Windows\solr\build\solr-core\test\J0\temp\solr.cloud.DistribCursorPagingTest_853BBA7F98D3D950-001\control-001\configsets: java.nio.file.DirectoryNotEmptyException: C:\Users\jenkins\workspace\Lucene-Solr-master-Windows\solr\build\solr-core\test\J0\temp\solr.cloud.DistribCursorPagingTest_853BBA7F98D3D950-001\control-001\configsets    C:\Users\jenkins\workspace\Lucene-Solr-master-Windows\solr\build\solr-core\test\J0\temp\solr.cloud.DistribCursorPagingTest_853BBA7F98D3D950-001\control-001: java.nio.file.DirectoryNotEmptyException: C:\Users\jenkins\workspace\Lucene-Solr-master-Windows\solr\build\solr-core\test\J0\temp\solr.cloud.DistribCursorPagingTest_853BBA7F98D3D950-001\control-001 

Stack Trace:
java.io.IOException: Could not remove the following files (in the order of attempts):
   C:\Users\jenkins\workspace\Lucene-Solr-master-Windows\solr\build\solr-core\test\J0\temp\solr.cloud.DistribCursorPagingTest_853BBA7F98D3D950-001\control-001\configsets\_default\conf: java.nio.file.DirectoryNotEmptyException: C:\Users\jenkins\workspace\Lucene-Solr-master-Windows\solr\build\solr-core\test\J0\temp\solr.cloud.DistribCursorPagingTest_853BBA7F98D3D950-001\control-001\configsets\_default\conf
   C:\Users\jenkins\workspace\Lucene-Solr-master-Windows\solr\build\solr-core\test\J0\temp\solr.cloud.DistribCursorPagingTest_853BBA7F98D3D950-001\control-001\configsets\_default: java.nio.file.DirectoryNotEmptyException: C:\Users\jenkins\workspace\Lucene-Solr-master-Windows\solr\build\solr-core\test\J0\temp\solr.cloud.DistribCursorPagingTest_853BBA7F98D3D950-001\control-001\configsets\_default
   C:\Users\jenkins\workspace\Lucene-Solr-master-Windows\solr\build\solr-core\test\J0\temp\solr.cloud.DistribCursorPagingTest_853BBA7F98D3D950-001\control-001\configsets: java.nio.file.DirectoryNotEmptyException: C:\Users\jenkins\workspace\Lucene-Solr-master-Windows\solr\build\solr-core\test\J0\temp\solr.cloud.DistribCursorPagingTest_853BBA7F98D3D950-001\control-001\configsets
   C:\Users\jenkins\workspace\Lucene-Solr-master-Windows\solr\build\solr-core\test\J0\temp\solr.cloud.DistribCursorPagingTest_853BBA7F98D3D950-001\control-001: java.nio.file.DirectoryNotEmptyException: C:\Users\jenkins\workspace\Lucene-Solr-master-Windows\solr\build\solr-core\test\J0\temp\solr.cloud.DistribCursorPagingTest_853BBA7F98D3D950-001\control-001

	at __randomizedtesting.SeedInfo.seed([853BBA7F98D3D950]:0)
	at org.apache.lucene.util.IOUtils.rm(IOUtils.java:329)
	at org.apache.lucene.util.TestRuleTemporaryFilesCleanup.afterAlways(TestRuleTemporaryFilesCleanup.java:216)
	at com.carrotsearch.randomizedtesting.rules.TestRuleAdapter$1.afterAlways(TestRuleAdapter.java:31)
	at com.carrotsearch.randomizedtesting.rules.StatementAdapter.evaluate(StatementAdapter.java:43)
	at com.carrotsearch.randomizedtesting.rules.StatementAdapter.evaluate(StatementAdapter.java:36)
	at org.apache.lucene.util.TestRuleAssertionsRequired$1.evaluate(TestRuleAssertionsRequired.java:53)
	at org.apache.lucene.util.TestRuleMarkFailure$1.evaluate(TestRuleMarkFailure.java:47)
	at org.apache.lucene.util.TestRuleIgnoreAfterMaxFailures$1.evaluate(TestRuleIgnoreAfterMaxFailures.java:64)
	at org.apache.lucene.util.TestRuleIgnoreTestSuites$1.evaluate(TestRuleIgnoreTestSuites.java:54)
	at com.carrotsearch.randomizedtesting.rules.StatementAdapter.evaluate(StatementAdapter.java:36)
	at com.carrotsearch.randomizedtesting.ThreadLeakControl$StatementRunner.run(ThreadLeakControl.java:368)
	at java.lang.Thread.run(Thread.java:748)


FAILED:  org.apache.solr.handler.TestSQLHandler.doTest

Error Message:


Stack Trace:
java.lang.AssertionError
	at __randomizedtesting.SeedInfo.seed([853BBA7F98D3D950:227F02DBF568CAE9]:0)
	at org.apache.solr.handler.TestSQLHandler.testBasicSelect(TestSQLHandler.java:181)
	at org.apache.solr.handler.TestSQLHandler.doTest(TestSQLHandler.java:82)
	at sun.reflect.NativeMethodAccessorImpl.invoke0(Native Method)
	at sun.reflect.NativeMethodAccessorImpl.invoke(NativeMethodAccessorImpl.java:62)
	at sun.reflect.DelegatingMethodAccessorImpl.invoke(DelegatingMethodAccessorImpl.java:43)
	at java.lang.reflect.Method.invoke(Method.java:498)
	at com.carrotsearch.randomizedtesting.RandomizedRunner.invoke(RandomizedRunner.java:1737)
	at com.carrotsearch.randomizedtesting.RandomizedRunner$8.evaluate(RandomizedRunner.java:934)
	at com.carrotsearch.randomizedtesting.RandomizedRunner$9.evaluate(RandomizedRunner.java:970)
	at com.carrotsearch.randomizedtesting.RandomizedRunner$10.evaluate(RandomizedRunner.java:984)
	at org.apache.solr.BaseDistributedSearchTestCase$ShardsRepeatRule$ShardsFixedStatement.callStatement(BaseDistributedSearchTestCase.java:993)
	at org.apache.solr.BaseDistributedSearchTestCase$ShardsRepeatRule$ShardsStatement.evaluate(BaseDistributedSearchTestCase.java:968)
	at com.carrotsearch.randomizedtesting.rules.SystemPropertiesRestoreRule$1.evaluate(SystemPropertiesRestoreRule.java:57)
	at org.apache.lucene.util.TestRuleSetupTeardownChained$1.evaluate(TestRuleSetupTeardownChained.java:49)
	at org.apache.lucene.util.AbstractBeforeAfterRule$1.evaluate(AbstractBeforeAfterRule.java:45)
	at org.apache.lucene.util.TestRuleThreadAndTestName$1.evaluate(TestRuleThreadAndTestName.java:48)
	at org.apache.lucene.util.TestRuleIgnoreAfterMaxFailures$1.evaluate(TestRuleIgnoreAfterMaxFailures.java:64)
	at org.apache.lucene.util.TestRuleMarkFailure$1.evaluate(TestRuleMarkFailure.java:47)
	at com.carrotsearch.randomizedtesting.rules.StatementAdapter.evaluate(StatementAdapter.java:36)
	at com.carrotsearch.randomizedtesting.ThreadLeakControl$StatementRunner.run(ThreadLeakControl.java:368)
	at com.carrotsearch.randomizedtesting.ThreadLeakControl.forkTimeoutingTask(ThreadLeakControl.java:817)
	at com.carrotsearch.randomizedtesting.ThreadLeakControl$3.evaluate(ThreadLeakControl.java:468)
	at com.carrotsearch.randomizedtesting.RandomizedRunner.runSingleTest(RandomizedRunner.java:943)
	at com.carrotsearch.randomizedtesting.RandomizedRunner$5.evaluate(RandomizedRunner.java:829)
	at com.carrotsearch.randomizedtesting.RandomizedRunner$6.evaluate(RandomizedRunner.java:879)
	at com.carrotsearch.randomizedtesting.RandomizedRunner$7.evaluate(RandomizedRunner.java:890)
	at com.carrotsearch.randomizedtesting.rules.StatementAdapter.evaluate(StatementAdapter.java:36)
	at com.carrotsearch.randomizedtesting.rules.SystemPropertiesRestoreRule$1.evaluate(SystemPropertiesRestoreRule.java:57)
	at org.apache.lucene.util.AbstractBeforeAfterRule$1.evaluate(AbstractBeforeAfterRule.java:45)
	at com.carrotsearch.randomizedtesting.rules.StatementAdapter.evaluate(StatementAdapter.java:36)
	at org.apache.lucene.util.TestRuleStoreClassName$1.evaluate(TestRuleStoreClassName.java:41)
	at com.carrotsearch.randomizedtesting.rules.NoShadowingOrOverridesOnMethodsRule$1.evaluate(NoShadowingOrOverridesOnMethodsRule.java:40)
	at com.carrotsearch.randomizedtesting.rules.NoShadowingOrOverridesOnMethodsRule$1.evaluate(NoShadowingOrOverridesOnMethodsRule.java:40)
	at com.carrotsearch.randomizedtesting.rules.StatementAdapter.evaluate(StatementAdapter.java:36)
	at com.carrotsearch.randomizedtesting.rules.StatementAdapter.evaluate(StatementAdapter.java:36)
	at com.carrotsearch.randomizedtesting.rules.StatementAdapter.evaluate(StatementAdapter.java:36)
	at org.apache.lucene.util.TestRuleAssertionsRequired$1.evaluate(TestRuleAssertionsRequired.java:53)
	at org.apache.lucene.util.TestRuleMarkFailure$1.evaluate(TestRuleMarkFailure.java:47)
	at org.apache.lucene.util.TestRuleIgnoreAfterMaxFailures$1.evaluate(TestRuleIgnoreAfterMaxFailures.java:64)
	at org.apache.lucene.util.TestRuleIgnoreTestSuites$1.evaluate(TestRuleIgnoreTestSuites.java:54)
	at com.carrotsearch.randomizedtesting.rules.StatementAdapter.evaluate(StatementAdapter.java:36)
	at com.carrotsearch.randomizedtesting.ThreadLeakControl$StatementRunner.run(ThreadLeakControl.java:368)
	at java.lang.Thread.run(Thread.java:748)


FAILED:  junit.framework.TestSuite.org.apache.solr.client.solrj.request.SchemaTest

Error Message:
Could not remove the following files (in the order of attempts):    C:\Users\jenkins\workspace\Lucene-Solr-master-Windows\solr\build\solr-solrj\test\J0\temp\solr.client.solrj.request.SchemaTest_706783DA71363954-001\tempDir-103\configsets\configset-1: java.nio.file.DirectoryNotEmptyException: C:\Users\jenkins\workspace\Lucene-Solr-master-Windows\solr\build\solr-solrj\test\J0\temp\solr.client.solrj.request.SchemaTest_706783DA71363954-001\tempDir-103\configsets\configset-1    C:\Users\jenkins\workspace\Lucene-Solr-master-Windows\solr\build\solr-solrj\test\J0\temp\solr.client.solrj.request.SchemaTest_706783DA71363954-001\tempDir-103\configsets: java.nio.file.DirectoryNotEmptyException: C:\Users\jenkins\workspace\Lucene-Solr-master-Windows\solr\build\solr-solrj\test\J0\temp\solr.client.solrj.request.SchemaTest_706783DA71363954-001\tempDir-103\configsets    C:\Users\jenkins\workspace\Lucene-Solr-master-Windows\solr\build\solr-solrj\test\J0\temp\solr.client.solrj.request.SchemaTest_706783DA71363954-001\tempDir-103: java.nio.file.DirectoryNotEmptyException: C:\Users\jenkins\workspace\Lucene-Solr-master-Windows\solr\build\solr-solrj\test\J0\temp\solr.client.solrj.request.SchemaTest_706783DA71363954-001\tempDir-103 

Stack Trace:
java.io.IOException: Could not remove the following files (in the order of attempts):
   C:\Users\jenkins\workspace\Lucene-Solr-master-Windows\solr\build\solr-solrj\test\J0\temp\solr.client.solrj.request.SchemaTest_706783DA71363954-001\tempDir-103\configsets\configset-1: java.nio.file.DirectoryNotEmptyException: C:\Users\jenkins\workspace\Lucene-Solr-master-Windows\solr\build\solr-solrj\test\J0\temp\solr.client.solrj.request.SchemaTest_706783DA71363954-001\tempDir-103\configsets\configset-1
   C:\Users\jenkins\workspace\Lucene-Solr-master-Windows\solr\build\solr-solrj\test\J0\temp\solr.client.solrj.request.SchemaTest_706783DA71363954-001\tempDir-103\configsets: java.nio.file.DirectoryNotEmptyException: C:\Users\jenkins\workspace\Lucene-Solr-master-Windows\solr\build\solr-solrj\test\J0\temp\solr.client.solrj.request.SchemaTest_706783DA71363954-001\tempDir-103\configsets
   C:\Users\jenkins\workspace\Lucene-Solr-master-Windows\solr\build\solr-solrj\test\J0\temp\solr.client.solrj.request.SchemaTest_706783DA71363954-001\tempDir-103: java.nio.file.DirectoryNotEmptyException: C:\Users\jenkins\workspace\Lucene-Solr-master-Windows\solr\build\solr-solrj\test\J0\temp\solr.client.solrj.request.SchemaTest_706783DA71363954-001\tempDir-103

	at __randomizedtesting.SeedInfo.seed([706783DA71363954]:0)
	at org.apache.lucene.util.IOUtils.rm(IOUtils.java:329)
	at org.apache.lucene.util.TestRuleTemporaryFilesCleanup.afterAlways(TestRuleTemporaryFilesCleanup.java:216)
	at com.carrotsearch.randomizedtesting.rules.TestRuleAdapter$1.afterAlways(TestRuleAdapter.java:31)
	at com.carrotsearch.randomizedtesting.rules.StatementAdapter.evaluate(StatementAdapter.java:43)
	at com.carrotsearch.randomizedtesting.rules.StatementAdapter.evaluate(StatementAdapter.java:36)
	at org.apache.lucene.util.TestRuleAssertionsRequired$1.evaluate(TestRuleAssertionsRequired.java:53)
	at org.apache.lucene.util.TestRuleMarkFailure$1.evaluate(TestRuleMarkFailure.java:47)
	at org.apache.lucene.util.TestRuleIgnoreAfterMaxFailures$1.evaluate(TestRuleIgnoreAfterMaxFailures.java:64)
	at org.apache.lucene.util.TestRuleIgnoreTestSuites$1.evaluate(TestRuleIgnoreTestSuites.java:54)
	at com.carrotsearch.randomizedtesting.rules.StatementAdapter.evaluate(StatementAdapter.java:36)
	at com.carrotsearch.randomizedtesting.ThreadLeakControl$StatementRunner.run(ThreadLeakControl.java:368)
	at java.lang.Thread.run(Thread.java:748)


FAILED:  junit.framework.TestSuite.org.apache.solr.update.processor.TestOpenNLPExtractNamedEntitiesUpdateProcessorFactory

Error Message:
Could not remove the following files (in the order of attempts):    C:\Users\jenkins\workspace\Lucene-Solr-master-Windows\solr\build\contrib\solr-analysis-extras\test\J1\temp\solr.update.processor.TestOpenNLPExtractNamedEntitiesUpdateProcessorFactory_12D97ED429EA3EF2-001\tempDir-001\collection1\conf: java.nio.file.DirectoryNotEmptyException: C:\Users\jenkins\workspace\Lucene-Solr-master-Windows\solr\build\contrib\solr-analysis-extras\test\J1\temp\solr.update.processor.TestOpenNLPExtractNamedEntitiesUpdateProcessorFactory_12D97ED429EA3EF2-001\tempDir-001\collection1\conf    C:\Users\jenkins\workspace\Lucene-Solr-master-Windows\solr\build\contrib\solr-analysis-extras\test\J1\temp\solr.update.processor.TestOpenNLPExtractNamedEntitiesUpdateProcessorFactory_12D97ED429EA3EF2-001\tempDir-001\collection1: java.nio.file.DirectoryNotEmptyException: C:\Users\jenkins\workspace\Lucene-Solr-master-Windows\solr\build\contrib\solr-analysis-extras\test\J1\temp\solr.update.processor.TestOpenNLPExtractNamedEntitiesUpdateProcessorFactory_12D97ED429EA3EF2-001\tempDir-001\collection1    C:\Users\jenkins\workspace\Lucene-Solr-master-Windows\solr\build\contrib\solr-analysis-extras\test\J1\temp\solr.update.processor.TestOpenNLPExtractNamedEntitiesUpdateProcessorFactory_12D97ED429EA3EF2-001\tempDir-001: java.nio.file.DirectoryNotEmptyException: C:\Users\jenkins\workspace\Lucene-Solr-master-Windows\solr\build\contrib\solr-analysis-extras\test\J1\temp\solr.update.processor.TestOpenNLPExtractNamedEntitiesUpdateProcessorFactory_12D97ED429EA3EF2-001\tempDir-001    C:\Users\jenkins\workspace\Lucene-Solr-master-Windows\solr\build\contrib\solr-analysis-extras\test\J1\temp\solr.update.processor.TestOpenNLPExtractNamedEntitiesUpdateProcessorFactory_12D97ED429EA3EF2-001\tempDir-001\collection1\conf\en-test-tokenizer.bin: java.nio.file.AccessDeniedException: C:\Users\jenkins\workspace\Lucene-Solr-master-Windows\solr\build\contrib\solr-analysis-extras\test\J1\temp\solr.update.processor.TestOpenNLPExtractNamedEntitiesUpdateProcessorFactory_12D97ED429EA3EF2-001\tempDir-001\collection1\conf\en-test-tokenizer.bin    C:\Users\jenkins\workspace\Lucene-Solr-master-Windows\solr\build\contrib\solr-analysis-extras\test\J1\temp\solr.update.processor.TestOpenNLPExtractNamedEntitiesUpdateProcessorFactory_12D97ED429EA3EF2-001\tempDir-001\collection1\conf\en-test-sent.bin: java.nio.file.AccessDeniedException: C:\Users\jenkins\workspace\Lucene-Solr-master-Windows\solr\build\contrib\solr-analysis-extras\test\J1\temp\solr.update.processor.TestOpenNLPExtractNamedEntitiesUpdateProcessorFactory_12D97ED429EA3EF2-001\tempDir-001\collection1\conf\en-test-sent.bin    C:\Users\jenkins\workspace\Lucene-Solr-master-Windows\solr\build\contrib\solr-analysis-extras\test\J1\temp\solr.update.processor.TestOpenNLPExtractNamedEntitiesUpdateProcessorFactory_12D97ED429EA3EF2-001\tempDir-001\collection1\conf\en-test-ner-person.bin: java.nio.file.AccessDeniedException: C:\Users\jenkins\workspace\Lucene-Solr-master-Windows\solr\build\contrib\solr-analysis-extras\test\J1\temp\solr.update.processor.TestOpenNLPExtractNamedEntitiesUpdateProcessorFactory_12D97ED429EA3EF2-001\tempDir-001\collection1\conf\en-test-ner-person.bin    C:\Users\jenkins\workspace\Lucene-Solr-master-Windows\solr\build\contrib\solr-analysis-extras\test\J1\temp\solr.update.processor.TestOpenNLPExtractNamedEntitiesUpdateProcessorFactory_12D97ED429EA3EF2-001: java.nio.file.DirectoryNotEmptyException: C:\Users\jenkins\workspace\Lucene-Solr-master-Windows\solr\build\contrib\solr-analysis-extras\test\J1\temp\solr.update.processor.TestOpenNLPExtractNamedEntitiesUpdateProcessorFactory_12D97ED429EA3EF2-001 

Stack Trace:
java.io.IOException: Could not remove the following files (in the order of attempts):
   C:\Users\jenkins\workspace\Lucene-Solr-master-Windows\solr\build\contrib\solr-analysis-extras\test\J1\temp\solr.update.processor.TestOpenNLPExtractNamedEntitiesUpdateProcessorFactory_12D97ED429EA3EF2-001\tempDir-001\collection1\conf: java.nio.file.DirectoryNotEmptyException: C:\Users\jenkins\workspace\Lucene-Solr-master-Windows\solr\build\contrib\solr-analysis-extras\test\J1\temp\solr.update.processor.TestOpenNLPExtractNamedEntitiesUpdateProcessorFactory_12D97ED429EA3EF2-001\tempDir-001\collection1\conf
   C:\Users\jenkins\workspace\Lucene-Solr-master-Windows\solr\build\contrib\solr-analysis-extras\test\J1\temp\solr.update.processor.TestOpenNLPExtractNamedEntitiesUpdateProcessorFactory_12D97ED429EA3EF2-001\tempDir-001\collection1: java.nio.file.DirectoryNotEmptyException: C:\Users\jenkins\workspace\Lucene-Solr-master-Windows\solr\build\contrib\solr-analysis-extras\test\J1\temp\solr.update.processor.TestOpenNLPExtractNamedEntitiesUpdateProcessorFactory_12D97ED429EA3EF2-001\tempDir-001\collection1
   C:\Users\jenkins\workspace\Lucene-Solr-master-Windows\solr\build\contrib\solr-analysis-extras\test\J1\temp\solr.update.processor.TestOpenNLPExtractNamedEntitiesUpdateProcessorFactory_12D97ED429EA3EF2-001\tempDir-001: java.nio.file.DirectoryNotEmptyException: C:\Users\jenkins\workspace\Lucene-Solr-master-Windows\solr\build\contrib\solr-analysis-extras\test\J1\temp\solr.update.processor.TestOpenNLPExtractNamedEntitiesUpdateProcessorFactory_12D97ED429EA3EF2-001\tempDir-001
   C:\Users\jenkins\workspace\Lucene-Solr-master-Windows\solr\build\contrib\solr-analysis-extras\test\J1\temp\solr.update.processor.TestOpenNLPExtractNamedEntitiesUpdateProcessorFactory_12D97ED429EA3EF2-001\tempDir-001\collection1\conf\en-test-tokenizer.bin: java.nio.file.AccessDeniedException: C:\Users\jenkins\workspace\Lucene-Solr-master-Windows\solr\build\contrib\solr-analysis-extras\test\J1\temp\solr.update.processor.TestOpenNLPExtractNamedEntitiesUpdateProcessorFactory_12D97ED429EA3EF2-001\tempDir-001\collection1\conf\en-test-tokenizer.bin
   C:\Users\jenkins\workspace\Lucene-Solr-master-Windows\solr\build\contrib\solr-analysis-extras\test\J1\temp\solr.update.processor.TestOpenNLPExtractNamedEntitiesUpdateProcessorFactory_12D97ED429EA3EF2-001\tempDir-001\collection1\conf\en-test-sent.bin: java.nio.file.AccessDeniedException: C:\Users\jenkins\workspace\Lucene-Solr-master-Windows\solr\build\contrib\solr-analysis-extras\test\J1\temp\solr.update.processor.TestOpenNLPExtractNamedEntitiesUpdateProcessorFactory_12D97ED429EA3EF2-001\tempDir-001\collection1\conf\en-test-sent.bin
   C:\Users\jenkins\workspace\Lucene-Solr-master-Windows\solr\build\contrib\solr-analysis-extras\test\J1\temp\solr.update.processor.TestOpenNLPExtractNamedEntitiesUpdateProcessorFactory_12D97ED429EA3EF2-001\tempDir-001\collection1\conf\en-test-ner-person.bin: java.nio.file.AccessDeniedException: C:\Users\jenkins\workspace\Lucene-Solr-master-Windows\solr\build\contrib\solr-analysis-extras\test\J1\temp\solr.update.processor.TestOpenNLPExtractNamedEntitiesUpdateProcessorFactory_12D97ED429EA3EF2-001\tempDir-001\collection1\conf\en-test-ner-person.bin
   C:\Users\jenkins\workspace\Lucene-Solr-master-Windows\solr\build\contrib\solr-analysis-extras\test\J1\temp\solr.update.processor.TestOpenNLPExtractNamedEntitiesUpdateProcessorFactory_12D97ED429EA3EF2-001: java.nio.file.DirectoryNotEmptyException: C:\Users\jenkins\workspace\Lucene-Solr-master-Windows\solr\build\contrib\solr-analysis-extras\test\J1\temp\solr.update.processor.TestOpenNLPExtractNamedEntitiesUpdateProcessorFactory_12D97ED429EA3EF2-001

	at __randomizedtesting.SeedInfo.seed([12D97ED429EA3EF2]:0)
	at org.apache.lucene.util.IOUtils.rm(IOUtils.java:329)
	at org.apache.lucene.util.TestRuleTemporaryFilesCleanup.afterAlways(TestRuleTemporaryFilesCleanup.java:216)
	at com.carrotsearch.randomizedtesting.rules.TestRuleAdapter$1.afterAlways(TestRuleAdapter.java:31)
	at com.carrotsearch.randomizedtesting.rules.StatementAdapter.evaluate(StatementAdapter.java:43)
	at com.carrotsearch.randomizedtesting.rules.StatementAdapter.evaluate(StatementAdapter.java:36)
	at org.apache.lucene.util.TestRuleAssertionsRequired$1.evaluate(TestRuleAssertionsRequired.java:53)
	at org.apache.lucene.util.TestRuleMarkFailure$1.evaluate(TestRuleMarkFailure.java:47)
	at org.apache.lucene.util.TestRuleIgnoreAfterMaxFailures$1.evaluate(TestRuleIgnoreAfterMaxFailures.java:64)
	at org.apache.lucene.util.TestRuleIgnoreTestSuites$1.evaluate(TestRuleIgnoreTestSuites.java:54)
	at com.carrotsearch.randomizedtesting.rules.StatementAdapter.evaluate(StatementAdapter.java:36)
	at com.carrotsearch.randomizedtesting.ThreadLeakControl$StatementRunner.run(ThreadLeakControl.java:368)
	at java.lang.Thread.run(Thread.java:748)




Build Log:
[...truncated 4905 lines...]
   [junit4] Suite: org.apache.lucene.index.TestBackwardsCompatibility
   [junit4] IGNOR/A 0.00s J1 | TestBackwardsCompatibility.testCreateNoCFS
   [junit4]    > Assumption #1: backcompat creation tests must be run with -Dtests.bwcdir=/path/to/write/indexes
   [junit4] IGNOR/A 0.00s J1 | TestBackwardsCompatibility.testCreateSortedIndex
   [junit4]    > Assumption #1: backcompat creation tests must be run with -Dtests.bwcdir=/path/to/write/indexes
   [junit4] IGNOR/A 0.00s J1 | TestBackwardsCompatibility.testCreateSingleSegmentCFS
   [junit4]    > Assumption #1: backcompat creation tests must be run with -Dtests.bwcdir=/path/to/write/indexes
   [junit4] IGNOR/A 0.00s J1 | TestBackwardsCompatibility.testCreateSingleSegmentNoCFS
   [junit4]    > Assumption #1: backcompat creation tests must be run with -Dtests.bwcdir=/path/to/write/indexes
   [junit4] IGNOR/A 0.00s J1 | TestBackwardsCompatibility.testCreateIndexWithDocValuesUpdates
   [junit4]    > Assumption #1: backcompat creation tests must be run with -Dtests.bwcdir=/path/to/write/indexes
   [junit4] IGNOR/A 0.00s J1 | TestBackwardsCompatibility.testCreateCFS
   [junit4]    > Assumption #1: backcompat creation tests must be run with -Dtests.bwcdir=/path/to/write/indexes
   [junit4] IGNOR/A 0.00s J1 | TestBackwardsCompatibility.testCreateMoreTermsIndex
   [junit4]    > Assumption #1: backcompat creation tests must be run with -Dtests.bwcdir=/path/to/write/indexes
   [junit4] IGNOR/A 0.00s J1 | TestBackwardsCompatibility.testCreateEmptyIndex
   [junit4]    > Assumption #1: backcompat creation tests must be run with -Dtests.bwcdir=/path/to/write/indexes
   [junit4]   2> NOTE: test params are: codec=CheapBastard, sim=Asserting(org.apache.lucene.search.similarities.AssertingSimilarity@16e7308), locale=sr-BA, timezone=America/Bahia_Banderas
   [junit4]   2> NOTE: Windows 10 10.0 x86/Oracle Corporation 1.8.0_144 (32-bit)/cpus=3,threads=1,free=64223160,total=199229440
   [junit4]   2> NOTE: All tests run in this JVM: [TestManyPointsInOldIndex, TestBackwardsCompatibility]
   [junit4]   2> NOTE: reproduce with: ant test  -Dtestcase=TestBackwardsCompatibility -Dtests.seed=8CA250ACC9E4E7EA -Dtests.slow=true -Dtests.locale=sr-BA -Dtests.timezone=America/Bahia_Banderas -Dtests.asserts=true -Dtests.file.encoding=UTF-8
   [junit4] ERROR   0.00s J1 | TestBackwardsCompatibility (suite) <<<
   [junit4]    > Throwable #1: java.io.IOException: Could not remove the following files (in the order of attempts):
   [junit4]    >    C:\Users\jenkins\workspace\Lucene-Solr-master-Windows\lucene\build\backward-codecs\test\J1\temp\lucene.index.TestBackwardsCompatibility_8CA250ACC9E4E7EA-001\2.9.4-cfs-001: java.nio.file.DirectoryNotEmptyException: C:\Users\jenkins\workspace\Lucene-Solr-master-Windows\lucene\build\backward-codecs\test\J1\temp\lucene.index.TestBackwardsCompatibility_8CA250ACC9E4E7EA-001\2.9.4-cfs-001
   [junit4]    > 	at __randomizedtesting.SeedInfo.seed([8CA250ACC9E4E7EA]:0)
   [junit4]    > 	at org.apache.lucene.util.IOUtils.rm(IOUtils.java:329)
   [junit4]    > 	at java.lang.Thread.run(Thread.java:748)
   [junit4] Completed [3/3 (1!)] on J1 in 15.55s, 30 tests, 1 error, 8 skipped <<< FAILURES!

[...truncated 1813 lines...]
   [junit4] Suite: org.apache.lucene.codecs.simpletext.TestSimpleTextStoredFieldsFormat
   [junit4] IGNOR/A 0.01s J0 | TestSimpleTextStoredFieldsFormat.testBigDocuments
   [junit4]    > Assumption #1: 'nightly' test group is disabled (@Nightly())
   [junit4]   2> NOTE: test params are: codec=Asserting(Lucene70), sim=Asserting(org.apache.lucene.search.similarities.AssertingSimilarity@f5f14d), locale=hi-IN, timezone=Asia/Kabul
   [junit4]   2> NOTE: Windows 10 10.0 x86/Oracle Corporation 1.8.0_144 (32-bit)/cpus=3,threads=1,free=61718728,total=85983232
   [junit4]   2> NOTE: All tests run in this JVM: [TestOrdsBlockTree, TestFSTOrdPostingsFormat, TestSimpleTextStoredFieldsFormat]
   [junit4]   2> NOTE: reproduce with: ant test  -Dtestcase=TestSimpleTextStoredFieldsFormat -Dtests.seed=BD8CC6CCD6388876 -Dtests.slow=true -Dtests.locale=hi-IN -Dtests.timezone=Asia/Kabul -Dtests.asserts=true -Dtests.file.encoding=Cp1252
   [junit4] ERROR   0.00s J0 | TestSimpleTextStoredFieldsFormat (suite) <<<
   [junit4]    > Throwable #1: java.io.IOException: Could not remove the following files (in the order of attempts):
   [junit4]    >    C:\Users\jenkins\workspace\Lucene-Solr-master-Windows\lucene\build\codecs\test\J0\temp\lucene.codecs.simpletext.TestSimpleTextStoredFieldsFormat_BD8CC6CCD6388876-001\index-SimpleFSDirectory-001: java.nio.file.AccessDeniedException: C:\Users\jenkins\workspace\Lucene-Solr-master-Windows\lucene\build\codecs\test\J0\temp\lucene.codecs.simpletext.TestSimpleTextStoredFieldsFormat_BD8CC6CCD6388876-001\index-SimpleFSDirectory-001
   [junit4]    >    C:\Users\jenkins\workspace\Lucene-Solr-master-Windows\lucene\build\codecs\test\J0\temp\lucene.codecs.simpletext.TestSimpleTextStoredFieldsFormat_BD8CC6CCD6388876-001: java.nio.file.DirectoryNotEmptyException: C:\Users\jenkins\workspace\Lucene-Solr-master-Windows\lucene\build\codecs\test\J0\temp\lucene.codecs.simpletext.TestSimpleTextStoredFieldsFormat_BD8CC6CCD6388876-001
   [junit4]    > 	at __randomizedtesting.SeedInfo.seed([BD8CC6CCD6388876]:0)
   [junit4]    > 	at org.apache.lucene.util.IOUtils.rm(IOUtils.java:329)
   [junit4]    > 	at java.lang.Thread.run(Thread.java:748)
   [junit4] Completed [3/20 (1!)] on J0 in 7.08s, 17 tests, 1 error, 1 skipped <<< FAILURES!

[...truncated 79 lines...]
   [junit4] Suite: org.apache.lucene.codecs.blockterms.TestVarGapFixedIntervalPostingsFormat
   [junit4]   2> NOTE: test params are: codec=Asserting(Lucene70): {}, docValues:{}, maxPointsInLeafNode=1141, maxMBSortInHeap=7.50523560594587, sim=Asserting(org.apache.lucene.search.similarities.AssertingSimilarity@523f4a), locale=uk, timezone=Etc/GMT+9
   [junit4]   2> NOTE: Windows 10 10.0 x86/Oracle Corporation 1.8.0_144 (32-bit)/cpus=3,threads=1,free=71753600,total=124518400
   [junit4]   2> NOTE: All tests run in this JVM: [TestDirectDocValuesFormat, TestMemoryPostingsFormat, TestSimpleTextPostingsFormat, TestSimpleTextNormsFormat, TestVarGapFixedIntervalPostingsFormat]
   [junit4]   2> NOTE: reproduce with: ant test  -Dtestcase=TestVarGapFixedIntervalPostingsFormat -Dtests.seed=BD8CC6CCD6388876 -Dtests.slow=true -Dtests.locale=uk -Dtests.timezone=Etc/GMT+9 -Dtests.asserts=true -Dtests.file.encoding=Cp1252
   [junit4] ERROR   0.00s J1 | TestVarGapFixedIntervalPostingsFormat (suite) <<<
   [junit4]    > Throwable #1: java.io.IOException: Could not remove the following files (in the order of attempts):
   [junit4]    >    C:\Users\jenkins\workspace\Lucene-Solr-master-Windows\lucene\build\codecs\test\J1\temp\lucene.codecs.blockterms.TestVarGapFixedIntervalPostingsFormat_BD8CC6CCD6388876-001\testPostingsEnumReuse-001: java.nio.file.AccessDeniedException: C:\Users\jenkins\workspace\Lucene-Solr-master-Windows\lucene\build\codecs\test\J1\temp\lucene.codecs.blockterms.TestVarGapFixedIntervalPostingsFormat_BD8CC6CCD6388876-001\testPostingsEnumReuse-001
   [junit4]    >    C:\Users\jenkins\workspace\Lucene-Solr-master-Windows\lucene\build\codecs\test\J1\temp\lucene.codecs.blockterms.TestVarGapFixedIntervalPostingsFormat_BD8CC6CCD6388876-001: java.nio.file.DirectoryNotEmptyException: C:\Users\jenkins\workspace\Lucene-Solr-master-Windows\lucene\build\codecs\test\J1\temp\lucene.codecs.blockterms.TestVarGapFixedIntervalPostingsFormat_BD8CC6CCD6388876-001
   [junit4]    > 	at __randomizedtesting.SeedInfo.seed([BD8CC6CCD6388876]:0)
   [junit4]    > 	at org.apache.lucene.util.IOUtils.rm(IOUtils.java:329)
   [junit4]    > 	at java.lang.Thread.run(Thread.java:748)
   [junit4] Completed [10/20 (2!)] on J1 in 6.24s, 25 tests, 1 error <<< FAILURES!

[...truncated 1646 lines...]
   [junit4] Suite: org.apache.lucene.store.TestRAFDirectory
   [junit4]   2> NOTE: test params are: codec=Asserting(Lucene70): {}, docValues:{}, maxPointsInLeafNode=633, maxMBSortInHeap=5.575305763968149, sim=Asserting(org.apache.lucene.search.similarities.AssertingSimilarity@1b1f859), locale=pt, timezone=America/Tegucigalpa
   [junit4]   2> NOTE: Windows 10 10.0 x86/Oracle Corporation 1.8.0_144 (32-bit)/cpus=3,threads=1,free=126034928,total=185073664
   [junit4]   2> NOTE: All tests run in this JVM: [TestInetAddressPoint, TestHighFreqTerms, TestDiversifiedTopDocsCollector, TestFSTsMisc, TestMultiPassIndexSplitter, SweetSpotSimilarityTest, TestRAFDirectory]
   [junit4]   2> NOTE: reproduce with: ant test  -Dtestcase=TestRAFDirectory -Dtests.seed=F00FE6292F19E3DB -Dtests.slow=true -Dtests.locale=pt -Dtests.timezone=America/Tegucigalpa -Dtests.asserts=true -Dtests.file.encoding=ISO-8859-1
   [junit4] ERROR   0.00s J0 | TestRAFDirectory (suite) <<<
   [junit4]    > Throwable #1: java.io.IOException: Could not remove the following files (in the order of attempts):
   [junit4]    >    C:\Users\jenkins\workspace\Lucene-Solr-master-Windows\lucene\build\misc\test\J0\temp\lucene.store.TestRAFDirectory_F00FE6292F19E3DB-001\testByte-001: java.nio.file.DirectoryNotEmptyException: C:\Users\jenkins\workspace\Lucene-Solr-master-Windows\lucene\build\misc\test\J0\temp\lucene.store.TestRAFDirectory_F00FE6292F19E3DB-001\testByte-001
   [junit4]    > 	at __randomizedtesting.SeedInfo.seed([F00FE6292F19E3DB]:0)
   [junit4]    > 	at org.apache.lucene.util.IOUtils.rm(IOUtils.java:329)
   [junit4]    > 	at java.lang.Thread.run(Thread.java:748)
   [junit4] Completed [12/13 (1!)] on J0 in 1.52s, 42 tests, 1 error <<< FAILURES!

[...truncated 4218 lines...]
   [junit4] Suite: org.apache.solr.cloud.DistribCursorPagingTest
   [junit4]   2> 758872 INFO  (SUITE-DistribCursorPagingTest-seed#[853BBA7F98D3D950]-worker) [    ] o.a.s.SolrTestCaseJ4 SecureRandom sanity checks: test.solr.allowed.securerandom=null & java.security.egd=file:/dev/./urandom
   [junit4]   2> Creating dataDir: C:\Users\jenkins\workspace\Lucene-Solr-master-Windows\solr\build\solr-core\test\J0\temp\solr.cloud.DistribCursorPagingTest_853BBA7F98D3D950-001\init-core-data-001
   [junit4]   2> 758873 WARN  (SUITE-DistribCursorPagingTest-seed#[853BBA7F98D3D950]-worker) [    ] o.a.s.SolrTestCaseJ4 startTrackingSearchers: numOpens=1 numCloses=1
   [junit4]   2> 758873 INFO  (SUITE-DistribCursorPagingTest-seed#[853BBA7F98D3D950]-worker) [    ] o.a.s.SolrTestCaseJ4 Using TrieFields (NUMERIC_POINTS_SYSPROP=false) w/NUMERIC_DOCVALUES_SYSPROP=false
   [junit4]   2> 758876 INFO  (SUITE-DistribCursorPagingTest-seed#[853BBA7F98D3D950]-worker) [    ] o.a.s.SolrTestCaseJ4 Randomized ssl (false) and clientAuth (false) via: @org.apache.solr.SolrTestCaseJ4$SuppressSSL(bugUrl=https://issues.apache.org/jira/browse/SOLR-9182 - causes OOM)
   [junit4]   2> 758876 INFO  (SUITE-DistribCursorPagingTest-seed#[853BBA7F98D3D950]-worker) [    ] o.a.s.BaseDistributedSearchTestCase Setting hostContext system property: /
   [junit4]   2> 758881 INFO  (TEST-DistribCursorPagingTest.test-seed#[853BBA7F98D3D950]) [    ] o.a.s.c.ZkTestServer STARTING ZK TEST SERVER
   [junit4]   2> 758884 INFO  (Thread-1537) [    ] o.a.s.c.ZkTestServer client port:0.0.0.0/0.0.0.0:0
   [junit4]   2> 758884 INFO  (Thread-1537) [    ] o.a.s.c.ZkTestServer Starting server
   [junit4]   2> 758887 ERROR (Thread-1537) [    ] o.a.z.s.ZooKeeperServer ZKShutdownHandler is not registered, so ZooKeeper server won't take any action on ERROR or SHUTDOWN server state changes
   [junit4]   2> 758982 INFO  (TEST-DistribCursorPagingTest.test-seed#[853BBA7F98D3D950]) [    ] o.a.s.c.ZkTestServer start zk server on port:50790
   [junit4]   2> 758986 INFO  (zkConnectionManagerCallback-1658-thread-1) [    ] o.a.s.c.c.ConnectionManager zkClient has connected
   [junit4]   2> 758987 WARN  (NIOServerCxn.Factory:0.0.0.0/0.0.0.0:0) [    ] o.a.z.s.NIOServerCnxn Unable to read additional data from client sessionid 0x100a44da6160000, likely client has closed socket
   [junit4]   2> 758989 INFO  (zkConnectionManagerCallback-1660-thread-1) [    ] o.a.s.c.c.ConnectionManager zkClient has connected
   [junit4]   2> 758994 INFO  (TEST-DistribCursorPagingTest.test-seed#[853BBA7F98D3D950]) [    ] o.a.s.c.AbstractZkTestCase put C:\Users\jenkins\workspace\Lucene-Solr-master-Windows\solr\core\src\test-files\solr\collection1\conf\solrconfig-deeppaging.xml to /configs/conf1/solrconfig.xml
   [junit4]   2> 758998 INFO  (TEST-DistribCursorPagingTest.test-seed#[853BBA7F98D3D950]) [    ] o.a.s.c.AbstractZkTestCase put C:\Users\jenkins\workspace\Lucene-Solr-master-Windows\solr\core\src\test-files\solr\collection1\conf\schema-sorts.xml to /configs/conf1/schema.xml
   [junit4]   2> 759000 INFO  (TEST-DistribCursorPagingTest.test-seed#[853BBA7F98D3D950]) [    ] o.a.s.c.AbstractZkTestCase put C:\Users\jenkins\workspace\Lucene-Solr-master-Windows\solr\core\src\test-files\solr\collection1\conf\solrconfig.snippet.randomindexconfig.xml to /configs/conf1/solrconfig.snippet.randomindexconfig.xml
   [junit4]   2> 759001 INFO  (TEST-DistribCursorPagingTest.test-seed#[853BBA7F98D3D950]) [    ] o.a.s.c.AbstractZkTestCase put C:\Users\jenkins\workspace\Lucene-Solr-master-Windows\solr\core\src\test-files\solr\collection1\conf\stopwords.txt to /configs/conf1/stopwords.txt
   [junit4]   2> 759002 INFO  (TEST-DistribCursorPagingTest.test-seed#[853BBA7F98D3D950]) [    ] o.a.s.c.AbstractZkTestCase put C:\Users\jenkins\workspace\Lucene-Solr-master-Windows\solr\core\src\test-files\solr\collection1\conf\protwords.txt to /configs/conf1/protwords.txt
   [junit4]   2> 759004 INFO  (TEST-DistribCursorPagingTest.test-seed#[853BBA7F98D3D950]) [    ] o.a.s.c.AbstractZkTestCase put C:\Users\jenkins\workspace\Lucene-Solr-master-Windows\solr\core\src\test-files\solr\collection1\conf\currency.xml to /configs/conf1/currency.xml
   [junit4]   2> 759005 INFO  (TEST-DistribCursorPagingTest.test-seed#[853BBA7F98D3D950]) [    ] o.a.s.c.AbstractZkTestCase put C:\Users\jenkins\workspace\Lucene-Solr-master-Windows\solr\core\src\test-files\solr\collection1\conf\enumsConfig.xml to /configs/conf1/enumsConfig.xml
   [junit4]   2> 759006 INFO  (TEST-DistribCursorPagingTest.test-seed#[853BBA7F98D3D950]) [    ] o.a.s.c.AbstractZkTestCase put C:\Users\jenkins\workspace\Lucene-Solr-master-Windows\solr\core\src\test-files\solr\collection1\conf\open-exchange-rates.json to /configs/conf1/open-exchange-rates.json
   [junit4]   2> 759008 INFO  (TEST-DistribCursorPagingTest.test-seed#[853BBA7F98D3D950]) [    ] o.a.s.c.AbstractZkTestCase put C:\Users\jenkins\workspace\Lucene-Solr-master-Windows\solr\core\src\test-files\solr\collection1\conf\mapping-ISOLatin1Accent.txt to /configs/conf1/mapping-ISOLatin1Accent.txt
   [junit4]   2> 759009 INFO  (TEST-DistribCursorPagingTest.test-seed#[853BBA7F98D3D950]) [    ] o.a.s.c.AbstractZkTestCase put C:\Users\jenkins\workspace\Lucene-Solr-master-Windows\solr\core\src\test-files\solr\collection1\conf\old_synonyms.txt to /configs/conf1/old_synonyms.txt
   [junit4]   2> 759011 INFO  (TEST-DistribCursorPagingTest.test-seed#[853BBA7F98D3D950]) [    ] o.a.s.c.AbstractZkTestCase put C:\Users\jenkins\workspace\Lucene-Solr-master-Windows\solr\core\src\test-files\solr\collection1\conf\synonyms.txt to /configs/conf1/synonyms.txt
   [junit4]   2> 759012 INFO  (TEST-DistribCursorPagingTest.test-seed#[853BBA7F98D3D950]) [    ] o.a.s.c.AbstractFullDistribZkTestBase Will use NRT replicas unless explicitly asked otherwise
   [junit4]   2> 759691 INFO  (TEST-DistribCursorPagingTest.test-seed#[853BBA7F98D3D950]) [    ] o.e.j.s.Server jetty-9.4.8.v20171121, build timestamp: 2017-11-21T17:27:37-04:00, git hash: 82b8fb23f757335bb3329d540ce37a2a2615f0a8
   [junit4]   2> 759691 INFO  (TEST-DistribCursorPagingTest.test-seed#[853BBA7F98D3D950]) [    ] o.e.j.s.session DefaultSessionIdManager workerName=node0
   [junit4]   2> 759691 INFO  (TEST-DistribCursorPagingTest.test-seed#[853BBA7F98D3D950]) [    ] o.e.j.s.session No SessionScavenger set, using defaults
   [junit4]   2> 759691 INFO  (TEST-DistribCursorPagingTest.test-seed#[853BBA7F98D3D950]) [    ] o.e.j.s.session Scavenging every 660000ms
   [junit4]   2> 759692 INFO  (TEST-DistribCursorPagingTest.test-seed#[853BBA7F98D3D950]) [    ] o.e.j.s.h.ContextHandler Started o.e.j.s.ServletContextHandler@9efb2e{/,null,AVAILABLE}
   [junit4]   2> 759694 INFO  (TEST-DistribCursorPagingTest.test-seed#[853BBA7F98D3D950]) [    ] o.e.j.s.AbstractConnector Started ServerConnector@7a1cb3{HTTP/1.1,[http/1.1]}{127.0.0.1:50800}
   [junit4]   2> 759694 INFO  (TEST-DistribCursorPagingTest.test-seed#[853BBA7F98D3D950]) [    ] o.e.j.s.Server Started @767564ms
   [junit4]   2> 759694 INFO  (TEST-DistribCursorPagingTest.test-seed#[853BBA7F98D3D950]) [    ] o.a.s.c.s.e.JettySolrRunner Jetty properties: {solr.data.dir=C:\Users\jenkins\workspace\Lucene-Solr-master-Windows\solr\build\solr-core\test\J0\temp\solr.cloud.DistribCursorPagingTest_853BBA7F98D3D950-001\tempDir-001/control/data, replicaType=NRT, hostContext=/, hostPort=50800, coreRootDirectory=C:\Users\jenkins\workspace\Lucene-Solr-master-Windows\solr\build\solr-core\test\J0\temp\solr.cloud.DistribCursorPagingTest_853BBA7F98D3D950-001\control-001\cores}
   [junit4]   2> 759694 ERROR (TEST-DistribCursorPagingTest.test-seed#[853BBA7F98D3D950]) [    ] o.a.s.u.StartupLoggingUtils Missing Java Option solr.log.dir. Logging may be missing or incomplete.
   [junit4]   2> 759694 INFO  (TEST-DistribCursorPagingTest.test-seed#[853BBA7F98D3D950]) [    ] o.a.s.s.SolrDispatchFilter  ___      _       Welcome to Apache Solr™ version 8.0.0
   [junit4]   2> 759694 INFO  (TEST-DistribCursorPagingTest.test-seed#[853BBA7F98D3D950]) [    ] o.a.s.s.SolrDispatchFilter / __| ___| |_ _   Starting in cloud mode on port null
   [junit4]   2> 759694 INFO  (TEST-DistribCursorPagingTest.test-seed#[853BBA7F98D3D950]) [    ] o.a.s.s.SolrDispatchFilter \__ \/ _ \ | '_|  Install dir: null
   [junit4]   2> 759694 INFO  (TEST-DistribCursorPagingTest.test-seed#[853BBA7F98D3D950]) [    ] o.a.s.s.SolrDispatchFilter |___/\___/_|_|    Start time: 2018-02-21T21:25:20.901Z
   [junit4]   2> 759698 INFO  (zkConnectionManagerCallback-1662-thread-1) [    ] o.a.s.c.c.ConnectionManager zkClient has connected
   [junit4]   2> 759699 INFO  (TEST-DistribCursorPagingTest.test-seed#[853BBA7F98D3D950]) [    ] o.a.s.s.SolrDispatchFilter Loading solr.xml from SolrHome (not found in ZooKeeper)
   [junit4]   2> 759699 INFO  (TEST-DistribCursorPagingTest.test-seed#[853BBA7F98D3D950]) [    ] o.a.s.c.SolrXmlConfig Loading container configuration from C:\Users\jenkins\workspace\Lucene-Solr-master-Windows\solr\build\solr-core\test\J0\temp\solr.cloud.DistribCursorPagingTest_853BBA7F98D3D950-001\control-001\solr.xml
   [junit4]   2> 759706 INFO  (TEST-DistribCursorPagingTest.test-seed#[853BBA7F98D3D950]) [    ] o.a.s.c.SolrXmlConfig Configuration parameter autoReplicaFailoverWorkLoopDelay is ignored
   [junit4]   2> 759706 INFO  (TEST-DistribCursorPagingTest.test-seed#[853BBA7F98D3D950]) [    ] o.a.s.c.SolrXmlConfig Configuration parameter autoReplicaFailoverBadNodeExpiration is ignored
   [junit4]   2> 759707 INFO  (TEST-DistribCursorPagingTest.test-seed#[853BBA7F98D3D950]) [    ] o.a.s.c.SolrXmlConfig MBean server found: com.sun.jmx.mbeanserver.JmxMBeanServer@1de5214, but no JMX reporters were configured - adding default JMX reporter.
   [junit4]   2> 759713 INFO  (TEST-DistribCursorPagingTest.test-seed#[853BBA7F98D3D950]) [    ] o.a.s.c.ZkContainer Zookeeper client=127.0.0.1:50790/solr
   [junit4]   2> 759716 INFO  (zkConnectionManagerCallback-1666-thread-1) [    ] o.a.s.c.c.ConnectionManager zkClient has connected
   [junit4]   2> 759727 INFO  (zkConnectionManagerCallback-1668-thread-1-processing-n:127.0.0.1:50800_) [n:127.0.0.1:50800_    ] o.a.s.c.c.ConnectionManager zkClient has connected
   [junit4]   2> 759813 INFO  (TEST-DistribCursorPagingTest.test-seed#[853BBA7F98D3D950]) [n:127.0.0.1:50800_    ] o.a.s.c.Overseer Overseer (id=null) closing
   [junit4]   2> 759813 INFO  (TEST-DistribCursorPagingTest.test-seed#[853BBA7F98D3D950]) [n:127.0.0.1:50800_    ] o.a.s.c.OverseerElectionContext I am going to be the leader 127.0.0.1:50800_
   [junit4]   2> 759814 INFO  (TEST-DistribCursorPagingTest.test-seed#[853BBA7F98D3D950]) [n:127.0.0.1:50800_    ] o.a.s.c.Overseer Overseer (id=72238247443824644-127.0.0.1:50800_-n_0000000000) starting
   [junit4]   2> 759821 INFO  (TEST-DistribCursorPagingTest.test-seed#[853BBA7F98D3D950]) [n:127.0.0.1:50800_    ] o.a.s.c.ZkController Register node as live in ZooKeeper:/live_nodes/127.0.0.1:50800_
   [junit4]   2> 759910 INFO  (OverseerStateUpdate-72238247443824644-127.0.0.1:50800_-n_0000000000) [n:127.0.0.1:50800_    ] o.a.s.c.c.ZkStateReader Updated live nodes from ZooKeeper... (0) -> (1)
   [junit4]   2> 760675 INFO  (TEST-DistribCursorPagingTest.test-seed#[853BBA7F98D3D950]) [n:127.0.0.1:50800_    ] o.a.s.m.r.SolrJmxReporter JMX monitoring for 'solr.node' (registry 'solr.node') enabled at server: com.sun.jmx.mbeanserver.JmxMBeanServer@1de5214
   [junit4]   2> 760684 INFO  (TEST-DistribCursorPagingTest.test-seed#[853BBA7F98D3D950]) [n:127.0.0.1:50800_    ] o.a.s.m.r.SolrJmxReporter JMX monitoring for 'solr.jvm' (registry 'solr.jvm') enabled at server: com.sun.jmx.mbeanserver.JmxMBeanServer@1de5214
   [junit4]   2> 760684 INFO  (TEST-DistribCursorPagingTest.test-seed#[853BBA7F98D3D950]) [n:127.0.0.1:50800_    ] o.a.s.m.r.SolrJmxReporter JMX monitoring for 'solr.jetty' (registry 'solr.jetty') enabled at server: com.sun.jmx.mbeanserver.JmxMBeanServer@1de5214
   [junit4]   2> 760687 INFO  (TEST-DistribCursorPagingTest.test-seed#[853BBA7F98D3D950]) [n:127.0.0.1:50800_    ] o.a.s.c.CorePropertiesLocator Found 0 core definitions underneath C:\Users\jenkins\workspace\Lucene-Solr-master-Windows\solr\build\solr-core\test\J0\temp\solr.cloud.DistribCursorPagingTest_853BBA7F98D3D950-001\control-001\cores
   [junit4]   2> 760759 INFO  (zkConnectionManagerCallback-1674-thread-1) [    ] o.a.s.c.c.ConnectionManager zkClient has connected
   [junit4]   2> 760765 INFO  (TEST-DistribCursorPagingTest.test-seed#[853BBA7F98D3D950]) [    ] o.a.s.c.c.ZkStateReader Updated live nodes from ZooKeeper... (0) -> (1)
   [junit4]   2> 760766 INFO  (TEST-DistribCursorPagingTest.test-seed#[853BBA7F98D3D950]) [    ] o.a.s.c.s.i.ZkClientClusterStateProvider Cluster at 127.0.0.1:50790/solr ready
   [junit4]   2> 760768 INFO  (qtp24734773-7847) [n:127.0.0.1:50800_    ] o.a.s.h.a.CollectionsHandler Invoked Collection Action :create with params replicationFactor=1&collection.configName=conf1&name=control_collection&nrtReplicas=1&action=CREATE&numShards=1&createNodeSet=127.0.0.1:50800_&wt=javabin&version=2 and sendToOCPQueue=true
   [junit4]   2> 760804 INFO  (OverseerThreadFactory-3974-thread-1-processing-n:127.0.0.1:50800_) [n:127.0.0.1:50800_    ] o.a.s.c.a.c.CreateCollectionCmd Create collection control_collection
   [junit4]   2> 760947 INFO  (qtp24734773-7852) [n:127.0.0.1:50800_    ] o.a.s.h.a.CoreAdminOperation core create command qt=/admin/cores&collection.configName=conf1&newCollection=true&name=control_collection_shard1_replica_n1&action=CREATE&numShards=1&collection=control_collection&shard=shard1&wt=javabin&version=2&replicaType=NRT
   [junit4]   2> 760949 INFO  (qtp24734773-7852) [n:127.0.0.1:50800_    ] o.a.s.c.TransientSolrCoreCacheDefault Allocating transient cache for 4 transient cores
   [junit4]   2> 761059 INFO  (zkCallback-1667-thread-1-processing-n:127.0.0.1:50800_) [n:127.0.0.1:50800_    ] o.a.s.c.c.ZkStateReader A cluster state change: [WatchedEvent state:SyncConnected type:NodeDataChanged path:/collections/control_collection/state.json] for collection [control_collection] has occurred - updating... (live nodes size: [1])
   [junit4]   2> 762008 INFO  (qtp24734773-7852) [n:127.0.0.1:50800_ c:control_collection s:shard1  x:control_collection_shard1_replica_n1] o.a.s.c.SolrConfig Using Lucene MatchVersion: 8.0.0
   [junit4]   2> 762020 INFO  (qtp24734773-7852) [n:127.0.0.1:50800_ c:control_collection s:shard1  x:control_collection_shard1_replica_n1] o.a.s.s.IndexSchema [control_collection_shard1_replica_n1] Schema name=sortable
   [junit4]   2> 763580 INFO  (qtp24734773-7852) [n:127.0.0.1:50800_ c:control_collection s:shard1  x:control_collection_shard1_replica_n1] o.a.s.s.IndexSchema Loaded schema sortable/1.6 with uniqueid field id
   [junit4]   2> 763580 INFO  (qtp24734773-7852) [n:127.0.0.1:50800_ c:control_collection s:shard1  x:control_collection_shard1_replica_n1] o.a.s.c.CoreContainer Creating SolrCore 'control_collection_shard1_replica_n1' using configuration from collection control_collection, trusted=true
   [junit4]   2> 763581 INFO  (qtp24734773-7852) [n:127.0.0.1:50800_ c:control_collection s:shard1  x:control_collection_shard1_replica_n1] o.a.s.m.r.SolrJmxReporter JMX monitoring for 'solr.core.control_collection.shard1.replica_n1' (registry 'solr.core.control_collection.shard1.replica_n1') enabled at server: com.sun.jmx.mbeanserver.JmxMBeanServer@1de5214
   [junit4]   2> 763581 INFO  (qtp24734773-7852) [n:127.0.0.1:50800_ c:control_collection s:shard1  x:control_collection_shard1_replica_n1] o.a.s.c.SolrCore solr.RecoveryStrategy.Builder
   [junit4]   2> 763581 INFO  (qtp24734773-7852) [n:127.0.0.1:50800_ c:control_collection s:shard1  x:control_collection_shard1_replica_n1] o.a.s.c.SolrCore [[control_collection_shard1_replica_n1] ] Opening new SolrCore at [C:\Users\jenkins\workspace\Lucene-Solr-master-Windows\solr\build\solr-core\test\J0\temp\solr.cloud.DistribCursorPagingTest_853BBA7F98D3D950-001\control-001\cores\control_collection_shard1_replica_n1], dataDir=[C:\Users\jenkins\workspace\Lucene-Solr-master-Windows\solr\build\solr-core\test\J0\temp\solr.cloud.DistribCursorPagingTest_853BBA7F98D3D950-001\control-001\cores\control_collection_shard1_replica_n1\data\]
   [junit4]   2> 763623 INFO  (qtp24734773-7852) [n:127.0.0.1:50800_ c:control_collection s:shard1  x:control_collection_shard1_replica_n1] o.a.s.u.RandomMergePolicy RandomMergePolicy wrapping class org.apache.lucene.index.LogByteSizeMergePolicy: [LogByteSizeMergePolicy: minMergeSize=1677721, mergeFactor=44, maxMergeSize=2147483648, maxMergeSizeForForcedMerge=9223372036854775807, calibrateSizeByDeletes=false, maxMergeDocs=2147483647, maxCFSSegmentSizeMB=8.796093022207999E12, noCFSRatio=0.7258315044402958]
   [junit4]   2> 763732 INFO  (qtp24734773-7852) [n:127.0.0.1:50800_ c:control_collection s:shard1  x:control_collection_shard1_replica_n1] o.a.s.u.UpdateHandler Using UpdateLog implementation: org.apache.solr.update.UpdateLog
   [junit4]   2> 763732 INFO  (qtp24734773-7852) [n:127.0.0.1:50800_ c:control_collection s:shard1  x:control_collection_shard1_replica_n1] o.a.s.u.UpdateLog Initializing UpdateLog: dataDir= defaultSyncLevel=FLUSH numRecordsToKeep=100 maxNumLogsToKeep=10 numVersionBuckets=65536
   [junit4]   2> 763734 INFO  (qtp24734773-7852) [n:127.0.0.1:50800_ c:control_collection s:shard1  x:control_collection_shard1_replica_n1] o.a.s.u.CommitTracker Hard AutoCommit: disabled
   [junit4]   2> 763734 INFO  (qtp24734773-7852) [n:127.0.0.1:50800_ c:control_collection s:shard1  x:control_collection_shard1_replica_n1] o.a.s.u.CommitTracker Soft AutoCommit: disabled
   [junit4]   2> 763736 INFO  (qtp24734773-7852) [n:127.0.0.1:50800_ c:control_collection s:shard1  x:control_collection_shard1_replica_n1] o.a.s.u.RandomMergePolicy RandomMergePolicy wrapping class org.apache.lucene.index.LogDocMergePolicy: [LogDocMergePolicy: minMergeSize=1000, mergeFactor=16, maxMergeSize=9223372036854775807, maxMergeSizeForForcedMerge=9223372036854775807, calibrateSizeByDeletes=false, maxMergeDocs=2147483647, maxCFSSegmentSizeMB=8.796093022207999E12, noCFSRatio=1.0]
   [junit4]   2> 763736 INFO  (qtp24734773-7852) [n:127.0.0.1:50800_ c:control_collection s:shard1  x:control_collection_shard1_replica_n1] o.a.s.s.SolrIndexSearcher Opening [Searcher@1d4c210[control_collection_shard1_replica_n1] main]
   [junit4]   2> 763737 INFO  (qtp24734773-7852) [n:127.0.0.1:50800_ c:control_collection s:shard1  x:control_collection_shard1_replica_n1] o.a.s.r.ManagedResourceStorage Configured ZooKeeperStorageIO with znodeBase: /configs/conf1
   [junit4]   2> 763737 INFO  (qtp24734773-7852) [n:127.0.0.1:50800_ c:control_collection s:shard1  x:control_collection_shard1_replica_n1] o.a.s.r.ManagedResourceStorage Loaded null at path _rest_managed.json using ZooKeeperStorageIO:path=/configs/conf1
   [junit4]   2> 763738 INFO  (qtp24734773-7852) [n:127.0.0.1:50800_ c:control_collection s:shard1  x:control_collection_shard1_replica_n1] o.a.s.h.ReplicationHandler Commits will be reserved for 10000ms.
   [junit4]   2> 763739 INFO  (searcherExecutor-3977-thread-1-processing-n:127.0.0.1:50800_ x:control_collection_shard1_replica_n1 s:shard1 c:control_collection) [n:127.0.0.1:50800_ c:control_collection s:shard1  x:control_collection_shard1_replica_n1] o.a.s.c.SolrCore [control_collection_shard1_replica_n1] Registered new searcher Searcher@1d4c210[control_collection_shard1_replica_n1] main{ExitableDirectoryReader(UninvertingDirectoryReader())}
   [junit4]   2> 763739 INFO  (qtp24734773-7852) [n:127.0.0.1:50800_ c:control_collection s:shard1  x:control_collection_shard1_replica_n1] o.a.s.u.UpdateLog Could not find max version in index or recent updates, using new clock 1593047331578576896
   [junit4]   2> 763749 INFO  (qtp24734773-7852) [n:127.0.0.1:50800_ c:control_collection s:shard1  x:control_collection_shard1_replica_n1] o.a.s.c.ShardLeaderElectionContext Enough replicas found to continue.
   [junit4]   2> 763749 INFO  (qtp24734773-7852) [n:127.0.0.1:50800_ c:control_collection s:shard1  x:control_collection_shard1_replica_n1] o.a.s.c.ShardLeaderElectionContext I may be the new leader - try and sync
   [junit4]   2> 763749 INFO  (qtp24734773-7852) [n:127.0.0.1:50800_ c:control_collection s:shard1  x:control_collection_shard1_replica_n1] o.a.s.c.SyncStrategy Sync replicas to http://127.0.0.1:50800/control_collection_shard1_replica_n1/
   [junit4]   2> 763749 INFO  (qtp24734773-7852) [n:127.0.0.1:50800_ c:control_collection s:shard1  x:control_collection_shard1_replica_n1] o.a.s.c.SyncStrategy Sync Success - now sync replicas to me
   [junit4]   2> 763749 INFO  (qtp24734773-7852) [n:127.0.0.1:50800_ c:control_collection s:shard1  x:control_collection_shard1_replica_n1] o.a.s.c.SyncStrategy http://127.0.0.1:50800/control_collection_shard1_replica_n1/ has no replicas
   [junit4]   2> 763749 INFO  (qtp24734773-7852) [n:127.0.0.1:50800_ c:control_collection s:shard1  x:control_collection_shard1_replica_n1] o.a.s.c.ShardLeaderElectionContext Found all replicas participating in election, clear LIR
   [junit4]   2> 763757 INFO  (qtp24734773-7852) [n:127.0.0.1:50800_ c:control_collection s:shard1  x:control_collection_shard1_replica_n1] o.a.s.c.ShardLeaderElectionContext I am the new leader: http://127.0.0.1:50800/control_collection_shard1_replica_n1/ shard1
   [junit4]   2> 763759 INFO  (zkCallback-1667-thread-1-processing-n:127.0.0.1:50800_) [n:127.0.0.1:50800_    ] o.a.s.c.c.ZkStateReader A cluster state change: [WatchedEvent state:SyncConnected type:NodeDataChanged path:/collections/control_collection/state.json] for collection [control_collection] has occurred - updating... (live nodes size: [1])
   [junit4]   2> 763809 INFO  (qtp24734773-7852) [n:127.0.0.1:50800_ c:control_collection s:shard1  x:control_collection_shard1_replica_n1] o.a.s.c.ZkController I am the leader, no recovery necessary
   [junit4]   2> 763826 INFO  (qtp24734773-7852) [n:127.0.0.1:50800_ c:control_collection s:shard1  x:control_collection_shard1_replica_n1] o.a.s.s.HttpSolrCall [admin] webapp=null path=/admin/cores params={qt=/admin/cores&collection.configName=conf1&newCollection=true&name=control_collection_shard1_replica_n1&action=CREATE&numShards=1&collection=control_collection&shard=shard1&wt=javabin&version=2&replicaType=NRT} status=0 QTime=2878
   [junit4]   2> 763846 INFO  (qtp24734773-7847) [n:127.0.0.1:50800_    ] o.a.s.h.a.CollectionsHandler Wait for new collection to be active for at most 30 seconds. Check all shard replicas
   [junit4]   2> 763960 INFO  (zkCallback-1667-thread-2-processing-n:127.0.0.1:50800_) [n:127.0.0.1:50800_    ] o.a.s.c.c.ZkStateReader A cluster state change: [WatchedEvent state:SyncConnected type:NodeDataChanged path:/collections/control_collection/state.json] for collection [control_collection] has occurred - updating... (live nodes size: [1])
   [junit4]   2> 764809 INFO  (OverseerCollectionConfigSetProcessor-72238247443824644-127.0.0.1:50800_-n_0000000000) [n:127.0.0.1:50800_    ] o.a.s.c.OverseerTaskQueue Response ZK path: /overseer/collection-queue-work/qnr-0000000000 doesn't exist.  Requestor may have disconnected from ZooKeeper
   [junit4]   2> 764848 INFO  (qtp24734773-7847) [n:127.0.0.1:50800_    ] o.a.s.s.HttpSolrCall [admin] webapp=null path=/admin/collections params={replicationFactor=1&collection.configName=conf1&name=control_collection&nrtReplicas=1&action=CREATE&numShards=1&createNodeSet=127.0.0.1:50800_&wt=javabin&version=2} status=0 QTime=4078
   [junit4]   2> 764849 WARN  (NIOServerCxn.Factory:0.0.0.0/0.0.0.0:0) [    ] o.a.z.s.NIOServerCnxn Unable to read additional data from client sessionid 0x100a44da6160005, likely client has closed socket
   [junit4]   2> 764887 INFO  (zkConnectionManagerCallback-1678-thread-1) [    ] o.a.s.c.c.ConnectionManager zkClient has connected
   [junit4]   2> 764889 INFO  (TEST-DistribCursorPagingTest.test-seed#[853BBA7F98D3D950]) [    ] o.a.s.c.c.ZkStateReader Updated live nodes from ZooKeeper... (0) -> (1)
   [junit4]   2> 764894 INFO  (TEST-DistribCursorPagingTest.test-seed#[853BBA7F98D3D950]) [    ] o.a.s.c.s.i.ZkClientClusterStateProvider Cluster at 127.0.0.1:50790/solr ready
   [junit4]   2> 764894 INFO  (TEST-DistribCursorPagingTest.test-seed#[853BBA7F98D3D950]) [    ] o.a.s.c.ChaosMonkey monkey: init - expire sessions:false cause connection loss:false
   [junit4]   2> 764896 INFO  (qtp24734773-7846) [n:127.0.0.1:50800_    ] o.a.s.h.a.CollectionsHandler Invoked Collection Action :create with params replicationFactor=1&collection.configName=conf1&name=collection1&nrtReplicas=1&action=CREATE&numShards=2&createNodeSet=&stateFormat=1&wt=javabin&version=2 and sendToOCPQueue=true
   [junit4]   2> 764914 INFO  (OverseerThreadFactory-3974-thread-2-processing-n:127.0.0.1:50800_) [n:127.0.0.1:50800_    ] o.a.s.c.a.c.CreateCollectionCmd Create collection collection1
   [junit4]   2> 764919 WARN  (OverseerThreadFactory-3974-thread-2-processing-n:127.0.0.1:50800_) [n:127.0.0.1:50800_    ] o.a.s.c.a.c.CreateCollectionCmd It is unusual to create a collection (collection1) without cores.
   [junit4]   2> 765155 INFO  (qtp24734773-7846) [n:127.0.0.1:50800_    ] o.a.s.h.a.CollectionsHandler Wait for new collection to be active for at most 30 seconds. Check all shard replicas
   [junit4]   2> 765155 INFO  (qtp24734773-7846) [n:127.0.0.1:50800_    ] o.a.s.s.HttpSolrCall [admin] webapp=null path=/admin/collections params={replicationFactor=1&collection.configName=conf1&name=collection1&nrtReplicas=1&action=CREATE&numShards=2&createNodeSet=&stateFormat=1&wt=javabin&version=2} status=0 QTime=259
   [junit4]   2> 765740 INFO  (TEST-DistribCursorPagingTest.test-seed#[853BBA7F98D3D950]) [    ] o.a.s.c.AbstractFullDistribZkTestBase create jetty 1 in directory C:\Users\jenkins\workspace\Lucene-Solr-master-Windows\solr\build\solr-core\test\J0\temp\solr.cloud.DistribCursorPagingTest_853BBA7F98D3D950-001\shard-1-001 of type NRT
   [junit4]   2> 765740 INFO  (TEST-DistribCursorPagingTest.test-seed#[853BBA7F98D3D950]) [    ] o.e.j.s.Server jetty-9.4.8.v20171121, build timestamp: 2017-11-21T17:27:37-04:00, git hash: 82b8fb23f757335bb3329d540ce37a2a2615f0a8
   [junit4]   2> 765741 INFO  (TEST-DistribCursorPagingTest.test-seed#[853BBA7F98D3D950]) [    ] o.e.j.s.session DefaultSessionIdManager workerName=node0
   [junit4]   2> 765741 INFO  (TEST-DistribCursorPagingTest.test-seed#[853BBA7F98D3D950]) [    ] o.e.j.s.session No SessionScavenger set, using defaults
   [junit4]   2> 765741 INFO  (TEST-DistribCursorPagingTest.test-seed#[853BBA7F98D3D950]) [    ] o.e.j.s.session Scavenging every 660000ms
   [junit4]   2> 765741 INFO  (TEST-DistribCursorPagingTest.test-seed#[853BBA7F98D3D950]) [    ] o.e.j.s.h.ContextHandler Started o.e.j.s.ServletContextHandler@f32345{/,null,AVAILABLE}
   [junit4]   2> 765742 INFO  (TEST-DistribCursorPagingTest.test-seed#[853BBA7F98D3D950]) [    ] o.e.j.s.AbstractConnector Started ServerConnector@1443cd9{HTTP/1.1,[http/1.1]}{127.0.0.1:50858}
   [junit4]   2> 765742 INFO  (TEST-DistribCursorPagingTest.test-seed#[853BBA7F98D3D950]) [    ] o.e.j.s.Server Started @773614ms
   [junit4]   2> 765742 INFO  (TEST-DistribCursorPagingTest.test-seed#[853BBA7F98D3D950]) [    ] o.a.s.c.s.e.JettySolrRunner Jetty properties: {solr.data.dir=C:\Users\jenkins\workspace\Lucene-Solr-master-Windows\solr\build\solr-core\test\J0\temp\solr.cloud.DistribCursorPagingTest_853BBA7F98D3D950-001\tempDir-001/jetty1, replicaType=NRT, solrconfig=solrconfig.xml, hostContext=/, hostPort=50858, coreRootDirectory=C:\Users\jenkins\workspace\Lucene-Solr-master-Windows\solr\build\solr-core\test\J0\temp\solr.cloud.DistribCursorPagingTest_853BBA7F98D3D950-001\shard-1-001\cores}
   [junit4]   2> 765742 ERROR (TEST-DistribCursorPagingTest.test-seed#[853BBA7F98D3D950]) [    ] o.a.s.u.StartupLoggingUtils Missing Java Option solr.log.dir. Logging may be missing or incomplete.
   [junit4]   2> 765743 INFO  (TEST-DistribCursorPagingTest.test-seed#[853BBA7F98D3D950]) [    ] o.a.s.s.SolrDispatchFilter  ___      _       Welcome to Apache Solr™ version 8.0.0
   [junit4]   2> 765743 INFO  (TEST-DistribCursorPagingTest.test-seed#[853BBA7F98D3D950]) [    ] o.a.s.s.SolrDispatchFilter / __| ___| |_ _   Starting in cloud mode on port null
   [junit4]   2> 765743 INFO  (TEST-DistribCursorPagingTest.test-seed#[853BBA7F98D3D950]) [    ] o.a.s.s.SolrDispatchFilter \__ \/ _ \ | '_|  Install dir: null
   [junit4]   2> 765743 INFO  (TEST-DistribCursorPagingTest.test-seed#[853BBA7F98D3D950]) [    ] o.a.s.s.SolrDispatchFilter |___/\___/_|_|    Start time: 2018-02-21T21:25:26.950Z
   [junit4]   2> 765745 INFO  (zkConnectionManagerCallback-1680-thread-1) [    ] o.a.s.c.c.ConnectionManager zkClient has connected
   [junit4]   2> 765746 WARN  (NIOServerCxn.Factory:0.0.0.0/0.0.0.0:0) [    ] o.a.z.s.NIOServerCnxn Unable to read additional data from client sessionid 0x100a44da6160007, likely client has closed socket
   [junit4]   2> 765746 INFO  (TEST-DistribCursorPagingTest.test-seed#[853BBA7F98D3D950]) [    ] o.a.s.s.SolrDispatchFilter Loading solr.xml from SolrHome (not found in ZooKeeper)
   [junit4]   2> 765746 INFO  (TEST-DistribCursorPagingTest.test-seed#[853BBA7F98D3D950]) [    ] o.a.s.c.SolrXmlConfig Loading container configuration from C:\Users\jenkins\workspace\Lucene-Solr-master-Windows\solr\build\solr-core\test\J0\temp\solr.cloud.DistribCursorPagingTest_853BBA7F98D3D950-001\shard-1-001\solr.xml
   [junit4]   2> 765752 INFO  (TEST-DistribCursorPagingTest.test-seed#[853BBA7F98D3D950]) [    ] o.a.s.c.SolrXmlConfig Configuration parameter autoReplicaFailoverWorkLoopDelay is ignored
   [junit4]   2> 765752 INFO  (TEST-DistribCursorPagingTest.test-seed#[853BBA7F98D3D950]) [    ] o.a.s.c.SolrXmlConfig Configuration parameter autoReplicaFailoverBadNodeExpiration is ignored
   [junit4]   2> 765754 INFO  (TEST-DistribCursorPagingTest.test-seed#[853BBA7F98D3D950]) [    ] o.a.s.c.SolrXmlConfig MBean server found: com.sun.jmx.mbeanserver.JmxMBeanServer@1de5214, but no JMX reporters were configured - adding default JMX reporter.
   [junit4]   2> 765758 INFO  (TEST-DistribCursorPagingTest.test-seed#[853BBA7F98D3D950]) [    ] o.a.s.c.ZkContainer Zookeeper client=127.0.0.1:50790/solr
   [junit4]   2> 765781 INFO  (zkConnectionManagerCallback-1684-thread-1) [    ] o.a.s.c.c.ConnectionManager zkClient has connected
   [junit4]   2> 765795 WARN  (NIOServerCxn.Factory:0.0.0.0/0.0.0.0:0) [    ] o.a.z.s.NIOServerCnxn Unable to read additional data from client sessionid 0x100a44da6160008, likely client has closed socket
   [junit4]   2> 765820 INFO  (zkConnectionManagerCallback-1686-thread-1-processing-n:127.0.0.1:50858_) [n:127.0.0.1:50858_    ] o.a.s.c.c.ConnectionManager zkClient has connected
   [junit4]   2> 765856 INFO  (TEST-DistribCursorPagingTest.test-seed#[853BBA7F98D3D950]) [n:127.0.0.1:50858_    ] o.a.s.c.c.ZkStateReader Updated live nodes from ZooKeeper... (0) -> (1)
   [junit4]   2> 765878 INFO  (TEST-DistribCursorPagingTest.test-seed#[853BBA7F98D3D950]) [n:127.0.0.1:50858_    ] o.a.s.c.Overseer Overseer (id=null) closing
   [junit4]   2> 765884 INFO  (TEST-DistribCursorPagingTest.test-seed#[853BBA7F98D3D950]) [n:127.0.0.1:50858_    ] o.a.s.c.ZkController Register node as live in ZooKeeper:/live_nodes/127.0.0.1:50858_
   [junit4]   2> 765888 INFO  (zkCallback-1677-thread-1) [    ] o.a.s.c.c.ZkStateReader Updated live nodes from ZooKeeper... (1) -> (2)
   [junit4]   2> 765888 INFO  (zkCallback-1667-thread-2-processing-n:127.0.0.1:50800_) [n:127.0.0.1:50800_    ] o.a.s.c.c.ZkStateReader Updated live nodes from ZooKeeper... (1) -> (2)
   [junit4]   2> 765896 INFO  (zkCallback-1685-thread-1-processing-n:127.0.0.1:50858_) [n:127.0.0.1:50858_    ] o.a.s.c.c.ZkStateReader Updated live nodes from ZooKeeper... (1) -> (2)
   [junit4]   2> 766021 INFO  (TEST-DistribCursorPagingTest.test-seed#[853BBA7F98D3D950]) [n:127.0.0.1:50858_    ] o.a.s.m.r.SolrJmxReporter JMX monitoring for 'solr.node' (registry 'solr.node') enabled at server: com.sun.jmx.mbeanserver.JmxMBeanServer@1de5214
   [junit4]   2> 766027 INFO  (TEST-DistribCursorPagingTest.test-seed#[853BBA7F98D3D950]) [n:127.0.0.1:50858_    ] o.a.s.m.r.SolrJmxReporter JMX monitoring for 'solr.jvm' (registry 'solr.jvm') enabled at server: com.sun.jmx.mbeanserver.JmxMBeanServer@1de5214
   [junit4]   2> 766027 INFO  (TEST-DistribCursorPagingTest.test-seed#[853BBA7F98D3D950]) [n:127.0.0.1:50858_    ] o.a.s.m.r.SolrJmxReporter JMX monitoring for 'solr.jetty' (registry 'solr.jetty') enabled at server: com.sun.jmx.mbeanserver.JmxMBeanServer@1de5214
   [junit4]   2> 766029 INFO  (TEST-DistribCursorPagingTest.test-seed#[853BBA7F98D3D950]) [n:127.0.0.1:50858_    ] o.a.s.c.CorePropertiesLocator Found 0 core definitions underneath C:\Users\jenkins\workspace\Lucene-Solr-master-Windows\solr\build\solr-core\test\J0\temp\solr.cloud.DistribCursorPagingTest_853BBA7F98D3D950-001\shard-1-001\cores
   [junit4]   2> 766064 INFO  (qtp24734773-7852) [n:127.0.0.1:50800_    ] o.a.s.h.a.CollectionsHandler Invoked Collection Action :addreplica with params node=127.0.0.1:50858_&action=ADDREPLICA&collection=collection1&shard=shard2&type=NRT&wt=javabin&version=2 and sendToOCPQueue=true
   [junit4]   2> 766067 INFO  (OverseerCollectionConfigSetProcessor-72238247443824644-127.0.0.1:50800_-n_0000000000) [n:127.0.0.1:50800_    ] o.a.s.c.OverseerTaskQueue Response ZK path: /overseer/collection-queue-work/qnr-0000000002 doesn't exist.  Requestor may have disconnected from ZooKeeper
   [junit4]   2> 766083 INFO  (OverseerThreadFactory-3974-thread-3-processing-n:127.0.0.1:50800_) [n:127.0.0.1:50800_    ] o.a.s.c.a.c.AddReplicaCmd Node Identified 127.0.0.1:50858_ for creating new replica
   [junit4]   2> 766110 INFO  (qtp20828356-7898) [n:127.0.0.1:50858_    ] o.a.s.h.a.CoreAdminOperation core create command qt=/admin/cores&collection.configName=conf1&name=collection1_shard2_replica_n41&action=CREATE&collection=collection1&shard=shard2&wt=javabin&version=2&replicaType=NRT
   [junit4]   2> 766110 INFO  (qtp20828356-7898) [n:127.0.0.1:50858_    ] o.a.s.c.TransientSolrCoreCacheDefault Allocating transient cache for 4 transient cores
   [junit4]   2> 767133 INFO  (qtp20828356-7898) [n:127.0.0.1:50858_ c:collection1 s:shard2  x:collection1_shard2_replica_n41] o.a.s.c.SolrConfig Using Lucene MatchVersion: 8.0.0
   [junit4]   2> 767141 INFO  (qtp20828356-7898) [n:127.0.0.1:50858_ c:collection1 s:shard2  x:collection1_shard2_replica_n41] o.a.s.s.IndexSchema [collection1_shard2_replica_n41] Schema name=sortable
   [junit4]   2> 767210 INFO  (qtp20828356-7898) [n:127.0.0.1:50858_ c:collection1 s:shard2  x:collection1_shard2_replica_n41] o.a.s.s.IndexSchema Loaded schema sortable/1.6 with uniqueid field id
   [junit4]   2> 767210 INFO  (qtp20828356-7898) [n:127.0.0.1:50858_ c:collection1 s:shard2  x:collection1_shard2_replica_n41] o.a.s.c.CoreContainer Creating SolrCore 'collection1_shard2_replica_n41' using configuration from collection collection1, trusted=true
   [junit4]   2> 767211 INFO  (qtp20828356-7898) [n:127.0.0.1:50858_ c:collection1 s:shard2  x:collection1_shard2_replica_n41] o.a.s.m.r.SolrJmxReporter JMX monitoring for 'solr.core.collection1.shard2.replica_n41' (registry 'solr.core.collection1.shard2.replica_n41') enabled at server: com.sun.jmx.mbeanserver.JmxMBeanServer@1de5214
   [junit4]   2> 767212 INFO  (qtp20828356-7898) [n:127.0.0.1:50858_ c:collection1 s:shard2  x:collection1_shard2_replica_n41] o.a.s.c.SolrCore solr.RecoveryStrategy.Builder
   [junit4]   2> 767212 INFO  (qtp20828356-7898) [n:127.0.0.1:50858_ c:collection1 s:shard2  x:collection1_shard2_replica_n41] o.a.s.c.SolrCore [[collection1_shard2_replica_n41] ] Opening new SolrCore at [C:\Users\jenkins\workspace\Lucene-Solr-master-Windows\solr\build\solr-core\test\J0\temp\solr.cloud.DistribCursorPagingTest_853BBA7F98D3D950-001\shard-1-001\cores\collection1_shard2_replica_n41], dataDir=[C:\Users\jenkins\workspace\Lucene-Solr-master-Windows\solr\build\solr-core\test\J0\temp\solr.cloud.DistribCursorPagingTest_853BBA7F98D3D950-001\shard-1-001\cores\collection1_shard2_replica_n41\data\]
   [junit4]   2> 767213 INFO  (qtp20828356-7898) [n:127.0.0.1:50858_ c:collection1 s:shard2  x:collection1_shard2_replica_n41] o.a.s.u.RandomMergePolicy RandomMergePolicy wrapping class org.apache.lucene.index.LogByteSizeMergePolicy: [LogByteSizeMergePolicy: minMergeSize=1677721, mergeFactor=44, maxMergeSize=2147483648, maxMergeSizeForForcedMerge=9223372036854775807, calibrateSizeByDeletes=false, maxMergeDocs=2147483647, maxCFSSegmentSizeMB=8.796093022207999E12, noCFSRatio=0.7258315044402958]
   [junit4]   2> 767411 INFO  (qtp20828356-7898) [n:127.0.0.1:50858_ c:collection1 s:shard2  x:collection1_shard2_replica_n41] o.a.s.u.UpdateHandler Using UpdateLog implementation: org.apache.solr.update.UpdateLog
   [junit4]   2> 767411 INFO  (qtp20828356-7898) [n:127.0.0.1:50858_ c:collection1 s:shard2  x:collection1_shard2_replica_n41] o.a.s.u.UpdateLog Initializing UpdateLog: dataDir= defaultSyncLevel=FLUSH numRecordsToKeep=100 maxNumLogsToKeep=10 numVersionBuckets=65536
   [junit4]   2> 767413 INFO  (qtp20828356-7898) [n:127.0.0.1:50858_ c:collection1 s:shard2  x:collection1_shard2_replica_n41] o.a.s.u.CommitTracker Hard AutoCommit: disabled
   [junit4]   2> 767413 INFO  (qtp20828356-7898) [n:127.0.0.1:50858_ c:collection1 s:shard2  x:collection1_shard2_replica_n41] o.a.s.u.CommitTracker Soft AutoCommit: disabled
   [junit4]   2> 767414 INFO  (qtp20828356-7898) [n:127.0.0.1:50858_ c:collection1 s:shard2  x:collection1_shard2_replica_n41] o.a.s.u.RandomMergePolicy RandomMergePolicy wrapping class org.apache.lucene.index.LogDocMergePolicy: [LogDocMergePolicy: minMergeSize=1000, mergeFactor=16, maxMergeSize=9223372036854775807, maxMergeSizeForForcedMerge=9223372036854775807, calibrateSizeByDeletes=false, maxMergeDocs=2147483647, maxCFSSegmentSizeMB=8.796093022207999E12, noCFSRatio=1.0]
   [junit4]   2> 767414 INFO  (qtp20828356-7898) [n:127.0.0.1:50858_ c:collection1 s:shard2  x:collection1_shard2_replica_n41] o.a.s.s.SolrIndexSearcher Opening [Searcher@17e30cb[collection1_shard2_replica_n41] main]
   [junit4]   2> 767416 INFO  (qtp20828356-7898) [n:127.0.0.1:50858_ c:collection1 s:shard2  x:collection1_shard2_replica_n41] o.a.s.r.ManagedResourceStorage Configured ZooKeeperStorageIO with znodeBase: /configs/conf1
   [junit4]   2> 767416 INFO  (qtp20828356-7898) [n:127.0.0.1:50858_ c:collection1 s:shard2  x:collection1_shard2_replica_n41] o.a.s.r.ManagedResourceStorage Loaded null at path _rest_managed.json using ZooKeeperStorageIO:path=/configs/conf1
   [junit4]   2> 767417 INFO  (qtp20828356-7898) [n:127.0.0.1:50858_ c:collection1 s:shard2  x:collection1_shard2_replica_n41] o.a.s.h.ReplicationHandler Commits will be reserved for 10000ms.
   [junit4]   2> 767417 INFO  (searcherExecutor-3988-thread-1-processing-n:127.0.0.1:50858_ x:collection1_shard2_replica_n41 s:shard2 c:collection1) [n:127.0.0.1:50858_ c:collection1 s:shard2  x:collection1_shard2_replica_n41] o.a.s.c.SolrCore [collection1_shard2_replica_n41] Registered new searcher Searcher@17e30cb[collection1_shard2_replica_n41] main{ExitableDirectoryReader(UninvertingDirectoryReader())}
   [junit4]   2> 767418 INFO  (qtp20828356-7898) [n:127.0.0.1:50858_ c:collection1 s:shard2  x:collection1_shard2_replica_n41] o.a.s.u.UpdateLog Could not find max version in index or recent updates, using new clock 1593047335436288000
   [junit4]   2> 767425 INFO  (qtp20828356-7898) [n:127.0.0.1:50858_ c:collection1 s:shard2  x:collection1_shard2_replica_n41] o.a.s.c.ShardLeaderElectionContext Enough replicas found to continue.
   [junit4]   2> 767425 INFO  (qtp20828356-7898) [n:127.0.0.1:50858_ c:collection1 s:shard2  x:collection1_shard2_replica_n41] o.a.s.c.ShardLeaderElectionContext I may be the new leader - try and sync
   [junit4]   2> 767425 INFO  (qtp20828356-7898) [n:127.0.0.1:50858_ c:collection1 s:shard2  x:collection1_shard2_replica_n41] o.a.s.c.SyncStrategy Sync replicas to http://127.0.0.1:50858/collection1_shard2_replica_n41/
   [junit4]   2> 767425 INFO  (qtp20828356-7898) [n:127.0.0.1:50858_ c:collection1 s:shard2  x:collection1_shard2_replica_n41] o.a.s.c.SyncStrategy Sync Success - now sync replicas to me
   [junit4]   2> 767425 INFO  (qtp20828356-7898) [n:127.0.0.1:50858_ c:collection1 s:shard2  x:collection1_shard2_replica_n41] o.a.s.c.SyncStrategy http://127.0.0.1:50858/collection1_shard2_replica_n41/ has no replicas
   [junit4]   2> 767425 INFO  (qtp20828356-7898) [n:127.0.0.1:50858_ c:collection1 s:shard2  x:collection1_shard2_replica_n41] o.a.s.c.ShardLeaderElectionContext Found all replicas participating in election, clear LIR
   [junit4]   2> 767428 INFO  (qtp20828356-7898) [n:127.0.0.1:50858_ c:collection1 s:shard2  x:collection1_shard2_replica_n41] o.a.s.c.ShardLeaderElectionContext I am the new leader: http://127.0.0.1:50858/collection1_shard2_replica_n41/ shard2
   [junit4]   2> 767600 INFO  (qtp20828356-7898) [n:127.0.0.1:50858_ c:collection1 s:shard2  x:collection1_shard2_replica_n41] o.a.s.c.ZkController I am the leader, no recovery necessary
   [junit4]   2> 767604 INFO  (qtp20828356-7898) [n:127.0.0.1:50858_ c:collection1 s:shard2  x:collection1_shard2_replica_n41] o.a.s.s.HttpSolrCall [admin] webapp=null path=/admin/cores params={qt=/admin/cores&collection.configName=conf1&name=collection1_shard2_replica_n41&action=CREATE&collection=collection1&shard=shard2&wt=javabin&version=2&replicaType=NRT} status=0 QTime=1494
   [junit4]   2> 767608 INFO  (qtp24734773-7852) [n:127.0.0.1:50800_    ] o.a.s.s.HttpSolrCall [admin] webapp=null path=/admin/collections params={node=127.0.0.1:50858_&action=ADDREPLICA&collection=collection1&shard=shard2&type=NRT&wt=javabin&version=2} status=0 QTime=1543
   [junit4]   2> 768092 INFO  (OverseerCollectionConfigSetProcessor-72238247443824644-127.0.0.1:50800_-n_0000000000) [n:127.0.0.1:50800_    ] o.a.s.c.OverseerTaskQueue Response ZK path: /overseer/collection-queue-work/qnr-0000000004 doesn't exist.  Requestor may have disconnected from ZooKeeper
   [junit4]   2> 768217 INFO  (TEST-DistribCursorPagingTest.test-seed#[853BBA7F98D3D950]) [    ] o.a.s.c.AbstractFullDistribZkTestBase create jetty 2 in directory C:\Users\jenkins\workspace\Lucene-Solr-master-Windows\solr\build\solr-core\test\J0\temp\solr.cloud.DistribCursorPagingTest_853BBA7F98D3D950-001\shard-2-001 of type NRT
   [junit4]   2> 768217 INFO  (TEST-DistribCursorPagingTest.test-seed#[853BBA7F98D3D950]) [    ] o.e.j.s.Server jetty-9.4.8.v20171121, build timestamp: 2017-11-21T17:27:37-04:00, git hash: 82b8fb23f757335bb3329d540ce37a2a2615f0a8
   [junit4]   2> 768218 INFO  (TEST-DistribCursorPagingTest.test-seed#[853BBA7F98D3D950]) [    ] o.e.j.s.session DefaultSessionIdManager workerName=node0
   [junit4]   2> 768218 INFO  (TEST-DistribCursorPagingTest.test-seed#[853BBA7F98D3D950]) [    ] o.e.j.s.session No SessionScavenger set, using defaults
   [junit4]   2> 768218 INFO  (TEST-DistribCursorPagingTest.test-seed#[853BBA7F98D3D950]) [    ] o.e.j.s.session Scavenging every 600000ms
   [junit4]   2> 768218 INFO  (TEST-DistribCursorPagingTest.test-seed#[853BBA7F98D3D950]) [    ] o.e.j.s.h.ContextHandler Started o.e.j.s.ServletContextHandler@19a55f6{/,null,AVAILABLE}
   [junit4]   2> 768219 INFO  (TEST-DistribCursorPagingTest.test-seed#[853BBA7F98D3D950]) [    ] o.e.j.s.AbstractConnector Started ServerConnector@7d3f15{HTTP/1.1,[http/1.1]}{127.0.0.1:50889}
   [junit4]   2> 768219 INFO  (TEST-DistribCursorPagingTest.test-seed#[853BBA7F98D3D950]) [    ] o.e.j.s.Server Started @776090ms
   [junit4]   2> 768219 INFO  (TEST-DistribCursorPagingTest.test-seed#[853BBA7F98D3D950]) [    ] o.a.s.c.s.e.JettySolrRunner Jetty properties: {solr.data.dir=C:\Users\jenkins\workspace\Lucene-Solr-master-Windows\solr\build\solr-core\test\J0\temp\solr.cloud.DistribCursorPagingTest_853BBA7F98D3D950-001\tempDir-001/jetty2, replicaType=NRT, solrconfig=solrconfig.xml, hostContext=/, hostPort=50889, coreRootDirectory=C:\Users\jenkins\workspace\Lucene-Solr-master-Windows\solr\build\solr-core\test\J0\..\..\..\..\..\..\..\..\..\Users\jenkins\workspace\Lucene-Solr-master-Windows\solr\build\solr-core\test\J0\temp\solr.cloud.DistribCursorPagingTest_853BBA7F98D3D950-001\shard-2-001\cores}
   [junit4]   2> 768219 ERROR (TEST-DistribCursorPagingTest.test-seed#[853BBA7F98D3D950]) [    ] o.a.s.u.StartupLoggingUtils Missing Java Option solr.log.dir. Logging may be missing or incomplete.
   [junit4]   2> 768219 INFO  (TEST-DistribCursorPagingTest.test-seed#[853BBA7F98D3D950]) [    ] o.a.s.s.SolrDispatchFilter  ___      _       Welcome to Apache Solr™ version 8.0.0
   [junit4]   2> 768219 INFO  (TEST-DistribCursorPagingTest.test-seed#[853BBA7F98D3D950]) [    ] o.a.s.s.SolrDispatchFilter / __| ___| |_ _   Starting in cloud mode on port null
   [junit4]   2> 768219 INFO  (TEST-DistribCursorPagingTest.test-seed#[853BBA7F98D3D950]) [    ] o.a.s.s.SolrDispatchFilter \__ \/ _ \ | '_|  Install dir: null
   [junit4]   2> 768219 INFO  (TEST-DistribCursorPagingTest.test-seed#[853BBA7F98D3D950]) [    ] o.a.s.s.SolrDispatchFilter |___/\___/_|_|    Start time: 2018-02-21T21:25:29.426Z
   [junit4]   2> 768269 INFO  (zkConnectionManagerCallback-1690-thread-1) [    ] o.a.s.c.c.ConnectionManager zkClient has connected
   [junit4]   2> 768272 INFO  (TEST-DistribCursorPagingTest.test-seed#[853BBA7F98D3D950]) [    ] o.a.s.s.SolrDispatchFilter Loading solr.xml from SolrHome (not found in ZooKeeper)
   [junit4]   2> 768272 INFO  (TEST-DistribCursorPagingTest.test-seed#[853BBA7F98D3D950]) [    ] o.a.s.c.SolrXmlConfig Loading container configuration from C:\Users\jenkins\workspace\Lucene-Solr-master-Windows\solr\build\solr-core\test\J0\temp\solr.cloud.DistribCursorPagingTest_853BBA7F98D3D950-001\shard-2-001\solr.xml
   [junit4]   2> 768278 INFO  (TEST-DistribCursorPagingTest.test-seed#[853BBA7F98D3D950]) [    ] o.a.s.c.SolrXmlConfig Configuration parameter autoReplicaFailoverWorkLoopDelay is ignored
   [junit4]   2> 768278 INFO  (TEST-DistribCursorPagingTest.test-seed#[853BBA7F98D3D950]) [    ] o.a.s.c.SolrXmlConfig Configuration parameter autoReplicaFailoverBadNodeExpiration is ignored
   [junit4]   2> 768279 INFO  (TEST-DistribCursorPagingTest.test-seed#[853BBA7F98D3D950]) [    ] o.a.s.c.SolrXmlConfig MBean server found: com.sun.jmx.mbeanserver.JmxMBeanServer@1de5214, but no JMX reporters were configured - adding default JMX reporter.
   [junit4]   2> 768282 INFO  (TEST-DistribCursorPagingTest.test-seed#[853BBA7F98D3D950]) [    ] o.a.s.c.ZkContainer Zookeeper client=127.0.0.1:50790/solr
   [junit4]   2> 768286 INFO  (zkConnectionManagerCallback-1694-thread-1) [    ] o.a.s.c.c.ConnectionManager zkClient has connected
   [junit4]   2> 768291 INFO  (zkConnectionManagerCallback-1696-thread-1-processing-n:127.0.0.1:50889_) [n:127.0.0.1:50889_    ] o.a.s.c.c.ConnectionManager zkClient has connected
   [junit4]   2> 768296 INFO  (TEST-DistribCursorPagingTest.test-seed#[853BBA7F98D3D950]) [n:127.0.0.1:50889_    ] o.a.s.c.c.ZkStateReader Updated live nodes from ZooKeeper... (0) -> (2)
   [junit4]   2> 768297 INFO  (TEST-DistribCursorPagingTest.test-seed#[853BBA7F98D3D950]) [n:127.0.0.1:50889_    ] o.a.s.c.Overseer Overseer (id=null) closing
   [junit4]   2> 768299 INFO  (TEST-DistribCursorPagingTest.test-seed#[853BBA7F98D3D950]) [n:127.0.0.1:50889_    ] o.a.s.c.ZkController Register node as live in ZooKeeper:/live_nodes/127.0.0.1:50889_
   [junit4]   2> 768300 INFO  (zkCallback-1677-thread-1) [    ] o.a.s.c.c.ZkStateReader Updated live nodes from ZooKeeper... (2) -> (3)
   [junit4]   2> 768300 INFO  (zkCallback-1685-thread-1-processing-n:127.0.0.1:50858_) [n:127.0.0.1:50858_    ] o.a.s.c.c.ZkStateReader Updated live nodes from ZooKeeper... (2) -> (3)
   [junit4]   2> 768300 INFO  (zkCallback-1667-thread-2-processing-n:127.0.0.1:50800_) [n:127.0.0.1:50800_    ] o.a.s.c.c.ZkStateReader Updated live nodes from ZooKeeper... (2) -> (3)
   [junit4]   2> 768304 INFO  (zkCallback-1695-thread-1-processing-n:127.0.0.1:50889_) [n:127.0.0.1:50889_    ] o.a.s.c.c.ZkStateReader Updated live nodes from ZooKeeper... (2) -> (3)
   [junit4]   2> 768447 INFO  (TEST-DistribCursorPagingTest.test-seed#[853BBA7F98D3D950]) [n:127.0.0.1:50889_    ] o.a.s.m.r.SolrJmxReporter J

[...truncated too long message...]

]   2> 154933 INFO  (SUITE-SchemaTest-seed#[706783DA71363954]-worker) [    ] o.a.s.SolrTestCaseJ4 ------------------------------------------------------- Done waiting for tracked resources to be released
   [junit4]   2> NOTE: test params are: codec=Asserting(Lucene70): {}, docValues:{}, maxPointsInLeafNode=442, maxMBSortInHeap=7.088068413103947, sim=Asserting(org.apache.lucene.search.similarities.AssertingSimilarity@e3b18e), locale=es-AR, timezone=Asia/Kuwait
   [junit4]   2> NOTE: Windows 10 10.0 x86/Oracle Corporation 1.8.0_144 (32-bit)/cpus=3,threads=1,free=145755632,total=268435456
   [junit4]   2> NOTE: All tests run in this JVM: [NormalDistributionEvaluatorTest, FieldAnalysisResponseTest, EmpiricalDistributionEvaluatorTest, ReverseEvaluatorTest, AppendEvaluatorTest, TestLBHttpSolrClient, TestPolicy, TestEmbeddedSolrServer, GreaterThanEvaluatorTest, TestCoreAdmin, TermsResponseTest, TestCloudSolrClientConnections, TestJavaBinCodec, SolrExampleEmbeddedTest, SolrExampleXMLTest, RecursiveEvaluatorTest, CeilingEvaluatorTest, AddEvaluatorTest, CosineEvaluatorTest, TestDocumentObjectBinder, TestSolrProperties, CloudSolrClientMultiConstructorTest, TestJsonRecordReader, CloudSolrClientBuilderTest, UuidEvaluatorTest, JettyWebappTest, MultiplyEvaluatorTest, StreamExpressionToExpessionTest, ArcSineEvaluatorTest, ExclusiveOrEvaluatorTest, NotEvaluatorTest, SubtractEvaluatorTest, ConcurrentUpdateSolrClientBuilderTest, SolrExampleStreamingTest, LargeVolumeBinaryJettyTest, TestBatchUpdate, TestSpellCheckResponse, MergeIndexesEmbeddedTest, SolrQueryTest, TestHash, ContentStreamTest, ModifiableSolrParamsTest, TestXMLEscaping, SolrDocumentTest, TestUpdateRequestCodec, NamedListTest, AnlysisResponseBaseTest, UsingSolrJRefGuideExamplesTest, CollectionAdminRequestRequiredParamsTest, GetByIdTest, TestSolrJErrorHandling, HttpSolrClientBuilderTest, HttpSolrClientSSLAuthConPoolTest, GraphTest, JdbcDriverTest, JdbcTest, JDBCStreamTest, SelectWithEvaluatorsTest, StreamingTest, AbsoluteValueEvaluatorTest, AndEvaluatorTest, ArcCosineEvaluatorTest, ArrayEvaluatorTest, AscEvaluatorTest, CumulativeProbabilityEvaluatorTest, DivideEvaluatorTest, FloorEvaluatorTest, GreaterThanEqualToEvaluatorTest, HyperbolicCosineEvaluatorTest, HyperbolicSineEvaluatorTest, LengthEvaluatorTest, LessThanEqualToEvaluatorTest, LessThanEvaluatorTest, ModuloEvaluatorTest, NormalizeEvaluatorTest, OrEvaluatorTest, PowerEvaluatorTest, RoundEvaluatorTest, SineEvaluatorTest, SquareRootEvaluatorTest, TangentEvaluatorTest, UniformDistributionEvaluatorTest, StreamExpressionParserTest, ConcatOperationTest, OperationsTest, SchemaTest]
   [junit4]   2> NOTE: reproduce with: ant test  -Dtestcase=SchemaTest -Dtests.seed=706783DA71363954 -Dtests.slow=true -Dtests.locale=es-AR -Dtests.timezone=Asia/Kuwait -Dtests.asserts=true -Dtests.file.encoding=Cp1252
   [junit4] ERROR   0.00s J0 | SchemaTest (suite) <<<
   [junit4]    > Throwable #1: java.io.IOException: Could not remove the following files (in the order of attempts):
   [junit4]    >    C:\Users\jenkins\workspace\Lucene-Solr-master-Windows\solr\build\solr-solrj\test\J0\temp\solr.client.solrj.request.SchemaTest_706783DA71363954-001\tempDir-103\configsets\configset-1: java.nio.file.DirectoryNotEmptyException: C:\Users\jenkins\workspace\Lucene-Solr-master-Windows\solr\build\solr-solrj\test\J0\temp\solr.client.solrj.request.SchemaTest_706783DA71363954-001\tempDir-103\configsets\configset-1
   [junit4]    >    C:\Users\jenkins\workspace\Lucene-Solr-master-Windows\solr\build\solr-solrj\test\J0\temp\solr.client.solrj.request.SchemaTest_706783DA71363954-001\tempDir-103\configsets: java.nio.file.DirectoryNotEmptyException: C:\Users\jenkins\workspace\Lucene-Solr-master-Windows\solr\build\solr-solrj\test\J0\temp\solr.client.solrj.request.SchemaTest_706783DA71363954-001\tempDir-103\configsets
   [junit4]    >    C:\Users\jenkins\workspace\Lucene-Solr-master-Windows\solr\build\solr-solrj\test\J0\temp\solr.client.solrj.request.SchemaTest_706783DA71363954-001\tempDir-103: java.nio.file.DirectoryNotEmptyException: C:\Users\jenkins\workspace\Lucene-Solr-master-Windows\solr\build\solr-solrj\test\J0\temp\solr.client.solrj.request.SchemaTest_706783DA71363954-001\tempDir-103
   [junit4]    > 	at __randomizedtesting.SeedInfo.seed([706783DA71363954]:0)
   [junit4]    > 	at org.apache.lucene.util.IOUtils.rm(IOUtils.java:329)
   [junit4]    > 	at java.lang.Thread.run(Thread.java:748)
   [junit4] Completed [119/146 (1!)] on J0 in 17.07s, 35 tests, 1 error <<< FAILURES!

[...truncated 1569 lines...]
   [junit4] Suite: org.apache.solr.update.processor.TestOpenNLPExtractNamedEntitiesUpdateProcessorFactory
   [junit4]   2> Creating dataDir: C:\Users\jenkins\workspace\Lucene-Solr-master-Windows\solr\build\contrib\solr-analysis-extras\test\J1\temp\solr.update.processor.TestOpenNLPExtractNamedEntitiesUpdateProcessorFactory_12D97ED429EA3EF2-001\init-core-data-001
   [junit4]   2> NOTE: test params are: codec=Asserting(Lucene70): {}, docValues:{}, maxPointsInLeafNode=1673, maxMBSortInHeap=7.028208817353578, sim=Asserting(org.apache.lucene.search.similarities.AssertingSimilarity@f98a66), locale=ar-YE, timezone=America/Port-au-Prince
   [junit4]   2> NOTE: Windows 10 10.0 x86/Oracle Corporation 1.8.0_144 (32-bit)/cpus=3,threads=1,free=51817512,total=95420416
   [junit4]   2> NOTE: All tests run in this JVM: [TestFoldingMultitermExtrasQuery, TestOpenNLPExtractNamedEntitiesUpdateProcessorFactory]
   [junit4]   2> NOTE: reproduce with: ant test  -Dtestcase=TestOpenNLPExtractNamedEntitiesUpdateProcessorFactory -Dtests.seed=12D97ED429EA3EF2 -Dtests.slow=true -Dtests.locale=ar-YE -Dtests.timezone=America/Port-au-Prince -Dtests.asserts=true -Dtests.file.encoding=Cp1252
   [junit4] ERROR   0.00s J1 | TestOpenNLPExtractNamedEntitiesUpdateProcessorFactory (suite) <<<
   [junit4]    > Throwable #1: java.io.IOException: Could not remove the following files (in the order of attempts):
   [junit4]    >    C:\Users\jenkins\workspace\Lucene-Solr-master-Windows\solr\build\contrib\solr-analysis-extras\test\J1\temp\solr.update.processor.TestOpenNLPExtractNamedEntitiesUpdateProcessorFactory_12D97ED429EA3EF2-001\tempDir-001\collection1\conf: java.nio.file.DirectoryNotEmptyException: C:\Users\jenkins\workspace\Lucene-Solr-master-Windows\solr\build\contrib\solr-analysis-extras\test\J1\temp\solr.update.processor.TestOpenNLPExtractNamedEntitiesUpdateProcessorFactory_12D97ED429EA3EF2-001\tempDir-001\collection1\conf
   [junit4]    >    C:\Users\jenkins\workspace\Lucene-Solr-master-Windows\solr\build\contrib\solr-analysis-extras\test\J1\temp\solr.update.processor.TestOpenNLPExtractNamedEntitiesUpdateProcessorFactory_12D97ED429EA3EF2-001\tempDir-001\collection1: java.nio.file.DirectoryNotEmptyException: C:\Users\jenkins\workspace\Lucene-Solr-master-Windows\solr\build\contrib\solr-analysis-extras\test\J1\temp\solr.update.processor.TestOpenNLPExtractNamedEntitiesUpdateProcessorFactory_12D97ED429EA3EF2-001\tempDir-001\collection1
   [junit4]    >    C:\Users\jenkins\workspace\Lucene-Solr-master-Windows\solr\build\contrib\solr-analysis-extras\test\J1\temp\solr.update.processor.TestOpenNLPExtractNamedEntitiesUpdateProcessorFactory_12D97ED429EA3EF2-001\tempDir-001: java.nio.file.DirectoryNotEmptyException: C:\Users\jenkins\workspace\Lucene-Solr-master-Windows\solr\build\contrib\solr-analysis-extras\test\J1\temp\solr.update.processor.TestOpenNLPExtractNamedEntitiesUpdateProcessorFactory_12D97ED429EA3EF2-001\tempDir-001
   [junit4]    >    C:\Users\jenkins\workspace\Lucene-Solr-master-Windows\solr\build\contrib\solr-analysis-extras\test\J1\temp\solr.update.processor.TestOpenNLPExtractNamedEntitiesUpdateProcessorFactory_12D97ED429EA3EF2-001\tempDir-001\collection1\conf\en-test-tokenizer.bin: java.nio.file.AccessDeniedException: C:\Users\jenkins\workspace\Lucene-Solr-master-Windows\solr\build\contrib\solr-analysis-extras\test\J1\temp\solr.update.processor.TestOpenNLPExtractNamedEntitiesUpdateProcessorFactory_12D97ED429EA3EF2-001\tempDir-001\collection1\conf\en-test-tokenizer.bin
   [junit4]    >    C:\Users\jenkins\workspace\Lucene-Solr-master-Windows\solr\build\contrib\solr-analysis-extras\test\J1\temp\solr.update.processor.TestOpenNLPExtractNamedEntitiesUpdateProcessorFactory_12D97ED429EA3EF2-001\tempDir-001\collection1\conf\en-test-sent.bin: java.nio.file.AccessDeniedException: C:\Users\jenkins\workspace\Lucene-Solr-master-Windows\solr\build\contrib\solr-analysis-extras\test\J1\temp\solr.update.processor.TestOpenNLPExtractNamedEntitiesUpdateProcessorFactory_12D97ED429EA3EF2-001\tempDir-001\collection1\conf\en-test-sent.bin
   [junit4]    >    C:\Users\jenkins\workspace\Lucene-Solr-master-Windows\solr\build\contrib\solr-analysis-extras\test\J1\temp\solr.update.processor.TestOpenNLPExtractNamedEntitiesUpdateProcessorFactory_12D97ED429EA3EF2-001\tempDir-001\collection1\conf\en-test-ner-person.bin: java.nio.file.AccessDeniedException: C:\Users\jenkins\workspace\Lucene-Solr-master-Windows\solr\build\contrib\solr-analysis-extras\test\J1\temp\solr.update.processor.TestOpenNLPExtractNamedEntitiesUpdateProcessorFactory_12D97ED429EA3EF2-001\tempDir-001\collection1\conf\en-test-ner-person.bin
   [junit4]    >    C:\Users\jenkins\workspace\Lucene-Solr-master-Windows\solr\build\contrib\solr-analysis-extras\test\J1\temp\solr.update.processor.TestOpenNLPExtractNamedEntitiesUpdateProcessorFactory_12D97ED429EA3EF2-001: java.nio.file.DirectoryNotEmptyException: C:\Users\jenkins\workspace\Lucene-Solr-master-Windows\solr\build\contrib\solr-analysis-extras\test\J1\temp\solr.update.processor.TestOpenNLPExtractNamedEntitiesUpdateProcessorFactory_12D97ED429EA3EF2-001
   [junit4]    > 	at __randomizedtesting.SeedInfo.seed([12D97ED429EA3EF2]:0)
   [junit4]    > 	at org.apache.lucene.util.IOUtils.rm(IOUtils.java:329)
   [junit4]    > 	at java.lang.Thread.run(Thread.java:748)
   [junit4] Completed [3/5 (1!)] on J1 in 1.21s, 8 tests, 1 error <<< FAILURES!

[...truncated 41859 lines...]

Mime
View raw message