lucene-dev mailing list archives

Site index · List index
Message view « Date » · « Thread »
Top « Date » · « Thread »
From Apache Jenkins Server <jenk...@builds.apache.org>
Subject [JENKINS] Lucene-Solr-Tests-master - Build # 2381 - Still Unstable
Date Mon, 26 Feb 2018 14:48:12 GMT
Build: https://builds.apache.org/job/Lucene-Solr-Tests-master/2381/

1 tests failed.
FAILED:  org.apache.solr.handler.TestReplicationHandler.doTestIndexAndConfigReplication

Error Message:
Index: 0, Size: 0

Stack Trace:
java.lang.IndexOutOfBoundsException: Index: 0, Size: 0
	at __randomizedtesting.SeedInfo.seed([50935C6DCA2D0E37:44DB0738E92AB329]:0)
	at java.util.ArrayList.rangeCheck(ArrayList.java:653)
	at java.util.ArrayList.get(ArrayList.java:429)
	at org.apache.solr.handler.TestReplicationHandler.doTestIndexAndConfigReplication(TestReplicationHandler.java:561)
	at sun.reflect.NativeMethodAccessorImpl.invoke0(Native Method)
	at sun.reflect.NativeMethodAccessorImpl.invoke(NativeMethodAccessorImpl.java:62)
	at sun.reflect.DelegatingMethodAccessorImpl.invoke(DelegatingMethodAccessorImpl.java:43)
	at java.lang.reflect.Method.invoke(Method.java:498)
	at com.carrotsearch.randomizedtesting.RandomizedRunner.invoke(RandomizedRunner.java:1737)
	at com.carrotsearch.randomizedtesting.RandomizedRunner$8.evaluate(RandomizedRunner.java:934)
	at com.carrotsearch.randomizedtesting.RandomizedRunner$9.evaluate(RandomizedRunner.java:970)
	at com.carrotsearch.randomizedtesting.RandomizedRunner$10.evaluate(RandomizedRunner.java:984)
	at com.carrotsearch.randomizedtesting.rules.SystemPropertiesRestoreRule$1.evaluate(SystemPropertiesRestoreRule.java:57)
	at org.apache.lucene.util.TestRuleSetupTeardownChained$1.evaluate(TestRuleSetupTeardownChained.java:49)
	at org.apache.lucene.util.AbstractBeforeAfterRule$1.evaluate(AbstractBeforeAfterRule.java:45)
	at org.apache.lucene.util.TestRuleThreadAndTestName$1.evaluate(TestRuleThreadAndTestName.java:48)
	at org.apache.lucene.util.TestRuleIgnoreAfterMaxFailures$1.evaluate(TestRuleIgnoreAfterMaxFailures.java:64)
	at org.apache.lucene.util.TestRuleMarkFailure$1.evaluate(TestRuleMarkFailure.java:47)
	at com.carrotsearch.randomizedtesting.rules.StatementAdapter.evaluate(StatementAdapter.java:36)
	at com.carrotsearch.randomizedtesting.ThreadLeakControl$StatementRunner.run(ThreadLeakControl.java:368)
	at com.carrotsearch.randomizedtesting.ThreadLeakControl.forkTimeoutingTask(ThreadLeakControl.java:817)
	at com.carrotsearch.randomizedtesting.ThreadLeakControl$3.evaluate(ThreadLeakControl.java:468)
	at com.carrotsearch.randomizedtesting.RandomizedRunner.runSingleTest(RandomizedRunner.java:943)
	at com.carrotsearch.randomizedtesting.RandomizedRunner$5.evaluate(RandomizedRunner.java:829)
	at com.carrotsearch.randomizedtesting.RandomizedRunner$6.evaluate(RandomizedRunner.java:879)
	at com.carrotsearch.randomizedtesting.RandomizedRunner$7.evaluate(RandomizedRunner.java:890)
	at com.carrotsearch.randomizedtesting.rules.StatementAdapter.evaluate(StatementAdapter.java:36)
	at com.carrotsearch.randomizedtesting.rules.SystemPropertiesRestoreRule$1.evaluate(SystemPropertiesRestoreRule.java:57)
	at org.apache.lucene.util.AbstractBeforeAfterRule$1.evaluate(AbstractBeforeAfterRule.java:45)
	at com.carrotsearch.randomizedtesting.rules.StatementAdapter.evaluate(StatementAdapter.java:36)
	at org.apache.lucene.util.TestRuleStoreClassName$1.evaluate(TestRuleStoreClassName.java:41)
	at com.carrotsearch.randomizedtesting.rules.NoShadowingOrOverridesOnMethodsRule$1.evaluate(NoShadowingOrOverridesOnMethodsRule.java:40)
	at com.carrotsearch.randomizedtesting.rules.NoShadowingOrOverridesOnMethodsRule$1.evaluate(NoShadowingOrOverridesOnMethodsRule.java:40)
	at com.carrotsearch.randomizedtesting.rules.StatementAdapter.evaluate(StatementAdapter.java:36)
	at com.carrotsearch.randomizedtesting.rules.StatementAdapter.evaluate(StatementAdapter.java:36)
	at com.carrotsearch.randomizedtesting.rules.StatementAdapter.evaluate(StatementAdapter.java:36)
	at org.apache.lucene.util.TestRuleAssertionsRequired$1.evaluate(TestRuleAssertionsRequired.java:53)
	at org.apache.lucene.util.TestRuleMarkFailure$1.evaluate(TestRuleMarkFailure.java:47)
	at org.apache.lucene.util.TestRuleIgnoreAfterMaxFailures$1.evaluate(TestRuleIgnoreAfterMaxFailures.java:64)
	at org.apache.lucene.util.TestRuleIgnoreTestSuites$1.evaluate(TestRuleIgnoreTestSuites.java:54)
	at com.carrotsearch.randomizedtesting.rules.StatementAdapter.evaluate(StatementAdapter.java:36)
	at com.carrotsearch.randomizedtesting.ThreadLeakControl$StatementRunner.run(ThreadLeakControl.java:368)
	at java.lang.Thread.run(Thread.java:748)




Build Log:
[...truncated 13363 lines...]
   [junit4] Suite: org.apache.solr.handler.TestReplicationHandler
   [junit4]   2> Creating dataDir: /x1/jenkins/jenkins-slave/workspace/Lucene-Solr-Tests-master/solr/build/solr-core/test/J2/temp/solr.handler.TestReplicationHandler_50935C6DCA2D0E37-001/init-core-data-001
   [junit4]   2> 1320532 WARN  (SUITE-TestReplicationHandler-seed#[50935C6DCA2D0E37]-worker) [    ] o.a.s.SolrTestCaseJ4 startTrackingSearchers: numOpens=10 numCloses=10
   [junit4]   2> 1320532 INFO  (SUITE-TestReplicationHandler-seed#[50935C6DCA2D0E37]-worker) [    ] o.a.s.SolrTestCaseJ4 Using TrieFields (NUMERIC_POINTS_SYSPROP=false) w/NUMERIC_DOCVALUES_SYSPROP=true
   [junit4]   2> 1320534 INFO  (SUITE-TestReplicationHandler-seed#[50935C6DCA2D0E37]-worker) [    ] o.a.s.SolrTestCaseJ4 Randomized ssl (false) and clientAuth (false) via: @org.apache.solr.SolrTestCaseJ4$SuppressSSL(bugUrl=None)
   [junit4]   2> 1320534 INFO  (SUITE-TestReplicationHandler-seed#[50935C6DCA2D0E37]-worker) [    ] o.a.s.SolrTestCaseJ4 SecureRandom sanity checks: test.solr.allowed.securerandom=null & java.security.egd=file:/dev/./urandom
   [junit4]   2> 1320536 INFO  (TEST-TestReplicationHandler.testRateLimitedReplication-seed#[50935C6DCA2D0E37]) [    ] o.a.s.SolrTestCaseJ4 ###Starting testRateLimitedReplication
   [junit4]   2> 1320536 INFO  (TEST-TestReplicationHandler.testRateLimitedReplication-seed#[50935C6DCA2D0E37]) [    ] o.a.s.SolrTestCaseJ4 Writing core.properties file to /x1/jenkins/jenkins-slave/workspace/Lucene-Solr-Tests-master/solr/build/solr-core/test/J2/temp/solr.handler.TestReplicationHandler_50935C6DCA2D0E37-001/solr-instance-001/collection1
   [junit4]   2> 1320539 INFO  (TEST-TestReplicationHandler.testRateLimitedReplication-seed#[50935C6DCA2D0E37]) [    ] o.e.j.s.Server jetty-9.4.8.v20171121, build timestamp: 2017-11-21T16:27:37-05:00, git hash: 82b8fb23f757335bb3329d540ce37a2a2615f0a8
   [junit4]   2> 1320539 INFO  (TEST-TestReplicationHandler.testRateLimitedReplication-seed#[50935C6DCA2D0E37]) [    ] o.e.j.s.session DefaultSessionIdManager workerName=node0
   [junit4]   2> 1320539 INFO  (TEST-TestReplicationHandler.testRateLimitedReplication-seed#[50935C6DCA2D0E37]) [    ] o.e.j.s.session No SessionScavenger set, using defaults
   [junit4]   2> 1320540 INFO  (TEST-TestReplicationHandler.testRateLimitedReplication-seed#[50935C6DCA2D0E37]) [    ] o.e.j.s.session Scavenging every 600000ms
   [junit4]   2> 1320540 INFO  (TEST-TestReplicationHandler.testRateLimitedReplication-seed#[50935C6DCA2D0E37]) [    ] o.e.j.s.h.ContextHandler Started o.e.j.s.ServletContextHandler@185073ec{/solr,null,AVAILABLE}
   [junit4]   2> 1320540 INFO  (TEST-TestReplicationHandler.testRateLimitedReplication-seed#[50935C6DCA2D0E37]) [    ] o.e.j.s.AbstractConnector Started ServerConnector@119ee75{HTTP/1.1,[http/1.1]}{127.0.0.1:60813}
   [junit4]   2> 1320540 INFO  (TEST-TestReplicationHandler.testRateLimitedReplication-seed#[50935C6DCA2D0E37]) [    ] o.e.j.s.Server Started @1323327ms
   [junit4]   2> 1320540 INFO  (TEST-TestReplicationHandler.testRateLimitedReplication-seed#[50935C6DCA2D0E37]) [    ] o.a.s.c.s.e.JettySolrRunner Jetty properties: {solr.data.dir=/x1/jenkins/jenkins-slave/workspace/Lucene-Solr-Tests-master/solr/build/solr-core/test/J2/temp/solr.handler.TestReplicationHandler_50935C6DCA2D0E37-001/solr-instance-001/collection1/data, hostContext=/solr, hostPort=60813}
   [junit4]   2> 1320541 ERROR (TEST-TestReplicationHandler.testRateLimitedReplication-seed#[50935C6DCA2D0E37]) [    ] o.a.s.u.StartupLoggingUtils Missing Java Option solr.log.dir. Logging may be missing or incomplete.
   [junit4]   2> 1320541 INFO  (TEST-TestReplicationHandler.testRateLimitedReplication-seed#[50935C6DCA2D0E37]) [    ] o.a.s.s.SolrDispatchFilter  ___      _       Welcome to Apache Solr™ version 8.0.0
   [junit4]   2> 1320541 INFO  (TEST-TestReplicationHandler.testRateLimitedReplication-seed#[50935C6DCA2D0E37]) [    ] o.a.s.s.SolrDispatchFilter / __| ___| |_ _   Starting in standalone mode on port null
   [junit4]   2> 1320541 INFO  (TEST-TestReplicationHandler.testRateLimitedReplication-seed#[50935C6DCA2D0E37]) [    ] o.a.s.s.SolrDispatchFilter \__ \/ _ \ | '_|  Install dir: null
   [junit4]   2> 1320541 INFO  (TEST-TestReplicationHandler.testRateLimitedReplication-seed#[50935C6DCA2D0E37]) [    ] o.a.s.s.SolrDispatchFilter |___/\___/_|_|    Start time: 2018-02-26T13:56:37.860Z
   [junit4]   2> 1320541 INFO  (TEST-TestReplicationHandler.testRateLimitedReplication-seed#[50935C6DCA2D0E37]) [    ] o.a.s.c.SolrXmlConfig Loading container configuration from /x1/jenkins/jenkins-slave/workspace/Lucene-Solr-Tests-master/solr/build/solr-core/test/J2/temp/solr.handler.TestReplicationHandler_50935C6DCA2D0E37-001/solr-instance-001/solr.xml
   [junit4]   2> 1320544 INFO  (TEST-TestReplicationHandler.testRateLimitedReplication-seed#[50935C6DCA2D0E37]) [    ] o.a.s.c.SolrXmlConfig Configuration parameter autoReplicaFailoverWorkLoopDelay is ignored
   [junit4]   2> 1320544 INFO  (TEST-TestReplicationHandler.testRateLimitedReplication-seed#[50935C6DCA2D0E37]) [    ] o.a.s.c.SolrXmlConfig Configuration parameter autoReplicaFailoverBadNodeExpiration is ignored
   [junit4]   2> 1320546 INFO  (TEST-TestReplicationHandler.testRateLimitedReplication-seed#[50935C6DCA2D0E37]) [    ] o.a.s.c.SolrXmlConfig MBean server found: com.sun.jmx.mbeanserver.JmxMBeanServer@36b042fe, but no JMX reporters were configured - adding default JMX reporter.
   [junit4]   2> 1320573 INFO  (TEST-TestReplicationHandler.testRateLimitedReplication-seed#[50935C6DCA2D0E37]) [    ] o.a.s.m.r.SolrJmxReporter JMX monitoring for 'solr.node' (registry 'solr.node') enabled at server: com.sun.jmx.mbeanserver.JmxMBeanServer@36b042fe
   [junit4]   2> 1320582 INFO  (TEST-TestReplicationHandler.testRateLimitedReplication-seed#[50935C6DCA2D0E37]) [    ] o.a.s.m.r.SolrJmxReporter JMX monitoring for 'solr.jvm' (registry 'solr.jvm') enabled at server: com.sun.jmx.mbeanserver.JmxMBeanServer@36b042fe
   [junit4]   2> 1320582 INFO  (TEST-TestReplicationHandler.testRateLimitedReplication-seed#[50935C6DCA2D0E37]) [    ] o.a.s.m.r.SolrJmxReporter JMX monitoring for 'solr.jetty' (registry 'solr.jetty') enabled at server: com.sun.jmx.mbeanserver.JmxMBeanServer@36b042fe
   [junit4]   2> 1320584 INFO  (TEST-TestReplicationHandler.testRateLimitedReplication-seed#[50935C6DCA2D0E37]) [    ] o.a.s.c.CorePropertiesLocator Found 1 core definitions underneath /x1/jenkins/jenkins-slave/workspace/Lucene-Solr-Tests-master/solr/build/solr-core/test/J2/temp/solr.handler.TestReplicationHandler_50935C6DCA2D0E37-001/solr-instance-001/.
   [junit4]   2> 1320584 INFO  (TEST-TestReplicationHandler.testRateLimitedReplication-seed#[50935C6DCA2D0E37]) [    ] o.a.s.c.CorePropertiesLocator Cores are: [collection1]
   [junit4]   2> 1320584 INFO  (coreLoadExecutor-5953-thread-1) [    ] o.a.s.c.TransientSolrCoreCacheDefault Allocating transient cache for 4 transient cores
   [junit4]   2> 1320605 INFO  (coreLoadExecutor-5953-thread-1) [    x:collection1] o.a.s.c.SolrConfig Using Lucene MatchVersion: 8.0.0
   [junit4]   2> 1320612 INFO  (coreLoadExecutor-5953-thread-1) [    x:collection1] o.a.s.s.IndexSchema [collection1] Schema name=test
   [junit4]   2> 1320614 INFO  (coreLoadExecutor-5953-thread-1) [    x:collection1] o.a.s.s.IndexSchema Loaded schema test/1.2 with uniqueid field id
   [junit4]   2> 1320614 INFO  (coreLoadExecutor-5953-thread-1) [    x:collection1] o.a.s.c.CoreContainer Creating SolrCore 'collection1' using configuration from instancedir /x1/jenkins/jenkins-slave/workspace/Lucene-Solr-Tests-master/solr/build/solr-core/test/J2/temp/solr.handler.TestReplicationHandler_50935C6DCA2D0E37-001/solr-instance-001/./collection1, trusted=true
   [junit4]   2> 1320614 INFO  (coreLoadExecutor-5953-thread-1) [    x:collection1] o.a.s.m.r.SolrJmxReporter JMX monitoring for 'solr.core.collection1' (registry 'solr.core.collection1') enabled at server: com.sun.jmx.mbeanserver.JmxMBeanServer@36b042fe
   [junit4]   2> 1320614 INFO  (coreLoadExecutor-5953-thread-1) [    x:collection1] o.a.s.c.SolrCore solr.RecoveryStrategy.Builder
   [junit4]   2> 1320614 INFO  (coreLoadExecutor-5953-thread-1) [    x:collection1] o.a.s.c.SolrCore [[collection1] ] Opening new SolrCore at [/x1/jenkins/jenkins-slave/workspace/Lucene-Solr-Tests-master/solr/build/solr-core/test/J2/temp/solr.handler.TestReplicationHandler_50935C6DCA2D0E37-001/solr-instance-001/collection1], dataDir=[/x1/jenkins/jenkins-slave/workspace/Lucene-Solr-Tests-master/solr/build/solr-core/test/J2/temp/solr.handler.TestReplicationHandler_50935C6DCA2D0E37-001/solr-instance-001/./collection1/data/]
   [junit4]   2> 1320615 INFO  (coreLoadExecutor-5953-thread-1) [    x:collection1] o.a.s.u.RandomMergePolicy RandomMergePolicy wrapping class org.apache.lucene.index.LogDocMergePolicy: [LogDocMergePolicy: minMergeSize=1000, mergeFactor=41, maxMergeSize=9223372036854775807, maxMergeSizeForForcedMerge=9223372036854775807, calibrateSizeByDeletes=true, maxMergeDocs=2147483647, maxCFSSegmentSizeMB=8.796093022207999E12, noCFSRatio=1.0]
   [junit4]   2> 1320646 INFO  (coreLoadExecutor-5953-thread-1) [    x:collection1] o.a.s.u.CommitTracker Hard AutoCommit: disabled
   [junit4]   2> 1320646 INFO  (coreLoadExecutor-5953-thread-1) [    x:collection1] o.a.s.u.CommitTracker Soft AutoCommit: disabled
   [junit4]   2> 1320647 INFO  (coreLoadExecutor-5953-thread-1) [    x:collection1] o.a.s.u.RandomMergePolicy RandomMergePolicy wrapping class org.apache.lucene.index.TieredMergePolicy: [TieredMergePolicy: maxMergeAtOnce=38, maxMergeAtOnceExplicit=34, maxMergedSegmentMB=27.9052734375, floorSegmentMB=0.2255859375, forceMergeDeletesPctAllowed=28.019490723736705, segmentsPerTier=18.0, maxCFSSegmentSizeMB=8.796093022207999E12, noCFSRatio=0.0
   [junit4]   2> 1320647 INFO  (coreLoadExecutor-5953-thread-1) [    x:collection1] o.a.s.s.SolrIndexSearcher Opening [Searcher@51b1e61d[collection1] main]
   [junit4]   2> 1320647 INFO  (coreLoadExecutor-5953-thread-1) [    x:collection1] o.a.s.r.ManagedResourceStorage File-based storage initialized to use dir: /x1/jenkins/jenkins-slave/workspace/Lucene-Solr-Tests-master/solr/build/solr-core/test/J2/temp/solr.handler.TestReplicationHandler_50935C6DCA2D0E37-001/solr-instance-001/collection1/conf
   [junit4]   2> 1320648 INFO  (coreLoadExecutor-5953-thread-1) [    x:collection1] o.a.s.h.ReplicationHandler Replication enabled for following config files: schema.xml,xslt/dummy.xsl
   [junit4]   2> 1320648 INFO  (coreLoadExecutor-5953-thread-1) [    x:collection1] o.a.s.h.ReplicationHandler Commits will be reserved for 10000ms.
   [junit4]   2> 1320649 INFO  (searcherExecutor-5954-thread-1-processing-x:collection1) [    x:collection1] o.a.s.c.SolrCore [collection1] Registered new searcher Searcher@51b1e61d[collection1] main{ExitableDirectoryReader(UninvertingDirectoryReader())}
   [junit4]   2> 1320650 INFO  (TEST-TestReplicationHandler.testRateLimitedReplication-seed#[50935C6DCA2D0E37]) [    ] o.a.s.SolrTestCaseJ4 Writing core.properties file to /x1/jenkins/jenkins-slave/workspace/Lucene-Solr-Tests-master/solr/build/solr-core/test/J2/temp/solr.handler.TestReplicationHandler_50935C6DCA2D0E37-001/solr-instance-002/collection1
   [junit4]   2> 1320654 INFO  (TEST-TestReplicationHandler.testRateLimitedReplication-seed#[50935C6DCA2D0E37]) [    ] o.e.j.s.Server jetty-9.4.8.v20171121, build timestamp: 2017-11-21T16:27:37-05:00, git hash: 82b8fb23f757335bb3329d540ce37a2a2615f0a8
   [junit4]   2> 1320658 INFO  (TEST-TestReplicationHandler.testRateLimitedReplication-seed#[50935C6DCA2D0E37]) [    ] o.e.j.s.session DefaultSessionIdManager workerName=node0
   [junit4]   2> 1320658 INFO  (TEST-TestReplicationHandler.testRateLimitedReplication-seed#[50935C6DCA2D0E37]) [    ] o.e.j.s.session No SessionScavenger set, using defaults
   [junit4]   2> 1320659 INFO  (TEST-TestReplicationHandler.testRateLimitedReplication-seed#[50935C6DCA2D0E37]) [    ] o.e.j.s.session Scavenging every 600000ms
   [junit4]   2> 1320659 INFO  (TEST-TestReplicationHandler.testRateLimitedReplication-seed#[50935C6DCA2D0E37]) [    ] o.e.j.s.h.ContextHandler Started o.e.j.s.ServletContextHandler@751277ef{/solr,null,AVAILABLE}
   [junit4]   2> 1320659 INFO  (TEST-TestReplicationHandler.testRateLimitedReplication-seed#[50935C6DCA2D0E37]) [    ] o.e.j.s.AbstractConnector Started ServerConnector@510bab7c{HTTP/1.1,[http/1.1]}{127.0.0.1:60060}
   [junit4]   2> 1320659 INFO  (TEST-TestReplicationHandler.testRateLimitedReplication-seed#[50935C6DCA2D0E37]) [    ] o.e.j.s.Server Started @1323446ms
   [junit4]   2> 1320660 INFO  (TEST-TestReplicationHandler.testRateLimitedReplication-seed#[50935C6DCA2D0E37]) [    ] o.a.s.c.s.e.JettySolrRunner Jetty properties: {solr.data.dir=/x1/jenkins/jenkins-slave/workspace/Lucene-Solr-Tests-master/solr/build/solr-core/test/J2/temp/solr.handler.TestReplicationHandler_50935C6DCA2D0E37-001/solr-instance-002/collection1/data, hostContext=/solr, hostPort=60060}
   [junit4]   2> 1320660 ERROR (TEST-TestReplicationHandler.testRateLimitedReplication-seed#[50935C6DCA2D0E37]) [    ] o.a.s.u.StartupLoggingUtils Missing Java Option solr.log.dir. Logging may be missing or incomplete.
   [junit4]   2> 1320660 INFO  (TEST-TestReplicationHandler.testRateLimitedReplication-seed#[50935C6DCA2D0E37]) [    ] o.a.s.s.SolrDispatchFilter  ___      _       Welcome to Apache Solr™ version 8.0.0
   [junit4]   2> 1320660 INFO  (TEST-TestReplicationHandler.testRateLimitedReplication-seed#[50935C6DCA2D0E37]) [    ] o.a.s.s.SolrDispatchFilter / __| ___| |_ _   Starting in standalone mode on port null
   [junit4]   2> 1320660 INFO  (TEST-TestReplicationHandler.testRateLimitedReplication-seed#[50935C6DCA2D0E37]) [    ] o.a.s.s.SolrDispatchFilter \__ \/ _ \ | '_|  Install dir: null
   [junit4]   2> 1320660 INFO  (TEST-TestReplicationHandler.testRateLimitedReplication-seed#[50935C6DCA2D0E37]) [    ] o.a.s.s.SolrDispatchFilter |___/\___/_|_|    Start time: 2018-02-26T13:56:37.979Z
   [junit4]   2> 1320661 INFO  (TEST-TestReplicationHandler.testRateLimitedReplication-seed#[50935C6DCA2D0E37]) [    ] o.a.s.c.SolrXmlConfig Loading container configuration from /x1/jenkins/jenkins-slave/workspace/Lucene-Solr-Tests-master/solr/build/solr-core/test/J2/temp/solr.handler.TestReplicationHandler_50935C6DCA2D0E37-001/solr-instance-002/solr.xml
   [junit4]   2> 1320664 INFO  (TEST-TestReplicationHandler.testRateLimitedReplication-seed#[50935C6DCA2D0E37]) [    ] o.a.s.c.SolrXmlConfig Configuration parameter autoReplicaFailoverWorkLoopDelay is ignored
   [junit4]   2> 1320664 INFO  (TEST-TestReplicationHandler.testRateLimitedReplication-seed#[50935C6DCA2D0E37]) [    ] o.a.s.c.SolrXmlConfig Configuration parameter autoReplicaFailoverBadNodeExpiration is ignored
   [junit4]   2> 1320665 INFO  (TEST-TestReplicationHandler.testRateLimitedReplication-seed#[50935C6DCA2D0E37]) [    ] o.a.s.c.SolrXmlConfig MBean server found: com.sun.jmx.mbeanserver.JmxMBeanServer@36b042fe, but no JMX reporters were configured - adding default JMX reporter.
   [junit4]   2> 1320694 INFO  (TEST-TestReplicationHandler.testRateLimitedReplication-seed#[50935C6DCA2D0E37]) [    ] o.a.s.m.r.SolrJmxReporter JMX monitoring for 'solr.node' (registry 'solr.node') enabled at server: com.sun.jmx.mbeanserver.JmxMBeanServer@36b042fe
   [junit4]   2> 1320703 INFO  (TEST-TestReplicationHandler.testRateLimitedReplication-seed#[50935C6DCA2D0E37]) [    ] o.a.s.m.r.SolrJmxReporter JMX monitoring for 'solr.jvm' (registry 'solr.jvm') enabled at server: com.sun.jmx.mbeanserver.JmxMBeanServer@36b042fe
   [junit4]   2> 1320703 INFO  (TEST-TestReplicationHandler.testRateLimitedReplication-seed#[50935C6DCA2D0E37]) [    ] o.a.s.m.r.SolrJmxReporter JMX monitoring for 'solr.jetty' (registry 'solr.jetty') enabled at server: com.sun.jmx.mbeanserver.JmxMBeanServer@36b042fe
   [junit4]   2> 1320705 INFO  (TEST-TestReplicationHandler.testRateLimitedReplication-seed#[50935C6DCA2D0E37]) [    ] o.a.s.c.CorePropertiesLocator Found 1 core definitions underneath /x1/jenkins/jenkins-slave/workspace/Lucene-Solr-Tests-master/solr/build/solr-core/test/J2/temp/solr.handler.TestReplicationHandler_50935C6DCA2D0E37-001/solr-instance-002/.
   [junit4]   2> 1320705 INFO  (TEST-TestReplicationHandler.testRateLimitedReplication-seed#[50935C6DCA2D0E37]) [    ] o.a.s.c.CorePropertiesLocator Cores are: [collection1]
   [junit4]   2> 1320706 INFO  (coreLoadExecutor-5963-thread-1) [    ] o.a.s.c.TransientSolrCoreCacheDefault Allocating transient cache for 4 transient cores
   [junit4]   2> 1320723 INFO  (coreLoadExecutor-5963-thread-1) [    x:collection1] o.a.s.c.SolrConfig Using Lucene MatchVersion: 8.0.0
   [junit4]   2> 1320730 INFO  (coreLoadExecutor-5963-thread-1) [    x:collection1] o.a.s.s.IndexSchema [collection1] Schema name=test
   [junit4]   2> 1320732 INFO  (coreLoadExecutor-5963-thread-1) [    x:collection1] o.a.s.s.IndexSchema Loaded schema test/1.2 with uniqueid field id
   [junit4]   2> 1320732 INFO  (coreLoadExecutor-5963-thread-1) [    x:collection1] o.a.s.c.CoreContainer Creating SolrCore 'collection1' using configuration from instancedir /x1/jenkins/jenkins-slave/workspace/Lucene-Solr-Tests-master/solr/build/solr-core/test/J2/temp/solr.handler.TestReplicationHandler_50935C6DCA2D0E37-001/solr-instance-002/./collection1, trusted=true
   [junit4]   2> 1320732 INFO  (coreLoadExecutor-5963-thread-1) [    x:collection1] o.a.s.m.r.SolrJmxReporter JMX monitoring for 'solr.core.collection1' (registry 'solr.core.collection1') enabled at server: com.sun.jmx.mbeanserver.JmxMBeanServer@36b042fe
   [junit4]   2> 1320732 INFO  (coreLoadExecutor-5963-thread-1) [    x:collection1] o.a.s.c.SolrCore solr.RecoveryStrategy.Builder
   [junit4]   2> 1320732 INFO  (coreLoadExecutor-5963-thread-1) [    x:collection1] o.a.s.c.SolrCore [[collection1] ] Opening new SolrCore at [/x1/jenkins/jenkins-slave/workspace/Lucene-Solr-Tests-master/solr/build/solr-core/test/J2/temp/solr.handler.TestReplicationHandler_50935C6DCA2D0E37-001/solr-instance-002/collection1], dataDir=[/x1/jenkins/jenkins-slave/workspace/Lucene-Solr-Tests-master/solr/build/solr-core/test/J2/temp/solr.handler.TestReplicationHandler_50935C6DCA2D0E37-001/solr-instance-002/./collection1/data/]
   [junit4]   2> 1320734 INFO  (coreLoadExecutor-5963-thread-1) [    x:collection1] o.a.s.u.RandomMergePolicy RandomMergePolicy wrapping class org.apache.lucene.index.LogDocMergePolicy: [LogDocMergePolicy: minMergeSize=1000, mergeFactor=41, maxMergeSize=9223372036854775807, maxMergeSizeForForcedMerge=9223372036854775807, calibrateSizeByDeletes=true, maxMergeDocs=2147483647, maxCFSSegmentSizeMB=8.796093022207999E12, noCFSRatio=1.0]
   [junit4]   2> 1320769 INFO  (coreLoadExecutor-5963-thread-1) [    x:collection1] o.a.s.u.CommitTracker Hard AutoCommit: disabled
   [junit4]   2> 1320769 INFO  (coreLoadExecutor-5963-thread-1) [    x:collection1] o.a.s.u.CommitTracker Soft AutoCommit: disabled
   [junit4]   2> 1320770 INFO  (coreLoadExecutor-5963-thread-1) [    x:collection1] o.a.s.u.RandomMergePolicy RandomMergePolicy wrapping class org.apache.lucene.index.TieredMergePolicy: [TieredMergePolicy: maxMergeAtOnce=38, maxMergeAtOnceExplicit=34, maxMergedSegmentMB=27.9052734375, floorSegmentMB=0.2255859375, forceMergeDeletesPctAllowed=28.019490723736705, segmentsPerTier=18.0, maxCFSSegmentSizeMB=8.796093022207999E12, noCFSRatio=0.0
   [junit4]   2> 1320770 INFO  (coreLoadExecutor-5963-thread-1) [    x:collection1] o.a.s.s.SolrIndexSearcher Opening [Searcher@6032e831[collection1] main]
   [junit4]   2> 1320771 INFO  (coreLoadExecutor-5963-thread-1) [    x:collection1] o.a.s.r.ManagedResourceStorage File-based storage initialized to use dir: /x1/jenkins/jenkins-slave/workspace/Lucene-Solr-Tests-master/solr/build/solr-core/test/J2/temp/solr.handler.TestReplicationHandler_50935C6DCA2D0E37-001/solr-instance-002/collection1/conf
   [junit4]   2> 1320772 INFO  (coreLoadExecutor-5963-thread-1) [    x:collection1] o.a.s.h.ReplicationHandler Poll scheduled at an interval of 1000ms
   [junit4]   2> 1320772 INFO  (coreLoadExecutor-5963-thread-1) [    x:collection1] o.a.s.h.ReplicationHandler Commits will be reserved for 10000ms.
   [junit4]   2> 1320773 INFO  (searcherExecutor-5964-thread-1-processing-x:collection1) [    x:collection1] o.a.s.c.SolrCore [collection1] Registered new searcher Searcher@6032e831[collection1] main{ExitableDirectoryReader(UninvertingDirectoryReader())}
   [junit4]   2> 1321205 INFO  (qtp1669138674-14509) [    x:collection1] o.a.s.c.S.Request [collection1]  webapp=/solr path=/replication params={qt=/replication&wt=javabin&version=2&command=indexversion} status=0 QTime=0
   [junit4]   2> 1321206 INFO  (indexFetcher-5968-thread-1) [    x:collection1] o.a.s.h.IndexFetcher Master's generation: 1
   [junit4]   2> 1321206 INFO  (indexFetcher-5968-thread-1) [    x:collection1] o.a.s.h.IndexFetcher Master's version: 0
   [junit4]   2> 1321206 INFO  (indexFetcher-5968-thread-1) [    x:collection1] o.a.s.h.IndexFetcher Slave's generation: 1
   [junit4]   2> 1321206 INFO  (indexFetcher-5968-thread-1) [    x:collection1] o.a.s.h.IndexFetcher Slave's version: 0
   [junit4]   2> 1321206 INFO  (indexFetcher-5968-thread-1) [    x:collection1] o.a.s.h.IndexFetcher New index in Master. Deleting mine...
   [junit4]   2> 1321206 INFO  (indexFetcher-5968-thread-1) [    x:collection1] o.a.s.u.DirectUpdateHandler2 start commit{,optimize=false,openSearcher=true,waitSearcher=true,expungeDeletes=false,softCommit=false,prepareCommit=false}
   [junit4]   2> 1321206 INFO  (indexFetcher-5968-thread-1) [    x:collection1] o.a.s.u.SolrIndexWriter Calling setCommitData with IW:org.apache.solr.update.SolrIndexWriter@4ba7d6a3 commitCommandVersion:0
   [junit4]   2> 1321207 INFO  (indexFetcher-5968-thread-1) [    x:collection1] o.a.s.s.SolrIndexSearcher Opening [Searcher@4ebdf67c[collection1] main]
   [junit4]   2> 1321207 INFO  (indexFetcher-5968-thread-1) [    x:collection1] o.a.s.u.DirectUpdateHandler2 end_commit_flush
   [junit4]   2> 1321208 INFO  (searcherExecutor-5964-thread-1-processing-x:collection1) [    x:collection1] o.a.s.c.SolrCore [collection1] Registered new searcher Searcher@4ebdf67c[collection1] main{ExitableDirectoryReader(UninvertingDirectoryReader())}
   [junit4]   2> 1321274 INFO  (qtp1669138674-14509) [    x:collection1] o.a.s.u.DirectUpdateHandler2 [collection1] REMOVING ALL DOCUMENTS FROM INDEX
   [junit4]   2> 1321275 INFO  (qtp1669138674-14509) [    x:collection1] o.a.s.u.p.LogUpdateProcessorFactory [collection1]  webapp=/solr path=/update params={wt=javabin&version=2}{deleteByQuery=*:*} 0 0
   [junit4]   2> 1321276 INFO  (qtp1933643211-14526) [    x:collection1] o.a.s.u.DirectUpdateHandler2 [collection1] REMOVING ALL DOCUMENTS FROM INDEX
   [junit4]   2> 1321276 INFO  (qtp1933643211-14526) [    x:collection1] o.a.s.u.p.LogUpdateProcessorFactory [collection1]  webapp=/solr path=/update params={wt=javabin&version=2}{deleteByQuery=*:*} 0 0
   [junit4]   2> 1321276 INFO  (qtp1669138674-14514) [    x:collection1] o.a.s.u.DirectUpdateHandler2 start commit{,optimize=false,openSearcher=true,waitSearcher=true,expungeDeletes=false,softCommit=false,prepareCommit=false}
   [junit4]   2> 1321276 INFO  (qtp1669138674-14514) [    x:collection1] o.a.s.u.SolrIndexWriter Calling setCommitData with IW:org.apache.solr.update.SolrIndexWriter@1dfcdd9d commitCommandVersion:0
   [junit4]   2> 1321277 INFO  (qtp1669138674-14514) [    x:collection1] o.a.s.s.SolrIndexSearcher Opening [Searcher@52063a69[collection1] main]
   [junit4]   2> 1321277 INFO  (qtp1669138674-14514) [    x:collection1] o.a.s.u.DirectUpdateHandler2 end_commit_flush
   [junit4]   2> 1321278 INFO  (searcherExecutor-5954-thread-1-processing-x:collection1) [    x:collection1] o.a.s.c.SolrCore [collection1] Registered new searcher Searcher@52063a69[collection1] main{ExitableDirectoryReader(UninvertingDirectoryReader())}
   [junit4]   2> 1321278 INFO  (qtp1669138674-14514) [    x:collection1] o.a.s.u.p.LogUpdateProcessorFactory [collection1]  webapp=/solr path=/update params={waitSearcher=true&commit=true&softCommit=false&wt=javabin&version=2}{commit=} 0 1
   [junit4]   2> 1321278 INFO  (qtp1933643211-14528) [    x:collection1] o.a.s.u.DirectUpdateHandler2 start commit{,optimize=false,openSearcher=true,waitSearcher=true,expungeDeletes=false,softCommit=false,prepareCommit=false}
   [junit4]   2> 1321279 INFO  (qtp1933643211-14528) [    x:collection1] o.a.s.u.SolrIndexWriter Calling setCommitData with IW:org.apache.solr.update.SolrIndexWriter@4ba7d6a3 commitCommandVersion:0
   [junit4]   2> 1321279 INFO  (qtp1933643211-14528) [    x:collection1] o.a.s.s.SolrIndexSearcher Opening [Searcher@49ae8149[collection1] main]
   [junit4]   2> 1321279 INFO  (qtp1933643211-14528) [    x:collection1] o.a.s.u.DirectUpdateHandler2 end_commit_flush
   [junit4]   2> 1321280 INFO  (searcherExecutor-5964-thread-1-processing-x:collection1) [    x:collection1] o.a.s.c.SolrCore [collection1] Registered new searcher Searcher@49ae8149[collection1] main{ExitableDirectoryReader(UninvertingDirectoryReader())}
   [junit4]   2> 1321280 INFO  (qtp1933643211-14528) [    x:collection1] o.a.s.u.p.LogUpdateProcessorFactory [collection1]  webapp=/solr path=/update params={waitSearcher=true&commit=true&softCommit=false&wt=javabin&version=2}{commit=} 0 1
   [junit4]   2> 1321281 INFO  (TEST-TestReplicationHandler.testRateLimitedReplication-seed#[50935C6DCA2D0E37]) [    ] o.e.j.s.AbstractConnector Stopped ServerConnector@119ee75{HTTP/1.1,[http/1.1]}{127.0.0.1:0}
   [junit4]   2> 1321281 INFO  (TEST-TestReplicationHandler.testRateLimitedReplication-seed#[50935C6DCA2D0E37]) [    ] o.a.s.c.CoreContainer Shutting down CoreContainer instance=1619201485
   [junit4]   2> 1321281 INFO  (TEST-TestReplicationHandler.testRateLimitedReplication-seed#[50935C6DCA2D0E37]) [    ] o.a.s.m.SolrMetricManager Closing metric reporters for registry=solr.node, tag=null
   [junit4]   2> 1321281 INFO  (TEST-TestReplicationHandler.testRateLimitedReplication-seed#[50935C6DCA2D0E37]) [    ] o.a.s.m.r.SolrJmxReporter Closing reporter [org.apache.solr.metrics.reporters.SolrJmxReporter@6fa0976b: rootName = null, domain = solr.node, service url = null, agent id = null] for registry solr.node / com.codahale.metrics.MetricRegistry@e61f13a
   [junit4]   2> 1321286 INFO  (TEST-TestReplicationHandler.testRateLimitedReplication-seed#[50935C6DCA2D0E37]) [    ] o.a.s.m.SolrMetricManager Closing metric reporters for registry=solr.jvm, tag=null
   [junit4]   2> 1321286 INFO  (TEST-TestReplicationHandler.testRateLimitedReplication-seed#[50935C6DCA2D0E37]) [    ] o.a.s.m.r.SolrJmxReporter Closing reporter [org.apache.solr.metrics.reporters.SolrJmxReporter@19966b6c: rootName = null, domain = solr.jvm, service url = null, agent id = null] for registry solr.jvm / com.codahale.metrics.MetricRegistry@1a549690
   [junit4]   2> 1321290 INFO  (TEST-TestReplicationHandler.testRateLimitedReplication-seed#[50935C6DCA2D0E37]) [    ] o.a.s.m.SolrMetricManager Closing metric reporters for registry=solr.jetty, tag=null
   [junit4]   2> 1321290 INFO  (TEST-TestReplicationHandler.testRateLimitedReplication-seed#[50935C6DCA2D0E37]) [    ] o.a.s.m.r.SolrJmxReporter Closing reporter [org.apache.solr.metrics.reporters.SolrJmxReporter@3cfb98df: rootName = null, domain = solr.jetty, service url = null, agent id = null] for registry solr.jetty / com.codahale.metrics.MetricRegistry@6b9658e0
   [junit4]   2> 1321290 INFO  (coreCloseExecutor-5969-thread-1) [    x:collection1] o.a.s.c.SolrCore [collection1]  CLOSING SolrCore org.apache.solr.core.SolrCore@7d638e43
   [junit4]   2> 1321290 INFO  (coreCloseExecutor-5969-thread-1) [    x:collection1] o.a.s.m.SolrMetricManager Closing metric reporters for registry=solr.core.collection1, tag=2103676483
   [junit4]   2> 1321291 INFO  (coreCloseExecutor-5969-thread-1) [    x:collection1] o.a.s.m.r.SolrJmxReporter Closing reporter [org.apache.solr.metrics.reporters.SolrJmxReporter@4e14e10: rootName = null, domain = solr.core.collection1, service url = null, agent id = null] for registry solr.core.collection1 / com.codahale.metrics.MetricRegistry@1ed07c93
   [junit4]   2> 1321298 INFO  (TEST-TestReplicationHandler.testRateLimitedReplication-seed#[50935C6DCA2D0E37]) [    ] o.e.j.s.h.ContextHandler Stopped o.e.j.s.ServletContextHandler@185073ec{/solr,null,UNAVAILABLE}
   [junit4]   2> 1321298 INFO  (TEST-TestReplicationHandler.testRateLimitedReplication-seed#[50935C6DCA2D0E37]) [    ] o.e.j.s.session Stopped scavenging
   [junit4]   2> 1321299 INFO  (TEST-TestReplicationHandler.testRateLimitedReplication-seed#[50935C6DCA2D0E37]) [    ] o.e.j.s.AbstractConnector Stopped ServerConnector@510bab7c{HTTP/1.1,[http/1.1]}{127.0.0.1:0}
   [junit4]   2> 1321299 INFO  (TEST-TestReplicationHandler.testRateLimitedReplication-seed#[50935C6DCA2D0E37]) [    ] o.a.s.c.CoreContainer Shutting down CoreContainer instance=1990192535
   [junit4]   2> 1321299 INFO  (TEST-TestReplicationHandler.testRateLimitedReplication-seed#[50935C6DCA2D0E37]) [    ] o.a.s.m.SolrMetricManager Closing metric reporters for registry=solr.node, tag=null
   [junit4]   2> 1321299 INFO  (TEST-TestReplicationHandler.testRateLimitedReplication-seed#[50935C6DCA2D0E37]) [    ] o.a.s.m.r.SolrJmxReporter Closing reporter [org.apache.solr.metrics.reporters.SolrJmxReporter@2accd994: rootName = null, domain = solr.node, service url = null, agent id = null] for registry solr.node / com.codahale.metrics.MetricRegistry@6e771d7d
   [junit4]   2> 1321305 INFO  (TEST-TestReplicationHandler.testRateLimitedReplication-seed#[50935C6DCA2D0E37]) [    ] o.a.s.m.SolrMetricManager Closing metric reporters for registry=solr.jvm, tag=null
   [junit4]   2> 1321305 INFO  (TEST-TestReplicationHandler.testRateLimitedReplication-seed#[50935C6DCA2D0E37]) [    ] o.a.s.m.r.SolrJmxReporter Closing reporter [org.apache.solr.metrics.reporters.SolrJmxReporter@15eb74f5: rootName = null, domain = solr.jvm, service url = null, agent id = null] for registry solr.jvm / com.codahale.metrics.MetricRegistry@1a549690
   [junit4]   2> 1321309 INFO  (TEST-TestReplicationHandler.testRateLimitedReplication-seed#[50935C6DCA2D0E37]) [    ] o.a.s.m.SolrMetricManager Closing metric reporters for registry=solr.jetty, tag=null
   [junit4]   2> 1321309 INFO  (TEST-TestReplicationHandler.testRateLimitedReplication-seed#[50935C6DCA2D0E37]) [    ] o.a.s.m.r.SolrJmxReporter Closing reporter [org.apache.solr.metrics.reporters.SolrJmxReporter@5eddfa38: rootName = null, domain = solr.jetty, service url = null, agent id = null] for registry solr.jetty / com.codahale.metrics.MetricRegistry@6b9658e0
   [junit4]   2> 1321309 INFO  (coreCloseExecutor-5971-thread-1) [    x:collection1] o.a.s.c.SolrCore [collection1]  CLOSING SolrCore org.apache.solr.core.SolrCore@71d7e2da
   [junit4]   2> 1321309 INFO  (coreCloseExecutor-5971-thread-1) [    x:collection1] o.a.s.m.SolrMetricManager Closing metric reporters for registry=solr.core.collection1, tag=1909973722
   [junit4]   2> 1321310 INFO  (coreCloseExecutor-5971-thread-1) [    x:collection1] o.a.s.m.r.SolrJmxReporter Closing reporter [org.apache.solr.metrics.reporters.SolrJmxReporter@27266a15: rootName = null, domain = solr.core.collection1, service url = null, agent id = null] for registry solr.core.collection1 / com.codahale.metrics.MetricRegistry@5e37d1d7
   [junit4]   2> 1321317 INFO  (TEST-TestReplicationHandler.testRateLimitedReplication-seed#[50935C6DCA2D0E37]) [    ] o.e.j.s.h.ContextHandler Stopped o.e.j.s.ServletContextHandler@751277ef{/solr,null,UNAVAILABLE}
   [junit4]   2> 1321317 INFO  (TEST-TestReplicationHandler.testRateLimitedReplication-seed#[50935C6DCA2D0E37]) [    ] o.e.j.s.session Stopped scavenging
   [junit4]   2> 1321319 INFO  (TEST-TestReplicationHandler.testRateLimitedReplication-seed#[50935C6DCA2D0E37]) [    ] o.e.j.s.Server jetty-9.4.8.v20171121, build timestamp: 2017-11-21T16:27:37-05:00, git hash: 82b8fb23f757335bb3329d540ce37a2a2615f0a8
   [junit4]   2> 1321320 INFO  (TEST-TestReplicationHandler.testRateLimitedReplication-seed#[50935C6DCA2D0E37]) [    ] o.e.j.s.session DefaultSessionIdManager workerName=node0
   [junit4]   2> 1321320 INFO  (TEST-TestReplicationHandler.testRateLimitedReplication-seed#[50935C6DCA2D0E37]) [    ] o.e.j.s.session No SessionScavenger set, using defaults
   [junit4]   2> 1321320 INFO  (TEST-TestReplicationHandler.testRateLimitedReplication-seed#[50935C6DCA2D0E37]) [    ] o.e.j.s.session Scavenging every 600000ms
   [junit4]   2> 1321320 INFO  (TEST-TestReplicationHandler.testRateLimitedReplication-seed#[50935C6DCA2D0E37]) [    ] o.e.j.s.h.ContextHandler Started o.e.j.s.ServletContextHandler@b4bf0d7{/solr,null,AVAILABLE}
   [junit4]   2> 1321321 INFO  (TEST-TestReplicationHandler.testRateLimitedReplication-seed#[50935C6DCA2D0E37]) [    ] o.e.j.s.AbstractConnector Started ServerConnector@7de9cc19{HTTP/1.1,[http/1.1]}{127.0.0.1:59904}
   [junit4]   2> 1321321 INFO  (TEST-TestReplicationHandler.testRateLimitedReplication-seed#[50935C6DCA2D0E37]) [    ] o.e.j.s.Server Started @1324108ms
   [junit4]   2> 1321321 INFO  (TEST-TestReplicationHandler.testRateLimitedReplication-seed#[50935C6DCA2D0E37]) [    ] o.a.s.c.s.e.JettySolrRunner Jetty properties: {solr.data.dir=/x1/jenkins/jenkins-slave/workspace/Lucene-Solr-Tests-master/solr/build/solr-core/test/J2/temp/solr.handler.TestReplicationHandler_50935C6DCA2D0E37-001/solr-instance-001/collection1/data, hostContext=/solr, hostPort=59904}
   [junit4]   2> 1321321 ERROR (TEST-TestReplicationHandler.testRateLimitedReplication-seed#[50935C6DCA2D0E37]) [    ] o.a.s.u.StartupLoggingUtils Missing Java Option solr.log.dir. Logging may be missing or incomplete.
   [junit4]   2> 1321321 INFO  (TEST-TestReplicationHandler.testRateLimitedReplication-seed#[50935C6DCA2D0E37]) [    ] o.a.s.s.SolrDispatchFilter  ___      _       Welcome to Apache Solr™ version 8.0.0
   [junit4]   2> 1321321 INFO  (TEST-TestReplicationHandler.testRateLimitedReplication-seed#[50935C6DCA2D0E37]) [    ] o.a.s.s.SolrDispatchFilter / __| ___| |_ _   Starting in standalone mode on port null
   [junit4]   2> 1321321 INFO  (TEST-TestReplicationHandler.testRateLimitedReplication-seed#[50935C6DCA2D0E37]) [    ] o.a.s.s.SolrDispatchFilter \__ \/ _ \ | '_|  Install dir: null
   [junit4]   2> 1321321 INFO  (TEST-TestReplicationHandler.testRateLimitedReplication-seed#[50935C6DCA2D0E37]) [    ] o.a.s.s.SolrDispatchFilter |___/\___/_|_|    Start time: 2018-02-26T13:56:38.640Z
   [junit4]   2> 1321322 INFO  (TEST-TestReplicationHandler.testRateLimitedReplication-seed#[50935C6DCA2D0E37]) [    ] o.a.s.c.SolrXmlConfig Loading container configuration from /x1/jenkins/jenkins-slave/workspace/Lucene-Solr-Tests-master/solr/build/solr-core/test/J2/temp/solr.handler.TestReplicationHandler_50935C6DCA2D0E37-001/solr-instance-001/solr.xml
   [junit4]   2> 1321325 INFO  (TEST-TestReplicationHandler.testRateLimitedReplication-seed#[50935C6DCA2D0E37]) [    ] o.a.s.c.SolrXmlConfig Configuration parameter autoReplicaFailoverWorkLoopDelay is ignored
   [junit4]   2> 1321325 INFO  (TEST-TestReplicationHandler.testRateLimitedReplication-seed#[50935C6DCA2D0E37]) [    ] o.a.s.c.SolrXmlConfig Configuration parameter autoReplicaFailoverBadNodeExpiration is ignored
   [junit4]   2> 1321326 INFO  (TEST-TestReplicationHandler.testRateLimitedReplication-seed#[50935C6DCA2D0E37]) [    ] o.a.s.c.SolrXmlConfig MBean server found: com.sun.jmx.mbeanserver.JmxMBeanServer@36b042fe, but no JMX reporters were configured - adding default JMX reporter.
   [junit4]   2> 1321362 INFO  (TEST-TestReplicationHandler.testRateLimitedReplication-seed#[50935C6DCA2D0E37]) [    ] o.a.s.m.r.SolrJmxReporter JMX monitoring for 'solr.node' (registry 'solr.node') enabled at server: com.sun.jmx.mbeanserver.JmxMBeanServer@36b042fe
   [junit4]   2> 1321371 INFO  (TEST-TestReplicationHandler.testRateLimitedReplication-seed#[50935C6DCA2D0E37]) [    ] o.a.s.m.r.SolrJmxReporter JMX monitoring for 'solr.jvm' (registry 'solr.jvm') enabled at server: com.sun.jmx.mbeanserver.JmxMBeanServer@36b042fe
   [junit4]   2> 1321371 INFO  (TEST-TestReplicationHandler.testRateLimitedReplication-seed#[50935C6DCA2D0E37]) [    ] o.a.s.m.r.SolrJmxReporter JMX monitoring for 'solr.jetty' (registry 'solr.jetty') enabled at server: com.sun.jmx.mbeanserver.JmxMBeanServer@36b042fe
   [junit4]   2> 1321373 INFO  (TEST-TestReplicationHandler.testRateLimitedReplication-seed#[50935C6DCA2D0E37]) [    ] o.a.s.c.CorePropertiesLocator Found 1 core definitions underneath /x1/jenkins/jenkins-slave/workspace/Lucene-Solr-Tests-master/solr/build/solr-core/test/J2/temp/solr.handler.TestReplicationHandler_50935C6DCA2D0E37-001/solr-instance-001/.
   [junit4]   2> 1321373 INFO  (TEST-TestReplicationHandler.testRateLimitedReplication-seed#[50935C6DCA2D0E37]) [    ] o.a.s.c.CorePropertiesLocator Cores are: [collection1]
   [junit4]   2> 1321373 INFO  (coreLoadExecutor-5978-thread-1) [    ] o.a.s.c.TransientSolrCoreCacheDefault Allocating transient cache for 4 transient cores
   [junit4]   2> 1321381 INFO  (coreLoadExecutor-5978-thread-1) [    x:collection1] o.a.s.c.SolrConfig Using Lucene MatchVersion: 8.0.0
   [junit4]   2> 1321388 INFO  (coreLoadExecutor-5978-thread-1) [    x:collection1] o.a.s.s.IndexSchema [collection1] Schema name=test
   [junit4]   2> 1321390 INFO  (coreLoadExecutor-5978-thread-1) [    x:collection1] o.a.s.s.IndexSchema Loaded schema test/1.2 with uniqueid field id
   [junit4]   2> 1321390 INFO  (coreLoadExecutor-5978-thread-1) [    x:collection1] o.a.s.c.CoreContainer Creating SolrCore 'collection1' using configuration from instancedir /x1/jenkins/jenkins-slave/workspace/Lucene-Solr-Tests-master/solr/build/solr-core/test/J2/temp/solr.handler.TestReplicationHandler_50935C6DCA2D0E37-001/solr-instance-001/./collection1, trusted=true
   [junit4]   2> 1321390 INFO  (coreLoadExecutor-5978-thread-1) [    x:collection1] o.a.s.m.r.SolrJmxReporter JMX monitoring for 'solr.core.collection1' (registry 'solr.core.collection1') enabled at server: com.sun.jmx.mbeanserver.JmxMBeanServer@36b042fe
   [junit4]   2> 1321390 INFO  (coreLoadExecutor-5978-thread-1) [    x:collection1] o.a.s.c.SolrCore solr.RecoveryStrategy.Builder
   [junit4]   2> 1321390 INFO  (coreLoadExecutor-5978-thread-1) [    x:collection1] o.a.s.c.SolrCore [[collection1] ] Opening new SolrCore at [/x1/jenkins/jenkins-slave/workspace/Lucene-Solr-Tests-master/solr/build/solr-core/test/J2/temp/solr.handler.TestReplicationHandler_50935C6DCA2D0E37-001/solr-instance-001/collection1], dataDir=[/x1/jenkins/jenkins-slave/workspace/Lucene-Solr-Tests-master/solr/build/solr-core/test/J2/temp/solr.handler.TestReplicationHandler_50935C6DCA2D0E37-001/solr-instance-001/./collection1/data/]
   [junit4]   2> 1321392 INFO  (coreLoadExecutor-5978-thread-1) [    x:collection1] o.a.s.u.RandomMergePolicy RandomMergePolicy wrapping class org.apache.lucene.index.LogByteSizeMergePolicy: [LogByteSizeMergePolicy: minMergeSize=1677721, mergeFactor=23, maxMergeSize=2147483648, maxMergeSizeForForcedMerge=9223372036854775807, calibrateSizeByDeletes=false, maxMergeDocs=2147483647, maxCFSSegmentSizeMB=8.796093022207999E12, noCFSRatio=0.0]
   [junit4]   2> 1321429 INFO  (coreLoadExecutor-5978-thread-1) [    x:collection1] o.a.s.u.CommitTracker Hard AutoCommit: disabled
   [junit4]   2> 1321429 INFO  (coreLoadExecutor-5978-thread-1) [    x:collection1] o.a.s.u.CommitTracker Soft AutoCommit: disabled
   [junit4]   2> 1321430 INFO  (coreLoadExecutor-5978-thread-1) [    x:collection1] o.a.s.u.RandomMergePolicy RandomMergePolicy wrapping class org.apache.lucene.index.TieredMergePolicy: [TieredMergePolicy: maxMergeAtOnce=13, maxMergeAtOnceExplicit=32, maxMergedSegmentMB=4.0400390625, floorSegmentMB=0.98828125, forceMergeDeletesPctAllowed=26.588415041342916, segmentsPerTier=4.0, maxCFSSegmentSizeMB=8.796093022207999E12, noCFSRatio=0.45221366572615385
   [junit4]   2> 1321431 INFO  (coreLoadExecutor-5978-thread-1) [    x:collection1] o.a.s.s.SolrIndexSearcher Opening [Searcher@7ea184d6[collection1] main]
   [junit4]   2> 1321431 INFO  (coreLoadExecutor-5978-thread-1) [    x:collection1] o.a.s.r.ManagedResourceStorage File-based storage initialized to use dir: /x1/jenkins/jenkins-slave/workspace/Lucene-Solr-Tests-master/solr/build/solr-core/test/J2/temp/solr.handler.TestReplicationHandler_50935C6DCA2D0E37-001/solr-instance-001/collection1/conf
   [junit4]   2> 1321431 INFO  (coreLoadExecutor-5978-thread-1) [    x:collection1] o.a.s.h.ReplicationHandler Commits will be reserved for 10000ms.
   [junit4]   2> 1321432 INFO  (searcherExecutor-5979-thread-1-processing-x:collection1) [    x:collection1] o.a.s.c.SolrCore [collection1] Registered new searcher Searcher@7ea184d6[collection1] main{ExitableDirectoryReader(UninvertingDirectoryReader())}
   [junit4]   2> 1321434 INFO  (qtp1706146084-14551) [    x:collection1] o.a.s.u.p.LogUpdateProcessorFactory [collection1]  webapp=/solr path=/update params={wt=javabin&version=2}{add=[0]} 0 0
   [junit4]   2> 1321435 INFO  (qtp1706146084-14553) [    x:collection1] o.a.s.u.p.LogUpdateProcessorFactory [collection1]  webapp=/solr path=/update params={wt=javabin&version=2}{add=[1]} 0 0
   [junit4]   2> 1321435 INFO  (qtp1706146084-14555) [    x:collection1] o.a.s.u.p.LogUpdateProcessorFactory [collection1]  webapp=/solr path=/update params={wt=javabin&version=2}{add=[2]} 0 0
   [junit4]   2> 1321436 INFO  (qtp1706146084-14553) [    x:collection1] o.a.s.u.p.LogUpdateProcessorFactory [collection1]  webapp=/solr path=/update params={wt=javabin&version=2}{add=[3]} 0 0
   [junit4]   2> 1321436 INFO  (qtp1706146084-14555) [    x:collection1] o.a.s.u.p.LogUpdateProcessorFactory [collection1]  webapp=/solr path=/update params={wt=javabin&version=2}{add=[4]} 0 0
   [junit4]   2> 1321437 INFO  (qtp1706146084-14553) [    x:collection1] o.a.s.u.p.LogUpdateProcessorFactory [collection1]  webapp=/solr path=/update params={wt=javabin&version=2}{add=[5]} 0 0
   [junit4]   2> 1321437 INFO  (qtp1706146084-14555) [    x:collection1] o.a.s.u.p.LogUpdateProcessorFactory [collection1]  webapp=/solr path=/update params={wt=javabin&version=2}{add=[6]} 0 0
   [junit4]   2> 1321437 INFO  (qtp1706146084-14553) [    x:collection1] o.a.s.u.p.LogUpdateProcessorFactory [collection1]  webapp=/solr path=/update params={wt=javabin&version=2}{add=[7]} 0 0
   [junit4]   2> 1321438 INFO  (qtp1706146084-14555) [    x:collection1] o.a.s.u.p.LogUpdateProcessorFactory [collection1]  webapp=/solr path=/update params={wt=javabin&version=2}{add=[8]} 0 0
   [junit4]   2> 1321438 INFO  (qtp1706146084-14553) [    x:collection1] o.a.s.u.p.LogUpdateProcessorFactory [collection1]  webapp=/solr path=/update params={wt=javabin&version=2}{add=[9]} 0 0
   [junit4]   2> 1321438 INFO  (qtp1706146084-14555) [    x:collection1] o.a.s.u.p.LogUpdateProcessorFactory [collection1]  webapp=/solr path=/update params={wt=javabin&version=2}{add=[10]} 0 0
   [junit4]   2> 1321439 INFO  (qtp1706146084-14553) [    x:collection1] o.a.s.u.p.LogUpdateProcessorFactory [collection1]  webapp=/solr path=/update params={wt=javabin&version=2}{add=[11]} 0 0
   [junit4]   2> 1321440 INFO  (qtp1706146084-14555) [    x:collection1] o.a.s.u.p.LogUpdateProcessorFactory [collection1]  webapp=/solr path=/update params={wt=javabin&version=2}{add=[12]} 0 0
   [junit4]   2> 1321440 INFO  (qtp1706146084-14553) [    x:collection1] o.a.s.u.p.LogUpdateProcessorFactory [collection1]  webapp=/solr path=/update params={wt=javabin&version=2}{add=[13]} 0 0
   [junit4]   2> 1321440 INFO  (qtp1706146084-14555) [    x:collection1] o.a.s.u.p.LogUpdateProcessorFactory [collection1]  webapp=/solr path=/update params={wt=javabin&version=2}{add=[14]} 0 0
   [junit4]   2> 1321441 INFO  (qtp1706146084-14553) [    x:collection1] o.a.s.u.p.LogUpdateProcessorFactory [collection1]  webapp=/solr path=/update params={wt=javabin&version=2}{add=[15]} 0 0
   [junit4]   2> 1321441 INFO  (qtp1706146084-14555) [    x:collection1] o.a.s.u.p.LogUpdateProcessorFactory [collection1]  webapp=/solr path=/update params={wt=javabin&version=2}{add=[16]} 0 0
   [junit4]   2> 1321442 INFO  (qtp1706146084-14553) [    x:collection1] o.a.s.u.p.LogUpdateProcessorFactory [collection1]  webapp=/solr path=/update params={wt=javabin&version=2}{add=[17]} 0 0
   [junit4]   2> 1321442 INFO  (qtp1706146084-14555) [    x:collection1] o.a.s.u.p.LogUpdateProcessorFactory [collection1]  webapp=/solr path=/update params={wt=javabin&version=2}{add=[18]} 0 0
   [junit4]   2> 1321442 INFO  (qtp1706146084-14553) [    x:collection1] o.a.s.u.p.LogUpdateProcessorFactory [collection1]  webapp=/solr path=/update params={wt=javabin&version=2}{add=[19]} 0 0
   [junit4]   2> 1321443 INFO  (qtp1706146084-14555) [    x:collection1] o.a.s.u.p.LogUpdateProcessorFactory [collection1]  webapp=/solr path=/update params={wt=javabin&version=2}{add=[20]} 0 0
   [junit4]   2> 1321444 INFO  (qtp1706146084-14553) [    x:collection1] o.a.s.u.p.LogUpdateProcessorFactory [collection1]  webapp=/solr path=/update params={wt=javabin&version=2}{add=[21]} 0 0
   [junit4]   2> 1321444 INFO  (qtp1706146084-14555) [    x:collection1] o.a.s.u.p.LogUpdateProcessorFactory [collection1]  webapp=/solr path=/update params={wt=javabin&version=2}{add=[22]} 0 0
   [junit4]   2> 1321444 INFO  (qtp1706146084-14553) [    x:collection1] o.a.s.u.p.LogUpdateProcessorFactory [collection1]  webapp=/solr path=/update params={wt=javabin&version=2}{add=[23]} 0 0
   [junit4]   2> 1321445 INFO  (qtp1706146084-14555) [    x:collection1] o.a.s.u.p.LogUpdateProcessorFactory [collection1]  webapp=/solr path=/update params={wt=javabin&version=2}{add=[24]} 0 0
   [junit4]   2> 1321445 INFO  (qtp1706146084-14553) [    x:collection1] o.a.s.u.p.LogUpdateProcessorFactory [collection1]  webapp=/solr path=/update params={wt=javabin&version=2}{add=[25]} 0 0
   [junit4]   2> 1321445 INFO  (qtp1706146084-14555) [    x:collection1] o.a.s.u.p.LogUpdateProcessorFactory [collection1]  webapp=/solr path=/update params={wt=javabin&version=2}{add=[26]} 0 0
   [junit4]   2> 1321446 INFO  (qtp1706146084-14553) [    x:collection1] o.a.s.u.p.LogUpdateProcessorFactory [collection1]  webapp=/solr path=/update params={wt=javabin&version=2}{add=[27]} 0 0
   [junit4]   2> 1321446 INFO  (qtp1706146084-14555) [    x:collection1] o.a.s.u.p.LogUpdateProcessorFactory [collection1]  webapp=/solr path=/update params={wt=javabin&version=2}{add=[28]} 0 0
   [junit4]   2> 1321447 INFO  (qtp1706146084-14553) [    x:collection1] o.a.s.u.p.LogUpdateProcessorFactory [collection1]  webapp=/solr path=/update params={wt=javabin&version=2}{add=[29]} 0 0
   [junit4]   2> 1321447 INFO  (qtp1706146084-14555) [    x:collection1] o.a.s.u.p.LogUpdateProcessorFactory [collection1]  webapp=/solr path=/update params={wt=javabin&version=2}{add=[30]} 0 0
   [junit4]   2> 1321447 INFO  (qtp1706146084-14553) [    x:collection1] o.a.s.u.p.LogUpdateProcessorFactory [collection1]  webapp=/solr path=/update params={wt=javabin&version=2}{add=[31]} 0 0
   [junit4]   2> 1321448 INFO  (qtp1706146084-14555) [    x:collection1] o.a.s.u.p.LogUpdateProcessorFactory [collection1]  webapp=/solr path=/update params={wt=javabin&version=2}{add=[32]} 0 0
   [junit4]   2> 1321448 INFO  (qtp1706146084-14553) [    x:collection1] o.a.s.u.p.LogUpdateProcessorFactory [collection1]  webapp=/solr path=/update params={wt=javabin&version=2}{add=[33]} 0 0
   [junit4]   2> 1321449 INFO  (qtp1706146084-14555) [    x:collection1] o.a.s.u.p.LogUpdateProcessorFactory [collection1]  webapp=/solr path=/update params={wt=javabin&version=2}{add=[34]} 0 0
   [junit4]   2> 1321449 INFO  (qtp1706146084-14553) [    x:collection1] o.a.s.u.p.LogUpdateProcessorFactory [collection1]  webapp=/solr path=/update params={wt=javabin&version=2}{add=[35]} 0 0
   [junit4]   2> 1321449 INFO  (qtp1706146084-14555) [    x:collection1] o.a.s.u.p.LogUpdateProcessorFactory [collection1]  webapp=/solr path=/update params={wt=javabin&version=2}{add=[36]} 0 0
   [junit4]   2> 1321449 INFO  (qtp1706146084-14553) [    x:collection1] o.a.s.u.p.LogUpdateProcessorFactory [collection1]  webapp=/solr path=/update params={wt=javabin&version=2}{add=[37]} 0 0
   [junit4]   2> 1321450 INFO  (qtp1706146084-14555) [    x:collection1] o.a.s.u.p.LogUpdateProcessorFactory [collection1]  webapp=/solr path=/update params={wt=javabin&version=2}{add=[38]} 0 0
   [junit4]   2> 1321450 INFO  (qtp1706146084-14553) [    x:collection1] o.a.s.u.p.LogUpdateProcessorFactory [collection1]  webapp=/solr path=/update params={wt=javabin&version=2}{add=[39]} 0 0
   [junit4]   2> 1321450 INFO  (qtp1706146084-14555) [    x:collection1] o.a.s.u.p.LogUpdateProcessorFactory [collection1]  webapp=/solr path=/update params={wt=javabin&version=2}{add=[40]} 0 0
   [junit4]   2> 1321451 INFO  (qtp1706146084-14553) [    x:collection1] o.a.s.u.p.LogUpdateProcessorFactory [collection1]  webapp=/solr path=/update params={wt=javabin&version=2}{add=[41]} 0 0
   [junit4]   2> 1321452 INFO  (qtp1706146084-14555) [    x:collection1] o.a.s.u.p.LogUpdateProcessorFactory [collection1]  webapp=/solr path=/update params={wt=javabin&version=2}{add=[42]} 0 0
   [junit4]   2> 1321452 INFO  (qtp1706146084-14553) [    x:collection1] o.a.s.u.p.LogUpdateProcessorFactory [collection1]  webapp=/solr path=/update params={wt=javabin&version=2}{add=[43]} 0 0
   [junit4]   2> 1321452 INFO  (qtp1706146084-14555) [    x:collection1] o.a.s.u.p.LogUpdateProcessorFactory [collection1]  webapp=/solr path=/update params={wt=javabin&version=2}{add=[44]} 0 0
   [junit4]   2> 1321452 INFO  (qtp1706146084-14553) [    x:collection1] o.a.s.u.p.LogUpdateProcessorFactory [collection1]  webapp=/solr path=/update params={wt=javabin&version=2}{add=[45]} 0 0
   [junit4]   2> 1321453 INFO  (qtp1706146084-14555) [    x:collection1] o.a.s.u.p.LogUpdateProcessorFactory [collection1]  webapp=/solr path=/update params={wt=javabin&version=2}{add=[46]} 0 0
   [junit4]   2> 1321453 INFO  (qtp1706146084-14553) [    x:collection1] o.a.s.u.p.LogUpdateProcessorFactory [collection1]  webapp=/solr path=/update params={wt=javabin&version=2}{add=[47]} 0 0
   [junit4]   2> 1321454 INFO  (qtp1706146084-14555) [    x:collection1] o.a.s.u.p.LogUpdateProcessorFactory [collection1]  webapp=/solr path=/update params={wt=javabin&version=2}{add=[48]} 0 0
   [junit4]   2> 1321454 INFO  (qtp1706146084-14553) [    x:collection1] o.a.s.u.p.LogUpdateProcessorFactory [collection1]  webapp=/solr path=/update params={wt=javabin&version=2}{add=[49]} 0 0
   [junit4]   2> 1321454 INFO  (qtp1706146084-14555) [    x:collection1] o.a.s.u.p.LogUpdateProcessorFactory [collection1]  webapp=/solr path=/update params={wt=javabin&version=2}{add=[50]} 0 0
   [junit4]   2> 1321455 INFO  (qtp1706146084-14553) [    x:collection1] o.a.s.u.p.LogUpdateProcessorFactory [collection1]  webapp=/solr path=/update params={wt=javabin&version=2}{add=[51]} 0 0
   [junit4]   2> 1321455 INFO  (qtp1706146084-14555) [    x:collection1] o.a.s.u.p.LogUpdateProcessorFactory [collection1]  webapp=/solr path=/update params={wt=javabin&version=2}{add=[52]} 0 0
   [junit4]   2> 1321455 INFO  (qtp1706146084-14553) [    x:collection1] o.a.s.u.p.LogUpdateProcessorFactory [collection1]  webapp=/solr path=/update params={wt=javabin&version=2}{add=[53]} 0 0
   [junit4]   2> 1321456 INFO  (qtp1706146084-14555) [    x:collection1] o.a.s.u.p.LogUpdateProcessorFactory [collection1]  webapp=/solr path=/update params={wt=javabin&version=2}{add=[54]} 0 0
   [junit4]   2> 1321456 INFO  (qtp1706146084-14553) [    x:collection1] o.a.s.u.p.LogUpdateProcessorFactory [collection1]  webapp=/solr path=/update params={wt=javabin&version=2}{add=[55]} 0 0
   [junit4]   2> 1321457 INFO  (qtp1706146084-14555) [    x:collection1] o.a.s.u.p.LogUpdateProcessorFactory [collection1]  webapp=/solr path=/update params={wt=javabin&version=2}{add=[56]} 0 0
   [junit4]   2> 1321457 INFO  (qtp1706146084-14553) [    x:collection1] o.a.s.u.p.LogUpdateProcessorFactory [collection1]  webapp=/solr path=/update params={wt=javabin&version=2}{add=[57]} 0 0
   [junit4]   2> 1321457 INFO  (qtp1706146084-14555) [    x:collection1] o.a.s.u.p.LogUpdateProcessorFactory [collection1]  webapp=/solr path=/update params={wt=javabin&version=2}{add=[58]} 0 0
   [junit4]   2> 1321458 INFO  (qtp1706146084-14553) [    x:collection1] o.a.s.u.p.LogUpdateProcessorFactory [collection1]  webapp=/solr path=/update params={wt=javabin&version=2}{add=[59]} 0 0
   [junit4]   2> 1321458 INFO  (qtp1706146084-14555) [    x:collection1] o.a.s.u.p.LogUpdateProcessorFactory [collection1]  webapp=/solr path=/update params={wt=javabin&version=2}{add=[60]} 0 0
   [junit4]   2> 1321459 INFO  (qtp1706146084-14553) [    x:collection1] o.a.s.u.p.LogUpdateProcessorFactory [collection1]  webapp=/solr path=/update params={wt=javabin&version=2}{add=[61]} 0 0
   [junit4]   2> 1321459 INFO  (qtp1706146084-14555) [    x:collection1] o.a.s.u.p.LogUpdateProcessorFactory [collection1]  webapp=/solr path=/update params={wt=javabin&version=2}{add=[62]} 0 0
   [junit4]   2> 1321460 INFO  (qtp1706146084-14553) [    x:collection1] o.a.s.u.p.LogUpdateProcessorFactory [collection1]  webapp=/solr path=/update params={wt=javabin&version=2}{add=[63]} 0 0
   [junit4]   2> 1321460 INFO  (qtp1706146084-14555) [    x:collection1] o.a.s.u.p.LogUpdateProcessorFactory [collection1]  webapp=/solr path=/update params={wt=javabin&version=2}{add=[64]} 0 0
   [junit4]   2> 1321460 INFO  (qtp1706146084-14553) [    x:collection1] o.a.s.u.p.LogUpdateProcessorFactory [collection1]  webapp=/solr path=/update params={wt=javabin&version=2}{add=[65]} 0 0
   [junit4]   2> 1321461 INFO  (qtp1706146084-14555) [    x:collection1] o.a.s.u.p.LogUpdateProcessorFactory [collection1]  webapp=/solr path=/update params={wt=javabin&version=2}{add=[66]} 0 0
   [junit4]   2> 1321461 INFO  (qtp1706146084-14553) [    x:collection1] o.a.s.u.p.LogUpdateProcessorFactory [collection1]  webapp=/solr path=/update params={wt=javabin&version=2}{add=[67]} 0 0
   [junit4]   2> 1321462 INFO  (qtp1706146084-14555) [    x:collection1] o.a.s.u.p.LogUpdateProcessorFactory [collection1]  webapp=/solr path=/update params={wt=javabin&version=2}{add=[68]} 0 0
   [junit4]   2> 1321462 INFO  (qtp1706146084-14553) [    x:collection1] o.a.s.u.p.LogUpdateProcessorFactory [collection1]  webapp=/solr path=/update params={wt=javabin&version=2}{add=[69]} 0 0
   [junit4]   2> 1321462 INFO  (qtp1706146084-14555) [    x:collection1] o.a.s.u.p.LogUpdateProcessorFactory [collection1]  webapp=/solr path=/update params={wt=javabin&version=2}{add=[70]} 0 0
   [junit4]   2> 1321463 INFO  (qtp1706146084-14553) [    x:collection1] o.a.s.u.p.LogUpdateProcessorFactory [collection1]  webapp=/solr path=/update params={wt=javabin&version=2}{add=[71]} 0 0
   [junit4]   2> 1321463 INFO  (qtp1706146084-14555) [    x:collection1] o.a.s.u.p.LogUpdateProcessorFactory [collection1]  webapp=/solr path=/update params={wt=javabin&version=2}{add=[72]} 0 0
   [junit4]   2> 1321464 INFO  (qtp1706146084-14553) [    x:collection1] o.a.s.u.p.LogUpdateProcessorFactory [collection1]  webapp=/solr path=/update params={wt=javabin&version=2}{add=[73]} 0 0
   [junit4]   2> 1321464 INFO  (qtp1706146084-14555) [    x:collection1] o.a.s.u.p.LogUpdateProcessorFactory [collection1]  webapp=/solr path=/update params={wt=javabin&version=2}{add=[74]} 0 0
   [junit4]   2> 1321464 INFO  (qtp1706146084-14553) [    x:collection1] o.a.s.u.p.LogUpdateProcessorFactory [collection1]  webapp=/solr path=/update params={wt=javabin&version=2}{add=[75]} 0 0
   [junit4]   2> 1321465 INFO  (qtp1706146084-14555) [    x:collection1] o.a.s.u.p.LogUpdateProcessorFactory [collection1]  webapp=/solr path=/update params={wt=javabin&version=2}{add=[76]} 0 0
   [junit4]   2> 1321465 INFO  (qtp1706146084-14553) [    x:collection1] o.a.s.u.p.LogUpdateProcessorFactory [collection1]  webapp=/solr path=/update params={wt=javabin&version=2}{add=[77]} 0 0
   [junit4]   2> 1321466 INFO  (qtp1706146084-14555) [    x:collection1] o.a.s.u.p.LogUpdateProcessorFactory [collection1]  webapp=/solr path=/update params={wt=javabin&version=2}{add=[78]} 0 0
   [junit4]   2> 1321466 INFO  (qtp1706146084-14553) [    x:collection1] o.a.s.u.p.LogUpdateProcessorFactory [collection1]  webapp=/solr path=/update params={wt=javabin&version=2}{add=[79]} 0 0
   [junit4]   2> 1321467 INFO  (qtp1706146084-14555) [    x:collection1] o.a.s.u.p.LogUpdateProcessorFactory [collection1]  webapp=/solr path=/update params={wt=javabin&version=2}{add=[80]} 0 0
   [junit4]   2> 1321467 INFO  (qtp1706146084-14553) [    x:collection1] o.a.s.u.p.LogUpdateProcessorFactory [collection1]  webapp=/solr path=/update params={wt=javabin&version=2}{add=[81]} 0 0
   [junit4]   2> 1321467 INFO  (qtp1706146084-14555) [    x:collection1] o.a.s.u.p.LogUpdateProcessorFactory [collection1]  webapp=/solr path=/update params={wt=javabin&version=2}{add=[82]} 0 0
   [junit4]   2> 1321468 INFO  (qtp1706146084-14553) [    x:collection1] o.a.s.u.p.LogUpdateProcessorFactory [collection1]  webapp=/solr path=/update params={wt=javabin&version=2}{add=[83]} 0 0
   [junit4]   2> 1321468 INFO  (qtp1706146084-14555) [    x:collection1] o.a.s.u.p.LogUpdateProcessorFactory [collection1]  webapp=/solr path=/update params={wt=javabin&version=2}{add=[84]} 0 0
   [junit4]   2> 1321469 INFO  (qtp1706146084-14553) [    x:collection1] o.a.s.u.p.LogUpdateProcessorFactory [collection1]  webapp=/solr path=/update params={wt=javabin&version=2}{add=[85]} 0 0
   [junit4]   2> 1321469 INFO  (qtp1706146084-14555) [    x:collection1] o.a.s.u.p.LogUpdateProcessorFactory [collection1]  webapp=/solr path=/update params={wt=javabin&version=2}{add=[86]} 0 0
   [junit4]   2> 1321470 INFO  (qtp1706146084-14553) [    x:collection1] o.a.s.u.DirectUpdateHandler2 start commit{,optimize=false,openSearcher=true,waitSearcher=true,expungeDeletes=false,softCommit=false,prepareCommit=false}
   [junit4]   2> 1321470 INFO  (qtp1706146084-14553) [    x:collection1] o.a.s.u.SolrIndexWriter Calling setCommitData with IW:org.apache.solr.update.SolrIndexWriter@e0269bc commitCommandVersion:0
   [junit4]   2> 1321492 INFO  (qtp1706146084-14553) [    x:collection1] o.a.s.s.SolrIndexSearcher Opening [Searcher@2599ae1e[collection1] main]
   [junit4]   2> 1321492 INFO  (qtp1706146084-14553) [    x:collection1] o.a.s.u.DirectUpdateHandler2 end_commit_flush
   [junit4]   2> 1321493 INFO  (searcherExecutor-5979-thread-1-processing-x:collection1) [    x:collection1] o.a.s.c.SolrCore [collection1] Registered new searcher Searcher@2599ae1e[collection1] main{ExitableDirectoryReader(UninvertingDirectoryReader(Uninverting(_0(8.0.0):C87)))}
   [junit4]   2> 1321494 INFO  (qtp1706146084-14553) [    x:collection1] o.a.s.u.p.LogUpdateProcessorFactory [collection1]  webapp=/solr path=/update params={waitSearcher=true&commit=true&softCommit=false&wt=javabin&version=2}{commit=} 0 24
   [junit4]   2> 1321494 INFO  (TEST-TestReplicationHandler.testRateLimitedReplication-seed#[50935C6DCA2D0E37]) [    ] o.e.j.s.AbstractConnector Stopped ServerConnector@7de9cc19{HTTP/1.1,[http/1.1]}{127.0.0.1:0}
   [junit4]   2> 1321494 INFO  (TEST-TestReplicationHandler.testRateLimitedReplication-seed#[50935C6DCA2D0E37]) [    ] o.a.s.c.CoreContainer Shutting down CoreContainer instance=1792896176
   [junit4]   2> 1321495 INFO  (TEST-TestReplicationHandler.testRateLimitedReplication-seed#[50935C6DCA2D0E37]) [    ] o.a.s.m.SolrMetricManager Closing metric reporters for registry=solr.node, tag=null
   [junit4]   2> 1321495 INFO  (TEST-TestReplicationHandler.testRateLimitedReplication-seed#[50935C6DCA2D0E37]) [    ] o.a.s.m.r.SolrJmxReporter Closing reporter [org.apache.solr.metrics.reporters.SolrJmxReporter@e642ecc: rootName = null, domain = solr.node, service url = null, agent id = null] for registry solr.node / com.codahale.metrics.MetricRegistry@6e931b23
   [junit4]   2> 1321500 INFO  (TEST-TestReplicationHandler.testRateLimitedReplication-seed#[50935C6DCA2D0E37]) [    ] o.a.s.m.SolrMetricManager Closing metric reporters for registry=solr.jvm, tag=null
   [junit4]   2> 1321500 INFO  (TEST-TestReplicationHandler.testRateLimitedReplication-seed#[50935C6DCA2D0E37]) [    ] o.a.s.m.r.SolrJmxReporter Closing reporter [org.apache.solr.metrics.reporters.SolrJmxReporter@49ba2962: rootName = null, domain = solr.jvm, service url = null, agent id = null] for registry solr.jvm / com.codahale.metrics.MetricRegistry@1a549690
   [junit4]   2> 1321505 INFO  (TEST-TestReplicationHandler.testRateLimitedReplication-seed#[50935C6DCA2D0E37]) [    ] o.a.s.m.SolrMetricManager Closing metric reporters for registry=solr.jetty, tag=null
   [junit4]   2> 1321505 INFO  (TEST-TestReplicationHandler.testRateLimitedReplication-seed#[50935C6DCA2D0E37]) [    ] o.a.s.m.r.SolrJmxReporter Closing reporter [org.apache.solr.metrics.reporters.SolrJmxReporter@66d013b: rootName = null, domain = solr.jetty, service url = null, agent id = null] for registry solr.jetty / com.codahale.metrics.MetricRegistry@6b9658e0
   [junit4]   2> 1321505 INFO  (coreCloseExecutor-5983-thread-1) [    x:collection1] o.a.s.c.SolrCore [collection1]  CLOSING SolrCore org.apache.solr.core.SolrCore@2d5c7ff5
   [junit4]   2> 1321505 INFO  (coreCloseExecutor-5983-thread-1) [    x:collection1] o.a.s.m.SolrMetricManager Closing metric reporters for registry=solr.core.collection1, tag=761036789
   [junit4]   2> 1321505 INFO  (coreCloseExecutor-5983-thread-1) [    x:collection1] o.a.s.m.r.SolrJmxReporter Closing reporter [org.apache.solr.metrics.reporters.SolrJmxReporter@7b932463: rootName = null, domain = solr.core.collection1, service url = null, agent id = null] for registry solr.core.collection1 / com.codahale.metrics.MetricRegistry@570ff64d
   [junit4]   2> 1321514 INFO  (TEST-TestReplicationHandler.testRateLimitedReplication-seed#[50935C6DCA2D0E37]) [    ] o.e.j.s.h.ContextHandler Stopped o.e.j.s.ServletContextHandler@b4bf0d7{/solr,null,UNAVAILABLE}
   [junit4]   2> 1321514 INFO  (TEST-TestReplicationHandler.testRateLimitedReplication-seed#[50935C6DCA2D0E37]) [    ] o.e.j.s.session Stopped scavenging
   [junit4]   2> 1321515 INFO  (TEST-TestReplicationHandler.testRateLimitedReplication-seed#[50935C6DCA2D0E37]) [    ] o.e.j.s.Server jetty-9.4.8.v20171121, build timestamp: 2017-11-21T16:27:37-05:00, git hash: 82b8fb23f757335bb3329d540ce37a2a2615f0a8
   [junit4]   2> 1321516 INFO  (TEST-TestReplicationHandler.testRateLimitedReplication-seed#[50935C6DCA2D0E37]) [    ] o.e.j.s.session DefaultSessionIdManager workerName=node0
   [junit4]   2> 1321516 INFO  (TEST-TestReplicationHandler.testRateLimitedReplication-seed#[50935C6DCA2D0E37]) [    ] o.e.j.s.session No SessionScavenger set, using defaults
   [junit4]   2> 1321516 INFO  (TEST-TestReplicationHandler.testRateLimitedReplication-seed#[50935C6DCA2D0E37]) [    ] o.e.j.s.session Scavenging every 600000ms
   [junit4]   2> 1321516 INFO  (TEST-TestReplicationHandler.testRateLimitedReplication-seed#[50935C6DCA2D0E37]) [    ] o.e.j.s.h.ContextHandler Started o.e.j.s.ServletContextHandler@74b5724b{/solr,null,AVAILABLE}
   [junit4]   2> 1321517 INFO  (TEST-TestReplicationHandler.testRateLimitedReplication-seed#[50935C6DCA2D0E37]) [    ] o.e.j.s.AbstractConnector Started ServerConnector@4b6a8013{HTTP/1.1,[http/1.1]}{127.0.0.1:34992}
   [junit4]   2> 1321517 INFO  (TEST-TestReplicationHandler.testRateLimitedReplication-seed#[50935C6DCA2D0E37]) [    ] o.e.j.s.Server Started @1324304ms
   [junit4]   2> 1321517 INFO  (TEST-TestReplicationHandler.testRateLimitedReplication-seed#[50935C6DCA2D0E37]) [    ] o.a.s.c.s.e.JettySolrRunner Jetty properties: {solr.data.dir=/x1/jenkins/jenkins-slave/workspace/Lucene-Solr-Tests-master/solr/build/solr-core/test/J2/temp/solr.handler.TestReplicationHandler_50935C6DCA2D0E37-001/solr-instance-001/collection1/data, hostContext=/solr, hostPort=34992}
   [junit4]   2> 1321517 ERROR (TEST-TestReplicationHandler.testRateLimitedReplication-seed#[50935C6DCA2D0E37]) [    ] o.a.s.u.StartupLoggingUtils Missing Java Option solr.log.dir. Logging may be missing or incomplete.
   [junit4]   2> 1321517 INFO  (TEST-TestReplicationHandler.testRateLimitedReplication-seed#[50935C6DCA2D0E37]) [    ] o.a.s.s.SolrDispatchFilter  ___      _       Welcome to Apache Solr™ version 8.0.0
   [junit4]   2> 1321517 INFO  (TEST-TestReplicationHandler.testRateLimitedReplication-seed#[50935C6DCA2D0E37]) [    ] o.a.s.s.SolrDispatchFilter / __| ___| |_ _   Starting in standalone mode on port null
   [junit4]   2> 1321517 INFO  (TEST-TestReplicationHandler.testRateLimitedReplication-seed#[50935C6DCA2D0E37]) [    ] o.a.s.s.SolrDispatchFilter \__ \/ _ \ | '_|  Install dir: null
   [junit4]   2> 1321517 INFO  (TEST-TestReplicationHandler.testRateLimitedReplication-seed#[50935C6DCA2D0E37]) [    ] o.a.s.s.SolrDispatchFilter |___/\___/_|_|    Start time: 2018-02-26T13:56:38.836Z
   [junit4]   2> 1321518 INFO  (TEST-TestReplicationHandler.testRateLimitedReplication-seed#[50935C6DCA2D0E37]) [    ] o.a.s.c.SolrXmlConfig Loading container configuration from /x1/jenkins/jenkins-slave/workspace/Lucene-Solr-Tests-master/solr/build/solr-core/test/J2/temp/solr.handler.TestReplicationHandler_50935C6DCA2D0E37-001/solr-instance-001/solr.xml
   [junit4]   2> 1321521 INFO  (TEST-TestReplicationHandler.testRateLimitedReplication-seed#[50935C6DCA2D0E37]) [    ] o.a.s.c.SolrXmlConfig Configuration parameter autoReplicaFailoverWorkLoopDelay is ignored
   [junit4]   2> 1321521 INFO  (TEST-TestReplicationHandler.testRateLimitedReplication-seed#[50935C6DCA2D0E37]) [    ] o.a.s.c.SolrXmlConfig Configuration parameter autoReplicaFailoverBadNodeExpiration is ignored
   [junit4]   2> 1321522 INFO  (TEST-TestReplicationHandler.testRateLimitedReplication-seed#[50935C6DCA2D0E37]) [    ] o.a.s.c.SolrXmlConfig MBean server found: com.sun.jmx.mbeanserver.JmxMBeanServer@36b042fe, but no JMX reporters were configured - adding default JMX reporter.
   [junit4]   2> 1321549 INFO  (TEST-TestReplicationHandler.testRateLimitedReplication-seed#[50935C6DCA2D0E37]) [    ] o.a.s.m.r.SolrJmxReporter JMX monitoring for 'solr.node' (registry 'solr.node') enabled at server: com.sun.jmx.mbeanserver.JmxMBeanServer@36b042fe
   [junit4]   2> 1321558 INFO  (TEST-TestReplicationHandler.testRateLimitedReplication-seed#[50935C6DCA2D0E37]) [    ] o.a.s.m.r.SolrJmxReporter JMX monitoring for 'solr.jvm' (registry 'solr.jvm') enabled at server: com.sun.jmx.mbeanserver.JmxMBeanServer@36b042fe
   [junit4]   2> 1321558 INFO  (TEST-TestReplicationHandler.testRateLimitedReplication-seed#[50935C6DCA2D0E37]) [    ] o.a.s.m.r.SolrJmxReporter JMX monitoring for 'solr.jetty' (registry 'solr.jetty') enabled at server: com.sun.jmx.mbeanserver.JmxMBeanServer@36b042fe
   [junit4]   2> 1321560 INFO  (TEST-TestReplicationHandler.testRateLimitedReplication-seed#[50935C6DCA2D0E37]) [    ] o.a.s.c.CorePropertiesLocator Found 1 core definitions underneath /x1/jenkins/jenkins-slave/workspace/Lucene-Solr-Tests-master/solr/build/solr-core/test/J2/temp/solr.handler.TestReplicationHandler_50935C6DCA2D0E37-001/solr-instance-001/.
   [junit4]   2> 1321560 INFO  (TEST-TestReplicationHandler.testRateLimitedReplication-seed#[50935C6DCA2D0E37]) [    ] o.a.s.c.CorePropertiesLocator Cores are: [collection1]
   [junit4]   2> 1321560 INFO  (coreLoadExecutor-5990-thread-1) [    ] o.a.s.c.TransientSolrCoreCacheDefault Allocating transient cache for 4 transient cores
   [junit4]   2> 1321569 INFO  (coreLoadExecutor-5990-thread-1) [    x:collection1] o.a.s.c.SolrConfig Using Lucene MatchVersion: 8.0.0
   [junit4]   2> 1321576 INFO  (coreLoadExecutor-5990-thread-1) [    x:collection1] o.a.s.s.IndexSchema [collection1] Schema name=test
   [junit4]   2> 1321577 INFO  (coreLoadExecutor-5990-thread-1) [    x:collection1] o.a.s.s.IndexSchema Loaded schema test/1.2 with uniqueid field id
   [junit4]   2> 1321577 INFO  (coreLoadExecutor-5990-thread-1) [    x:collection1] o.a.s.c.CoreContainer Creating SolrCore 'collection1' using configuration from instancedir /x1/jenkins/jenkins-slave/workspace/Lucene-Solr-Tests-master/solr/build/solr-core/test/J2/temp/solr.handler.TestReplicationHandler_50935C6DCA2D0E37-001/solr-instance-001/./collection1, trusted=true
   [junit4]   2> 1321578 INFO  (coreLoadExecutor-5990-thread-1) [    x:collection1] o.a.s.m.r.SolrJmxReporter JMX monitoring for 'solr.core.collection1' (registry 'solr.core.collection1') enabled at server: com.sun.jmx.mbeanserver.JmxMBeanServer@36b042fe
   [junit4]   2> 1321578 INFO  (coreLoadExecutor-5990-thread-1) [    x:collection1] o.a.s.c.SolrCore solr.RecoveryStrategy.Builder
   [junit4]   2> 1321578 INFO  (coreLoadExecutor-5990-thread-1) [    x:collection1] o.a.s.c.SolrCore [[collection1] ] Opening new SolrCore at [/x1/jenkins/jenkins-slave/workspace/Lucene-Solr-Tests-master/solr/build/solr-core/test/J2/temp/solr.handler.TestReplicationHandler_50935C6DCA2D0E37-001/solr-instance-001/collection1], dataDir=[/x1/jenkins/jenkins-slave/workspace/Lucene-Solr-Tests-master/solr/build/solr-core/test/J2/temp/solr.handler.TestReplicationHandler_50935C6DCA2D0E37-001/solr-instance-001/./collection1/data/]
   [junit4]   2> 1321618 INFO  (coreLoadExecutor-5990-thread-1) [    x:collection1] o.a.s.u.CommitTracker Hard AutoCommit: disabled
   [junit4]   2> 1321618 INFO  (coreLoadExecutor-5990-thread-1) [    x:collection1] o.a.s.u.CommitTracker Soft AutoCommit: disabled
   [junit4]   2> 1321619 INFO  (coreLoadExecutor-5990-thread-1) [    x:collection1] o.a.s.u.RandomMergePolicy RandomMergePolicy wrapping class org.apache.lucene.index.LogByteSizeMergePolicy: [LogByteSizeMergePolicy: minMergeSize=1677721, mergeFactor=23, maxMergeSize=2147483648, maxMergeSizeForForcedMerge=9223372036854775807, calibrateSizeByDeletes=false, maxMergeDocs=2147483647, maxCFSSegmentSizeMB=8.796093022207999E12, noCFSRatio=0.0]
   [junit4]   2> 1321621 INFO  (coreLoadExecutor-5990-thread-1) [    x:collection1] o.a.s.s.SolrIndexSearcher Opening [Searcher@15c0aac2[collection1] main]
   [junit4]   2> 1321621 INFO  (coreLoadExecutor-5990-thread-1) [    x:collection1] o.a.s.r.ManagedResourceStorage File-based storage initialized to use dir: /x1/jenkins/jenkins-slave/workspace/Lucene-Solr-Tests-master/solr/build/solr-core/test/J2/temp/solr.handler.TestReplicationHandler_50935C6DCA2D0E37-001/solr-instance-001/collection1/conf
   [junit4]   2> 1321621 INFO  (coreLoadExecutor-5990-thread-1) [    x:collection1] o.a.s.h.ReplicationHandler Commits will be reserved for 10000ms.
   [junit4]   2> 1321622 INFO  (searcherExecutor-5991-thread-1-processing-x:collection1) [    x:collection1] o.a.s.c.SolrCore [collection1] Registered new searcher Searcher@15c0aac2[collection1] main{ExitableDirectoryReader(UninvertingDirectoryReader(Uninverting(_0(8.0.0):C87)))}
   [junit4]   2> 1322124 INFO  (TEST-TestReplicationHandler.testRateLimitedReplication-seed#[50935C6DCA2D0E37]) [    ] o.e.j.s.Server jetty-9.4.8.v20171121, build timestamp: 2017-11-21T16:27:37-05:00, git hash: 82b8fb23f757335bb3329d540ce37a2a2615f0a8
   [junit4]   2> 1322125 INFO  (TEST-TestReplicationHandler.testRateLimitedReplication-seed#[50935C6DCA2D0E37]) [    ] o.e.j.s.session DefaultSessionIdManager workerName=node0
   [junit4]   2> 1322125 INFO  (TEST-TestReplicationHandler.testRateLimitedReplication-seed#[50935C6DCA2D0E37]) [    ] o.e.j.s.session No SessionScavenger set, using defaults
   [junit4]   2> 1322125 INFO  (TEST-TestReplicationHandler.testRateLimitedReplication-seed#[50935C6DCA2D0E37]) [    ] o.e.j.s.session Scavenging every 660000ms
   [junit4]   2> 1322125 INFO  (TEST-TestReplicationHandler.testRateLimitedReplication-seed#[50935C6DCA2D0E37]) [    ] o.e.j.s.h.ContextHandler Started o.e.j.s.ServletContextHandler@70255d2f{/solr,null,AVAILABLE}
   [junit4]   2> 1322126 INFO  (TEST-TestReplicationHandler.testRateLimitedReplication-seed#[50935C6DCA2D0E37]) [    ] o.e.j.s.AbstractConnector Started ServerConnector@147525d8{HTTP/1.1,[http/1.1]}{127.0.0.1:58805}
   [junit4]   2> 1322126 INFO  (TEST-TestReplicationHandler.testRateLimitedReplication-seed#[50935C6DCA2D0E37]) [    ] o.e.j.s.Server Started @1324913ms
   [junit4]   2> 1322126 INFO  (TEST-TestReplicationHandler.testRateLimitedReplication-seed#[50935C6DCA2D0E37]) [    ] o.a.s.c.s.e.JettySolrRunner Jetty properties: {solr.data.dir=/x1/jenkins/jenkins-slave/workspace/Lucene-Solr-Tests-master/solr/build/solr-core/test/J2/temp/solr.handler.TestReplicationHandler_50935C6DCA2D0E37-001/solr-instance-002/collection1/data, hostContext=/solr, hostPort=58805}
   [junit4]   2> 1322126 ERROR (TEST-TestReplicationHandler.testRateLimitedReplication-seed#[50935C6DCA2D0E37]) [    ] o.a.s.u.StartupLoggingUtils Missing Java Option solr.log.dir. Logging may be missing or incomplete.
   [junit4]   2> 1322126 INFO  (TEST-TestReplicationHandler.testRateLimitedReplication-seed#[50935C6DCA2D0E37]) [    ] o.a.s.s.SolrDispatchFilter  ___      _       Welcome to Apache Solr™ version 8.0.0
   [junit4]   2> 1322126 INFO  (TEST-TestReplicationHandler.testRateLimitedReplication-seed#[50935C6DCA2D0E37]) [    ] o.a.s.s.SolrDispatchFilter / __| ___| |_ _   Starting in standalone mode on port null
   [junit4]   2> 1322126 INFO  (TEST-TestReplicationHandler.testRateLimitedReplication-seed#[50935C6DCA2D0E37]) [    ] o.a.s.s.SolrDispatchFilter \__ \/ _ \ | '_|  Install dir: null
   [junit4]   2> 1322126 INFO  (TEST-TestReplicationHandler.testRateLimitedReplication-seed#[50935C6DCA2D0E37]) [    ] o.a.s.s.SolrDispatchFilter |___/\___/_|_|    Start time: 2018-02-26T13:56:39.445Z
   [junit4]   2> 1322127 INFO  (TEST-TestReplicationHandler.testRateLimitedReplication-seed#[50935C6DCA2D0E37]) [    ] o.a.s.c.SolrXmlConfig Loading container configuration from /x1/jenkins/jenkins-slave/workspace/Lucene-Solr-Tests-master/solr/build/solr-core/test/J2/temp/solr.handler.TestReplicationHandler_50935C6DCA2D0E37-001/solr-instance-002/solr.xml
   [junit4]   2> 1322130 INFO  (TEST-TestReplicationHandler.testRateLimitedReplication-seed#[50935C6DCA2D0E37]) [    ] o.a.s.c.SolrXmlConfig Configuration parameter autoReplicaFailoverWorkLoopDelay is ignored
   [junit4]   2> 1322130 INFO  (TEST-TestReplicationHandler.testRateLimitedReplication-seed#[50935C6DCA2D0E37]) [    ] o.a.s.c.SolrXmlConfig Configuration parameter autoReplicaFailoverBadNodeExpiration is ignored
   [junit4]   2> 1322131 INFO  (TEST-TestReplicationHandler.testRateLimitedReplication-seed#[50935C6DCA2D0E37]) [    ] o.a.s.c.SolrXmlConfig MBean server found: com.sun.jmx.mbeanserver.JmxMBeanServer@36b042fe, but no JMX reporters were configured - adding default JMX reporter.
   [junit4]   2> 1322160 INFO  (TEST-TestReplicationHandler.testRateLimitedReplication-seed#[50935C6DCA2D0E37]) [    ] o.a.s.m.r.SolrJmxReporter JMX monitoring for 'solr.node' (registry 'solr.node') enabled at server: com.sun.jmx.mbeanserver.JmxMBeanServer@36b042fe
   [junit4]   2> 1322170 INFO  (TEST-TestReplicationHandler.testRateLimitedReplication-seed#[50935C6DCA2D0E37]) [    ] o.a.s.m.r.SolrJmxReporter JMX monitoring for 'solr.jvm' (registry 'solr.jvm') enabled at server: com.sun.jmx.mbeanserver.JmxMBeanServer@36b042fe
   [junit4]   2> 1322170 INFO  (TEST-TestReplicationHandler.testRateLimitedReplication-seed#[50935C6DCA2D0E37]) [    ] o.a.s.m.r.SolrJmxReporter JMX monitoring for 'solr.jetty' (registry 'solr.jetty') enabled at server: com.sun.jmx.mbeanserver.JmxMBeanServer@36b042fe
   [junit4]   2> 1322172 INFO  (TEST-TestReplicationHandler.testRateLimitedReplication-seed#[50935C6DCA2D0E37]) [    ] o.a.s.c.CorePropertiesLocator Found 1 core definitions underneath /x1/jenkins/jenkins-slave/workspace/Lucene-Solr-Tests-master/solr/build/solr-core/test/J2/temp/solr.handler.TestReplicationHandler_50935C6DCA2D0E37-001/solr-instance-002/.
   [junit4]   2> 1322172 INFO  (TEST-TestReplicationHandler.testRateLimitedReplication-seed#[50935C6DCA2D0E37]) [    ] o.a.s.c.CorePropertiesLocator Cores are: [collection1]
   [junit4]   2> 1322172 INFO  (coreLoadExecutor-6000-thread-1) [    ] o.a.s.c.TransientSolrCoreCacheDefault Allocating transient cache for 4 transient cores
   [junit4]   2> 1322180 INFO  (coreLoadExecutor-6000-thread-1) [    x:collection1] o.a.s.c.SolrConfig Using Lucene MatchVersion: 8.0.0
   [junit4]   2> 1322187 INFO  (coreLoadExecutor-6000-thread-1) [    x:collection1] o.a.s.s.IndexSchema [collection1] Schema name=test
   [junit4]   2> 1322188 INFO  (coreLoadExecutor-6000-thread-1) [    x:collection1] o.a.s.s.IndexSchema Loaded schema test/1.2 with uniqueid field id
   [junit4]   2> 1322188 INFO  (coreLoadExecutor-6000-thread-1) [    x:collection1] o.a.s.c.CoreContainer Creating SolrCore 'collection1' using configuration from instancedir /x1/jenkins/jenkins-slave/workspace/Lucene-Solr-Tests-master/solr/build/solr-core/test/J2/temp/solr.handler.TestReplicationHandler_50935C6DCA2D0E37-001/solr-instance-002/./collection1, trusted=true
   [junit4]   2> 1322189 INFO  (coreLoadExecutor-6000-thread-1) [    x:collection1] o.a.s.m.r.SolrJmxReporter JMX monitoring for 'solr.core.collection1' (registry 'solr.core.collection1') enabled at server: com.sun.jmx.mbeanserver.JmxMBeanServer@36b042fe
   [junit4]   2> 1322189 INFO  (coreLoadExecutor-6000-thread-1) [    x:collection1] o.a.s.c.SolrCore solr.RecoveryStrategy.Builder
   [junit4]   2> 1322189 INFO  (coreLoadExecutor-6000-thread-1) [    x:collection1] o.a.s.c.SolrCore [[collection1] ] Opening new SolrCore at [/x1/jenkins/jenkins-slave/workspace/Lucene-Solr-Tests-master/solr/build/solr-core/test/J2/temp/solr.handler.TestReplicationHandler_50935C6DCA2D0E37-001/solr-instance-002/collection1], dataDir=[/x1/jenkins/jenkins-slave/workspace/Lucene-Solr-Tests-master/solr/build/solr-core/test/J2/temp/solr.handler.TestReplicationHandler_50935C6DCA2D0E37-001/solr-instance-002/./collection1/data/]
   [junit4]   2> 1322191 INFO  (coreLoadExecutor-6000-thread-1) [    x:collection1] o.a.s.u.RandomMergePolicy RandomMergePolicy wrapping class org.apache.lucene.index.LogByteSizeMergePolicy: [LogByteSizeMergePolicy: minMergeSize=1677721, mergeFactor=23, maxMergeSize=2147483648, maxMergeSizeForForcedMerge=9223372036854775807, calibrateSizeByDeletes=false, maxMergeDocs=2147483647, maxCFSSegmentSizeMB=8.796093022207999E12, noCFSRatio=0.0]
   [junit4]   2> 1322229 INFO  (coreLoadExecutor-6000-thread-1) [    x:collection1] o.a.s.u.CommitTracker Hard AutoCommit: disabled
   [junit4]   2> 1322229 INFO  (coreLoadExecutor-6000-thread-1) [    x:collection1] o.a.s.u.CommitTracker Soft AutoCommit: disabled
   [junit4]   2> 1322230 INFO  (coreLoadExecutor-6000-thread-1) [    x:collection1] o.a.s.u.RandomMergePolicy RandomMergePolicy wrapping class org.apache.lucene.index.TieredMergePolicy: [TieredMergePolicy: maxMergeAtOnce=13, maxMergeAtOnceExplicit=32, maxMergedSegmentMB=4.0400390625, floorSegmentMB=0.98828125, forceMergeDeletesPctAllowed=26.588415041342916, segmentsPerTier=4.0, maxCFSSegmentSizeMB=8.796093022207999E12, noCFSRatio=0.45221366572615385
   [junit4]   2> 1322230 INFO  (coreLoadExecutor-6000-thread-1) [    x:collection1] o.a.s.s.SolrIndexSearcher Opening [Searcher@4a9bc968[collection1] main]
   [junit4]   2> 1322231 INFO  (coreLoadExecutor-6000-thread-1) [    x:collection1] o.a.s.r.ManagedResourceStorage File-based storage initialized to use dir: /x1/jenkins/jenkins-slave/workspace/Lucene-Solr-Tests-master/solr/build/solr-core/test/J2/temp/solr.handler.TestReplicationHandler_50935C6DCA2D0E37-001/solr-instance-002/collection1/conf
   [junit4]   2> 1322231 INFO  (coreLoadExecutor-6000-thread-1) [    x:collection1] o.a.s.h.ReplicationHandler Commits will be reserved for 10000ms.
   [junit4]   2> 1322232 INFO  (searcherExecutor-6001-thread-1-processing-x:collection1) [    x:collection1] o.a.s.c.SolrCore [collection1] Registered new searcher Searcher@4a9bc968[collection1] main{ExitableDirectoryReader(UninvertingDirectoryReader())}
   [junit4]   2> 1322235 WARN  (explicit-fetchindex-cmd) [    x:collection1] o.a.s.h.IndexFetcher 'masterUrl' must be specified without the /replication suffix
   [junit4]   2> 1322237 INFO  (qtp1908762054-14573) [    x:collection1] o.a.s.c.S.Request [collection1]  webapp=/solr path=/replication params={qt=/replication&wt=javabin&version=2&command=indexversion} status=0 QTime=0
   [junit4]   2> 1322237 INFO  (explicit-fetchindex-cmd) [    x:collection1] o.a.s.h.IndexFetcher Master's generation: 2
   [junit4]   2> 1322237 INFO  (explicit-fetchindex-cmd) [    x:collection1] o.a.s.h.IndexFetcher Master's version: 1519653398789
   [junit4]   2> 1322237 INFO  (explicit-fetchindex-cmd) [    x:collection1] o.a.s.h.IndexFetcher Slave's generation: 1
   [junit4]   2> 1322237 INFO  (explicit-fetchindex-cmd) [    x:collection1] o.a.s.h.IndexFetcher Slave's version: 0
   [junit4]   2> 1322237 INFO  (explicit-fetchindex-cmd) [    x:collection1] o.a.s.h.IndexFetcher Starting replication process
   [junit4]   2> 1322239 INFO  (qtp1908762054-14575) [    x:collection1] o.a.s.c.S.Request [collection1]  webapp=/solr path=/replication params={generation=2&qt=/replication&tlogFiles=false&wt=javabin&version=2&command=filelist} status=0 QTime=1
   [junit4]   2> 1322239 INFO  (explicit-fetchindex-cmd) [    x:collection1] o.a.s.h.IndexFetcher Number of files in latest index in master: 10
   [junit4]   2> 1322240 INFO  (explicit-fetchindex-cmd) [    x:collection1] o.a.s.u.RandomMergePolicy RandomMergePolicy wrapping class org.apache.lucene.index.LogByteSizeMergePolicy: [LogByteSizeMergePolicy: minMergeSize=1677721, mergeFactor=23, maxMergeSize=2147483648, maxMergeSizeForForcedMerge=9223372036854775807, calibrateSizeByDeletes=false, maxMergeDocs=2147483647, maxCFSSegmentSizeMB=8.796093022207999E12, noCFSRatio=0.0]
   [junit4]   2> 1322241 INFO  (explicit-fetchindex-cmd) [    x:collection1] o.a.s.u.DefaultSolrCoreState New IndexWriter is ready to be used.
   [junit4]   2> 1322241 INFO  (explicit-fetchindex-cmd) [    x:collection1] o.a.s.h.IndexFetcher Starting download (fullCopy=false) to NRTCachingDirectory(MMapDirectory@/x1/jenkins/jenkins-slave/workspace/Lucene-Solr-Tests-master/solr/build/solr-core/test/J2/temp/solr.handler.TestReplicationHandler_50935C6DCA2D0E37-001/solr-instance-002/collection1/data/index.20180226165639558 lockFactory=org.apache.lucene.store.SingleInstanceLockFactory@10c62263; maxCacheMB=48.0 maxMergeSizeMB=4.0)
   [junit4]   2> 1322242 INFO  (qtp1908762054-14576) [    x:collection1] o.a.s.c.S.Request [collection1]  webapp=/solr path=/replication params={generation=2&qt=/replication&file=_0.si&checksum=true&wt=filestream&command=filecontent} status=0 QTime=0
   [junit4]   2> 1322252 INFO  (qtp1908762054-14575) [    x:collection1] o.a.s.c.S.Request [collection1]  webapp=/solr path=/replication params={generation=2&qt=/replication&file=_0.nvd&checksum=true&wt=filestream&command=filecontent} status=0 QTime=0
   [junit4]   2> 1322254 INFO  (qtp1908762054-14576) [    x:collection1] o.a.s.c.S.Request [collection1]  webapp=/solr path=/replication params={generation=2&qt=/replication&file=_0.fdx&checksum=true&wt=filestream&command=filecontent} status=0 QTime=0
   [junit4]   2> 1322255 INFO  (qtp1908762054-14575) [    x:collection1] o.a.s.c.S.Request [collection1]  webapp=/solr path=/replication params={generation=2&qt=/replication&file=_0_Asserting_0.doc&checksum=true&wt=filestream&command=filecontent} status=0 QTime=0
   [junit4]   2> 1322257 INFO  (qtp1908762054-14576) [    x:collection1] o.a.s.c.S.Request [collection1]  webapp=/solr path=/replication params={generation=2&qt=/replication&file=_0_Asserting_0.tim&checksum=true&wt=filestream&command=filecontent} status=0 QTime=0
   [junit4]   2> 1327419 INFO  (qtp1908762054-14576) [    x:collection1] o.a.s.c.S.Request [collection1]  webapp=/solr path=/replication params={generation=2&qt=/replication&file=_0.fdt&checksum=true&wt=filestream&command=filecontent} status=0 QTime=0
   [junit4]   2> 1332467 INFO  (qtp1908762054-14575) [    x:collection1] o.a.s.c.S.Request [collection1]  webapp=/solr path=/replication params={generation=2&qt=/replication&file=_0_Asserting_0.tip&checksum=true&wt=filestream&command=filecontent} status=0 QTime=0
   [junit4]   2> 1332468 INFO  (qtp1908762054-14576) [    x:collection1] o.a.s.c.S.Request [collection1]  webapp=/solr path=/replication params={generation=2&qt=/replication&file=_0.fnm&checksum=true&wt=filestream&command=filecontent} status=0 QTime=0
   [junit4]   2> 1332469 INFO  (qtp1908762054-14575) [    x:collection1] o.a.s.c.S.Request [collection1]  webapp=/solr path=/replication params={generation=2&qt=/replication&file=_0.nvm&checksum=true&wt=filestream&command=filecontent} status=0 QTime=0
   [junit4]   2> 1332470 INFO  (qtp1908762054-14576) [    x:collection1] o.a.s.c.S.Request [collection1]  webapp=/solr path=/replication params={generation=2&qt=/replication&file=segments_2&checksum=true&wt=filestream&command=filecontent} status=0 QTime=0
   [junit4]   2> 1332471 INFO  (explicit-fetchindex-cmd) [    x:collection1] o.a.s.h.IndexFetcher Total time taken for download (fullCopy=false,bytesDownloaded=536535) : 10 secs (53653 bytes/sec) to NRTCachingDirectory(MMapDirectory@/x1/jenkins/jenkins-slave/workspace/Lucene-Solr-Tests-master/solr/build/solr-core/test/J2/temp/solr.handler.TestReplicationHandler_50935C6DCA2D0E37-001/solr-instance-002/collection1/data/index.20180226165639558 lockFactory=org.apache.lucene.store.SingleInstanceLockFactory@10c62263; maxCacheMB=48.0 maxMergeSizeMB=4.0)
   [junit4]   2> 1332482 INFO  (explicit-fetchindex-cmd) [    x:collection1] o.a.s.u.RandomMergePolicy RandomMergePolicy wrapping class org.apache.lucene.index.TieredMergePolicy: [TieredMergePolicy: maxMergeAtOnce=13, maxMergeAtOnceExplicit=32, maxMergedSegmentMB=4.0400390625, floorSeg

[...truncated too long message...]

O  (TEST-TestReplicationHandler.doTestReplicateAfterStartupWithNoActivity-seed#[50935C6DCA2D0E37]) [    ] o.a.s.m.r.SolrJmxReporter Closing reporter [org.apache.solr.metrics.reporters.SolrJmxReporter@78120227: rootName = null, domain = solr.node, service url = null, agent id = null] for registry solr.node / com.codahale.metrics.MetricRegistry@7a702d00
   [junit4]   2> 1407529 INFO  (TEST-TestReplicationHandler.doTestReplicateAfterStartupWithNoActivity-seed#[50935C6DCA2D0E37]) [    ] o.a.s.m.SolrMetricManager Closing metric reporters for registry=solr.jvm, tag=null
   [junit4]   2> 1407529 INFO  (TEST-TestReplicationHandler.doTestReplicateAfterStartupWithNoActivity-seed#[50935C6DCA2D0E37]) [    ] o.a.s.m.r.SolrJmxReporter Closing reporter [org.apache.solr.metrics.reporters.SolrJmxReporter@6552ff17: rootName = null, domain = solr.jvm, service url = null, agent id = null] for registry solr.jvm / com.codahale.metrics.MetricRegistry@1a549690
   [junit4]   2> 1407532 INFO  (TEST-TestReplicationHandler.doTestReplicateAfterStartupWithNoActivity-seed#[50935C6DCA2D0E37]) [    ] o.a.s.m.SolrMetricManager Closing metric reporters for registry=solr.jetty, tag=null
   [junit4]   2> 1407532 INFO  (TEST-TestReplicationHandler.doTestReplicateAfterStartupWithNoActivity-seed#[50935C6DCA2D0E37]) [    ] o.a.s.m.r.SolrJmxReporter Closing reporter [org.apache.solr.metrics.reporters.SolrJmxReporter@10dd4867: rootName = null, domain = solr.jetty, service url = null, agent id = null] for registry solr.jetty / com.codahale.metrics.MetricRegistry@6b9658e0
   [junit4]   2> 1407534 INFO  (coreCloseExecutor-6631-thread-1) [    x:collection1] o.a.s.c.SolrCore [collection1]  CLOSING SolrCore org.apache.solr.core.SolrCore@5392c1c5
   [junit4]   2> 1407534 INFO  (coreCloseExecutor-6631-thread-1) [    x:collection1] o.a.s.m.SolrMetricManager Closing metric reporters for registry=solr.core.collection1, tag=1402126789
   [junit4]   2> 1407534 INFO  (coreCloseExecutor-6631-thread-1) [    x:collection1] o.a.s.m.r.SolrJmxReporter Closing reporter [org.apache.solr.metrics.reporters.SolrJmxReporter@e17ad8a: rootName = null, domain = solr.core.collection1, service url = null, agent id = null] for registry solr.core.collection1 / com.codahale.metrics.MetricRegistry@75b3deb5
   [junit4]   2> 1407541 INFO  (TEST-TestReplicationHandler.doTestReplicateAfterStartupWithNoActivity-seed#[50935C6DCA2D0E37]) [    ] o.e.j.s.h.ContextHandler Stopped o.e.j.s.ServletContextHandler@783d8db6{/solr,null,UNAVAILABLE}
   [junit4]   2> 1407541 INFO  (TEST-TestReplicationHandler.doTestReplicateAfterStartupWithNoActivity-seed#[50935C6DCA2D0E37]) [    ] o.e.j.s.session Stopped scavenging
   [junit4]   2> 1407542 INFO  (TEST-TestReplicationHandler.doTestReplicateAfterStartupWithNoActivity-seed#[50935C6DCA2D0E37]) [    ] o.e.j.s.AbstractConnector Stopped ServerConnector@213ac10f{HTTP/1.1,[http/1.1]}{127.0.0.1:0}
   [junit4]   2> 1407543 INFO  (TEST-TestReplicationHandler.doTestReplicateAfterStartupWithNoActivity-seed#[50935C6DCA2D0E37]) [    ] o.a.s.c.CoreContainer Shutting down CoreContainer instance=809402930
   [junit4]   2> 1407543 INFO  (TEST-TestReplicationHandler.doTestReplicateAfterStartupWithNoActivity-seed#[50935C6DCA2D0E37]) [    ] o.a.s.m.SolrMetricManager Closing metric reporters for registry=solr.node, tag=null
   [junit4]   2> 1407543 INFO  (TEST-TestReplicationHandler.doTestReplicateAfterStartupWithNoActivity-seed#[50935C6DCA2D0E37]) [    ] o.a.s.m.r.SolrJmxReporter Closing reporter [org.apache.solr.metrics.reporters.SolrJmxReporter@7e495158: rootName = null, domain = solr.node, service url = null, agent id = null] for registry solr.node / com.codahale.metrics.MetricRegistry@1c4eaaa3
   [junit4]   2> 1407549 INFO  (TEST-TestReplicationHandler.doTestReplicateAfterStartupWithNoActivity-seed#[50935C6DCA2D0E37]) [    ] o.a.s.m.SolrMetricManager Closing metric reporters for registry=solr.jvm, tag=null
   [junit4]   2> 1407549 INFO  (TEST-TestReplicationHandler.doTestReplicateAfterStartupWithNoActivity-seed#[50935C6DCA2D0E37]) [    ] o.a.s.m.r.SolrJmxReporter Closing reporter [org.apache.solr.metrics.reporters.SolrJmxReporter@69307844: rootName = null, domain = solr.jvm, service url = null, agent id = null] for registry solr.jvm / com.codahale.metrics.MetricRegistry@1a549690
   [junit4]   2> 1407553 INFO  (TEST-TestReplicationHandler.doTestReplicateAfterStartupWithNoActivity-seed#[50935C6DCA2D0E37]) [    ] o.a.s.m.SolrMetricManager Closing metric reporters for registry=solr.jetty, tag=null
   [junit4]   2> 1407553 INFO  (TEST-TestReplicationHandler.doTestReplicateAfterStartupWithNoActivity-seed#[50935C6DCA2D0E37]) [    ] o.a.s.m.r.SolrJmxReporter Closing reporter [org.apache.solr.metrics.reporters.SolrJmxReporter@800d581: rootName = null, domain = solr.jetty, service url = null, agent id = null] for registry solr.jetty / com.codahale.metrics.MetricRegistry@6b9658e0
   [junit4]   2> 1407558 INFO  (coreCloseExecutor-6633-thread-1) [    x:collection1] o.a.s.c.SolrCore [collection1]  CLOSING SolrCore org.apache.solr.core.SolrCore@3a6fa683
   [junit4]   2> 1407558 INFO  (coreCloseExecutor-6633-thread-1) [    x:collection1] o.a.s.m.SolrMetricManager Closing metric reporters for registry=solr.core.collection1, tag=980395651
   [junit4]   2> 1407558 INFO  (coreCloseExecutor-6633-thread-1) [    x:collection1] o.a.s.m.r.SolrJmxReporter Closing reporter [org.apache.solr.metrics.reporters.SolrJmxReporter@65c6cb28: rootName = null, domain = solr.core.collection1, service url = null, agent id = null] for registry solr.core.collection1 / com.codahale.metrics.MetricRegistry@443d75
   [junit4]   2> 1407575 INFO  (TEST-TestReplicationHandler.doTestReplicateAfterStartupWithNoActivity-seed#[50935C6DCA2D0E37]) [    ] o.e.j.s.h.ContextHandler Stopped o.e.j.s.ServletContextHandler@69b19b67{/solr,null,UNAVAILABLE}
   [junit4]   2> 1407575 INFO  (TEST-TestReplicationHandler.doTestReplicateAfterStartupWithNoActivity-seed#[50935C6DCA2D0E37]) [    ] o.e.j.s.session Stopped scavenging
   [junit4]   2> NOTE: leaving temporary files on disk at: /x1/jenkins/jenkins-slave/workspace/Lucene-Solr-Tests-master/solr/build/solr-core/test/J2/temp/solr.handler.TestReplicationHandler_50935C6DCA2D0E37-001
   [junit4]   2> NOTE: test params are: codec=Asserting(Lucene70), sim=Asserting(org.apache.lucene.search.similarities.AssertingSimilarity@735a0c40), locale=en-PH, timezone=Africa/Mogadishu
   [junit4]   2> NOTE: Linux 3.13.0-88-generic amd64/Oracle Corporation 1.8.0_144 (64-bit)/cpus=4,threads=1,free=336434776,total=530579456
   [junit4]   2> NOTE: All tests run in this JVM: [MoveReplicaHDFSFailoverTest, TestInfoStreamLogging, TestValueSourceCache, TestNamedUpdateProcessors, SpellCheckComponentTest, TestChildDocTransformer, TestManagedStopFilterFactory, TestRangeQuery, SortSpecParsingTest, HdfsThreadLeakTest, TestConfigSetsAPIExclusivity, TestDistributedStatsComponentCardinality, UniqFieldsUpdateProcessorFactoryTest, ComputePlanActionTest, TestRawTransformer, TestSchemaManager, AutoscalingHistoryHandlerTest, TestCoreDiscovery, TestLocalFSCloudBackupRestore, TestRealTimeGet, TestSolrCoreSnapshots, TimeZoneUtilsTest, TestFiltering, TestManagedSchemaAPI, UnloadDistributedZkTest, TestCollationFieldDocValues, DistributedFacetSimpleRefinementLongTailTest, LeaderElectionIntegrationTest, TestBulkSchemaConcurrent, TestFileDictionaryLookup, TestDistribIDF, PreAnalyzedFieldTest, TestSolrCLIRunExample, TestAtomicUpdateErrorCases, CoreMergeIndexesAdminHandlerTest, NodeLostTriggerTest, CdcrUpdateLogTest, TestSubQueryTransformerDistrib, TestSchemaVersionResource, TlogReplayBufferedWhileIndexingTest, SpatialHeatmapFacetsTest, TestComplexPhraseLeadingWildcard, ResponseLogComponentTest, TestLRUStatsCache, TestJavabinTupleStreamParser, BasicDistributedZk2Test, TestSolrDeletionPolicy2, DateMathParserTest, TestCoreBackup, UninvertDocValuesMergePolicyTest, SolrIndexMetricsTest, ZkStateReaderTest, MoreLikeThisHandlerTest, DirectSolrSpellCheckerTest, ClassificationUpdateProcessorIntegrationTest, SaslZkACLProviderTest, TestGenericDistributedQueue, TestLeaderElectionZkExpiry, BadCopyFieldTest, CacheHeaderTest, SolrCmdDistributorTest, LeaderFailoverAfterPartitionTest, ConnectionReuseTest, TestSmileRequest, TestTrieFacet, JvmMetricsTest, TestPayloadScoreQParserPlugin, TestDeleteCollectionOnDownNodes, DocValuesTest, TestSystemCollAutoCreate, LegacyCloudClusterPropTest, TestComputePlanAction, SpellCheckCollatorWithCollapseTest, ConnectionManagerTest, DistributedQueueTest, TestSchemaNameResource, RecoveryZkTest, MetricUtilsTest, TestNestedDocsSort, NoCacheHeaderTest, IndexSchemaRuntimeFieldTest, HttpTriggerListenerTest, TestLazyCores, TestImpersonationWithHadoopAuth, SolrCloudExampleTest, CollectionsAPISolrJTest, DistributedSpellCheckComponentTest, TestLMJelinekMercerSimilarityFactory, TestFieldCache, TestConfigsApi, TestNumericRangeQuery64, TestCloudPivotFacet, PKIAuthenticationIntegrationTest, TestCollectionAPI, AtomicUpdateProcessorFactoryTest, DisMaxRequestHandlerTest, StatelessScriptUpdateProcessorFactoryTest, TestSSLRandomization, TestSolrCloudWithKerberosAlt, TestHashQParserPlugin, TestUtils, TestCodecSupport, CoreSorterTest, HLLSerializationTest, TestStressInPlaceUpdates, LukeRequestHandlerTest, HdfsChaosMonkeySafeLeaderTest, DistributedFacetPivotLargeTest, SolrJmxReporterTest, TestTolerantSearch, CollectionReloadTest, TestJsonRequest, HdfsCollectionsAPIDistributedZkTest, TestFieldCacheSortRandom, ReturnFieldsTest, BJQParserTest, BlockCacheTest, PeerSyncReplicationTest, TestNodeLostTrigger, SpatialFilterTest, PingRequestHandlerTest, DistributedFacetPivotSmallTest, TestPerFieldSimilarityWithDefaultOverride, TestDynamicFieldCollectionResource, HdfsWriteToMultipleCollectionsTest, DeleteInactiveReplicaTest, ChaosMonkeySafeLeaderTest, SyncSliceTest, OpenCloseCoreStressTest, BasicZkTest, TestReplicationHandler]
   [junit4] Completed [400/778 (1!)] on J2 in 87.07s, 16 tests, 1 error, 1 skipped <<< FAILURES!

[...truncated 49103 lines...]

Mime
View raw message