lucene-dev mailing list archives

Site index · List index
Message view « Date » · « Thread »
Top « Date » · « Thread »
From Policeman Jenkins Server <jenk...@thetaphi.de>
Subject [JENKINS] Lucene-Solr-7.x-Solaris (64bit/jdk1.8.0) - Build # 456 - Still Unstable!
Date Thu, 22 Feb 2018 09:07:57 GMT
Build: https://jenkins.thetaphi.de/job/Lucene-Solr-7.x-Solaris/456/
Java: 64bit/jdk1.8.0 -XX:+UseCompressedOops -XX:+UseSerialGC

2 tests failed.
FAILED:  junit.framework.TestSuite.org.apache.solr.security.hadoop.TestImpersonationWithHadoopAuth

Error Message:
1 thread leaked from SUITE scope at org.apache.solr.security.hadoop.TestImpersonationWithHadoopAuth:     1) Thread[id=9893, name=jetty-launcher-1896-thread-2-EventThread, state=TIMED_WAITING, group=TGRP-TestImpersonationWithHadoopAuth]         at sun.misc.Unsafe.park(Native Method)         at java.util.concurrent.locks.LockSupport.parkNanos(LockSupport.java:215)         at java.util.concurrent.locks.AbstractQueuedSynchronizer.doAcquireSharedNanos(AbstractQueuedSynchronizer.java:1037)         at java.util.concurrent.locks.AbstractQueuedSynchronizer.tryAcquireSharedNanos(AbstractQueuedSynchronizer.java:1328)         at java.util.concurrent.CountDownLatch.await(CountDownLatch.java:277)         at org.apache.curator.CuratorZookeeperClient.internalBlockUntilConnectedOrTimedOut(CuratorZookeeperClient.java:323)         at org.apache.curator.RetryLoop.callWithRetry(RetryLoop.java:105)         at org.apache.curator.framework.imps.GetDataBuilderImpl.pathInForeground(GetDataBuilderImpl.java:288)         at org.apache.curator.framework.imps.GetDataBuilderImpl.forPath(GetDataBuilderImpl.java:279)         at org.apache.curator.framework.imps.GetDataBuilderImpl.forPath(GetDataBuilderImpl.java:41)         at org.apache.curator.framework.recipes.shared.SharedValue.readValue(SharedValue.java:244)         at org.apache.curator.framework.recipes.shared.SharedValue.access$100(SharedValue.java:44)         at org.apache.curator.framework.recipes.shared.SharedValue$1.process(SharedValue.java:61)         at org.apache.curator.framework.imps.NamespaceWatcher.process(NamespaceWatcher.java:67)         at org.apache.zookeeper.ClientCnxn$EventThread.processEvent(ClientCnxn.java:531)         at org.apache.zookeeper.ClientCnxn$EventThread.run(ClientCnxn.java:506)

Stack Trace:
com.carrotsearch.randomizedtesting.ThreadLeakError: 1 thread leaked from SUITE scope at org.apache.solr.security.hadoop.TestImpersonationWithHadoopAuth: 
   1) Thread[id=9893, name=jetty-launcher-1896-thread-2-EventThread, state=TIMED_WAITING, group=TGRP-TestImpersonationWithHadoopAuth]
        at sun.misc.Unsafe.park(Native Method)
        at java.util.concurrent.locks.LockSupport.parkNanos(LockSupport.java:215)
        at java.util.concurrent.locks.AbstractQueuedSynchronizer.doAcquireSharedNanos(AbstractQueuedSynchronizer.java:1037)
        at java.util.concurrent.locks.AbstractQueuedSynchronizer.tryAcquireSharedNanos(AbstractQueuedSynchronizer.java:1328)
        at java.util.concurrent.CountDownLatch.await(CountDownLatch.java:277)
        at org.apache.curator.CuratorZookeeperClient.internalBlockUntilConnectedOrTimedOut(CuratorZookeeperClient.java:323)
        at org.apache.curator.RetryLoop.callWithRetry(RetryLoop.java:105)
        at org.apache.curator.framework.imps.GetDataBuilderImpl.pathInForeground(GetDataBuilderImpl.java:288)
        at org.apache.curator.framework.imps.GetDataBuilderImpl.forPath(GetDataBuilderImpl.java:279)
        at org.apache.curator.framework.imps.GetDataBuilderImpl.forPath(GetDataBuilderImpl.java:41)
        at org.apache.curator.framework.recipes.shared.SharedValue.readValue(SharedValue.java:244)
        at org.apache.curator.framework.recipes.shared.SharedValue.access$100(SharedValue.java:44)
        at org.apache.curator.framework.recipes.shared.SharedValue$1.process(SharedValue.java:61)
        at org.apache.curator.framework.imps.NamespaceWatcher.process(NamespaceWatcher.java:67)
        at org.apache.zookeeper.ClientCnxn$EventThread.processEvent(ClientCnxn.java:531)
        at org.apache.zookeeper.ClientCnxn$EventThread.run(ClientCnxn.java:506)
	at __randomizedtesting.SeedInfo.seed([664B7BE5FCE5DCCD]:0)


FAILED:  junit.framework.TestSuite.org.apache.solr.cloud.TestSolrCloudWithSecureImpersonation

Error Message:
1 thread leaked from SUITE scope at org.apache.solr.cloud.TestSolrCloudWithSecureImpersonation:     1) Thread[id=35909, name=jetty-launcher-8334-thread-1-EventThread, state=TIMED_WAITING, group=TGRP-TestSolrCloudWithSecureImpersonation]         at sun.misc.Unsafe.park(Native Method)         at java.util.concurrent.locks.LockSupport.parkNanos(LockSupport.java:215)         at java.util.concurrent.locks.AbstractQueuedSynchronizer.doAcquireSharedNanos(AbstractQueuedSynchronizer.java:1037)         at java.util.concurrent.locks.AbstractQueuedSynchronizer.tryAcquireSharedNanos(AbstractQueuedSynchronizer.java:1328)         at java.util.concurrent.CountDownLatch.await(CountDownLatch.java:277)         at org.apache.curator.CuratorZookeeperClient.internalBlockUntilConnectedOrTimedOut(CuratorZookeeperClient.java:323)         at org.apache.curator.RetryLoop.callWithRetry(RetryLoop.java:105)         at org.apache.curator.framework.imps.GetDataBuilderImpl.pathInForeground(GetDataBuilderImpl.java:288)         at org.apache.curator.framework.imps.GetDataBuilderImpl.forPath(GetDataBuilderImpl.java:279)         at org.apache.curator.framework.imps.GetDataBuilderImpl.forPath(GetDataBuilderImpl.java:41)         at org.apache.curator.framework.recipes.shared.SharedValue.readValue(SharedValue.java:244)         at org.apache.curator.framework.recipes.shared.SharedValue.access$100(SharedValue.java:44)         at org.apache.curator.framework.recipes.shared.SharedValue$1.process(SharedValue.java:61)         at org.apache.curator.framework.imps.NamespaceWatcher.process(NamespaceWatcher.java:67)         at org.apache.zookeeper.ClientCnxn$EventThread.processEvent(ClientCnxn.java:531)         at org.apache.zookeeper.ClientCnxn$EventThread.run(ClientCnxn.java:506)

Stack Trace:
com.carrotsearch.randomizedtesting.ThreadLeakError: 1 thread leaked from SUITE scope at org.apache.solr.cloud.TestSolrCloudWithSecureImpersonation: 
   1) Thread[id=35909, name=jetty-launcher-8334-thread-1-EventThread, state=TIMED_WAITING, group=TGRP-TestSolrCloudWithSecureImpersonation]
        at sun.misc.Unsafe.park(Native Method)
        at java.util.concurrent.locks.LockSupport.parkNanos(LockSupport.java:215)
        at java.util.concurrent.locks.AbstractQueuedSynchronizer.doAcquireSharedNanos(AbstractQueuedSynchronizer.java:1037)
        at java.util.concurrent.locks.AbstractQueuedSynchronizer.tryAcquireSharedNanos(AbstractQueuedSynchronizer.java:1328)
        at java.util.concurrent.CountDownLatch.await(CountDownLatch.java:277)
        at org.apache.curator.CuratorZookeeperClient.internalBlockUntilConnectedOrTimedOut(CuratorZookeeperClient.java:323)
        at org.apache.curator.RetryLoop.callWithRetry(RetryLoop.java:105)
        at org.apache.curator.framework.imps.GetDataBuilderImpl.pathInForeground(GetDataBuilderImpl.java:288)
        at org.apache.curator.framework.imps.GetDataBuilderImpl.forPath(GetDataBuilderImpl.java:279)
        at org.apache.curator.framework.imps.GetDataBuilderImpl.forPath(GetDataBuilderImpl.java:41)
        at org.apache.curator.framework.recipes.shared.SharedValue.readValue(SharedValue.java:244)
        at org.apache.curator.framework.recipes.shared.SharedValue.access$100(SharedValue.java:44)
        at org.apache.curator.framework.recipes.shared.SharedValue$1.process(SharedValue.java:61)
        at org.apache.curator.framework.imps.NamespaceWatcher.process(NamespaceWatcher.java:67)
        at org.apache.zookeeper.ClientCnxn$EventThread.processEvent(ClientCnxn.java:531)
        at org.apache.zookeeper.ClientCnxn$EventThread.run(ClientCnxn.java:506)
	at __randomizedtesting.SeedInfo.seed([664B7BE5FCE5DCCD]:0)




Build Log:
[...truncated 12740 lines...]
   [junit4] Suite: org.apache.solr.security.hadoop.TestImpersonationWithHadoopAuth
   [junit4]   2> Creating dataDir: /export/home/jenkins/workspace/Lucene-Solr-7.x-Solaris/solr/build/solr-core/test/J1/temp/solr.security.hadoop.TestImpersonationWithHadoopAuth_664B7BE5FCE5DCCD-001/init-core-data-001
   [junit4]   2> 1149761 WARN  (SUITE-TestImpersonationWithHadoopAuth-seed#[664B7BE5FCE5DCCD]-worker) [    ] o.a.s.SolrTestCaseJ4 startTrackingSearchers: numOpens=1 numCloses=1
   [junit4]   2> 1149761 INFO  (SUITE-TestImpersonationWithHadoopAuth-seed#[664B7BE5FCE5DCCD]-worker) [    ] o.a.s.SolrTestCaseJ4 Using PointFields (NUMERIC_POINTS_SYSPROP=true) w/NUMERIC_DOCVALUES_SYSPROP=false
   [junit4]   2> 1149763 INFO  (SUITE-TestImpersonationWithHadoopAuth-seed#[664B7BE5FCE5DCCD]-worker) [    ] o.a.s.SolrTestCaseJ4 Randomized ssl (false) and clientAuth (false) via: @org.apache.solr.util.RandomizeSSL(reason=, value=NaN, ssl=NaN, clientAuth=NaN)
   [junit4]   2> 1149763 INFO  (SUITE-TestImpersonationWithHadoopAuth-seed#[664B7BE5FCE5DCCD]-worker) [    ] o.a.s.SolrTestCaseJ4 SecureRandom sanity checks: test.solr.allowed.securerandom=null & java.security.egd=file:/dev/./urandom
   [junit4]   2> 1149801 INFO  (SUITE-TestImpersonationWithHadoopAuth-seed#[664B7BE5FCE5DCCD]-worker) [    ] o.a.s.c.MiniSolrCloudCluster Starting cluster of 2 servers in /export/home/jenkins/workspace/Lucene-Solr-7.x-Solaris/solr/build/solr-core/test/J1/temp/solr.security.hadoop.TestImpersonationWithHadoopAuth_664B7BE5FCE5DCCD-001/tempDir-001
   [junit4]   2> 1149801 INFO  (SUITE-TestImpersonationWithHadoopAuth-seed#[664B7BE5FCE5DCCD]-worker) [    ] o.a.s.c.ZkTestServer STARTING ZK TEST SERVER
   [junit4]   2> 1149801 INFO  (Thread-3631) [    ] o.a.s.c.ZkTestServer client port:0.0.0.0/0.0.0.0:0
   [junit4]   2> 1149801 INFO  (Thread-3631) [    ] o.a.s.c.ZkTestServer Starting server
   [junit4]   2> 1149803 ERROR (Thread-3631) [    ] o.a.z.s.ZooKeeperServer ZKShutdownHandler is not registered, so ZooKeeper server won't take any action on ERROR or SHUTDOWN server state changes
   [junit4]   2> 1149905 INFO  (SUITE-TestImpersonationWithHadoopAuth-seed#[664B7BE5FCE5DCCD]-worker) [    ] o.a.s.c.ZkTestServer start zk server on port:65167
   [junit4]   2> 1149914 INFO  (zkConnectionManagerCallback-1899-thread-1) [    ] o.a.s.c.c.ConnectionManager zkClient has connected
   [junit4]   2> 1149942 INFO  (jetty-launcher-1896-thread-2) [    ] o.e.j.s.Server jetty-9.4.8.v20171121, build timestamp: 2017-11-21T21:27:37Z, git hash: 82b8fb23f757335bb3329d540ce37a2a2615f0a8
   [junit4]   2> 1149944 INFO  (jetty-launcher-1896-thread-2) [    ] o.e.j.s.session DefaultSessionIdManager workerName=node0
   [junit4]   2> 1149944 INFO  (jetty-launcher-1896-thread-2) [    ] o.e.j.s.session No SessionScavenger set, using defaults
   [junit4]   2> 1149944 INFO  (jetty-launcher-1896-thread-2) [    ] o.e.j.s.session Scavenging every 660000ms
   [junit4]   2> 1149944 INFO  (jetty-launcher-1896-thread-2) [    ] o.e.j.s.h.ContextHandler Started o.e.j.s.ServletContextHandler@2c4a5f35{/solr,null,AVAILABLE}
   [junit4]   2> 1149945 INFO  (jetty-launcher-1896-thread-2) [    ] o.e.j.s.AbstractConnector Started ServerConnector@2cf24888{HTTP/1.1,[http/1.1]}{127.0.0.1:57442}
   [junit4]   2> 1149945 INFO  (jetty-launcher-1896-thread-2) [    ] o.e.j.s.Server Started @1153344ms
   [junit4]   2> 1149945 INFO  (jetty-launcher-1896-thread-2) [    ] o.a.s.c.s.e.JettySolrRunner Jetty properties: {hostContext=/solr, hostPort=57442}
   [junit4]   2> 1149945 ERROR (jetty-launcher-1896-thread-2) [    ] o.a.s.u.StartupLoggingUtils Missing Java Option solr.log.dir. Logging may be missing or incomplete.
   [junit4]   2> 1149945 INFO  (jetty-launcher-1896-thread-1) [    ] o.e.j.s.Server jetty-9.4.8.v20171121, build timestamp: 2017-11-21T21:27:37Z, git hash: 82b8fb23f757335bb3329d540ce37a2a2615f0a8
   [junit4]   2> 1149945 INFO  (jetty-launcher-1896-thread-2) [    ] o.a.s.s.SolrDispatchFilter  ___      _       Welcome to Apache Solr™ version 7.3.0
   [junit4]   2> 1149945 INFO  (jetty-launcher-1896-thread-2) [    ] o.a.s.s.SolrDispatchFilter / __| ___| |_ _   Starting in cloud mode on port null
   [junit4]   2> 1149945 INFO  (jetty-launcher-1896-thread-2) [    ] o.a.s.s.SolrDispatchFilter \__ \/ _ \ | '_|  Install dir: null
   [junit4]   2> 1149945 INFO  (jetty-launcher-1896-thread-2) [    ] o.a.s.s.SolrDispatchFilter |___/\___/_|_|    Start time: 2018-02-22T07:49:18.173Z
   [junit4]   2> 1149946 INFO  (jetty-launcher-1896-thread-1) [    ] o.e.j.s.session DefaultSessionIdManager workerName=node0
   [junit4]   2> 1149946 INFO  (jetty-launcher-1896-thread-1) [    ] o.e.j.s.session No SessionScavenger set, using defaults
   [junit4]   2> 1149946 INFO  (jetty-launcher-1896-thread-1) [    ] o.e.j.s.session Scavenging every 660000ms
   [junit4]   2> 1149947 INFO  (jetty-launcher-1896-thread-1) [    ] o.e.j.s.h.ContextHandler Started o.e.j.s.ServletContextHandler@50ac8a59{/solr,null,AVAILABLE}
   [junit4]   2> 1149948 INFO  (jetty-launcher-1896-thread-1) [    ] o.e.j.s.AbstractConnector Started ServerConnector@fcffb5a{HTTP/1.1,[http/1.1]}{127.0.0.1:60841}
   [junit4]   2> 1149948 INFO  (jetty-launcher-1896-thread-1) [    ] o.e.j.s.Server Started @1153347ms
   [junit4]   2> 1149948 INFO  (jetty-launcher-1896-thread-1) [    ] o.a.s.c.s.e.JettySolrRunner Jetty properties: {hostContext=/solr, hostPort=60841}
   [junit4]   2> 1149948 ERROR (jetty-launcher-1896-thread-1) [    ] o.a.s.u.StartupLoggingUtils Missing Java Option solr.log.dir. Logging may be missing or incomplete.
   [junit4]   2> 1149948 INFO  (jetty-launcher-1896-thread-1) [    ] o.a.s.s.SolrDispatchFilter  ___      _       Welcome to Apache Solr™ version 7.3.0
   [junit4]   2> 1149948 INFO  (jetty-launcher-1896-thread-1) [    ] o.a.s.s.SolrDispatchFilter / __| ___| |_ _   Starting in cloud mode on port null
   [junit4]   2> 1149948 INFO  (jetty-launcher-1896-thread-1) [    ] o.a.s.s.SolrDispatchFilter \__ \/ _ \ | '_|  Install dir: null
   [junit4]   2> 1149948 INFO  (jetty-launcher-1896-thread-1) [    ] o.a.s.s.SolrDispatchFilter |___/\___/_|_|    Start time: 2018-02-22T07:49:18.176Z
   [junit4]   2> 1149950 INFO  (zkConnectionManagerCallback-1901-thread-1) [    ] o.a.s.c.c.ConnectionManager zkClient has connected
   [junit4]   2> 1149951 INFO  (jetty-launcher-1896-thread-2) [    ] o.a.s.s.SolrDispatchFilter solr.xml found in ZooKeeper. Loading...
   [junit4]   2> 1149952 INFO  (zkConnectionManagerCallback-1903-thread-1) [    ] o.a.s.c.c.ConnectionManager zkClient has connected
   [junit4]   2> 1149952 INFO  (jetty-launcher-1896-thread-1) [    ] o.a.s.s.SolrDispatchFilter solr.xml found in ZooKeeper. Loading...
   [junit4]   2> 1149982 INFO  (jetty-launcher-1896-thread-1) [    ] o.a.s.c.ZkContainer Zookeeper client=127.0.0.1:65167/solr
   [junit4]   2> 1149984 INFO  (zkConnectionManagerCallback-1907-thread-1) [    ] o.a.s.c.c.ConnectionManager zkClient has connected
   [junit4]   2> 1149997 INFO  (jetty-launcher-1896-thread-2) [    ] o.a.s.c.ZkContainer Zookeeper client=127.0.0.1:65167/solr
   [junit4]   2> 1150001 INFO  (zkConnectionManagerCallback-1913-thread-1-processing-n:127.0.0.1:60841_solr) [n:127.0.0.1:60841_solr    ] o.a.s.c.c.ConnectionManager zkClient has connected
   [junit4]   2> 1150002 INFO  (zkConnectionManagerCallback-1911-thread-1) [    ] o.a.s.c.c.ConnectionManager zkClient has connected
   [junit4]   2> 1150015 INFO  (zkConnectionManagerCallback-1915-thread-1-processing-n:127.0.0.1:57442_solr) [n:127.0.0.1:57442_solr    ] o.a.s.c.c.ConnectionManager zkClient has connected
   [junit4]   2> 1150055 INFO  (jetty-launcher-1896-thread-1) [n:127.0.0.1:60841_solr    ] o.a.s.c.Overseer Overseer (id=null) closing
   [junit4]   2> 1150056 INFO  (jetty-launcher-1896-thread-1) [n:127.0.0.1:60841_solr    ] o.a.s.c.OverseerElectionContext I am going to be the leader 127.0.0.1:60841_solr
   [junit4]   2> 1150062 INFO  (jetty-launcher-1896-thread-1) [n:127.0.0.1:60841_solr    ] o.a.s.c.Overseer Overseer (id=72241307093434372-127.0.0.1:60841_solr-n_0000000000) starting
   [junit4]   2> 1150075 INFO  (jetty-launcher-1896-thread-1) [n:127.0.0.1:60841_solr    ] o.a.s.c.ZkController Register node as live in ZooKeeper:/live_nodes/127.0.0.1:60841_solr
   [junit4]   2> 1150081 INFO  (zkCallback-1912-thread-1-processing-n:127.0.0.1:60841_solr) [n:127.0.0.1:60841_solr    ] o.a.s.c.c.ZkStateReader Updated live nodes from ZooKeeper... (0) -> (1)
   [junit4]   2> 1150118 INFO  (jetty-launcher-1896-thread-1) [n:127.0.0.1:60841_solr    ] o.a.s.c.CoreContainer Initializing authentication plugin: org.apache.solr.security.HadoopAuthPlugin
   [junit4]   2> 1150122 INFO  (jetty-launcher-1896-thread-1) [n:127.0.0.1:60841_solr    ] o.a.s.s.HadoopAuthPlugin Params: {proxyuser.anyHostUsersGroup.hosts=*, proxyuser.wrongHost.hosts=1.1.1.1.1.1, proxyuser.bogusGroup.groups=__some_bogus_group, proxyuser.localHostAnyGroup.groups=*, cookie.domain=127.0.0.1, proxyuser.wrongHost.groups=*, type=simple, proxyuser.noHosts.groups=*, proxyuser.anyHostUsersGroup.groups=staff, proxyuser.noGroups.hosts=*, proxyuser.anyHostAnyUser.groups=*, delegation-token.token-kind=solr-dt, proxyuser.bogusGroup.hosts=*, zk-dt-secret-manager.znodeWorkingPath=solr/security/zkdtsm, signer.secret.provider.zookeeper.path=/token, zk-dt-secret-manager.enable=true, proxyuser.localHostAnyGroup.hosts=serv1-vm3,localhost,127.0.0.1, proxyuser.anyHostAnyUser.hosts=*, signer.secret.provider=zookeeper}
   [junit4]   2> 1150126 INFO  (jetty-launcher-1896-thread-1) [n:127.0.0.1:60841_solr    ] o.a.c.f.i.CuratorFrameworkImpl Starting
   [junit4]   2> 1150129 INFO  (jetty-launcher-1896-thread-1-EventThread) [n:127.0.0.1:60841_solr    ] o.a.c.f.s.ConnectionStateManager State change: CONNECTED
   [junit4]   2> 1150174 INFO  (jetty-launcher-1896-thread-1) [n:127.0.0.1:60841_solr    ] o.a.s.c.CoreContainer PKIAuthenticationPlugin is managing internode requests
   [junit4]   2> 1150196 INFO  (jetty-launcher-1896-thread-2) [n:127.0.0.1:57442_solr    ] o.a.s.c.c.ZkStateReader Updated live nodes from ZooKeeper... (0) -> (1)
   [junit4]   2> 1150202 INFO  (jetty-launcher-1896-thread-2) [n:127.0.0.1:57442_solr    ] o.a.s.c.Overseer Overseer (id=null) closing
   [junit4]   2> 1150205 INFO  (jetty-launcher-1896-thread-2) [n:127.0.0.1:57442_solr    ] o.a.s.c.ZkController Register node as live in ZooKeeper:/live_nodes/127.0.0.1:57442_solr
   [junit4]   2> 1150206 INFO  (zkCallback-1912-thread-1-processing-n:127.0.0.1:60841_solr) [n:127.0.0.1:60841_solr    ] o.a.s.c.c.ZkStateReader Updated live nodes from ZooKeeper... (1) -> (2)
   [junit4]   2> 1150207 INFO  (zkCallback-1914-thread-1-processing-n:127.0.0.1:57442_solr) [n:127.0.0.1:57442_solr    ] o.a.s.c.c.ZkStateReader Updated live nodes from ZooKeeper... (1) -> (2)
   [junit4]   2> 1150238 INFO  (jetty-launcher-1896-thread-1) [n:127.0.0.1:60841_solr    ] o.a.s.m.r.SolrJmxReporter JMX monitoring for 'solr_60841.solr.node' (registry 'solr.node') enabled at server: com.sun.jmx.mbeanserver.JmxMBeanServer@41538633
   [junit4]   2> 1150247 INFO  (jetty-launcher-1896-thread-1) [n:127.0.0.1:60841_solr    ] o.a.s.m.r.SolrJmxReporter JMX monitoring for 'solr_60841.solr.jvm' (registry 'solr.jvm') enabled at server: com.sun.jmx.mbeanserver.JmxMBeanServer@41538633
   [junit4]   2> 1150247 INFO  (jetty-launcher-1896-thread-1) [n:127.0.0.1:60841_solr    ] o.a.s.m.r.SolrJmxReporter JMX monitoring for 'solr_60841.solr.jetty' (registry 'solr.jetty') enabled at server: com.sun.jmx.mbeanserver.JmxMBeanServer@41538633
   [junit4]   2> 1150248 INFO  (jetty-launcher-1896-thread-1) [n:127.0.0.1:60841_solr    ] o.a.s.c.CorePropertiesLocator Found 0 core definitions underneath /export/home/jenkins/workspace/Lucene-Solr-7.x-Solaris/solr/build/solr-core/test/J1/temp/solr.security.hadoop.TestImpersonationWithHadoopAuth_664B7BE5FCE5DCCD-001/tempDir-001/node2/.
   [junit4]   2> 1150269 INFO  (jetty-launcher-1896-thread-2) [n:127.0.0.1:57442_solr    ] o.a.s.c.CoreContainer Initializing authentication plugin: org.apache.solr.security.HadoopAuthPlugin
   [junit4]   2> 1150269 INFO  (jetty-launcher-1896-thread-2) [n:127.0.0.1:57442_solr    ] o.a.s.s.HadoopAuthPlugin Params: {proxyuser.anyHostUsersGroup.hosts=*, proxyuser.wrongHost.hosts=1.1.1.1.1.1, proxyuser.bogusGroup.groups=__some_bogus_group, proxyuser.localHostAnyGroup.groups=*, cookie.domain=127.0.0.1, proxyuser.wrongHost.groups=*, type=simple, proxyuser.noHosts.groups=*, proxyuser.anyHostUsersGroup.groups=staff, proxyuser.noGroups.hosts=*, proxyuser.anyHostAnyUser.groups=*, delegation-token.token-kind=solr-dt, proxyuser.bogusGroup.hosts=*, zk-dt-secret-manager.znodeWorkingPath=solr/security/zkdtsm, signer.secret.provider.zookeeper.path=/token, zk-dt-secret-manager.enable=true, proxyuser.localHostAnyGroup.hosts=serv1-vm3,localhost,127.0.0.1, proxyuser.anyHostAnyUser.hosts=*, signer.secret.provider=zookeeper}
   [junit4]   2> 1150271 INFO  (jetty-launcher-1896-thread-2) [n:127.0.0.1:57442_solr    ] o.a.c.f.i.CuratorFrameworkImpl Starting
   [junit4]   2> 1150282 INFO  (jetty-launcher-1896-thread-2-EventThread) [n:127.0.0.1:57442_solr    ] o.a.c.f.s.ConnectionStateManager State change: CONNECTED
   [junit4]   2> 1150341 INFO  (jetty-launcher-1896-thread-2) [n:127.0.0.1:57442_solr    ] o.a.s.c.CoreContainer PKIAuthenticationPlugin is managing internode requests
   [junit4]   2> 1150430 INFO  (jetty-launcher-1896-thread-2) [n:127.0.0.1:57442_solr    ] o.a.s.m.r.SolrJmxReporter JMX monitoring for 'solr_57442.solr.node' (registry 'solr.node') enabled at server: com.sun.jmx.mbeanserver.JmxMBeanServer@41538633
   [junit4]   2> 1150437 INFO  (jetty-launcher-1896-thread-2) [n:127.0.0.1:57442_solr    ] o.a.s.m.r.SolrJmxReporter JMX monitoring for 'solr_57442.solr.jvm' (registry 'solr.jvm') enabled at server: com.sun.jmx.mbeanserver.JmxMBeanServer@41538633
   [junit4]   2> 1150437 INFO  (jetty-launcher-1896-thread-2) [n:127.0.0.1:57442_solr    ] o.a.s.m.r.SolrJmxReporter JMX monitoring for 'solr_57442.solr.jetty' (registry 'solr.jetty') enabled at server: com.sun.jmx.mbeanserver.JmxMBeanServer@41538633
   [junit4]   2> 1150438 INFO  (jetty-launcher-1896-thread-2) [n:127.0.0.1:57442_solr    ] o.a.s.c.CorePropertiesLocator Found 0 core definitions underneath /export/home/jenkins/workspace/Lucene-Solr-7.x-Solaris/solr/build/solr-core/test/J1/temp/solr.security.hadoop.TestImpersonationWithHadoopAuth_664B7BE5FCE5DCCD-001/tempDir-001/node1/.
   [junit4]   2> 1150503 INFO  (zkConnectionManagerCallback-1921-thread-1) [    ] o.a.s.c.c.ConnectionManager zkClient has connected
   [junit4]   2> 1150508 INFO  (zkConnectionManagerCallback-1925-thread-1) [    ] o.a.s.c.c.ConnectionManager zkClient has connected
   [junit4]   2> 1150510 INFO  (SUITE-TestImpersonationWithHadoopAuth-seed#[664B7BE5FCE5DCCD]-worker) [    ] o.a.s.c.c.ZkStateReader Updated live nodes from ZooKeeper... (0) -> (2)
   [junit4]   2> 1150511 INFO  (SUITE-TestImpersonationWithHadoopAuth-seed#[664B7BE5FCE5DCCD]-worker) [    ] o.a.s.c.s.i.ZkClientClusterStateProvider Cluster at 127.0.0.1:65167/solr ready
   [junit4]   2> 1150549 INFO  (TEST-TestImpersonationWithHadoopAuth.testProxyInvalidProxyUser-seed#[664B7BE5FCE5DCCD]) [    ] o.a.s.SolrTestCaseJ4 ###Starting testProxyInvalidProxyUser
   [junit4]   2> 1150617 WARN  (TEST-TestImpersonationWithHadoopAuth.testProxyInvalidProxyUser-seed#[664B7BE5FCE5DCCD]) [    ] o.a.h.c.p.ResponseProcessCookies Invalid cookie header: "Set-Cookie: hadoop.auth="u=bar&p=bar&t=simple-dt&e=1519321758842&s=zHHlHxYBCeb+VcWtQXBVkNMGRyg="; Domain=127.0.0.1; Expires=Kam, 22-Feb-2018 17:49:18 GMT; HttpOnly". Invalid 'expires' attribute: Kam, 22-Feb-2018 17:49:18 GMT
   [junit4]   2> 1150617 INFO  (TEST-TestImpersonationWithHadoopAuth.testProxyInvalidProxyUser-seed#[664B7BE5FCE5DCCD]) [    ] o.a.s.SolrTestCaseJ4 ###Ending testProxyInvalidProxyUser
   [junit4]   2> 1150709 INFO  (TEST-TestImpersonationWithHadoopAuth.testProxyInvalidGroup-seed#[664B7BE5FCE5DCCD]) [    ] o.a.s.SolrTestCaseJ4 ###Starting testProxyInvalidGroup
   [junit4]   2> 1150807 WARN  (qtp109810651-9847) [    ] o.a.h.s.ShellBasedUnixGroupsMapping got exception trying to get groups for user bar: id: invalid user name: "bar"
   [junit4]   2> id: invalid user name: "bar"
   [junit4]   2> 
   [junit4]   2> 1150810 WARN  (TEST-TestImpersonationWithHadoopAuth.testProxyInvalidGroup-seed#[664B7BE5FCE5DCCD]) [    ] o.a.h.c.p.ResponseProcessCookies Invalid cookie header: "Set-Cookie: hadoop.auth="u=bogusGroup&p=bogusGroup&t=simple-dt&e=1519321758949&s=/JhY23TLC/zwhcJKAindSD1rYRY="; Domain=127.0.0.1; Expires=Kam, 22-Feb-2018 17:49:18 GMT; HttpOnly". Invalid 'expires' attribute: Kam, 22-Feb-2018 17:49:18 GMT
   [junit4]   2> 1150811 INFO  (TEST-TestImpersonationWithHadoopAuth.testProxyInvalidGroup-seed#[664B7BE5FCE5DCCD]) [    ] o.a.s.SolrTestCaseJ4 ###Ending testProxyInvalidGroup
   [junit4]   2> 1150845 INFO  (TEST-TestImpersonationWithHadoopAuth.testProxyWrongHost-seed#[664B7BE5FCE5DCCD]) [    ] o.a.s.SolrTestCaseJ4 ###Starting testProxyWrongHost
   [junit4]   2> 1165966 WARN  (jetty-launcher-1896-thread-2-SendThread(127.0.0.1:65167)) [n:127.0.0.1:57442_solr    ] o.a.z.ClientCnxn Client session timed out, have not heard from server in 15532ms for sessionid 0x100a716076a0006
   [junit4]   2> 1165966 WARN  (jetty-launcher-1896-thread-1-SendThread(127.0.0.1:65167)) [n:127.0.0.1:60841_solr    ] o.a.z.ClientCnxn Client session timed out, have not heard from server in 15594ms for sessionid 0x100a716076a0007
   [junit4]   2> 1165967 WARN  (NIOServerCxn.Factory:0.0.0.0/0.0.0.0:0) [    ] o.a.z.s.NIOServerCnxn Unable to read additional data from client sessionid 0x100a716076a0006, likely client has closed socket
   [junit4]   2> 1165967 WARN  (jetty-launcher-1896-thread-1-SendThread(127.0.0.1:65167)) [n:127.0.0.1:60841_solr    ] o.a.z.ClientCnxn Client session timed out, have not heard from server in 15665ms for sessionid 0x100a716076a0004
   [junit4]   2> 1165967 WARN  (NIOServerCxn.Factory:0.0.0.0/0.0.0.0:0) [    ] o.a.z.s.NIOServerCnxn Unable to read additional data from client sessionid 0x100a716076a0007, likely client has closed socket
   [junit4]   2> 1165966 WARN  (jetty-launcher-1896-thread-2-SendThread(127.0.0.1:65167)) [n:127.0.0.1:57442_solr    ] o.a.z.ClientCnxn Client session timed out, have not heard from server in 15595ms for sessionid 0x100a716076a0008
   [junit4]   2> 1165967 WARN  (NIOServerCxn.Factory:0.0.0.0/0.0.0.0:0) [    ] o.a.z.s.NIOServerCnxn Unable to read additional data from client sessionid 0x100a716076a0004, likely client has closed socket
   [junit4]   2> 1165968 WARN  (TEST-TestImpersonationWithHadoopAuth.testProxyWrongHost-seed#[664B7BE5FCE5DCCD]) [    ] o.a.h.c.p.ResponseProcessCookies Invalid cookie header: "Set-Cookie: hadoop.auth="u=wrongHost&p=wrongHost&t=simple-dt&e=1519321759075&s=ngiTx5X0FbK3aQCAeNZIBdL8ykk="; Domain=127.0.0.1; Expires=Kam, 22-Feb-2018 17:49:19 GMT; HttpOnly". Invalid 'expires' attribute: Kam, 22-Feb-2018 17:49:19 GMT
   [junit4]   2> 1165968 WARN  (NIOServerCxn.Factory:0.0.0.0/0.0.0.0:0) [    ] o.a.z.s.NIOServerCnxn Unable to read additional data from client sessionid 0x100a716076a0008, likely client has closed socket
   [junit4]   2> 1165968 INFO  (TEST-TestImpersonationWithHadoopAuth.testProxyWrongHost-seed#[664B7BE5FCE5DCCD]) [    ] o.a.s.SolrTestCaseJ4 ###Ending testProxyWrongHost
   [junit4]   2> 1165995 INFO  (TEST-TestImpersonationWithHadoopAuth.testProxyValidateHost-seed#[664B7BE5FCE5DCCD]) [    ] o.a.s.SolrTestCaseJ4 ###Starting testProxyValidateHost
   [junit4]   2> 1165997 INFO  (qtp109810651-9847) [n:127.0.0.1:60841_solr    ] o.a.s.h.a.CollectionsHandler Invoked Collection Action :list with params doAs=bar&action=LIST&user.name=localHostAnyGroup&wt=javabin&version=2 and sendToOCPQueue=true
   [junit4]   2> 1165997 INFO  (qtp109810651-9847) [n:127.0.0.1:60841_solr    ] o.a.s.s.HttpSolrCall [admin] webapp=null path=/admin/collections params={doAs=bar&action=LIST&user.name=localHostAnyGroup&wt=javabin&version=2} status=0 QTime=0
   [junit4]   2> 1165998 WARN  (TEST-TestImpersonationWithHadoopAuth.testProxyValidateHost-seed#[664B7BE5FCE5DCCD]) [    ] o.a.h.c.p.ResponseProcessCookies Invalid cookie header: "Set-Cookie: hadoop.auth="u=localHostAnyGroup&p=localHostAnyGroup&t=simple-dt&e=1519321774225&s=FOniuiMETM7RomhNhPN8/RHowkw="; Domain=127.0.0.1; Expires=Kam, 22-Feb-2018 17:49:34 GMT; HttpOnly". Invalid 'expires' attribute: Kam, 22-Feb-2018 17:49:34 GMT
   [junit4]   2> 1165998 INFO  (TEST-TestImpersonationWithHadoopAuth.testProxyValidateHost-seed#[664B7BE5FCE5DCCD]) [    ] o.a.s.SolrTestCaseJ4 ###Ending testProxyValidateHost
   [junit4]   2> 1166019 INFO  (TEST-TestImpersonationWithHadoopAuth.testProxyValidateGroup-seed#[664B7BE5FCE5DCCD]) [    ] o.a.s.SolrTestCaseJ4 ###Starting testProxyValidateGroup
   [junit4]   2> 1166021 INFO  (qtp109810651-9847) [n:127.0.0.1:60841_solr    ] o.a.s.h.a.CollectionsHandler Invoked Collection Action :list with params doAs=jenkins&action=LIST&user.name=anyHostUsersGroup&wt=javabin&version=2 and sendToOCPQueue=true
   [junit4]   2> 1166021 INFO  (qtp109810651-9847) [n:127.0.0.1:60841_solr    ] o.a.s.s.HttpSolrCall [admin] webapp=null path=/admin/collections params={doAs=jenkins&action=LIST&user.name=anyHostUsersGroup&wt=javabin&version=2} status=0 QTime=0
   [junit4]   2> 1166022 WARN  (TEST-TestImpersonationWithHadoopAuth.testProxyValidateGroup-seed#[664B7BE5FCE5DCCD]) [    ] o.a.h.c.p.ResponseProcessCookies Invalid cookie header: "Set-Cookie: hadoop.auth="u=anyHostUsersGroup&p=anyHostUsersGroup&t=simple-dt&e=1519321774249&s=HEVRyJ1DfHaeauYGC8pS5NtPsMQ="; Domain=127.0.0.1; Expires=Kam, 22-Feb-2018 17:49:34 GMT; HttpOnly". Invalid 'expires' attribute: Kam, 22-Feb-2018 17:49:34 GMT
   [junit4]   2> 1166022 INFO  (TEST-TestImpersonationWithHadoopAuth.testProxyValidateGroup-seed#[664B7BE5FCE5DCCD]) [    ] o.a.s.SolrTestCaseJ4 ###Ending testProxyValidateGroup
   [junit4]   2> 1166043 INFO  (TEST-TestImpersonationWithHadoopAuth.testProxyNoConfigGroups-seed#[664B7BE5FCE5DCCD]) [    ] o.a.s.SolrTestCaseJ4 ###Starting testProxyNoConfigGroups
   [junit4]   2> 1166047 WARN  (TEST-TestImpersonationWithHadoopAuth.testProxyNoConfigGroups-seed#[664B7BE5FCE5DCCD]) [    ] o.a.h.c.p.ResponseProcessCookies Invalid cookie header: "Set-Cookie: hadoop.auth="u=noGroups&p=noGroups&t=simple-dt&e=1519321774273&s=BQwWMtnuL5NKvY2JalbRvYz/Uns="; Domain=127.0.0.1; Expires=Kam, 22-Feb-2018 17:49:34 GMT; HttpOnly". Invalid 'expires' attribute: Kam, 22-Feb-2018 17:49:34 GMT
   [junit4]   2> 1166047 INFO  (TEST-TestImpersonationWithHadoopAuth.testProxyNoConfigGroups-seed#[664B7BE5FCE5DCCD]) [    ] o.a.s.SolrTestCaseJ4 ###Ending testProxyNoConfigGroups
   [junit4] IGNOR/A 0.00s J1 | TestImpersonationWithHadoopAuth.testForwarding
   [junit4]    > Assumption #1: 'awaitsfix' test group is disabled (@AwaitsFix(bugUrl=https://issues.apache.org/jira/browse/HADOOP-9893))
   [junit4]   2> 1166067 WARN  (zkConnectionManagerCallback-1915-thread-1-processing-n:127.0.0.1:57442_solr) [n:127.0.0.1:57442_solr    ] o.a.s.c.c.ConnectionManager Watcher org.apache.solr.common.cloud.ConnectionManager@6f230156 name: ZooKeeperConnection Watcher:127.0.0.1:65167/solr got event WatchedEvent state:Disconnected type:None path:null path: null type: None
   [junit4]   2> 1166068 WARN  (zkConnectionManagerCallback-1915-thread-1-processing-n:127.0.0.1:57442_solr) [n:127.0.0.1:57442_solr    ] o.a.s.c.c.ConnectionManager zkClient has disconnected
   [junit4]   2> 1166070 WARN  (zkConnectionManagerCallback-1913-thread-1-processing-n:127.0.0.1:60841_solr) [n:127.0.0.1:60841_solr    ] o.a.s.c.c.ConnectionManager Watcher org.apache.solr.common.cloud.ConnectionManager@1df4f30d name: ZooKeeperConnection Watcher:127.0.0.1:65167/solr got event WatchedEvent state:Disconnected type:None path:null path: null type: None
   [junit4]   2> 1166070 WARN  (zkConnectionManagerCallback-1913-thread-1-processing-n:127.0.0.1:60841_solr) [n:127.0.0.1:60841_solr    ] o.a.s.c.c.ConnectionManager zkClient has disconnected
   [junit4]   2> 1166072 WARN  (zkConnectionManagerCallback-1925-thread-1) [    ] o.a.s.c.c.ConnectionManager Watcher org.apache.solr.common.cloud.ConnectionManager@4b946a48 name: ZooKeeperConnection Watcher:127.0.0.1:65167/solr got event WatchedEvent state:Disconnected type:None path:null path: null type: None
   [junit4]   2> 1166072 WARN  (zkConnectionManagerCallback-1925-thread-1) [    ] o.a.s.c.c.ConnectionManager zkClient has disconnected
   [junit4]   2> 1166074 INFO  (jetty-launcher-1896-thread-2-EventThread) [n:127.0.0.1:57442_solr    ] o.a.c.f.s.ConnectionStateManager State change: SUSPENDED
   [junit4]   2> 1166082 INFO  (TEST-TestImpersonationWithHadoopAuth.testProxyNullProxyUser-seed#[664B7BE5FCE5DCCD]) [    ] o.a.s.SolrTestCaseJ4 ###Starting testProxyNullProxyUser
   [junit4]   2> 1166084 INFO  (qtp109810651-9847) [n:127.0.0.1:60841_solr    ] o.a.s.s.SolrDispatchFilter Error authenticating
   [junit4]   2> java.lang.IllegalArgumentException: userName is NULL, empty or contains a '&'
   [junit4]   2> 	at org.apache.hadoop.security.authentication.util.AuthToken.checkForIllegalArgument(AuthToken.java:87)
   [junit4]   2> 	at org.apache.hadoop.security.authentication.util.AuthToken.<init>(AuthToken.java:70)
   [junit4]   2> 	at org.apache.hadoop.security.authentication.server.AuthenticationToken.<init>(AuthenticationToken.java:58)
   [junit4]   2> 	at org.apache.hadoop.security.authentication.server.PseudoAuthenticationHandler.authenticate(PseudoAuthenticationHandler.java:195)
   [junit4]   2> 	at org.apache.hadoop.security.token.delegation.web.DelegationTokenAuthenticationHandler.authenticate(DelegationTokenAuthenticationHandler.java:348)
   [junit4]   2> 	at org.apache.solr.security.RequestContinuesRecorderAuthenticationHandler.authenticate(RequestContinuesRecorderAuthenticationHandler.java:69)
   [junit4]   2> 	at org.apache.hadoop.security.authentication.server.AuthenticationFilter.doFilter(AuthenticationFilter.java:518)
   [junit4]   2> 	at org.apache.solr.security.HadoopAuthFilter.doFilter(HadoopAuthFilter.java:110)
   [junit4]   2> 	at org.apache.solr.security.HadoopAuthPlugin.doAuthenticate(HadoopAuthPlugin.java:245)
   [junit4]   2> 	at org.apache.solr.servlet.SolrDispatchFilter.authenticateRequest(SolrDispatchFilter.java:454)
   [junit4]   2> 	at org.apache.solr.servlet.SolrDispatchFilter.doFilter(SolrDispatchFilter.java:349)
   [junit4]   2> 	at org.apache.solr.servlet.SolrDispatchFilter.doFilter(SolrDispatchFilter.java:326)
   [junit4]   2> 	at org.eclipse.jetty.servlet.ServletHandler$CachedChain.doFilter(ServletHandler.java:1637)
   [junit4]   2> 	at org.apache.solr.client.solrj.embedded.JettySolrRunner$DebugFilter.doFilter(JettySolrRunner.java:139)
   [junit4]   2> 	at org.eclipse.jetty.servlet.ServletHandler$CachedChain.doFilter(ServletHandler.java:1637)
   [junit4]   2> 	at org.eclipse.jetty.servlet.ServletHandler.doHandle(ServletHandler.java:533)
   [junit4]   2> 	at org.eclipse.jetty.server.handler.ScopedHandler.nextHandle(ScopedHandler.java:188)
   [junit4]   2> 	at org.eclipse.jetty.server.session.SessionHandler.doHandle(SessionHandler.java:1595)
   [junit4]   2> 	at org.eclipse.jetty.server.handler.ScopedHandler.nextHandle(ScopedHandler.java:188)
   [junit4]   2> 	at org.eclipse.jetty.server.handler.ContextHandler.doHandle(ContextHandler.java:1253)
   [junit4]   2> 	at org.eclipse.jetty.server.handler.ScopedHandler.nextScope(ScopedHandler.java:168)
   [junit4]   2> 	at org.eclipse.jetty.servlet.ServletHandler.doScope(ServletHandler.java:473)
   [junit4]   2> 	at org.eclipse.jetty.server.session.SessionHandler.doScope(SessionHandler.java:1564)
   [junit4]   2> 	at org.eclipse.jetty.server.handler.ScopedHandler.nextScope(ScopedHandler.java:166)
   [junit4]   2> 	at org.eclipse.jetty.server.handler.ContextHandler.doScope(ContextHandler.java:1155)
   [junit4]   2> 	at org.eclipse.jetty.server.handler.ScopedHandler.handle(ScopedHandler.java:141)
   [junit4]   2> 	at org.eclipse.jetty.server.handler.gzip.GzipHandler.handle(GzipHandler.java:527)
   [junit4]   2> 	at org.eclipse.jetty.server.handler.HandlerWrapper.handle(HandlerWrapper.java:132)
   [junit4]   2> 	at org.eclipse.jetty.server.Server.handle(Server.java:530)
   [junit4]   2> 	at org.eclipse.jetty.server.HttpChannel.handle(HttpChannel.java:347)
   [junit4]   2> 	at org.eclipse.jetty.server.HttpConnection.onFillable(HttpConnection.java:256)
   [junit4]   2> 	at org.eclipse.jetty.io.AbstractConnection$ReadCallback.succeeded(AbstractConnection.java:279)
   [junit4]   2> 	at org.eclipse.jetty.io.FillInterest.fillable(FillInterest.java:102)
   [junit4]   2> 	at org.eclipse.jetty.io.ChannelEndPoint$2.run(ChannelEndPoint.java:124)
   [junit4]   2> 	at org.eclipse.jetty.util.thread.strategy.EatWhatYouKill.doProduce(EatWhatYouKill.java:247)
   [junit4]   2> 	at org.eclipse.jetty.util.thread.strategy.EatWhatYouKill.produce(EatWhatYouKill.java:140)
   [junit4]   2> 	at org.eclipse.jetty.util.thread.strategy.EatWhatYouKill.run(EatWhatYouKill.java:131)
   [junit4]   2> 	at org.eclipse.jetty.util.thread.ReservedThreadExecutor$ReservedThread.run(ReservedThreadExecutor.java:382)
   [junit4]   2> 	at org.eclipse.jetty.util.thread.QueuedThreadPool.runJob(QueuedThreadPool.java:708)
   [junit4]   2> 	at org.eclipse.jetty.util.thread.QueuedThreadPool$2.run(QueuedThreadPool.java:626)
   [junit4]   2> 	at java.lang.Thread.run(Thread.java:748)
   [junit4]   2> 1166085 WARN  (qtp109810651-9847) [n:127.0.0.1:60841_solr    ] o.e.j.s.HttpChannel /solr/admin/collections
   [junit4]   2> org.apache.solr.common.SolrException: Error during request authentication, 
   [junit4]   2> 	at org.apache.solr.servlet.SolrDispatchFilter.authenticateRequest(SolrDispatchFilter.java:460)
   [junit4]   2> 	at org.apache.solr.servlet.SolrDispatchFilter.doFilter(SolrDispatchFilter.java:349)
   [junit4]   2> 	at org.apache.solr.servlet.SolrDispatchFilter.doFilter(SolrDispatchFilter.java:326)
   [junit4]   2> 	at org.eclipse.jetty.servlet.ServletHandler$CachedChain.doFilter(ServletHandler.java:1637)
   [junit4]   2> 	at org.apache.solr.client.solrj.embedded.JettySolrRunner$DebugFilter.doFilter(JettySolrRunner.java:139)
   [junit4]   2> 	at org.eclipse.jetty.servlet.ServletHandler$CachedChain.doFilter(ServletHandler.java:1637)
   [junit4]   2> 	at org.eclipse.jetty.servlet.ServletHandler.doHandle(ServletHandler.java:533)
   [junit4]   2> 	at org.eclipse.jetty.server.handler.ScopedHandler.nextHandle(ScopedHandler.java:188)
   [junit4]   2> 	at org.eclipse.jetty.server.session.SessionHandler.doHandle(SessionHandler.java:1595)
   [junit4]   2> 	at org.eclipse.jetty.server.handler.ScopedHandler.nextHandle(ScopedHandler.java:188)
   [junit4]   2> 	at org.eclipse.jetty.server.handler.ContextHandler.doHandle(ContextHandler.java:1253)
   [junit4]   2> 	at org.eclipse.jetty.server.handler.ScopedHandler.nextScope(ScopedHandler.java:168)
   [junit4]   2> 	at org.eclipse.jetty.servlet.ServletHandler.doScope(ServletHandler.java:473)
   [junit4]   2> 	at org.eclipse.jetty.server.session.SessionHandler.doScope(SessionHandler.java:1564)
   [junit4]   2> 	at org.eclipse.jetty.server.handler.ScopedHandler.nextScope(ScopedHandler.java:166)
   [junit4]   2> 	at org.eclipse.jetty.server.handler.ContextHandler.doScope(ContextHandler.java:1155)
   [junit4]   2> 	at org.eclipse.jetty.server.handler.ScopedHandler.handle(ScopedHandler.java:141)
   [junit4]   2> 	at org.eclipse.jetty.server.handler.gzip.GzipHandler.handle(GzipHandler.java:527)
   [junit4]   2> 	at org.eclipse.jetty.server.handler.HandlerWrapper.handle(HandlerWrapper.java:132)
   [junit4]   2> 	at org.eclipse.jetty.server.Server.handle(Server.java:530)
   [junit4]   2> 	at org.eclipse.jetty.server.HttpChannel.handle(HttpChannel.java:347)
   [junit4]   2> 	at org.eclipse.jetty.server.HttpConnection.onFillable(HttpConnection.java:256)
   [junit4]   2> 	at org.eclipse.jetty.io.AbstractConnection$ReadCallback.succeeded(AbstractConnection.java:279)
   [junit4]   2> 	at org.eclipse.jetty.io.FillInterest.fillable(FillInterest.java:102)
   [junit4]   2> 	at org.eclipse.jetty.io.ChannelEndPoint$2.run(ChannelEndPoint.java:124)
   [junit4]   2> 	at org.eclipse.jetty.util.thread.strategy.EatWhatYouKill.doProduce(EatWhatYouKill.java:247)
   [junit4]   2> 	at org.eclipse.jetty.util.thread.strategy.EatWhatYouKill.produce(EatWhatYouKill.java:140)
   [junit4]   2> 	at org.eclipse.jetty.util.thread.strategy.EatWhatYouKill.run(EatWhatYouKill.java:131)
   [junit4]   2> 	at org.eclipse.jetty.util.thread.ReservedThreadExecutor$ReservedThread.run(ReservedThreadExecutor.java:382)
   [junit4]   2> 	at org.eclipse.jetty.util.thread.QueuedThreadPool.runJob(QueuedThreadPool.java:708)
   [junit4]   2> 	at org.eclipse.jetty.util.thread.QueuedThreadPool$2.run(QueuedThreadPool.java:626)
   [junit4]   2> 	at java.lang.Thread.run(Thread.java:748)
   [junit4]   2> Caused by: java.lang.IllegalArgumentException: userName is NULL, empty or contains a '&'
   [junit4]   2> 	at org.apache.hadoop.security.authentication.util.AuthToken.checkForIllegalArgument(AuthToken.java:87)
   [junit4]   2> 	at org.apache.hadoop.security.authentication.util.AuthToken.<init>(AuthToken.java:70)
   [junit4]   2> 	at org.apache.hadoop.security.authentication.server.AuthenticationToken.<init>(AuthenticationToken.java:58)
   [junit4]   2> 	at org.apache.hadoop.security.authentication.server.PseudoAuthenticationHandler.authenticate(PseudoAuthenticationHandler.java:195)
   [junit4]   2> 	at org.apache.hadoop.security.token.delegation.web.DelegationTokenAuthenticationHandler.authenticate(DelegationTokenAuthenticationHandler.java:348)
   [junit4]   2> 	at org.apache.solr.security.RequestContinuesRecorderAuthenticationHandler.authenticate(RequestContinuesRecorderAuthenticationHandler.java:69)
   [junit4]   2> 	at org.apache.hadoop.security.authentication.server.AuthenticationFilter.doFilter(AuthenticationFilter.java:518)
   [junit4]   2> 	at org.apache.solr.security.HadoopAuthFilter.doFilter(HadoopAuthFilter.java:110)
   [junit4]   2> 	at org.apache.solr.security.HadoopAuthPlugin.doAuthenticate(HadoopAuthPlugin.java:245)
   [junit4]   2> 	at org.apache.solr.servlet.SolrDispatchFilter.authenticateRequest(SolrDispatchFilter.java:454)
   [junit4]   2> 	... 31 more
   [junit4]   2> 1166091 INFO  (TEST-TestImpersonationWithHadoopAuth.testProxyNullProxyUser-seed#[664B7BE5FCE5DCCD]) [    ] o.a.s.SolrTestCaseJ4 ###Ending testProxyNullProxyUser
   [junit4]   2> 1166116 INFO  (TEST-TestImpersonationWithHadoopAuth.testProxyValidateAnyHostAnyUser-seed#[664B7BE5FCE5DCCD]) [    ] o.a.s.SolrTestCaseJ4 ###Starting testProxyValidateAnyHostAnyUser
   [junit4]   2> 1166118 INFO  (qtp109810651-9843) [n:127.0.0.1:60841_solr    ] o.a.s.h.a.CollectionsHandler Invoked Collection Action :list with params doAs=bar&action=LIST&user.name=anyHostAnyUser&wt=javabin&version=2 and sendToOCPQueue=true
   [junit4]   2> 1166118 INFO  (qtp109810651-9843) [n:127.0.0.1:60841_solr    ] o.a.s.s.HttpSolrCall [admin] webapp=null path=/admin/collections params={doAs=bar&action=LIST&user.name=anyHostAnyUser&wt=javabin&version=2} status=0 QTime=0
   [junit4]   2> 1166118 WARN  (TEST-TestImpersonationWithHadoopAuth.testProxyValidateAnyHostAnyUser-seed#[664B7BE5FCE5DCCD]) [    ] o.a.h.c.p.ResponseProcessCookies Invalid cookie header: "Set-Cookie: hadoop.auth="u=anyHostAnyUser&p=anyHostAnyUser&t=simple-dt&e=1519321774345&s=IccpRisAzOxzK6Ul30CjJqsGR74="; Domain=127.0.0.1; Expires=Kam, 22-Feb-2018 17:49:34 GMT; HttpOnly". Invalid 'expires' attribute: Kam, 22-Feb-2018 17:49:34 GMT
   [junit4]   2> 1166118 INFO  (TEST-TestImpersonationWithHadoopAuth.testProxyValidateAnyHostAnyUser-seed#[664B7BE5FCE5DCCD]) [    ] o.a.s.SolrTestCaseJ4 ###Ending testProxyValidateAnyHostAnyUser
   [junit4]   2> 1166142 INFO  (TEST-TestImpersonationWithHadoopAuth.testProxyNoConfigHosts-seed#[664B7BE5FCE5DCCD]) [    ] o.a.s.SolrTestCaseJ4 ###Starting testProxyNoConfigHosts
   [junit4]   2> 1166146 WARN  (TEST-TestImpersonationWithHadoopAuth.testProxyNoConfigHosts-seed#[664B7BE5FCE5DCCD]) [    ] o.a.h.c.p.ResponseProcessCookies Invalid cookie header: "Set-Cookie: hadoop.auth="u=noHosts&p=noHosts&t=simple-dt&e=1519321774372&s=55BeW3BTxVr8rdP1tQr3XTDJnUI="; Domain=127.0.0.1; Expires=Kam, 22-Feb-2018 17:49:34 GMT; HttpOnly". Invalid 'expires' attribute: Kam, 22-Feb-2018 17:49:34 GMT
   [junit4]   2> 1166146 INFO  (TEST-TestImpersonationWithHadoopAuth.testProxyNoConfigHosts-seed#[664B7BE5FCE5DCCD]) [    ] o.a.s.SolrTestCaseJ4 ###Ending testProxyNoConfigHosts
   [junit4]   2> 1167142 INFO  (jetty-closer-1897-thread-1) [    ] o.e.j.s.AbstractConnector Stopped ServerConnector@fcffb5a{HTTP/1.1,[http/1.1]}{127.0.0.1:0}
   [junit4]   2> 1167142 INFO  (jetty-closer-1897-thread-2) [    ] o.e.j.s.AbstractConnector Stopped ServerConnector@2cf24888{HTTP/1.1,[http/1.1]}{127.0.0.1:0}
   [junit4]   2> 1167143 INFO  (jetty-closer-1897-thread-1) [    ] o.a.s.c.CoreContainer Shutting down CoreContainer instance=183697033
   [junit4]   2> 1167143 INFO  (jetty-closer-1897-thread-2) [    ] o.a.s.c.CoreContainer Shutting down CoreContainer instance=287571485
   [junit4]   2> 1167143 INFO  (jetty-closer-1897-thread-1) [    ] o.a.s.m.SolrMetricManager Closing metric reporters for registry=solr.node, tag=null
   [junit4]   2> 1167143 INFO  (jetty-closer-1897-thread-1) [    ] o.a.s.m.r.SolrJmxReporter Closing reporter [org.apache.solr.metrics.reporters.SolrJmxReporter@4036d69f: rootName = solr_60841, domain = solr.node, service url = null, agent id = null] for registry solr.node / com.codahale.metrics.MetricRegistry@4f2914ab
   [junit4]   2> 1167143 INFO  (jetty-closer-1897-thread-2) [    ] o.a.s.m.SolrMetricManager Closing metric reporters for registry=solr.node, tag=null
   [junit4]   2> 1167143 INFO  (jetty-closer-1897-thread-2) [    ] o.a.s.m.r.SolrJmxReporter Closing reporter [org.apache.solr.metrics.reporters.SolrJmxReporter@2e2b551f: rootName = solr_57442, domain = solr.node, service url = null, agent id = null] for registry solr.node / com.codahale.metrics.MetricRegistry@7499b9fe
   [junit4]   2> 1167148 INFO  (jetty-closer-1897-thread-1) [    ] o.a.s.m.SolrMetricManager Closing metric reporters for registry=solr.jvm, tag=null
   [junit4]   2> 1167148 INFO  (jetty-closer-1897-thread-1) [    ] o.a.s.m.r.SolrJmxReporter Closing reporter [org.apache.solr.metrics.reporters.SolrJmxReporter@78991771: rootName = solr_60841, domain = solr.jvm, service url = null, agent id = null] for registry solr.jvm / com.codahale.metrics.MetricRegistry@2b4611d4
   [junit4]   2> 1167148 INFO  (jetty-closer-1897-thread-2) [    ] o.a.s.m.SolrMetricManager Closing metric reporters for registry=solr.jvm, tag=null
   [junit4]   2> 1167148 INFO  (jetty-closer-1897-thread-2) [    ] o.a.s.m.r.SolrJmxReporter Closing reporter [org.apache.solr.metrics.reporters.SolrJmxReporter@65b249a: rootName = solr_57442, domain = solr.jvm, service url = null, agent id = null] for registry solr.jvm / com.codahale.metrics.MetricRegistry@2b4611d4
   [junit4]   2> 1167150 INFO  (jetty-closer-1897-thread-1) [    ] o.a.s.m.SolrMetricManager Closing metric reporters for registry=solr.jetty, tag=null
   [junit4]   2> 1167150 INFO  (jetty-closer-1897-thread-1) [    ] o.a.s.m.r.SolrJmxReporter Closing reporter [org.apache.solr.metrics.reporters.SolrJmxReporter@144e693c: rootName = solr_60841, domain = solr.jetty, service url = null, agent id = null] for registry solr.jetty / com.codahale.metrics.MetricRegistry@94ee25a
   [junit4]   2> 1167150 INFO  (jetty-closer-1897-thread-2) [    ] o.a.s.m.SolrMetricManager Closing metric reporters for registry=solr.jetty, tag=null
   [junit4]   2> 1167151 INFO  (jetty-closer-1897-thread-2) [    ] o.a.s.m.r.SolrJmxReporter Closing reporter [org.apache.solr.metrics.reporters.SolrJmxReporter@5ca57bdc: rootName = solr_57442, domain = solr.jetty, service url = null, agent id = null] for registry solr.jetty / com.codahale.metrics.MetricRegistry@94ee25a
   [junit4]   2> 1167244 INFO  (zkConnectionManagerCallback-1913-thread-1-processing-n:127.0.0.1:60841_solr) [n:127.0.0.1:60841_solr    ] o.a.s.c.c.ConnectionManager zkClient has connected
   [junit4]   2> 1167245 INFO  (jetty-closer-1897-thread-1) [    ] o.a.s.c.ZkController Remove node as live in ZooKeeper:/live_nodes/127.0.0.1:60841_solr
   [junit4]   2> 1167246 INFO  (jetty-closer-1897-thread-1) [    ] o.a.s.m.SolrMetricManager Closing metric reporters for registry=solr.cluster, tag=null
   [junit4]   2> 1167246 INFO  (jetty-closer-1897-thread-1) [    ] o.a.s.c.TransientSolrCoreCacheDefault Allocating transient cache for 2147483647 transient cores
   [junit4]   2> 1167246 INFO  (jetty-closer-1897-thread-1) [    ] o.a.s.c.Overseer Overseer (id=72241307093434372-127.0.0.1:60841_solr-n_0000000000) closing
   [junit4]   2> 1167247 INFO  (OverseerStateUpdate-72241307093434372-127.0.0.1:60841_solr-n_0000000000) [n:127.0.0.1:60841_solr    ] o.a.s.c.Overseer According to ZK I (id=72241307093434372-127.0.0.1:60841_solr-n_0000000000) am no longer a leader.
   [junit4]   2> 1167247 INFO  (OverseerStateUpdate-72241307093434372-127.0.0.1:60841_solr-n_0000000000) [n:127.0.0.1:60841_solr    ] o.a.s.c.Overseer Overseer Loop exiting : 127.0.0.1:60841_solr
   [junit4]   2> 1167248 INFO  (OverseerCollectionConfigSetProcessor-72241307093434372-127.0.0.1:60841_solr-n_0000000000) [n:127.0.0.1:60841_solr    ] o.a.s.c.OverseerTaskProcessor According to ZK I (id=72241307093434372-127.0.0.1:60841_solr-n_0000000000) am no longer a leader.
   [junit4]   2> 1167249 WARN  (OverseerAutoScalingTriggerThread-72241307093434372-127.0.0.1:60841_solr-n_0000000000) [n:127.0.0.1:60841_solr    ] o.a.s.c.a.OverseerTriggerThread OverseerTriggerThread woken up but we are closed, exiting.
   [junit4]   2> 1167250 INFO  (zkCallback-1912-thread-5-processing-n:127.0.0.1:60841_solr) [n:127.0.0.1:60841_solr    ] o.a.s.c.c.ZkStateReader Updated live nodes from ZooKeeper... (2) -> (1)
   [junit4]   2> 1167250 WARN  (ScheduledTrigger-3227-thread-1) [n:127.0.0.1:60841_solr    ] o.a.s.c.a.TriggerBase Exception updating trigger state '/autoscaling/triggerState/.auto_add_replicas'
   [junit4]   2> java.lang.InterruptedException: sleep interrupted
   [junit4]   2> 	at java.lang.Thread.sleep(Native Method)
   [junit4]   2> 	at org.apache.solr.common.cloud.ZkCmdExecutor.retryDelay(ZkCmdExecutor.java:111)
   [junit4]   2> 	at org.apache.solr.common.cloud.ZkCmdExecutor.retryOperation(ZkCmdExecutor.java:70)
   [junit4]   2> 	at org.apache.solr.common.cloud.SolrZkClient.exists(SolrZkClient.java:316)
   [junit4]   2> 	at org.apache.solr.client.solrj.impl.ZkDistribStateManager.hasData(ZkDistribStateManager.java:58)
   [junit4]   2> 	at org.apache.solr.cloud.autoscaling.TriggerBase.saveState(TriggerBase.java:203)
   [junit4]   2> 	at org.apache.solr.cloud.autoscaling.ScheduledTriggers$ScheduledTrigger.run(ScheduledTriggers.java:573)
   [junit4]   2> 	at java.util.concurrent.Executors$RunnableAdapter.call(Executors.java:511)
   [junit4]   2> 	at java.util.concurrent.FutureTask.runAndReset(FutureTask.java:308)
   [junit4]   2> 	at java.util.concurrent.ScheduledThreadPoolExecutor$ScheduledFutureTask.access$301(ScheduledThreadPoolExecutor.java:180)
   [junit4]   2> 	at java.util.concurrent.ScheduledThreadPoolExecutor$ScheduledFutureTask.run(ScheduledThreadPoolExecutor.java:294)
   [junit4]   2> 	at java.util.concurrent.ThreadPoolExecutor.runWorker(ThreadPoolExecutor.java:1149)
   [junit4]   2> 	at java.util.concurrent.ThreadPoolExecutor$Worker.run(ThreadPoolExecutor.java:624)
   [junit4]   2> 	at java.lang.Thread.run(Thread.java:748)
   [junit4]   2> 1167253 ERROR (Thread[Thread-3648,5,TGRP-TestImpersonationWithHadoopAuth]) [n:127.0.0.1:60841_solr    ] o.a.h.s.t.d.AbstractDelegationTokenSecretManager ExpiredTokenRemover received java.lang.InterruptedException: sleep interrupted
   [junit4]   2> 1167612 INFO  (jetty-closer-1897-thread-1) [    ] o.e.j.s.h.ContextHandler Stopped o.e.j.s.ServletContextHandler@50ac8a59{/solr,null,UNAVAILABLE}
   [junit4]   2> 1167613 INFO  (jetty-closer-1897-thread-1) [    ] o.e.j.s.session Stopped scavenging
   [junit4]   2> 1167820 INFO  (zkConnectionManagerCallback-1915-thread-1-processing-n:127.0.0.1:57442_solr) [n:127.0.0.1:57442_solr    ] o.a.s.c.c.ConnectionManager zkClient has connected
   [junit4]   2> 1167821 INFO  (zkCallback-1914-thread-5-processing-n:127.0.0.1:57442_solr) [n:127.0.0.1:57442_solr    ] o.a.s.c.c.ZkStateReader Updated live nodes from ZooKeeper... (2) -> (1)
   [junit4]   2> 1167821 INFO  (zkCallback-1914-thread-1-processing-n:127.0.0.1:57442_solr) [n:127.0.0.1:57442_solr    ] o.a.s.c.OverseerElectionContext I am going to be the leader 127.0.0.1:57442_solr
   [junit4]   2> 1167822 INFO  (jetty-closer-1897-thread-2) [    ] o.a.s.c.ZkController Remove node as live in ZooKeeper:/live_nodes/127.0.0.1:57442_solr
   [junit4]   2> 1167823 INFO  (jetty-closer-1897-thread-2) [    ] o.a.s.m.SolrMetricManager Closing metric reporters for registry=solr.cluster, tag=null
   [junit4]   2> 1167823 INFO  (jetty-closer-1897-thread-2) [    ] o.a.s.c.TransientSolrCoreCacheDefault Allocating transient cache for 2147483647 transient cores
   [junit4]   2> 1167823 INFO  (zkCallback-1914-thread-5-processing-n:127.0.0.1:57442_solr) [n:127.0.0.1:57442_solr    ] o.a.s.c.c.ZkStateReader Updated live nodes from ZooKeeper... (1) -> (0)
   [junit4]   2> 1167825 ERROR (Thread[Thread-3651,5,TGRP-TestImpersonationWithHadoopAuth]) [n:127.0.0.1:57442_solr    ] o.a.h.s.t.d.AbstractDelegationTokenSecretManager ExpiredTokenRemover received java.lang.InterruptedException: sleep interrupted
   [junit4]   2> 1168055 INFO  (jetty-closer-1897-thread-2) [    ] o.e.j.s.h.ContextHandler Stopped o.e.j.s.ServletContextHandler@2c4a5f35{/solr,null,UNAVAILABLE}
   [junit4]   2> 1168056 INFO  (jetty-closer-1897-thread-2) [    ] o.e.j.s.session Stopped scavenging
   [junit4]   2> 1168057 ERROR (SUITE-TestImpersonationWithHadoopAuth-seed#[664B7BE5FCE5DCCD]-worker) [    ] o.a.z.s.ZooKeeperServer ZKShutdownHandler is not registered, so ZooKeeper server won't take any action on ERROR or SHUTDOWN server state changes
   [junit4]   2> 1168059 INFO  (SUITE-TestImpersonationWithHadoopAuth-seed#[664B7BE5FCE5DCCD]-worker) [    ] o.a.s.c.ZkTestServer connecting to 127.0.0.1:65167 65167
   [junit4]   2> 1173159 INFO  (Thread-3631) [    ] o.a.s.c.ZkTestServer connecting to 127.0.0.1:65167 65167
   [junit4]   2> 1173160 WARN  (Thread-3631) [    ] o.a.s.c.ZkTestServer Watch limit violations: 
   [junit4]   2> Maximum concurrent create/delete watches above limit:
   [junit4]   2> 
   [junit4]   2> 	3	/solr/aliases.json
   [junit4]   2> 	3	/solr/clusterprops.json
   [junit4]   2> 	2	/solr/security.json
   [junit4]   2> 
   [junit4]   2> Maximum concurrent data watches above limit:
   [junit4]   2> 
   [junit4]   2> 	3	/solr/security/zkdtsm/ZKDTSMRoot/ZKDTSMKeyIdRoot
   [junit4]   2> 	3	/solr/clusterstate.json
   [junit4]   2> 	2	/solr/security/zkdtsm/ZKDTSMRoot/ZKDTSMMasterKeyRoot/DK_1
   [junit4]   2> 	2	/solr/security/zkdtsm/ZKDTSMRoot/ZKDTSMMasterKeyRoot/DK_3
   [junit4]   2> 	2	/solr/security/zkdtsm/ZKDTSMRoot/ZKDTSMMasterKeyRoot/DK_2
   [junit4]   2> 	2	/solr/security/zkdtsm/ZKDTSMRoot/ZKDTSMMasterKeyRoot/DK_4
   [junit4]   2> 	2	/solr/security/zkdtsm/ZKDTSMRoot/ZKDTSMSeqNumRoot
   [junit4]   2> 
   [junit4]   2> Maximum concurrent children watches above limit:
   [junit4]   2> 
   [junit4]   2> 	3	/solr/live_nodes
   [junit4]   2> 	3	/solr/collections
   [junit4]   2> 	3	/solr/security/zkdtsm/ZKDTSMRoot/ZKDTSMTokensRoot
   [junit4]   2> 	2	/solr/security/zkdtsm/ZKDTSMRoot/ZKDTSMMasterKeyRoot
   [junit4]   2> 
   [junit4]   2> 1173160 INFO  (SUITE-TestImpersonationWithHadoopAuth-seed#[664B7BE5FCE5DCCD]-worker) [    ] o.a.s.SolrTestCaseJ4 ------------------------------------------------------- Done waiting for tracked resources to be released
   [junit4]   2> Feb 22, 2018 7:49:41 AM com.carrotsearch.randomizedtesting.ThreadLeakControl checkThreadLeaks
   [junit4]   2> WARNING: Will linger awaiting termination of 1 leaked thread(s).
   [junit4]   2> Feb 22, 2018 7:50:01 AM com.carrotsearch.randomizedtesting.ThreadLeakControl checkThreadLeaks
   [junit4]   2> SEVERE: 1 thread leaked from SUITE scope at org.apache.solr.security.hadoop.TestImpersonationWithHadoopAuth: 
   [junit4]   2>    1) Thread[id=9893, name=jetty-launcher-1896-thread-2-EventThread, state=TIMED_WAITING, group=TGRP-TestImpersonationWithHadoopAuth]
   [junit4]   2>         at sun.misc.Unsafe.park(Native Method)
   [junit4]   2>         at java.util.concurrent.locks.LockSupport.parkNanos(LockSupport.java:215)
   [junit4]   2>         at java.util.concurrent.locks.AbstractQueuedSynchronizer.doAcquireSharedNanos(AbstractQueuedSynchronizer.java:1037)
   [junit4]   2>         at java.util.concurrent.locks.AbstractQueuedSynchronizer.tryAcquireSharedNanos(AbstractQueuedSynchronizer.java:1328)
   [junit4]   2>         at java.util.concurrent.CountDownLatch.await(CountDownLatch.java:277)
   [junit4]   2>         at org.apache.curator.CuratorZookeeperClient.internalBlockUntilConnectedOrTimedOut(CuratorZookeeperClient.java:323)
   [junit4]   2>         at org.apache.curator.RetryLoop.callWithRetry(RetryLoop.java:105)
   [junit4]   2>         at org.apache.curator.framework.imps.GetDataBuilderImpl.pathInForeground(GetDataBuilderImpl.java:288)
   [junit4]   2>         at org.apache.curator.framework.imps.GetDataBuilderImpl.forPath(GetDataBuilderImpl.java:279)
   [junit4]   2>         at org.apache.curator.framework.imps.GetDataBuilderImpl.forPath(GetDataBuilderImpl.java:41)
   [junit4]   2>         at org.apache.curator.framework.recipes.shared.SharedValue.readValue(SharedValue.java:244)
   [junit4]   2>         at org.apache.curator.framework.recipes.shared.SharedValue.access$100(SharedValue.java:44)
   [junit4]   2>         at org.apache.curator.framework.recipes.shared.SharedValue$1.process(SharedValue.java:61)
   [junit4]   2>         at org.apache.curator.framework.imps.NamespaceWatcher.process(NamespaceWatcher.java:67)
   [junit4]   2>         at org.apache.zookeeper.ClientCnxn$EventThread.processEvent(ClientCnxn.java:531)
   [junit4]   2>         at org.apache.zookeeper.ClientCnxn$EventThread.run(ClientCnxn.java:506)
   [junit4]   2> Feb 22, 2018 7:50:01 AM com.carrotsearch.randomizedtesting.ThreadLeakControl tryToInterruptAll
   [junit4]   2> INFO: Starting to interrupt leaked threads:
   [junit4]   2>    1) Thread[id=9893, name=jetty-launcher-1896-thread-2-EventThread, state=TIMED_WAITING, group=TGRP-TestImpersonationWithHadoopAuth]
   [junit4]   2> 1193258 ERROR (jetty-launcher-1896-thread-2-EventThread) [n:127.0.0.1:57442_solr    ] o.a.c.f.i.CuratorFrameworkImpl Watcher exception
   [junit4]   2> java.lang.InterruptedException
   [junit4]   2> 	at java.util.concurrent.locks.AbstractQueuedSynchronizer.doAcquireSharedNanos(AbstractQueuedSynchronizer.java:1039)
   [junit4]   2> 	at java.util.concurrent.locks.AbstractQueuedSynchronizer.tryAcquireSharedNanos(AbstractQueuedSynchronizer.java:1328)
   [junit4]   2> 	at java.util.concurrent.CountDownLatch.await(CountDownLatch.java:277)
   [junit4]   2> 	at org.apache.curator.CuratorZookeeperClient.internalBlockUntilConnectedOrTimedOut(CuratorZookeeperClient.java:323)
   [junit4]   2> 	at org.apache.curator.RetryLoop.callWithRetry(RetryLoop.java:105)
   [junit4]   2> 	at org.apache.curator.framework.imps.GetDataBuilderImpl.pathInForeground(GetDataBuilderImpl.java:288)
   [junit4]   2> 	at org.apache.curator.framework.imps.GetDataBuilderImpl.forPath(GetDataBuilderImpl.java:279)
   [junit4]   2> 	at org.apache.curator.framework.imps.GetDataBuilderImpl.forPath(GetDataBuilderImpl.java:41)
   [junit4]   2> 	at org.apache.curator.framework.recipes.shared.SharedValue.readValue(SharedValue.java:244)
   [junit4]   2> 	at org.apache.curator.framework.recipes.shared.SharedValue.access$100(SharedValue.java:44)
   [junit4]   2> 	at org.apache.curator.framework.recipes.shared.SharedValue$1.process(SharedValue.java:61)
   [junit4]   2> 	at org.apache.curator.framework.imps.NamespaceWatcher.process(NamespaceWatcher.java:67)
   [junit4]   2> 	at org.apache.zookeeper.ClientCnxn$EventThread.processEvent(ClientCnxn.java:531)
   [junit4]   2> 	at org.apache.zookeeper.ClientCnxn$EventThread.run(ClientCnxn.java:506)
   [junit4]   2> Feb 22, 2018 7:50:01 AM com.carrotsearch.randomizedtesting.ThreadLeakControl tryToInterruptAll
   [junit4]   2> INFO: All leaked threads terminated.
   [junit4]   2> NOTE: test params are: codec=Asserting(Lucene70): {}, docValues:{}, maxPointsInLeafNode=1203, maxMBSortInHeap=5.987098023249644, sim=RandomSimilarity(queryNorm=true): {}, locale=id, timezone=US/Aleutian
   [junit4]   2> NOTE: SunOS 5.11 amd64/Oracle Corporation 1.8.0_152 (64-bit)/cpus=3,threads=1,free=30673680,total=427352064
   [junit4]   2> NOTE: All tests run in this JVM: [JsonLoaderTest, TestCrossCoreJoin, TestSubQueryTransformer, TestCoreDiscovery, TestDynamicFieldCollectionResource, TestWordDelimiterFilterFactory, TestOverriddenPrefixQueryForCustomFieldType, TestDirectoryFactory, UpdateParamsTest, TestRandomDVFaceting, TestRTGBase, TestManagedSynonymGraphFilterFactory, TestSizeLimitedDistributedMap, DistanceUnitsTest, TestIndexingPerformance, TestExactStatsCache, TestDFRSimilarityFactory, BlobRepositoryCloudTest, HdfsRecoveryZkTest, ReplicaListTransformerTest, CoreSorterTest, TestLegacyFieldReuse, TestQuerySenderListener, VMParamsZkACLAndCredentialsProvidersTest, TestPayloadScoreQParserPlugin, UninvertDocValuesMergePolicyTest, TestCloudInspectUtil, TestFastWriter, URLClassifyProcessorTest, TestCSVLoader, FullSolrCloudDistribCmdsTest, TestInPlaceUpdatesStandalone, SubstringBytesRefFilterTest, EchoParamsTest, DeleteLastCustomShardedReplicaTest, TestSha256AuthenticationProvider, SchemaApiFailureTest, TestTlogReplica, TestConfigSetsAPIExclusivity, SuggesterWFSTTest, TestIntervalFaceting, FieldAnalysisRequestHandlerTest, ZkStateWriterTest, TestReloadDeadlock, TestDocSet, TestFieldSortValues, TestSimpleQParserPlugin, HdfsChaosMonkeyNothingIsSafeTest, AutoAddReplicasPlanActionTest, DOMUtilTest, SuggesterTest, ChaosMonkeySafeLeaderWithPullReplicasTest, SuggestComponentTest, TestSolrFieldCacheBean, TestFieldCacheSort, TestCollapseQParserPlugin, TestMacroExpander, RuleEngineTest, CheckHdfsIndexTest, NodeLostTriggerTest, DocExpirationUpdateProcessorFactoryTest, BooleanFieldTest, AnalyticsQueryTest, MetricTriggerTest, AddBlockUpdateTest, ClassificationUpdateProcessorFactoryTest, DocValuesTest, SolrCoreCheckLockOnStartupTest, TestConfigSetProperties, TestJettySolrRunner, MigrateRouteKeyTest, TestConfigsApi, V2ApiIntegrationTest, OverseerTest, TestReRankQParserPlugin, TestNamedUpdateProcessors, TestStressRecovery, TestNumericTokenStream, SolrSlf4jReporterTest, BlockJoinFacetRandomTest, SolrCmdDistributorTest, CollectionStateFormat2Test, TestRTimerTree, TestAtomicUpdateErrorCases, TermVectorComponentTest, PrimUtilsTest, ResponseHeaderTest, TestSolrCloudWithDelegationTokens, CdcrVersionReplicationTest, TestFieldTypeCollectionResource, SpellPossibilityIteratorTest, TestExportWriter, ComputePlanActionTest, CircularListTest, HdfsAutoAddReplicasIntegrationTest, TestSolrCoreProperties, TestLegacyFieldCache, TestImpersonationWithHadoopAuth]
   [junit4]   2> NOTE: reproduce with: ant test  -Dtestcase=TestImpersonationWithHadoopAuth -Dtests.seed=664B7BE5FCE5DCCD -Dtests.slow=true -Dtests.locale=id -Dtests.timezone=US/Aleutian -Dtests.asserts=true -Dtests.file.encoding=UTF-8
   [junit4] ERROR   0.00s J1 | TestImpersonationWithHadoopAuth (suite) <<<
   [junit4]    > Throwable #1: com.carrotsearch.randomizedtesting.ThreadLeakError: 1 thread leaked from SUITE scope at org.apache.solr.security.hadoop.TestImpersonationWithHadoopAuth: 
   [junit4]    >    1) Thread[id=9893, name=jetty-launcher-1896-thread-2-EventThread, state=TIMED_WAITING, group=TGRP-TestImpersonationWithHadoopAuth]
   [junit4]    >         at sun.misc.Unsafe.park(Native Method)
   [junit4]    >         at java.util.concurrent.locks.LockSupport.parkNanos(LockSupport.java:215)
   [junit4]    >         at java.util.concurrent.locks.AbstractQueuedSynchronizer.doAcquireSharedNanos(AbstractQueuedSynchronizer.java:1037)
   [junit4]    >         at java.util.concurrent.locks.AbstractQueuedSynchronizer.tryAcquireSharedNanos(AbstractQueuedSynchronizer.java:1328)
   [junit4]    >         at java.util.concurrent.CountDownLatch.await(CountDownLatch.java:277)
   [junit4]    >         at org.apache.curator.CuratorZookeeperClient.internalBlockUntilConnectedOrTimedOut(CuratorZookeeperClient.java:323)
   [junit4]    >         at org.apache.curator.RetryLoop.callWithRetry(RetryLoop.java:105)
   [junit4]    >         at org.apache.curator.framework.imps.GetDataBuilderImpl.pathInForeground(GetDataBuilderImpl.java:288)
   [junit4]    >         at org.apache.curator.framework.imps.GetDataBuilderImpl.forPath(GetDataBuilderImpl.java:279)
   [junit4]    >         at org.apache.curator.framework.imps.GetDataBuilderImpl.forPath(GetDataBuilderImpl.java:41)
   [junit4]    >         at org.apache.curator.framework.recipes.shared.SharedValue.readValue(SharedValue.java:244)
   [junit4]    >         at org.apache.curator.framework.recipes.shared.SharedValue.access$100(SharedValue.java:44)
   [junit4]    >         at org.apache.curator.framework.recipes.shared.SharedValue$1.process(SharedValue.java:61)
   [junit4]    >         at org.apache.curator.framework.imps.NamespaceWatcher.process(NamespaceWatcher.java:67)
   [junit4]    >         at org.apache.zookeeper.ClientCnxn$EventThread.processEvent(ClientCnxn.java:531)
   [junit4]    >         at org.apache.zookeeper.ClientCnxn$EventThread.run(ClientCnxn.java:506)
   [junit4]    > 	at __randomizedtesting.SeedInfo.seed([664B7BE5FCE5DCCD]:0)
   [junit4] Completed [223/777 (1!)] on J1 in 43.51s, 10 tests, 1 error, 1 skipped <<< FAILURES!

[...truncated 1116 lines...]
   [junit4] Suite: org.apache.solr.cloud.TestSolrCloudWithSecureImpersonation
   [junit4]   2> Creating dataDir: /export/home/jenkins/workspace/Lucene-Solr-7.x-Solaris/solr/build/solr-core/test/J0/temp/solr.cloud.TestSolrCloudWithSecureImpersonation_664B7BE5FCE5DCCD-001/init-core-data-001
   [junit4]   2> 3500155 WARN  (SUITE-TestSolrCloudWithSecureImpersonation-seed#[664B7BE5FCE5DCCD]-worker) [    ] o.a.s.SolrTestCaseJ4 startTrackingSearchers: numOpens=12 numCloses=12
   [junit4]   2> 3500156 INFO  (SUITE-TestSolrCloudWithSecureImpersonation-seed#[664B7BE5FCE5DCCD]-worker) [    ] o.a.s.SolrTestCaseJ4 Using TrieFields (NUMERIC_POINTS_SYSPROP=false) w/NUMERIC_DOCVALUES_SYSPROP=false
   [junit4]   2> 3500157 INFO  (SUITE-TestSolrCloudWithSecureImpersonation-seed#[664B7BE5FCE5DCCD]-worker) [    ] o.a.s.SolrTestCaseJ4 Randomized ssl (true) and clientAuth (false) via: @org.apache.solr.util.RandomizeSSL(reason=, value=NaN, ssl=NaN, clientAuth=NaN)
   [junit4]   2> 3500157 INFO  (SUITE-TestSolrCloudWithSecureImpersonation-seed#[664B7BE5FCE5DCCD]-worker) [    ] o.a.s.SolrTestCaseJ4 SecureRandom sanity checks: test.solr.allowed.securerandom=null & java.security.egd=file:/dev/./urandom
   [junit4]   2> 3500186 INFO  (SUITE-TestSolrCloudWithSecureImpersonation-seed#[664B7BE5FCE5DCCD]-worker) [    ] o.a.s.c.MiniSolrCloudCluster Starting cluster of 2 servers in /export/home/jenkins/workspace/Lucene-Solr-7.x-Solaris/solr/build/solr-core/test/J0/temp/solr.cloud.TestSolrCloudWithSecureImpersonation_664B7BE5FCE5DCCD-001/tempDir-001
   [junit4]   2> 3500186 INFO  (SUITE-TestSolrCloudWithSecureImpersonation-seed#[664B7BE5FCE5DCCD]-worker) [    ] o.a.s.c.ZkTestServer STARTING ZK TEST SERVER
   [junit4]   2> 3500187 INFO  (Thread-9060) [    ] o.a.s.c.ZkTestServer client port:0.0.0.0/0.0.0.0:0
   [junit4]   2> 3500187 INFO  (Thread-9060) [    ] o.a.s.c.ZkTestServer Starting server
   [junit4]   2> 3500188 ERROR (Thread-9060) [    ] o.a.z.s.ZooKeeperServer ZKShutdownHandler is not registered, so ZooKeeper server won't take any action on ERROR or SHUTDOWN server state changes
   [junit4]   2> 3500287 INFO  (SUITE-TestSolrCloudWithSecureImpersonation-seed#[664B7BE5FCE5DCCD]-worker) [    ] o.a.s.c.ZkTestServer start zk server on port:44552
   [junit4]   2> 3500289 INFO  (zkConnectionManagerCallback-8337-thread-1) [    ] o.a.s.c.c.ConnectionManager zkClient has connected
   [junit4]   2> 3500294 INFO  (jetty-launcher-8334-thread-1) [    ] o.e.j.s.Server jetty-9.4.8.v20171121, build timestamp: 2017-11-21T23:27:37+02:00, git hash: 82b8fb23f757335bb3329d540ce37a2a2615f0a8
   [junit4]   2> 3500294 INFO  (jetty-launcher-8334-thread-2) [    ] o.e.j.s.Server jetty-9.4.8.v20171121, build timestamp: 2017-11-21T23:27:37+02:00, git hash: 82b8fb23f757335bb3329d540ce37a2a2615f0a8
   [junit4]   2> 3500313 INFO  (jetty-launcher-8334-thread-1) [    ] o.e.j.s.session DefaultSessionIdManager workerName=node0
   [junit4]   2> 3500313 INFO  (jetty-launcher-8334-thread-1) [    ] o.e.j.s.session No SessionScavenger set, using defaults
   [junit4]   2> 3500313 INFO  (jetty-launcher-8334-thread-1) [    ] o.e.j.s.session Scavenging every 600000ms
   [junit4]   2> 3500313 INFO  (jetty-launcher-8334-thread-2) [    ] o.e.j.s.session DefaultSessionIdManager workerName=node0
   [junit4]   2> 3500313 INFO  (jetty-launcher-8334-thread-2) [    ] o.e.j.s.session No SessionScavenger set, using defaults
   [junit4]   2> 3500313 INFO  (jetty-launcher-8334-thread-2) [    ] o.e.j.s.session Scavenging every 600000ms
   [junit4]   2> 3500313 INFO  (jetty-launcher-8334-thread-1) [    ] o.e.j.s.h.ContextHandler Started o.e.j.s.ServletContextHandler@75efc18{/solr,null,AVAILABLE}
   [junit4]   2> 3500313 INFO  (jetty-launcher-8334-thread-2) [    ] o.e.j.s.h.ContextHandler Started o.e.j.s.ServletContextHandler@4e70b88d{/solr,null,AVAILABLE}
   [junit4]   2> 3500314 INFO  (jetty-launcher-8334-thread-1) [    ] o.e.j.s.AbstractConnector Started ServerConnector@47983774{SSL,[ssl, http/1.1]}{127.0.0.1:58744}
   [junit4]   2> 3500314 INFO  (jetty-launcher-8334-thread-1) [    ] o.e.j.s.Server Started @3506852ms
   [junit4]   2> 3500314 INFO  (jetty-launcher-8334-thread-1) [    ] o.a.s.c.s.e.JettySolrRunner Jetty properties: {hostContext=/solr, hostPort=58744}
   [junit4]   2> 3500314 ERROR (jetty-launcher-8334-thread-1) [    ] o.a.s.u.StartupLoggingUtils Missing Java Option solr.log.dir. Logging may be missing or incomplete.
   [junit4]   2> 3500314 INFO  (jetty-launcher-8334-thread-1) [    ] o.a.s.s.SolrDispatchFilter  ___      _       Welcome to Apache Solr™ version 7.3.0
   [junit4]   2> 3500314 INFO  (jetty-launcher-8334-thread-1) [    ] o.a.s.s.SolrDispatchFilter / __| ___| |_ _   Starting in cloud mode on port null
   [junit4]   2> 3500314 INFO  (jetty-launcher-8334-thread-1) [    ] o.a.s.s.SolrDispatchFilter \__ \/ _ \ | '_|  Install dir: null
   [junit4]   2> 3500314 INFO  (jetty-launcher-8334-thread-1) [    ] o.a.s.s.SolrDispatchFilter |___/\___/_|_|    Start time: 2018-02-22T08:28:28.660Z
   [junit4]   2> 3500315 INFO  (jetty-launcher-8334-thread-2) [    ] o.e.j.s.AbstractConnector Started ServerConnector@2a89fbb6{SSL,[ssl, http/1.1]}{127.0.0.1:45966}
   [junit4]   2> 3500315 INFO  (jetty-launcher-8334-thread-2) [    ] o.e.j.s.Server Started @3506854ms
   [junit4]   2> 3500315 INFO  (jetty-launcher-8334-thread-2) [    ] o.a.s.c.s.e.JettySolrRunner Jetty properties: {hostContext=/solr, hostPort=45966}
   [junit4]   2> 3500316 ERROR (jetty-launcher-8334-thread-2) [    ] o.a.s.u.StartupLoggingUtils Missing Java Option solr.log.dir. Logging may be missing or incomplete.
   [junit4]   2> 3500316 INFO  (jetty-launcher-8334-thread-2) [    ] o.a.s.s.SolrDispatchFilter  ___      _       Welcome to Apache Solr™ version 7.3.0
   [junit4]   2> 3500316 INFO  (jetty-launcher-8334-thread-2) [    ] o.a.s.s.SolrDispatchFilter / __| ___| |_ _   Starting in cloud mode on port null
   [junit4]   2> 3500316 INFO  (jetty-launcher-8334-thread-2) [    ] o.a.s.s.SolrDispatchFilter \__ \/ _ \ | '_|  Install dir: null
   [junit4]   2> 3500316 INFO  (jetty-launcher-8334-thread-2) [    ] o.a.s.s.SolrDispatchFilter |___/\___/_|_|    Start time: 2018-02-22T08:28:28.662Z
   [junit4]   2> 3500318 INFO  (zkConnectionManagerCallback-8339-thread-1) [    ] o.a.s.c.c.ConnectionManager zkClient has connected
   [junit4]   2> 3500318 INFO  (zkConnectionManagerCallback-8341-thread-1) [    ] o.a.s.c.c.ConnectionManager zkClient has connected
   [junit4]   2> 3500318 INFO  (jetty-launcher-8334-thread-1) [    ] o.a.s.s.SolrDispatchFilter solr.xml found in ZooKeeper. Loading...
   [junit4]   2> 3500318 INFO  (jetty-launcher-8334-thread-2) [    ] o.a.s.s.SolrDispatchFilter solr.xml found in ZooKeeper. Loading...
   [junit4]   2> 3500327 INFO  (jetty-launcher-8334-thread-1) [    ] o.a.s.c.ZkContainer Zookeeper client=127.0.0.1:44552/solr
   [junit4]   2> 3500327 INFO  (jetty-launcher-8334-thread-2) [    ] o.a.s.c.ZkContainer Zookeeper client=127.0.0.1:44552/solr
   [junit4]   2> 3500328 INFO  (zkConnectionManagerCallback-8349-thread-1) [    ] o.a.s.c.c.ConnectionManager zkClient has connected
   [junit4]   2> 3500329 INFO  (zkConnectionManagerCallback-8347-thread-1) [    ] o.a.s.c.c.ConnectionManager zkClient has connected
   [junit4]   2> 3500331 INFO  (zkConnectionManagerCallback-8352-thread-1-processing-n:127.0.0.1:58744_solr) [n:127.0.0.1:58744_solr    ] o.a.s.c.c.ConnectionManager zkClient has connected
   [junit4]   2> 3500332 INFO  (zkConnectionManagerCallback-8353-thread-1-processing-n:127.0.0.1:45966_solr) [n:127.0.0.1:45966_solr    ] o.a.s.c.c.ConnectionManager zkClient has connected
   [junit4]   2> 3500439 INFO  (jetty-launcher-8334-thread-2) [n:127.0.0.1:45966_solr    ] o.a.s.c.Overseer Overseer (id=null) closing
   [junit4]   2> 3500440 INFO  (jetty-launcher-8334-thread-2) [n:127.0.0.1:45966_solr    ] o.a.s.c.OverseerElectionContext I am going to be the leader 127.0.0.1:45966_solr
   [junit4]   2> 3500441 INFO  (jetty-launcher-8334-thread-2) [n:127.0.0.1:45966_solr    ] o.a.s.c.Overseer Overseer (id=72241461333852166-127.0.0.1:45966_solr-n_0000000000) starting
   [junit4]   2> 3500450 INFO  (jetty-launcher-8334-thread-2) [n:127.0.0.1:45966_solr    ] o.a.s.c.ZkController Register node as live in ZooKeeper:/live_nodes/127.0.0.1:45966_solr
   [junit4]   2> 3500455 INFO  (OverseerStateUpdate-72241461333852166-127.0.0.1:45966_solr-n_0000000000) [n:127.0.0.1:45966_solr    ] o.a.s.c.c.ZkStateReader Updated live nodes from ZooKeeper... (0) -> (1)
   [junit4]   2> 3500516 INFO  (jetty-launcher-8334-thread-2) [n:127.0.0.1:45966_solr    ] o.a.s.c.CoreContainer Initializing authentication plugin: org.apache.solr.security.HttpParamDelegationTokenPlugin
   [junit4]   2> 3500525 WARN  (jetty-launcher-8334-thread-2) [n:127.0.0.1:45966_solr    ] o.a.s.c.s.i.Krb5HttpClientBuilder org.apache.solr.client.solrj.impl.Krb5HttpClientBuilder is configured without specifying system property 'java.security.auth.login.config'
   [junit4]   2> 3500533 INFO  (jetty-launcher-8334-thread-2) [n:127.0.0.1:45966_solr    ] o.a.s.s.KerberosPlugin Params: {solr.kerberos.impersonator.user.noGroups.hosts=*, solr.kerberos.impersonator.user.bogusGroup.groups=__some_bogus_group, token.valid=30, cookie.domain=127.0.0.1, solr.kerberos.impersonator.user.anyHostAnyUser.groups=*, solr.kerberos.impersonator.user.bogusGroup.hosts=*, solr.kerberos.impersonator.user.anyHostAnyUser.hosts=*, token.validity=36000, solr.kerberos.impersonator.user.noHosts.groups=*, type=kerberos, solr.kerberos.impersonator.user.localHostAnyGroup.groups=*, delegation-token.token-kind=solr-dt, solr.kerberos.impersonator.user.wrongHost.hosts=1.1.1.1.1.1, cookie.path=/, zk-dt-secret-manager.znodeWorkingPath=solr/security/zkdtsm, solr.kerberos.impersonator.user.localHostAnyGroup.hosts=serv1-vm3,localhost,127.0.0.1, signer.secret.provider.zookeeper.path=/token, solr.kerberos.impersonator.user.anyHostUsersGroup.groups=staff, zk-dt-secret-manager.enable=true, solr.kerberos.impersonator.user.wrongHost.groups=*, kerberos.name.rules=DEFAULT, signer.secret.provider=zookeeper, solr.kerberos.impersonator.user.anyHostUsersGroup.hosts=*}
   [junit4]   2> 3500543 INFO  (jetty-launcher-8334-thread-1) [n:127.0.0.1:58744_solr    ] o.a.s.c.c.ZkStateReader Updated live nodes from ZooKeeper... (0) -> (1)
   [junit4]   2> 3500579 INFO  (jetty-launcher-8334-thread-1) [n:127.0.0.1:58744_solr    ] o.a.s.c.Overseer Overseer (id=null) closing
   [junit4]   2> 3500585 INFO  (jetty-launcher-8334-thread-1) [n:127.0.0.1:58744_solr    ] o.a.s.c.ZkController Register node as live in ZooKeeper:/live_nodes/127.0.0.1:58744_solr
   [junit4]   2> 3500587 INFO  (zkCallback-8351-thread-1-processing-n:127.0.0.1:45966_solr) [n:127.0.0.1:45966_solr    ] o.a.s.c.c.ZkStateReader Updated live nodes from ZooKeeper... (1) -> (2)
   [junit4]   2> 3500588 INFO  (zkCallback-8350-thread-1-processing-n:127.0.0.1:58744_solr) [n:127.0.0.1:58744_solr    ] o.a.s.c.c.ZkStateReader Updated live nodes from ZooKeeper... (1) -> (2)
   [junit4]   2> 3500613 INFO  (jetty-launcher-8334-thread-2) [n:127.0.0.1:45966_solr    ] o.a.c.f.i.CuratorFrameworkImpl Starting
   [junit4]   2> 3500629 INFO  (jetty-launcher-8334-thread-1) [n:127.0.0.1:58744_solr    ] o.a.s.c.CoreContainer Initializing authentication plugin: org.apache.solr.security.HttpParamDelegationTokenPlugin
   [junit4]   2> 3500629 WARN  (jetty-launcher-8334-thread-1) [n:127.0.0.1:58744_solr    ] o.a.s.c.s.i.Krb5HttpClientBuilder org.apache.solr.client.solrj.impl.Krb5HttpClientBuilder is configured without specifying system property 'java.security.auth.login.config'
   [junit4]   2> 3500630 INFO  (jetty-launcher-8334-thread-1) [n:127.0.0.1:58744_solr    ] o.a.s.s.KerberosPlugin Params: {solr.kerberos.impersonator.user.noGroups.hosts=*, solr.kerberos.impersonator.user.bogusGroup.groups=__some_bogus_group, token.valid=30, cookie.domain=127.0.0.1, solr.kerberos.impersonator.user.anyHostAnyUser.groups=*, solr.kerberos.impersonator.user.bogusGroup.hosts=*, solr.kerberos.impersonator.user.anyHostAnyUser.hosts=*, token.validity=36000, solr.kerberos.impersonator.user.noHosts.groups=*, type=kerberos, solr.kerberos.impersonator.user.localHostAnyGroup.groups=*, delegation-token.token-kind=solr-dt, solr.kerberos.impersonator.user.wrongHost.hosts=1.1.1.1.1.1, cookie.path=/, zk-dt-secret-manager.znodeWorkingPath=solr/security/zkdtsm, solr.kerberos.impersonator.user.localHostAnyGroup.hosts=serv1-vm3,localhost,127.0.0.1, signer.secret.provider.zookeeper.path=/token, solr.kerberos.impersonator.user.anyHostUsersGroup.groups=staff, zk-dt-secret-manager.enable=true, solr.kerberos.impersonator.user.wrongHost.groups=*, kerberos.name.rules=DEFAULT, signer.secret.provider=zookeeper, solr.kerberos.impersonator.user.anyHostUsersGroup.hosts=*}
   [junit4]   2> 3500644 INFO  (jetty-launcher-8334-thread-1) [n:127.0.0.1:58744_solr    ] o.a.c.f.i.CuratorFrameworkImpl Starting
   [junit4]   2> 3500670 INFO  (jetty-launcher-8334-thread-1-EventThread) [n:127.0.0.1:58744_solr    ] o.a.c.f.s.ConnectionStateManager State change: CONNECTED
   [junit4]   2> 3500670 INFO  (jetty-launcher-8334-thread-2-EventThread) [n:127.0.0.1:45966_solr    ] o.a.c.f.s.ConnectionStateManager State change: CONNECTED
   [junit4]   2> 3501793 WARN  (jetty-launcher-8334-thread-2) [n:127.0.0.1:45966_solr    ] o.a.s.c.s.i.Krb5HttpClientBuilder org.apache.solr.client.solrj.impl.Krb5HttpClientBuilder is configured without specifying system property 'java.security.auth.login.config'
   [junit4]   2> 3501794 WARN  (jetty-launcher-8334-thread-1) [n:127.0.0.1:58744_solr    ] o.a.s.c.s.i.Krb5HttpClientBuilder org.apache.solr.client.solrj.impl.Krb5HttpClientBuilder is configured without specifying system property 'java.security.auth.login.config'
   [junit4]   2> 3501839 INFO  (jetty-launcher-8334-thread-2) [n:127.0.0.1:45966_solr    ] o.a.s.m.r.SolrJmxReporter JMX monitoring for 'solr_45966.solr.node' (registry 'solr.node') enabled at server: com.sun.jmx.mbeanserver.JmxMBeanServer@6329caff
   [junit4]   2> 3501844 INFO  (jetty-launcher-8334-thread-1) [n:127.0.0.1:58744_solr    ] o.a.s.m.r.SolrJmxReporter JMX monitoring for 'solr_58744.solr.node' (registry 'solr.node') enabled at server: com.sun.jmx.mbeanserver.JmxMBeanServer@6329caff
   [junit4]   2> 3501848 INFO  (jetty-launcher-8334-thread-2) [n:127.0.0.1:45966_solr    ] o.a.s.m.r.SolrJmxReporter JMX monitoring for 'solr_45966.solr.jvm' (registry 'solr.jvm') enabled at server: com.sun.jmx.mbeanserver.JmxMBeanServer@6329caff
   [junit4]   2> 3501849 INFO  (jetty-launcher-8334-thread-2) [n:127.0.0.1:45966_solr    ] o.a.s.m.r.SolrJmxReporter JMX monitoring for 'solr_45966.solr.jetty' (registry 'solr.jetty') enabled at server: com.sun.jmx.mbeanserver.JmxMBeanServer@6329caff
   [junit4]   2> 3501850 INFO  (jetty-launcher-8334-thread-2) [n:127.0.0.1:45966_solr    ] o.a.s.c.CorePropertiesLocator Found 0 core definitions underneath /export/home/jenkins/workspace/Lucene-Solr-7.x-Solaris/solr/build/solr-core/test/J0/temp/solr.cloud.TestSolrCloudWithSecureImpersonation_664B7BE5FCE5DCCD-001/tempDir-001/node2/.
   [junit4]   2> 3501854 INFO  (jetty-launcher-8334-thread-1) [n:127.0.0.1:58744_solr    ] o.a.s.m.r.SolrJmxReporter JMX monitoring for 'solr_58744.solr.jvm' (registry 'solr.jvm') enabled at server: com.sun.jmx.mbeanserver.JmxMBeanServer@6329caff
   [junit4]   2> 3501854 INFO  (jetty-launcher-8334-thread-1) [n:127.0.0.1:58744_solr    ] o.a.s.m.r.SolrJmxReporter JMX monitoring for 'solr_58744.solr.jetty' (registry 'solr.jetty') enabled at server: com.sun.jmx.mbeanserver.JmxMBeanServer@6329caff
   [junit4]   2> 3501855 INFO  (jetty-launcher-8334-thread-1) [n:127.0.0.1:58744_solr    ] o.a.s.c.CorePropertiesLocator Found 0 core definitions underneath /export/home/jenkins/workspace/Lucene-Solr-7.x-Solaris/solr/build/solr-core/test/J0/temp/solr.cloud.TestSolrCloudWithSecureImpersonation_664B7BE5FCE5DCCD-001/tempDir-001/node1/.
   [junit4]   2> 3501903 INFO  (zkConnectionManagerCallback-8359-thread-1) [    ] o.a.s.c.c.ConnectionManager zkClient has connected
   [junit4]   2> 3501932 INFO  (TEST-TestSolrCloudWithSecureImpersonation.testProxyInvalidGroup-seed#[664B7BE5FCE5DCCD]) [    ] o.a.s.SolrTestCaseJ4 ###Starting testProxyInvalidGroup
   [junit4]   2> 3502002 WARN  (qtp1999082171-35861) [    ] o.a.h.s.ShellBasedUnixGroupsMapping got exception trying to get groups for user bar: id: invalid user name: "bar"
   [junit4]   2> id: invalid user name: "bar"
   [junit4]   2> 
   [junit4]   2> 3502021 WARN  (TEST-TestSolrCloudWithSecureImpersonation.testProxyInvalidGroup-seed#[664B7BE5FCE5DCCD]) [    ] o.a.h.c.p.ResponseProcessCookies Invalid cookie header: "Set-Cookie: hadoop.auth="u=bogusGroup&p=bogusGroup&t=test&e=1519324110314&s=m2HrKJsFIwmZA/sERLK5XPJaUis="; Path=/; Domain=127.0.0.1; Expires= , 22-   -2018 18:28:30 GMT; Secure; HttpOnly". Invalid 'expires' attribute: , 22- -2018 18:28:30 GMT
   [junit4]   2> 3502021 INFO  (TEST-TestSolrCloudWithSecureImpersonation.testProxyInvalidGroup-seed#[664B7BE5FCE5DCCD]) [    ] o.a.s.SolrTestCaseJ4 ###Ending testProxyInvalidGroup
   [junit4]   2> 3502046 INFO  (TEST-TestSolrCloudWithSecureImpersonation.testProxyNullProxyUser-seed#[664B7BE5FCE5DCCD]) [    ] o.a.s.SolrTestCaseJ4 ###Starting testProxyNullProxyUser
   [junit4]   2> 3502046 INFO  (qtp1999082171-35864) [    ] o.a.s.s.SolrDispatchFilter Error authenticating
   [junit4]   2> java.lang.IllegalArgumentException: userName is NULL, empty or contains a '&'
   [junit4]   2> 	at org.apache.hadoop.security.authentication.util.AuthToken.checkForIllegalArgument(AuthToken.java:87)
   [junit4]   2> 	at org.apache.hadoop.security.authentication.util.AuthToken.<init>(AuthToken.java:70)
   [junit4]   2> 	at org.apache.hadoop.security.authentication.server.AuthenticationToken.<init>(AuthenticationToken.java:58)
   [junit4]   2> 	at org.apache.solr.security.HttpParamDelegationTokenPlugin$HttpParamDelegationTokenAuthenticationHandler$HttpParamAuthenticationHandler.authenticate(HttpParamDelegationTokenPlugin.java:213)
   [junit4]   2> 	at org.apache.hadoop.security.token.delegation.web.DelegationTokenAuthenticationHandler.authenticate(DelegationTokenAuthenticationHandler.java:348)
   [junit4]   2> 	at org.apache.solr.security.RequestContinuesRecorderAuthenticationHandler.authenticate(RequestContinuesRecorderAuthenticationHandler.java:69)
   [junit4]   2> 	at org.apache.hadoop.security.authentication.server.AuthenticationFilter.doFilter(AuthenticationFilter.java:518)
   [junit4]   2> 	at org.apache.solr.security.DelegationTokenKerberosFilter.doFilter(DelegationTokenKerberosFilter.java:134)
   [junit4]   2> 	at org.apache.solr.security.HttpParamDelegationTokenPlugin$HttpParamToRequestFilter.doFilter(HttpParamDelegationTokenPlugin.java:245)
   [junit4]   2> 	at org.apache.solr.security.KerberosPlugin.doAuthenticate(KerberosPlugin.java:243)
   [junit4]   2> 	at org.apache.solr.servlet.SolrDispatchFilter.authenticateRequest(SolrDispatchFilter.java:454)
   [junit4]   2> 	at org.apache.solr.servlet.SolrDispatchFilter.doFilter(SolrDispatchFilter.java:349)
   [junit4]   2> 	at org.apache.solr.servlet.SolrDispatchFilter.doFilter(SolrDispatchFilter.java:326)
   [junit4]   2> 	at org.eclipse.jetty.servlet.ServletHandler$CachedChain.doFilter(ServletHandler.java:1637)
   [junit4]   2> 	at org.apache.solr.client.solrj.embedded.JettySolrRunner$DebugFilter.doFilter(JettySolrRunner.java:139)
   [junit4]   2> 	at org.eclipse.jetty.servlet.ServletHandler$CachedChain.doFilter(ServletHandler.java:1637)
   [junit4]   2> 	at org.eclipse.jetty.servlet.ServletHandler.doHandle(ServletHandler.java:533)
   [junit4]   2> 	at org.eclipse.jetty.server.handler.ScopedHandler.nextHandle(ScopedHandler.java:188)
   [junit4]   2> 	at org.eclipse.jetty.server.session.SessionHandler.doHandle(SessionHandler.java:1595)
   [junit4]   2> 	at org.eclipse.jetty.server.handler.ScopedHandler.nextHandle(ScopedHandler.java:188)
   [junit4]   2> 	at org.eclipse.jetty.server.handler.ContextHandler.doHandle(ContextHandler.java:1253)
   [junit4]   2> 	at org.eclipse.jetty.server.handler.ScopedHandler.nextScope(ScopedHandler.java:168)
   [junit4]   2> 	at org.eclipse.jetty.servlet.ServletHandler.doScope(ServletHandler.java:473)
   [junit4]   2> 	at org.eclipse.jetty.server.session.SessionHandler.doScope(SessionHandler.java:1564)
   [junit4]   2> 	at org.eclipse.jetty.server.handler.ScopedHandler.nextScope(ScopedHandler.java:166)
   [junit4]   2> 	at org.eclipse.jetty.server.handler.ContextHandler.doScope(ContextHandler.java:1155)
   [junit4]   2> 	at org.eclipse.jetty.server.handler.ScopedHandler.handle(ScopedHandler.java:141)
   [junit4]   2> 	at org.eclipse.jetty.server.handler.gzip.GzipHandler.handle(GzipHandler.java:527)
   [junit4]   2> 	at org.eclipse.jetty.server.handler.HandlerWrapper.handle(HandlerWrapper.java:132)
   [junit4]   2> 	at org.eclipse.jetty.server.Server.handle(Server.java:530)
   [junit4]   2> 	at org.eclipse.jetty.server.HttpChannel.handle(HttpChannel.java:347)
   [junit4]   2> 	at org.eclipse.jetty.server.HttpConnection.onFillable(HttpConnection.java:256)
   [junit4]   2> 	at org.eclipse.jetty.io.AbstractConnection$ReadCallback.succeeded(AbstractConnection.java:279)
   [junit4]   2> 	at org.eclipse.jetty.io.FillInterest.fillable(FillInterest.java:102)
   [junit4]   2> 	at org.eclipse.jetty.io.ssl.SslConnection.onFillable(SslConnection.java:289)
   [junit4]   2> 	at org.eclipse.jetty.io.ssl.SslConnection$3.succeeded(SslConnection.java:149)
   [junit4]   2> 	at org.eclipse.jetty.io.FillInterest.fillable(FillInterest.java:102)
   [junit4]   2> 	at org.eclipse.jetty.io.ChannelEndPoint$2.run(ChannelEndPoint.java:124)
   [junit4]   2> 	at org.eclipse.jetty.util.thread.strategy.EatWhatYouKill.doProduce(EatWhatYouKill.java:247)
   [junit4]   2> 	at org.eclipse.jetty.util.thread.strategy.EatWhatYouKill.produce(EatWhatYouKill.java:140)
   [junit4]   2> 	at org.eclipse.jetty.util.thread.strategy.EatWhatYouKill.run(EatWhatYouKill.java:131)
   [junit4]   2> 	at org.eclipse.jetty.util.thread.ReservedThreadExecutor$ReservedThread.run(ReservedThreadExecutor.java:382)
   [junit4]   2> 	at org.eclipse.jetty.util.thread.QueuedThreadPool.runJob(QueuedThreadPool.java:708)
   [junit4]   2> 	at org.eclipse.jetty.util.thread.QueuedThreadPool$2.run(QueuedThreadPool.java:626)
   [junit4]   2> 	at java.lang.Thread.run(Thread.java:748)
   [junit4]   2> 3502048 WARN  (qtp1999082171-35864) [    ] o.e.j.s.HttpChannel /solr/admin/collections
   [junit4]   2> org.apache.solr.common.SolrException: Error during request authentication, 
   [junit4]   2> 	at org.apache.solr.servlet.SolrDispatchFilter.authenticateRequest(SolrDispatchFilter.java:460)
   [junit4]   2> 	at org.apache.solr.servlet.SolrDispatchFilter.doFilter(SolrDispatchFilter.java:349)
   [junit4]   2> 	at org.apache.solr.servlet.SolrDispatchFilter.doFilter(SolrDispatchFilter.java:326)
   [junit4]   2> 	at org.eclipse.jetty.servlet.ServletHandler$CachedChain.doFilter(ServletHandler.java:1637)
   [junit4]   2> 	at org.apache.solr.client.solrj.embedded.JettySolrRunner$DebugFilter.doFilter(JettySolrRunner.java:139)
   [junit4]   2> 	at org.eclipse.jetty.servlet.ServletHandler$CachedChain.doFilter(ServletHandler.java:1637)
   [junit4]   2> 	at org.eclipse.jetty.servlet.ServletHandler.doHandle(ServletHandler.java:533)
   [junit4]   2> 	at org.eclipse.jetty.server.handler.ScopedHandler.nextHandle(ScopedHandler.java:188)
   [junit4]   2> 	at org.eclipse.jetty.server.session.SessionHandler.doHandle(SessionHandler.java:1595)
   [junit4]   2> 	at org.eclipse.jetty.server.handler.ScopedHandler.nextHandle(ScopedHandler.java:188)
   [junit4]   2> 	at org.eclipse.jetty.server.handler.ContextHandler.doHandle(ContextHandler.java:1253)
   [junit4]   2> 	at org.eclipse.jetty.server.handler.ScopedHandler.nextScope(ScopedHandler.java:168)
   [junit4]   2> 	at org.eclipse.jetty.servlet.ServletHandler.doScope(ServletHandler.java:473)
   [junit4]   2> 	at org.eclipse.jetty.server.session.SessionHandler.doScope(SessionHandler.java:1564)
   [junit4]   2> 	at org.eclipse.jetty.server.handler.ScopedHandler.nextScope(ScopedHandler.java:166)
   [junit4]   2> 	at org.eclipse.jetty.server.handler.ContextHandler.doScope(ContextHandler.java:1155)
   [junit4]   2> 	at org.eclipse.jetty.server.handler

[...truncated too long message...]

org.apache.curator.framework.imps.NamespaceWatcher.process(NamespaceWatcher.java:67)
   [junit4]   2> 	at org.apache.zookeeper.ClientCnxn$EventThread.processEvent(ClientCnxn.java:531)
   [junit4]   2> 	at org.apache.zookeeper.ClientCnxn$EventThread.run(ClientCnxn.java:506)
   [junit4]   2> Feb 22, 2018 8:29:15 AM com.carrotsearch.randomizedtesting.ThreadLeakControl tryToInterruptAll
   [junit4]   2> INFO: All leaked threads terminated.
   [junit4]   2> NOTE: test params are: codec=FastDecompressionCompressingStoredFields(storedFieldsFormat=CompressingStoredFieldsFormat(compressionMode=FAST_DECOMPRESSION, chunkSize=30019, maxDocsPerChunk=129, blockSize=224), termVectorsFormat=CompressingTermVectorsFormat(compressionMode=FAST_DECOMPRESSION, chunkSize=30019, blockSize=224)), sim=RandomSimilarity(queryNorm=true): {}, locale=ar-MA, timezone=America/Argentina/Catamarca
   [junit4]   2> NOTE: SunOS 5.11 amd64/Oracle Corporation 1.8.0_152 (64-bit)/cpus=3,threads=1,free=258459320,total=518979584
   [junit4]   2> NOTE: All tests run in this JVM: [NumericFieldsTest, ChangedSchemaMergeTest, TestFieldCacheSortRandom, TestCustomStream, TestTriggerIntegration, UpdateLogTest, TestBM25SimilarityFactory, SolrIndexConfigTest, TestTolerantSearch, TestTrieFacet, TestGenericDistributedQueue, DistribCursorPagingTest, TestRebalanceLeaders, TestSortByMinMaxFunction, StatelessScriptUpdateProcessorFactoryTest, TestPolicyCloud, TestSearcherReuse, DistributedQueryElevationComponentTest, TestSystemCollAutoCreate, TestSurroundQueryParser, SolrCLIZkUtilsTest, TestJsonRequest, TestConfigSetsAPI, TestRawResponseWriter, XmlUpdateRequestHandlerTest, TestExactSharedStatsCache, TestFiltering, ZkFailoverTest, UUIDUpdateProcessorFallbackTest, TestMinMaxOnMultiValuedField, TestFieldResource, TestMultiValuedNumericRangeQuery, DirectoryFactoryTest, OverseerRolesTest, TestXIncludeConfig, HttpSolrCallGetCoreTest, TestIBSimilarityFactory, BitVectorTest, ImplicitSnitchTest, HdfsDirectoryTest, TestPayloadCheckQParserPlugin, CopyFieldTest, TestCopyFieldCollectionResource, TestFaceting, OpenExchangeRatesOrgProviderTest, TestCustomDocTransformer, TestSolrCloudSnapshots, DistributedSuggestComponentTest, TestUninvertingReader, SuggestComponentContextFilterQueryTest, CollectionTooManyReplicasTest, OutOfBoxZkACLAndCredentialsProvidersTest, TestHashQParserPlugin, TestAddFieldRealTimeGet, RankQueryTest, LeaderElectionContextKeyTest, TestDistributedStatsComponentCardinality, TestStandardQParsers, TestAnalyzeInfixSuggestions, BasicDistributedZkTest, TestUtils, TestCollectionAPI, AddSchemaFieldsUpdateProcessorFactoryTest, TestNumericRangeQuery64, CreateCollectionCleanupTest, BasicZkTest, DistributedFacetExistsSmallTest, TestDeleteCollectionOnDownNodes, HdfsThreadLeakTest, TestShortCircuitedRequests, TestRuleBasedAuthorizationPlugin, TestQueryUtils, TestLegacyNumericUtils, CustomCollectionTest, TestLeaderElectionZkExpiry, TestUtilizeNode, StressHdfsTest, TestConfigSetsAPIZkFailure, TestCSVResponseWriter, TestSuggestSpellingConverter, FastVectorHighlighterTest, TestCollectionAPIs, TestBinaryField, CdcrBidirectionalTest, StatsReloadRaceTest, PolyFieldTest, AnalysisAfterCoreReloadTest, TestNoOpRegenerator, TestSmileRequest, SolrMetricManagerTest, TestLegacyNumericRangeQueryBuilder, DateRangeFieldTest, DirectSolrSpellCheckerTest, TriLevelCompositeIdRoutingTest, TestSchemalessBufferedUpdates, LegacyCloudClusterPropTest, TestLegacyField, OpenCloseCoreStressTest, TestTrackingShardHandlerFactory, SpatialFilterTest, BlockDirectoryTest, HLLUtilTest, TestHalfAndHalfDocValues, RegexBytesRefFilterTest, SolrRequestParserTest, TestShardHandlerFactory, HighlighterMaxOffsetTest, ClassificationUpdateProcessorIntegrationTest, TestFilteredDocIdSet, DataDrivenBlockJoinTest, AutoScalingHandlerTest, SolrJmxReporterTest, TestReload, ConvertedLegacyTest, CdcrRequestHandlerTest, TestSolrConfigHandler, TestConfigSetImmutable, SolrGraphiteReporterTest, TestInPlaceUpdatesDistrib, LargeFieldTest, TestOmitPositions, DirectSolrConnectionTest, PreAnalyzedUpdateProcessorTest, SecurityConfHandlerTest, RollingRestartTest, TestCursorMarkWithoutUniqueKey, TestRecoveryHdfs, TestJoin, TestGroupingSearch, TestQuerySenderNoQuery, SuggesterFSTTest, AnalyticsMergeStrategyTest, SolrMetricsIntegrationTest, AtomicUpdatesTest, TestSSLRandomization, TestStressCloudBlindAtomicUpdates, PathHierarchyTokenizerFactoryTest, ZkNodePropsTest, CacheHeaderTest, AddReplicaTest, ConjunctionSolrSpellCheckerTest, TestEmbeddedSolrServerSchemaAPI, V2StandaloneTest, TestHighlightDedupGrouping, TestDynamicFieldResource, TestExceedMaxTermLength, StatsComponentTest, TestCloudDeleteByQuery, TestMissingGroups, HdfsUnloadDistributedZkTest, CurrencyRangeFacetCloudTest, IgnoreCommitOptimizeUpdateProcessorFactoryTest, SpellingQueryConverterTest, TestElisionMultitermQuery, FullHLLTest, RequiredFieldsTest, TestJavabinTupleStreamParser, ConfigureRecoveryStrategyTest, ResourceLoaderTest, TestRandomFlRTGCloud, QueryElevationComponentTest, TestSweetSpotSimilarityFactory, TestObjectReleaseTracker, BasicAuthStandaloneTest, TestClusterStateProvider, TestRecovery, TestSchemaVersionResource, TestQueryTypes, TestDynamicLoading, CoreAdminCreateDiscoverTest, WordBreakSolrSpellCheckerTest, TestSolrConfigHandlerCloud, TestOnReconnectListenerSupport, TestJmxIntegration, TestPseudoReturnFields, TestCloudPseudoReturnFields, TestGeoJSONResponseWriter, MultiTermTest, SolrInfoBeanTest, TestStressLiveNodes, LeaderElectionTest, TermsComponentTest, TestQueryWrapperFilter, TestFastOutputStream, TestEmbeddedSolrServerAdminHandler, BasicDistributedZk2Test, UnloadDistributedZkTest, SyncSliceTest, LeaderElectionIntegrationTest, ShardRoutingTest, RecoveryZkTest, TestReplicationHandler, ClusterStateUpdateTest, TestRandomFaceting, TestZkChroot, ZkCLITest, ShardRoutingCustomTest, TestDistributedSearch, DistributedSpellCheckComponentTest, TermVectorComponentDistributedTest, ZkControllerTest, TestRealTimeGet, TestStressReorder, TestStressVersions, DistributedTermsComponentTest, TestRangeQuery, TestCoreContainer, TestSolr4Spatial, SolrCoreTest, TestSort, TestFunctionQuery, TestLazyCores, DirectUpdateHandlerTest, TestIndexSearcher, HighlighterTest, SoftAutoCommitTest, TestLFUCache, TestSolrIndexConfig, BadComponentTest, TestMergePolicyConfig, OutputWriterTest, TestLuceneMatchVersion, TestCharFilters, TestLMJelinekMercerSimilarityFactory, TestFastLRUCache, PreAnalyzedFieldTest, ClusterStateTest, SliceStateTest, UUIDFieldTest, CursorPagingTest, SolrTestCaseJ4Test, TestDistributedMissingSort, TestLuceneIndexBackCompat, ActionThrottleTest, AliasIntegrationTest, CleanupOldIndexTest, CloudExitableDirectoryReaderTest, CollectionsAPISolrJTest, CreateRoutedAliasTest, DeleteReplicaTest, DistributedVersionInfoTest, HttpPartitionOnCommitTest, HttpPartitionTest, LIRRollingUpdatesTest, LeaderInitiatedRecoveryOnShardRestartTest, MissingSegmentRecoveryTest, MoveReplicaHDFSFailoverTest, MoveReplicaTest, MultiThreadedOCPTest, RecoveryAfterSoftCommitTest, ReplaceNodeNoTargetTest, RestartWhileUpdatingTest, SharedFSAutoReplicaFailoverTest, SolrCloudExampleTest, TestCloudRecovery, TestClusterProperties, TestCryptoKeys, TestDownShardTolerantSearch, TestLeaderElectionWithEmptyReplica, TestPrepRecovery, TestSegmentSorting, TestSkipOverseerOperations, TestSolrCloudWithSecureImpersonation]
   [junit4]   2> NOTE: reproduce with: ant test  -Dtestcase=TestSolrCloudWithSecureImpersonation -Dtests.seed=664B7BE5FCE5DCCD -Dtests.slow=true -Dtests.locale=ar-MA -Dtests.timezone=America/Argentina/Catamarca -Dtests.asserts=true -Dtests.file.encoding=UTF-8
   [junit4] ERROR   0.00s J0 | TestSolrCloudWithSecureImpersonation (suite) <<<
   [junit4]    > Throwable #1: com.carrotsearch.randomizedtesting.ThreadLeakError: 1 thread leaked from SUITE scope at org.apache.solr.cloud.TestSolrCloudWithSecureImpersonation: 
   [junit4]    >    1) Thread[id=35909, name=jetty-launcher-8334-thread-1-EventThread, state=TIMED_WAITING, group=TGRP-TestSolrCloudWithSecureImpersonation]
   [junit4]    >         at sun.misc.Unsafe.park(Native Method)
   [junit4]    >         at java.util.concurrent.locks.LockSupport.parkNanos(LockSupport.java:215)
   [junit4]    >         at java.util.concurrent.locks.AbstractQueuedSynchronizer.doAcquireSharedNanos(AbstractQueuedSynchronizer.java:1037)
   [junit4]    >         at java.util.concurrent.locks.AbstractQueuedSynchronizer.tryAcquireSharedNanos(AbstractQueuedSynchronizer.java:1328)
   [junit4]    >         at java.util.concurrent.CountDownLatch.await(CountDownLatch.java:277)
   [junit4]    >         at org.apache.curator.CuratorZookeeperClient.internalBlockUntilConnectedOrTimedOut(CuratorZookeeperClient.java:323)
   [junit4]    >         at org.apache.curator.RetryLoop.callWithRetry(RetryLoop.java:105)
   [junit4]    >         at org.apache.curator.framework.imps.GetDataBuilderImpl.pathInForeground(GetDataBuilderImpl.java:288)
   [junit4]    >         at org.apache.curator.framework.imps.GetDataBuilderImpl.forPath(GetDataBuilderImpl.java:279)
   [junit4]    >         at org.apache.curator.framework.imps.GetDataBuilderImpl.forPath(GetDataBuilderImpl.java:41)
   [junit4]    >         at org.apache.curator.framework.recipes.shared.SharedValue.readValue(SharedValue.java:244)
   [junit4]    >         at org.apache.curator.framework.recipes.shared.SharedValue.access$100(SharedValue.java:44)
   [junit4]    >         at org.apache.curator.framework.recipes.shared.SharedValue$1.process(SharedValue.java:61)
   [junit4]    >         at org.apache.curator.framework.imps.NamespaceWatcher.process(NamespaceWatcher.java:67)
   [junit4]    >         at org.apache.zookeeper.ClientCnxn$EventThread.processEvent(ClientCnxn.java:531)
   [junit4]    >         at org.apache.zookeeper.ClientCnxn$EventThread.run(ClientCnxn.java:506)
   [junit4]    > 	at __randomizedtesting.SeedInfo.seed([664B7BE5FCE5DCCD]:0)
   [junit4] Completed [578/777 (2!)] on J0 in 47.33s, 12 tests, 1 error <<< FAILURES!

[...truncated 49362 lines...]

Mime
View raw message