lucene-dev mailing list archives

Site index · List index
Message view « Date » · « Thread »
Top « Date » · « Thread »
From Policeman Jenkins Server <jenk...@thetaphi.de>
Subject [JENKINS] Lucene-Solr-7.x-Linux (64bit/jdk-9.0.4) - Build # 1439 - Still Unstable!
Date Tue, 27 Feb 2018 11:44:46 GMT
Build: https://jenkins.thetaphi.de/job/Lucene-Solr-7.x-Linux/1439/
Java: 64bit/jdk-9.0.4 -XX:-UseCompressedOops -XX:+UseG1GC

6 tests failed.
FAILED:  junit.framework.TestSuite.org.apache.solr.cloud.SSLMigrationTest

Error Message:
ObjectTracker found 2 object(s) that were not released!!! [InternalHttpClient, InternalHttpClient] org.apache.solr.common.util.ObjectReleaseTracker$ObjectTrackerException: org.apache.http.impl.client.InternalHttpClient  at org.apache.solr.common.util.ObjectReleaseTracker.track(ObjectReleaseTracker.java:42)  at org.apache.solr.client.solrj.impl.HttpClientUtil.createClient(HttpClientUtil.java:289)  at org.apache.solr.client.solrj.impl.HttpClientUtil.createClient(HttpClientUtil.java:298)  at org.apache.solr.client.solrj.impl.HttpClientUtil.createClient(HttpClientUtil.java:236)  at org.apache.solr.client.solrj.impl.HttpClientUtil.createClient(HttpClientUtil.java:223)  at org.apache.solr.client.solrj.impl.LBHttpSolrClient.constructClient(LBHttpSolrClient.java:292)  at org.apache.solr.client.solrj.impl.LBHttpSolrClient.<init>(LBHttpSolrClient.java:270)  at org.apache.solr.client.solrj.impl.LBHttpSolrClient$Builder.build(LBHttpSolrClient.java:967)  at org.apache.solr.SolrTestCaseJ4.getLBHttpSolrClient(SolrTestCaseJ4.java:2473)  at org.apache.solr.cloud.SSLMigrationTest.setUrlScheme(SSLMigrationTest.java:132)  at org.apache.solr.cloud.SSLMigrationTest.testMigrateSSL(SSLMigrationTest.java:66)  at org.apache.solr.cloud.SSLMigrationTest.test(SSLMigrationTest.java:61)  at java.base/jdk.internal.reflect.NativeMethodAccessorImpl.invoke0(Native Method)  at java.base/jdk.internal.reflect.NativeMethodAccessorImpl.invoke(NativeMethodAccessorImpl.java:62)  at java.base/jdk.internal.reflect.DelegatingMethodAccessorImpl.invoke(DelegatingMethodAccessorImpl.java:43)  at java.base/java.lang.reflect.Method.invoke(Method.java:564)  at com.carrotsearch.randomizedtesting.RandomizedRunner.invoke(RandomizedRunner.java:1737)  at com.carrotsearch.randomizedtesting.RandomizedRunner$8.evaluate(RandomizedRunner.java:934)  at com.carrotsearch.randomizedtesting.RandomizedRunner$9.evaluate(RandomizedRunner.java:970)  at com.carrotsearch.randomizedtesting.RandomizedRunner$10.evaluate(RandomizedRunner.java:984)  at org.apache.solr.BaseDistributedSearchTestCase$ShardsRepeatRule$ShardsFixedStatement.callStatement(BaseDistributedSearchTestCase.java:993)  at org.apache.solr.BaseDistributedSearchTestCase$ShardsRepeatRule$ShardsStatement.evaluate(BaseDistributedSearchTestCase.java:968)  at com.carrotsearch.randomizedtesting.rules.SystemPropertiesRestoreRule$1.evaluate(SystemPropertiesRestoreRule.java:57)  at org.apache.lucene.util.TestRuleSetupTeardownChained$1.evaluate(TestRuleSetupTeardownChained.java:49)  at org.apache.lucene.util.AbstractBeforeAfterRule$1.evaluate(AbstractBeforeAfterRule.java:45)  at org.apache.lucene.util.TestRuleThreadAndTestName$1.evaluate(TestRuleThreadAndTestName.java:48)  at org.apache.lucene.util.TestRuleIgnoreAfterMaxFailures$1.evaluate(TestRuleIgnoreAfterMaxFailures.java:64)  at org.apache.lucene.util.TestRuleMarkFailure$1.evaluate(TestRuleMarkFailure.java:47)  at com.carrotsearch.randomizedtesting.rules.StatementAdapter.evaluate(StatementAdapter.java:36)  at com.carrotsearch.randomizedtesting.ThreadLeakControl$StatementRunner.run(ThreadLeakControl.java:368)  at com.carrotsearch.randomizedtesting.ThreadLeakControl.forkTimeoutingTask(ThreadLeakControl.java:817)  at com.carrotsearch.randomizedtesting.ThreadLeakControl$3.evaluate(ThreadLeakControl.java:468)  at com.carrotsearch.randomizedtesting.RandomizedRunner.runSingleTest(RandomizedRunner.java:943)  at com.carrotsearch.randomizedtesting.RandomizedRunner$5.evaluate(RandomizedRunner.java:829)  at com.carrotsearch.randomizedtesting.RandomizedRunner$6.evaluate(RandomizedRunner.java:879)  at com.carrotsearch.randomizedtesting.RandomizedRunner$7.evaluate(RandomizedRunner.java:890)  at com.carrotsearch.randomizedtesting.rules.StatementAdapter.evaluate(StatementAdapter.java:36)  at com.carrotsearch.randomizedtesting.rules.SystemPropertiesRestoreRule$1.evaluate(SystemPropertiesRestoreRule.java:57)  at org.apache.lucene.util.AbstractBeforeAfterRule$1.evaluate(AbstractBeforeAfterRule.java:45)  at com.carrotsearch.randomizedtesting.rules.StatementAdapter.evaluate(StatementAdapter.java:36)  at org.apache.lucene.util.TestRuleStoreClassName$1.evaluate(TestRuleStoreClassName.java:41)  at com.carrotsearch.randomizedtesting.rules.NoShadowingOrOverridesOnMethodsRule$1.evaluate(NoShadowingOrOverridesOnMethodsRule.java:40)  at com.carrotsearch.randomizedtesting.rules.NoShadowingOrOverridesOnMethodsRule$1.evaluate(NoShadowingOrOverridesOnMethodsRule.java:40)  at com.carrotsearch.randomizedtesting.rules.StatementAdapter.evaluate(StatementAdapter.java:36)  at com.carrotsearch.randomizedtesting.rules.StatementAdapter.evaluate(StatementAdapter.java:36)  at org.apache.lucene.util.TestRuleAssertionsRequired$1.evaluate(TestRuleAssertionsRequired.java:53)  at org.apache.lucene.util.TestRuleMarkFailure$1.evaluate(TestRuleMarkFailure.java:47)  at org.apache.lucene.util.TestRuleIgnoreAfterMaxFailures$1.evaluate(TestRuleIgnoreAfterMaxFailures.java:64)  at org.apache.lucene.util.TestRuleIgnoreTestSuites$1.evaluate(TestRuleIgnoreTestSuites.java:54)  at com.carrotsearch.randomizedtesting.rules.StatementAdapter.evaluate(StatementAdapter.java:36)  at com.carrotsearch.randomizedtesting.ThreadLeakControl$StatementRunner.run(ThreadLeakControl.java:368)  at java.base/java.lang.Thread.run(Thread.java:844)  org.apache.solr.common.util.ObjectReleaseTracker$ObjectTrackerException: org.apache.http.impl.client.InternalHttpClient  at org.apache.solr.common.util.ObjectReleaseTracker.track(ObjectReleaseTracker.java:42)  at org.apache.solr.client.solrj.impl.HttpClientUtil.createClient(HttpClientUtil.java:289)  at org.apache.solr.client.solrj.impl.HttpClientUtil.createClient(HttpClientUtil.java:298)  at org.apache.solr.client.solrj.impl.HttpClientUtil.createClient(HttpClientUtil.java:236)  at org.apache.solr.client.solrj.impl.HttpClientUtil.createClient(HttpClientUtil.java:223)  at org.apache.solr.client.solrj.impl.LBHttpSolrClient.constructClient(LBHttpSolrClient.java:292)  at org.apache.solr.client.solrj.impl.LBHttpSolrClient.<init>(LBHttpSolrClient.java:270)  at org.apache.solr.client.solrj.impl.LBHttpSolrClient$Builder.build(LBHttpSolrClient.java:967)  at org.apache.solr.SolrTestCaseJ4.getLBHttpSolrClient(SolrTestCaseJ4.java:2473)  at org.apache.solr.cloud.SSLMigrationTest.setUrlScheme(SSLMigrationTest.java:132)  at org.apache.solr.cloud.SSLMigrationTest.testMigrateSSL(SSLMigrationTest.java:66)  at org.apache.solr.cloud.SSLMigrationTest.test(SSLMigrationTest.java:60)  at java.base/jdk.internal.reflect.NativeMethodAccessorImpl.invoke0(Native Method)  at java.base/jdk.internal.reflect.NativeMethodAccessorImpl.invoke(NativeMethodAccessorImpl.java:62)  at java.base/jdk.internal.reflect.DelegatingMethodAccessorImpl.invoke(DelegatingMethodAccessorImpl.java:43)  at java.base/java.lang.reflect.Method.invoke(Method.java:564)  at com.carrotsearch.randomizedtesting.RandomizedRunner.invoke(RandomizedRunner.java:1737)  at com.carrotsearch.randomizedtesting.RandomizedRunner$8.evaluate(RandomizedRunner.java:934)  at com.carrotsearch.randomizedtesting.RandomizedRunner$9.evaluate(RandomizedRunner.java:970)  at com.carrotsearch.randomizedtesting.RandomizedRunner$10.evaluate(RandomizedRunner.java:984)  at org.apache.solr.BaseDistributedSearchTestCase$ShardsRepeatRule$ShardsFixedStatement.callStatement(BaseDistributedSearchTestCase.java:993)  at org.apache.solr.BaseDistributedSearchTestCase$ShardsRepeatRule$ShardsStatement.evaluate(BaseDistributedSearchTestCase.java:968)  at com.carrotsearch.randomizedtesting.rules.SystemPropertiesRestoreRule$1.evaluate(SystemPropertiesRestoreRule.java:57)  at org.apache.lucene.util.TestRuleSetupTeardownChained$1.evaluate(TestRuleSetupTeardownChained.java:49)  at org.apache.lucene.util.AbstractBeforeAfterRule$1.evaluate(AbstractBeforeAfterRule.java:45)  at org.apache.lucene.util.TestRuleThreadAndTestName$1.evaluate(TestRuleThreadAndTestName.java:48)  at org.apache.lucene.util.TestRuleIgnoreAfterMaxFailures$1.evaluate(TestRuleIgnoreAfterMaxFailures.java:64)  at org.apache.lucene.util.TestRuleMarkFailure$1.evaluate(TestRuleMarkFailure.java:47)  at com.carrotsearch.randomizedtesting.rules.StatementAdapter.evaluate(StatementAdapter.java:36)  at com.carrotsearch.randomizedtesting.ThreadLeakControl$StatementRunner.run(ThreadLeakControl.java:368)  at com.carrotsearch.randomizedtesting.ThreadLeakControl.forkTimeoutingTask(ThreadLeakControl.java:817)  at com.carrotsearch.randomizedtesting.ThreadLeakControl$3.evaluate(ThreadLeakControl.java:468)  at com.carrotsearch.randomizedtesting.RandomizedRunner.runSingleTest(RandomizedRunner.java:943)  at com.carrotsearch.randomizedtesting.RandomizedRunner$5.evaluate(RandomizedRunner.java:829)  at com.carrotsearch.randomizedtesting.RandomizedRunner$6.evaluate(RandomizedRunner.java:879)  at com.carrotsearch.randomizedtesting.RandomizedRunner$7.evaluate(RandomizedRunner.java:890)  at com.carrotsearch.randomizedtesting.rules.StatementAdapter.evaluate(StatementAdapter.java:36)  at com.carrotsearch.randomizedtesting.rules.SystemPropertiesRestoreRule$1.evaluate(SystemPropertiesRestoreRule.java:57)  at org.apache.lucene.util.AbstractBeforeAfterRule$1.evaluate(AbstractBeforeAfterRule.java:45)  at com.carrotsearch.randomizedtesting.rules.StatementAdapter.evaluate(StatementAdapter.java:36)  at org.apache.lucene.util.TestRuleStoreClassName$1.evaluate(TestRuleStoreClassName.java:41)  at com.carrotsearch.randomizedtesting.rules.NoShadowingOrOverridesOnMethodsRule$1.evaluate(NoShadowingOrOverridesOnMethodsRule.java:40)  at com.carrotsearch.randomizedtesting.rules.NoShadowingOrOverridesOnMethodsRule$1.evaluate(NoShadowingOrOverridesOnMethodsRule.java:40)  at com.carrotsearch.randomizedtesting.rules.StatementAdapter.evaluate(StatementAdapter.java:36)  at com.carrotsearch.randomizedtesting.rules.StatementAdapter.evaluate(StatementAdapter.java:36)  at org.apache.lucene.util.TestRuleAssertionsRequired$1.evaluate(TestRuleAssertionsRequired.java:53)  at org.apache.lucene.util.TestRuleMarkFailure$1.evaluate(TestRuleMarkFailure.java:47)  at org.apache.lucene.util.TestRuleIgnoreAfterMaxFailures$1.evaluate(TestRuleIgnoreAfterMaxFailures.java:64)  at org.apache.lucene.util.TestRuleIgnoreTestSuites$1.evaluate(TestRuleIgnoreTestSuites.java:54)  at com.carrotsearch.randomizedtesting.rules.StatementAdapter.evaluate(StatementAdapter.java:36)  at com.carrotsearch.randomizedtesting.ThreadLeakControl$StatementRunner.run(ThreadLeakControl.java:368)  at java.base/java.lang.Thread.run(Thread.java:844)  

Stack Trace:
java.lang.AssertionError: ObjectTracker found 2 object(s) that were not released!!! [InternalHttpClient, InternalHttpClient]
org.apache.solr.common.util.ObjectReleaseTracker$ObjectTrackerException: org.apache.http.impl.client.InternalHttpClient
	at org.apache.solr.common.util.ObjectReleaseTracker.track(ObjectReleaseTracker.java:42)
	at org.apache.solr.client.solrj.impl.HttpClientUtil.createClient(HttpClientUtil.java:289)
	at org.apache.solr.client.solrj.impl.HttpClientUtil.createClient(HttpClientUtil.java:298)
	at org.apache.solr.client.solrj.impl.HttpClientUtil.createClient(HttpClientUtil.java:236)
	at org.apache.solr.client.solrj.impl.HttpClientUtil.createClient(HttpClientUtil.java:223)
	at org.apache.solr.client.solrj.impl.LBHttpSolrClient.constructClient(LBHttpSolrClient.java:292)
	at org.apache.solr.client.solrj.impl.LBHttpSolrClient.<init>(LBHttpSolrClient.java:270)
	at org.apache.solr.client.solrj.impl.LBHttpSolrClient$Builder.build(LBHttpSolrClient.java:967)
	at org.apache.solr.SolrTestCaseJ4.getLBHttpSolrClient(SolrTestCaseJ4.java:2473)
	at org.apache.solr.cloud.SSLMigrationTest.setUrlScheme(SSLMigrationTest.java:132)
	at org.apache.solr.cloud.SSLMigrationTest.testMigrateSSL(SSLMigrationTest.java:66)
	at org.apache.solr.cloud.SSLMigrationTest.test(SSLMigrationTest.java:61)
	at java.base/jdk.internal.reflect.NativeMethodAccessorImpl.invoke0(Native Method)
	at java.base/jdk.internal.reflect.NativeMethodAccessorImpl.invoke(NativeMethodAccessorImpl.java:62)
	at java.base/jdk.internal.reflect.DelegatingMethodAccessorImpl.invoke(DelegatingMethodAccessorImpl.java:43)
	at java.base/java.lang.reflect.Method.invoke(Method.java:564)
	at com.carrotsearch.randomizedtesting.RandomizedRunner.invoke(RandomizedRunner.java:1737)
	at com.carrotsearch.randomizedtesting.RandomizedRunner$8.evaluate(RandomizedRunner.java:934)
	at com.carrotsearch.randomizedtesting.RandomizedRunner$9.evaluate(RandomizedRunner.java:970)
	at com.carrotsearch.randomizedtesting.RandomizedRunner$10.evaluate(RandomizedRunner.java:984)
	at org.apache.solr.BaseDistributedSearchTestCase$ShardsRepeatRule$ShardsFixedStatement.callStatement(BaseDistributedSearchTestCase.java:993)
	at org.apache.solr.BaseDistributedSearchTestCase$ShardsRepeatRule$ShardsStatement.evaluate(BaseDistributedSearchTestCase.java:968)
	at com.carrotsearch.randomizedtesting.rules.SystemPropertiesRestoreRule$1.evaluate(SystemPropertiesRestoreRule.java:57)
	at org.apache.lucene.util.TestRuleSetupTeardownChained$1.evaluate(TestRuleSetupTeardownChained.java:49)
	at org.apache.lucene.util.AbstractBeforeAfterRule$1.evaluate(AbstractBeforeAfterRule.java:45)
	at org.apache.lucene.util.TestRuleThreadAndTestName$1.evaluate(TestRuleThreadAndTestName.java:48)
	at org.apache.lucene.util.TestRuleIgnoreAfterMaxFailures$1.evaluate(TestRuleIgnoreAfterMaxFailures.java:64)
	at org.apache.lucene.util.TestRuleMarkFailure$1.evaluate(TestRuleMarkFailure.java:47)
	at com.carrotsearch.randomizedtesting.rules.StatementAdapter.evaluate(StatementAdapter.java:36)
	at com.carrotsearch.randomizedtesting.ThreadLeakControl$StatementRunner.run(ThreadLeakControl.java:368)
	at com.carrotsearch.randomizedtesting.ThreadLeakControl.forkTimeoutingTask(ThreadLeakControl.java:817)
	at com.carrotsearch.randomizedtesting.ThreadLeakControl$3.evaluate(ThreadLeakControl.java:468)
	at com.carrotsearch.randomizedtesting.RandomizedRunner.runSingleTest(RandomizedRunner.java:943)
	at com.carrotsearch.randomizedtesting.RandomizedRunner$5.evaluate(RandomizedRunner.java:829)
	at com.carrotsearch.randomizedtesting.RandomizedRunner$6.evaluate(RandomizedRunner.java:879)
	at com.carrotsearch.randomizedtesting.RandomizedRunner$7.evaluate(RandomizedRunner.java:890)
	at com.carrotsearch.randomizedtesting.rules.StatementAdapter.evaluate(StatementAdapter.java:36)
	at com.carrotsearch.randomizedtesting.rules.SystemPropertiesRestoreRule$1.evaluate(SystemPropertiesRestoreRule.java:57)
	at org.apache.lucene.util.AbstractBeforeAfterRule$1.evaluate(AbstractBeforeAfterRule.java:45)
	at com.carrotsearch.randomizedtesting.rules.StatementAdapter.evaluate(StatementAdapter.java:36)
	at org.apache.lucene.util.TestRuleStoreClassName$1.evaluate(TestRuleStoreClassName.java:41)
	at com.carrotsearch.randomizedtesting.rules.NoShadowingOrOverridesOnMethodsRule$1.evaluate(NoShadowingOrOverridesOnMethodsRule.java:40)
	at com.carrotsearch.randomizedtesting.rules.NoShadowingOrOverridesOnMethodsRule$1.evaluate(NoShadowingOrOverridesOnMethodsRule.java:40)
	at com.carrotsearch.randomizedtesting.rules.StatementAdapter.evaluate(StatementAdapter.java:36)
	at com.carrotsearch.randomizedtesting.rules.StatementAdapter.evaluate(StatementAdapter.java:36)
	at org.apache.lucene.util.TestRuleAssertionsRequired$1.evaluate(TestRuleAssertionsRequired.java:53)
	at org.apache.lucene.util.TestRuleMarkFailure$1.evaluate(TestRuleMarkFailure.java:47)
	at org.apache.lucene.util.TestRuleIgnoreAfterMaxFailures$1.evaluate(TestRuleIgnoreAfterMaxFailures.java:64)
	at org.apache.lucene.util.TestRuleIgnoreTestSuites$1.evaluate(TestRuleIgnoreTestSuites.java:54)
	at com.carrotsearch.randomizedtesting.rules.StatementAdapter.evaluate(StatementAdapter.java:36)
	at com.carrotsearch.randomizedtesting.ThreadLeakControl$StatementRunner.run(ThreadLeakControl.java:368)
	at java.base/java.lang.Thread.run(Thread.java:844)

org.apache.solr.common.util.ObjectReleaseTracker$ObjectTrackerException: org.apache.http.impl.client.InternalHttpClient
	at org.apache.solr.common.util.ObjectReleaseTracker.track(ObjectReleaseTracker.java:42)
	at org.apache.solr.client.solrj.impl.HttpClientUtil.createClient(HttpClientUtil.java:289)
	at org.apache.solr.client.solrj.impl.HttpClientUtil.createClient(HttpClientUtil.java:298)
	at org.apache.solr.client.solrj.impl.HttpClientUtil.createClient(HttpClientUtil.java:236)
	at org.apache.solr.client.solrj.impl.HttpClientUtil.createClient(HttpClientUtil.java:223)
	at org.apache.solr.client.solrj.impl.LBHttpSolrClient.constructClient(LBHttpSolrClient.java:292)
	at org.apache.solr.client.solrj.impl.LBHttpSolrClient.<init>(LBHttpSolrClient.java:270)
	at org.apache.solr.client.solrj.impl.LBHttpSolrClient$Builder.build(LBHttpSolrClient.java:967)
	at org.apache.solr.SolrTestCaseJ4.getLBHttpSolrClient(SolrTestCaseJ4.java:2473)
	at org.apache.solr.cloud.SSLMigrationTest.setUrlScheme(SSLMigrationTest.java:132)
	at org.apache.solr.cloud.SSLMigrationTest.testMigrateSSL(SSLMigrationTest.java:66)
	at org.apache.solr.cloud.SSLMigrationTest.test(SSLMigrationTest.java:60)
	at java.base/jdk.internal.reflect.NativeMethodAccessorImpl.invoke0(Native Method)
	at java.base/jdk.internal.reflect.NativeMethodAccessorImpl.invoke(NativeMethodAccessorImpl.java:62)
	at java.base/jdk.internal.reflect.DelegatingMethodAccessorImpl.invoke(DelegatingMethodAccessorImpl.java:43)
	at java.base/java.lang.reflect.Method.invoke(Method.java:564)
	at com.carrotsearch.randomizedtesting.RandomizedRunner.invoke(RandomizedRunner.java:1737)
	at com.carrotsearch.randomizedtesting.RandomizedRunner$8.evaluate(RandomizedRunner.java:934)
	at com.carrotsearch.randomizedtesting.RandomizedRunner$9.evaluate(RandomizedRunner.java:970)
	at com.carrotsearch.randomizedtesting.RandomizedRunner$10.evaluate(RandomizedRunner.java:984)
	at org.apache.solr.BaseDistributedSearchTestCase$ShardsRepeatRule$ShardsFixedStatement.callStatement(BaseDistributedSearchTestCase.java:993)
	at org.apache.solr.BaseDistributedSearchTestCase$ShardsRepeatRule$ShardsStatement.evaluate(BaseDistributedSearchTestCase.java:968)
	at com.carrotsearch.randomizedtesting.rules.SystemPropertiesRestoreRule$1.evaluate(SystemPropertiesRestoreRule.java:57)
	at org.apache.lucene.util.TestRuleSetupTeardownChained$1.evaluate(TestRuleSetupTeardownChained.java:49)
	at org.apache.lucene.util.AbstractBeforeAfterRule$1.evaluate(AbstractBeforeAfterRule.java:45)
	at org.apache.lucene.util.TestRuleThreadAndTestName$1.evaluate(TestRuleThreadAndTestName.java:48)
	at org.apache.lucene.util.TestRuleIgnoreAfterMaxFailures$1.evaluate(TestRuleIgnoreAfterMaxFailures.java:64)
	at org.apache.lucene.util.TestRuleMarkFailure$1.evaluate(TestRuleMarkFailure.java:47)
	at com.carrotsearch.randomizedtesting.rules.StatementAdapter.evaluate(StatementAdapter.java:36)
	at com.carrotsearch.randomizedtesting.ThreadLeakControl$StatementRunner.run(ThreadLeakControl.java:368)
	at com.carrotsearch.randomizedtesting.ThreadLeakControl.forkTimeoutingTask(ThreadLeakControl.java:817)
	at com.carrotsearch.randomizedtesting.ThreadLeakControl$3.evaluate(ThreadLeakControl.java:468)
	at com.carrotsearch.randomizedtesting.RandomizedRunner.runSingleTest(RandomizedRunner.java:943)
	at com.carrotsearch.randomizedtesting.RandomizedRunner$5.evaluate(RandomizedRunner.java:829)
	at com.carrotsearch.randomizedtesting.RandomizedRunner$6.evaluate(RandomizedRunner.java:879)
	at com.carrotsearch.randomizedtesting.RandomizedRunner$7.evaluate(RandomizedRunner.java:890)
	at com.carrotsearch.randomizedtesting.rules.StatementAdapter.evaluate(StatementAdapter.java:36)
	at com.carrotsearch.randomizedtesting.rules.SystemPropertiesRestoreRule$1.evaluate(SystemPropertiesRestoreRule.java:57)
	at org.apache.lucene.util.AbstractBeforeAfterRule$1.evaluate(AbstractBeforeAfterRule.java:45)
	at com.carrotsearch.randomizedtesting.rules.StatementAdapter.evaluate(StatementAdapter.java:36)
	at org.apache.lucene.util.TestRuleStoreClassName$1.evaluate(TestRuleStoreClassName.java:41)
	at com.carrotsearch.randomizedtesting.rules.NoShadowingOrOverridesOnMethodsRule$1.evaluate(NoShadowingOrOverridesOnMethodsRule.java:40)
	at com.carrotsearch.randomizedtesting.rules.NoShadowingOrOverridesOnMethodsRule$1.evaluate(NoShadowingOrOverridesOnMethodsRule.java:40)
	at com.carrotsearch.randomizedtesting.rules.StatementAdapter.evaluate(StatementAdapter.java:36)
	at com.carrotsearch.randomizedtesting.rules.StatementAdapter.evaluate(StatementAdapter.java:36)
	at org.apache.lucene.util.TestRuleAssertionsRequired$1.evaluate(TestRuleAssertionsRequired.java:53)
	at org.apache.lucene.util.TestRuleMarkFailure$1.evaluate(TestRuleMarkFailure.java:47)
	at org.apache.lucene.util.TestRuleIgnoreAfterMaxFailures$1.evaluate(TestRuleIgnoreAfterMaxFailures.java:64)
	at org.apache.lucene.util.TestRuleIgnoreTestSuites$1.evaluate(TestRuleIgnoreTestSuites.java:54)
	at com.carrotsearch.randomizedtesting.rules.StatementAdapter.evaluate(StatementAdapter.java:36)
	at com.carrotsearch.randomizedtesting.ThreadLeakControl$StatementRunner.run(ThreadLeakControl.java:368)
	at java.base/java.lang.Thread.run(Thread.java:844)


	at __randomizedtesting.SeedInfo.seed([3AEE099F1D713112]:0)
	at org.junit.Assert.fail(Assert.java:93)
	at org.junit.Assert.assertTrue(Assert.java:43)
	at org.junit.Assert.assertNull(Assert.java:551)
	at org.apache.solr.SolrTestCaseJ4.teardownTestCases(SolrTestCaseJ4.java:297)
	at jdk.internal.reflect.GeneratedMethodAccessor88.invoke(Unknown Source)
	at java.base/jdk.internal.reflect.DelegatingMethodAccessorImpl.invoke(DelegatingMethodAccessorImpl.java:43)
	at java.base/java.lang.reflect.Method.invoke(Method.java:564)
	at com.carrotsearch.randomizedtesting.RandomizedRunner.invoke(RandomizedRunner.java:1737)
	at com.carrotsearch.randomizedtesting.RandomizedRunner$7.evaluate(RandomizedRunner.java:897)
	at com.carrotsearch.randomizedtesting.rules.StatementAdapter.evaluate(StatementAdapter.java:36)
	at com.carrotsearch.randomizedtesting.rules.SystemPropertiesRestoreRule$1.evaluate(SystemPropertiesRestoreRule.java:57)
	at org.apache.lucene.util.AbstractBeforeAfterRule$1.evaluate(AbstractBeforeAfterRule.java:45)
	at com.carrotsearch.randomizedtesting.rules.StatementAdapter.evaluate(StatementAdapter.java:36)
	at org.apache.lucene.util.TestRuleStoreClassName$1.evaluate(TestRuleStoreClassName.java:41)
	at com.carrotsearch.randomizedtesting.rules.NoShadowingOrOverridesOnMethodsRule$1.evaluate(NoShadowingOrOverridesOnMethodsRule.java:40)
	at com.carrotsearch.randomizedtesting.rules.NoShadowingOrOverridesOnMethodsRule$1.evaluate(NoShadowingOrOverridesOnMethodsRule.java:40)
	at com.carrotsearch.randomizedtesting.rules.StatementAdapter.evaluate(StatementAdapter.java:36)
	at com.carrotsearch.randomizedtesting.rules.StatementAdapter.evaluate(StatementAdapter.java:36)
	at org.apache.lucene.util.TestRuleAssertionsRequired$1.evaluate(TestRuleAssertionsRequired.java:53)
	at org.apache.lucene.util.TestRuleMarkFailure$1.evaluate(TestRuleMarkFailure.java:47)
	at org.apache.lucene.util.TestRuleIgnoreAfterMaxFailures$1.evaluate(TestRuleIgnoreAfterMaxFailures.java:64)
	at org.apache.lucene.util.TestRuleIgnoreTestSuites$1.evaluate(TestRuleIgnoreTestSuites.java:54)
	at com.carrotsearch.randomizedtesting.rules.StatementAdapter.evaluate(StatementAdapter.java:36)
	at com.carrotsearch.randomizedtesting.ThreadLeakControl$StatementRunner.run(ThreadLeakControl.java:368)
	at java.base/java.lang.Thread.run(Thread.java:844)


FAILED:  junit.framework.TestSuite.org.apache.solr.cloud.SSLMigrationTest

Error Message:
2 threads leaked from SUITE scope at org.apache.solr.cloud.SSLMigrationTest:     1) Thread[id=17198, name=Connection evictor, state=TIMED_WAITING, group=TGRP-SSLMigrationTest]         at java.base@9.0.4/java.lang.Thread.sleep(Native Method)         at app//org.apache.http.impl.client.IdleConnectionEvictor$1.run(IdleConnectionEvictor.java:66)         at java.base@9.0.4/java.lang.Thread.run(Thread.java:844)    2) Thread[id=17060, name=Connection evictor, state=TIMED_WAITING, group=TGRP-SSLMigrationTest]         at java.base@9.0.4/java.lang.Thread.sleep(Native Method)         at app//org.apache.http.impl.client.IdleConnectionEvictor$1.run(IdleConnectionEvictor.java:66)         at java.base@9.0.4/java.lang.Thread.run(Thread.java:844)

Stack Trace:
com.carrotsearch.randomizedtesting.ThreadLeakError: 2 threads leaked from SUITE scope at org.apache.solr.cloud.SSLMigrationTest: 
   1) Thread[id=17198, name=Connection evictor, state=TIMED_WAITING, group=TGRP-SSLMigrationTest]
        at java.base@9.0.4/java.lang.Thread.sleep(Native Method)
        at app//org.apache.http.impl.client.IdleConnectionEvictor$1.run(IdleConnectionEvictor.java:66)
        at java.base@9.0.4/java.lang.Thread.run(Thread.java:844)
   2) Thread[id=17060, name=Connection evictor, state=TIMED_WAITING, group=TGRP-SSLMigrationTest]
        at java.base@9.0.4/java.lang.Thread.sleep(Native Method)
        at app//org.apache.http.impl.client.IdleConnectionEvictor$1.run(IdleConnectionEvictor.java:66)
        at java.base@9.0.4/java.lang.Thread.run(Thread.java:844)
	at __randomizedtesting.SeedInfo.seed([3AEE099F1D713112]:0)


FAILED:  org.apache.solr.cloud.ZkControllerTest.testPublishAndWaitForDownStates

Error Message:
The ZkController.publishAndWaitForDownStates should have timed out but it didn't

Stack Trace:
java.lang.AssertionError: The ZkController.publishAndWaitForDownStates should have timed out but it didn't
	at __randomizedtesting.SeedInfo.seed([3AEE099F1D713112:1DE16573BCE67E2D]:0)
	at org.junit.Assert.fail(Assert.java:93)
	at org.junit.Assert.assertTrue(Assert.java:43)
	at org.apache.solr.cloud.ZkControllerTest.testPublishAndWaitForDownStates(ZkControllerTest.java:306)
	at java.base/jdk.internal.reflect.NativeMethodAccessorImpl.invoke0(Native Method)
	at java.base/jdk.internal.reflect.NativeMethodAccessorImpl.invoke(NativeMethodAccessorImpl.java:62)
	at java.base/jdk.internal.reflect.DelegatingMethodAccessorImpl.invoke(DelegatingMethodAccessorImpl.java:43)
	at java.base/java.lang.reflect.Method.invoke(Method.java:564)
	at com.carrotsearch.randomizedtesting.RandomizedRunner.invoke(RandomizedRunner.java:1737)
	at com.carrotsearch.randomizedtesting.RandomizedRunner$8.evaluate(RandomizedRunner.java:934)
	at com.carrotsearch.randomizedtesting.RandomizedRunner$9.evaluate(RandomizedRunner.java:970)
	at com.carrotsearch.randomizedtesting.RandomizedRunner$10.evaluate(RandomizedRunner.java:984)
	at com.carrotsearch.randomizedtesting.rules.SystemPropertiesRestoreRule$1.evaluate(SystemPropertiesRestoreRule.java:57)
	at org.apache.lucene.util.TestRuleSetupTeardownChained$1.evaluate(TestRuleSetupTeardownChained.java:49)
	at org.apache.lucene.util.AbstractBeforeAfterRule$1.evaluate(AbstractBeforeAfterRule.java:45)
	at org.apache.lucene.util.TestRuleThreadAndTestName$1.evaluate(TestRuleThreadAndTestName.java:48)
	at org.apache.lucene.util.TestRuleIgnoreAfterMaxFailures$1.evaluate(TestRuleIgnoreAfterMaxFailures.java:64)
	at org.apache.lucene.util.TestRuleMarkFailure$1.evaluate(TestRuleMarkFailure.java:47)
	at com.carrotsearch.randomizedtesting.rules.StatementAdapter.evaluate(StatementAdapter.java:36)
	at com.carrotsearch.randomizedtesting.ThreadLeakControl$StatementRunner.run(ThreadLeakControl.java:368)
	at com.carrotsearch.randomizedtesting.ThreadLeakControl.forkTimeoutingTask(ThreadLeakControl.java:817)
	at com.carrotsearch.randomizedtesting.ThreadLeakControl$3.evaluate(ThreadLeakControl.java:468)
	at com.carrotsearch.randomizedtesting.RandomizedRunner.runSingleTest(RandomizedRunner.java:943)
	at com.carrotsearch.randomizedtesting.RandomizedRunner$5.evaluate(RandomizedRunner.java:829)
	at com.carrotsearch.randomizedtesting.RandomizedRunner$6.evaluate(RandomizedRunner.java:879)
	at com.carrotsearch.randomizedtesting.RandomizedRunner$7.evaluate(RandomizedRunner.java:890)
	at com.carrotsearch.randomizedtesting.rules.StatementAdapter.evaluate(StatementAdapter.java:36)
	at com.carrotsearch.randomizedtesting.rules.SystemPropertiesRestoreRule$1.evaluate(SystemPropertiesRestoreRule.java:57)
	at org.apache.lucene.util.AbstractBeforeAfterRule$1.evaluate(AbstractBeforeAfterRule.java:45)
	at com.carrotsearch.randomizedtesting.rules.StatementAdapter.evaluate(StatementAdapter.java:36)
	at org.apache.lucene.util.TestRuleStoreClassName$1.evaluate(TestRuleStoreClassName.java:41)
	at com.carrotsearch.randomizedtesting.rules.NoShadowingOrOverridesOnMethodsRule$1.evaluate(NoShadowingOrOverridesOnMethodsRule.java:40)
	at com.carrotsearch.randomizedtesting.rules.NoShadowingOrOverridesOnMethodsRule$1.evaluate(NoShadowingOrOverridesOnMethodsRule.java:40)
	at com.carrotsearch.randomizedtesting.rules.StatementAdapter.evaluate(StatementAdapter.java:36)
	at com.carrotsearch.randomizedtesting.rules.StatementAdapter.evaluate(StatementAdapter.java:36)
	at org.apache.lucene.util.TestRuleAssertionsRequired$1.evaluate(TestRuleAssertionsRequired.java:53)
	at org.apache.lucene.util.TestRuleMarkFailure$1.evaluate(TestRuleMarkFailure.java:47)
	at org.apache.lucene.util.TestRuleIgnoreAfterMaxFailures$1.evaluate(TestRuleIgnoreAfterMaxFailures.java:64)
	at org.apache.lucene.util.TestRuleIgnoreTestSuites$1.evaluate(TestRuleIgnoreTestSuites.java:54)
	at com.carrotsearch.randomizedtesting.rules.StatementAdapter.evaluate(StatementAdapter.java:36)
	at com.carrotsearch.randomizedtesting.ThreadLeakControl$StatementRunner.run(ThreadLeakControl.java:368)
	at java.base/java.lang.Thread.run(Thread.java:844)


FAILED:  org.apache.solr.core.TestJmxIntegration.testJmxOnCoreReload

Error Message:
Number of registered MBeans is not the same as info registry size expected:<108> but was:<0>

Stack Trace:
java.lang.AssertionError: Number of registered MBeans is not the same as info registry size expected:<108> but was:<0>
	at __randomizedtesting.SeedInfo.seed([3AEE099F1D713112:3857D2F36E32EDDF]:0)
	at org.junit.Assert.fail(Assert.java:93)
	at org.junit.Assert.failNotEquals(Assert.java:647)
	at org.junit.Assert.assertEquals(Assert.java:128)
	at org.junit.Assert.assertEquals(Assert.java:472)
	at org.apache.solr.core.TestJmxIntegration.testJmxOnCoreReload(TestJmxIntegration.java:180)
	at java.base/jdk.internal.reflect.NativeMethodAccessorImpl.invoke0(Native Method)
	at java.base/jdk.internal.reflect.NativeMethodAccessorImpl.invoke(NativeMethodAccessorImpl.java:62)
	at java.base/jdk.internal.reflect.DelegatingMethodAccessorImpl.invoke(DelegatingMethodAccessorImpl.java:43)
	at java.base/java.lang.reflect.Method.invoke(Method.java:564)
	at com.carrotsearch.randomizedtesting.RandomizedRunner.invoke(RandomizedRunner.java:1737)
	at com.carrotsearch.randomizedtesting.RandomizedRunner$8.evaluate(RandomizedRunner.java:934)
	at com.carrotsearch.randomizedtesting.RandomizedRunner$9.evaluate(RandomizedRunner.java:970)
	at com.carrotsearch.randomizedtesting.RandomizedRunner$10.evaluate(RandomizedRunner.java:984)
	at com.carrotsearch.randomizedtesting.rules.SystemPropertiesRestoreRule$1.evaluate(SystemPropertiesRestoreRule.java:57)
	at org.apache.lucene.util.TestRuleSetupTeardownChained$1.evaluate(TestRuleSetupTeardownChained.java:49)
	at org.apache.lucene.util.AbstractBeforeAfterRule$1.evaluate(AbstractBeforeAfterRule.java:45)
	at org.apache.lucene.util.TestRuleThreadAndTestName$1.evaluate(TestRuleThreadAndTestName.java:48)
	at org.apache.lucene.util.TestRuleIgnoreAfterMaxFailures$1.evaluate(TestRuleIgnoreAfterMaxFailures.java:64)
	at org.apache.lucene.util.TestRuleMarkFailure$1.evaluate(TestRuleMarkFailure.java:47)
	at com.carrotsearch.randomizedtesting.rules.StatementAdapter.evaluate(StatementAdapter.java:36)
	at com.carrotsearch.randomizedtesting.ThreadLeakControl$StatementRunner.run(ThreadLeakControl.java:368)
	at com.carrotsearch.randomizedtesting.ThreadLeakControl.forkTimeoutingTask(ThreadLeakControl.java:817)
	at com.carrotsearch.randomizedtesting.ThreadLeakControl$3.evaluate(ThreadLeakControl.java:468)
	at com.carrotsearch.randomizedtesting.RandomizedRunner.runSingleTest(RandomizedRunner.java:943)
	at com.carrotsearch.randomizedtesting.RandomizedRunner$5.evaluate(RandomizedRunner.java:829)
	at com.carrotsearch.randomizedtesting.RandomizedRunner$6.evaluate(RandomizedRunner.java:879)
	at com.carrotsearch.randomizedtesting.RandomizedRunner$7.evaluate(RandomizedRunner.java:890)
	at com.carrotsearch.randomizedtesting.rules.StatementAdapter.evaluate(StatementAdapter.java:36)
	at com.carrotsearch.randomizedtesting.rules.SystemPropertiesRestoreRule$1.evaluate(SystemPropertiesRestoreRule.java:57)
	at org.apache.lucene.util.AbstractBeforeAfterRule$1.evaluate(AbstractBeforeAfterRule.java:45)
	at com.carrotsearch.randomizedtesting.rules.StatementAdapter.evaluate(StatementAdapter.java:36)
	at org.apache.lucene.util.TestRuleStoreClassName$1.evaluate(TestRuleStoreClassName.java:41)
	at com.carrotsearch.randomizedtesting.rules.NoShadowingOrOverridesOnMethodsRule$1.evaluate(NoShadowingOrOverridesOnMethodsRule.java:40)
	at com.carrotsearch.randomizedtesting.rules.NoShadowingOrOverridesOnMethodsRule$1.evaluate(NoShadowingOrOverridesOnMethodsRule.java:40)
	at com.carrotsearch.randomizedtesting.rules.StatementAdapter.evaluate(StatementAdapter.java:36)
	at com.carrotsearch.randomizedtesting.rules.StatementAdapter.evaluate(StatementAdapter.java:36)
	at org.apache.lucene.util.TestRuleAssertionsRequired$1.evaluate(TestRuleAssertionsRequired.java:53)
	at org.apache.lucene.util.TestRuleMarkFailure$1.evaluate(TestRuleMarkFailure.java:47)
	at org.apache.lucene.util.TestRuleIgnoreAfterMaxFailures$1.evaluate(TestRuleIgnoreAfterMaxFailures.java:64)
	at org.apache.lucene.util.TestRuleIgnoreTestSuites$1.evaluate(TestRuleIgnoreTestSuites.java:54)
	at com.carrotsearch.randomizedtesting.rules.StatementAdapter.evaluate(StatementAdapter.java:36)
	at com.carrotsearch.randomizedtesting.ThreadLeakControl$StatementRunner.run(ThreadLeakControl.java:368)
	at java.base/java.lang.Thread.run(Thread.java:844)


FAILED:  org.apache.solr.handler.TestReplicationHandler.doTestIndexFetchOnMasterRestart

Error Message:
IOException occured when talking to server at: http://127.0.0.1:39079/solr/collection1

Stack Trace:
org.apache.solr.client.solrj.SolrServerException: IOException occured when talking to server at: http://127.0.0.1:39079/solr/collection1
	at __randomizedtesting.SeedInfo.seed([3AEE099F1D713112:E219CD7BB6AAF34E]:0)
	at org.apache.solr.client.solrj.impl.HttpSolrClient.executeMethod(HttpSolrClient.java:657)
	at org.apache.solr.client.solrj.impl.HttpSolrClient.request(HttpSolrClient.java:255)
	at org.apache.solr.client.solrj.impl.HttpSolrClient.request(HttpSolrClient.java:244)
	at org.apache.solr.client.solrj.SolrRequest.process(SolrRequest.java:194)
	at org.apache.solr.client.solrj.SolrClient.add(SolrClient.java:173)
	at org.apache.solr.client.solrj.SolrClient.add(SolrClient.java:138)
	at org.apache.solr.client.solrj.SolrClient.add(SolrClient.java:152)
	at org.apache.solr.handler.TestReplicationHandler.index(TestReplicationHandler.java:180)
	at org.apache.solr.handler.TestReplicationHandler.doTestIndexFetchOnMasterRestart(TestReplicationHandler.java:643)
	at java.base/jdk.internal.reflect.NativeMethodAccessorImpl.invoke0(Native Method)
	at java.base/jdk.internal.reflect.NativeMethodAccessorImpl.invoke(NativeMethodAccessorImpl.java:62)
	at java.base/jdk.internal.reflect.DelegatingMethodAccessorImpl.invoke(DelegatingMethodAccessorImpl.java:43)
	at java.base/java.lang.reflect.Method.invoke(Method.java:564)
	at com.carrotsearch.randomizedtesting.RandomizedRunner.invoke(RandomizedRunner.java:1737)
	at com.carrotsearch.randomizedtesting.RandomizedRunner$8.evaluate(RandomizedRunner.java:934)
	at com.carrotsearch.randomizedtesting.RandomizedRunner$9.evaluate(RandomizedRunner.java:970)
	at com.carrotsearch.randomizedtesting.RandomizedRunner$10.evaluate(RandomizedRunner.java:984)
	at com.carrotsearch.randomizedtesting.rules.SystemPropertiesRestoreRule$1.evaluate(SystemPropertiesRestoreRule.java:57)
	at org.apache.lucene.util.TestRuleSetupTeardownChained$1.evaluate(TestRuleSetupTeardownChained.java:49)
	at org.apache.lucene.util.AbstractBeforeAfterRule$1.evaluate(AbstractBeforeAfterRule.java:45)
	at org.apache.lucene.util.TestRuleThreadAndTestName$1.evaluate(TestRuleThreadAndTestName.java:48)
	at org.apache.lucene.util.TestRuleIgnoreAfterMaxFailures$1.evaluate(TestRuleIgnoreAfterMaxFailures.java:64)
	at org.apache.lucene.util.TestRuleMarkFailure$1.evaluate(TestRuleMarkFailure.java:47)
	at com.carrotsearch.randomizedtesting.rules.StatementAdapter.evaluate(StatementAdapter.java:36)
	at com.carrotsearch.randomizedtesting.ThreadLeakControl$StatementRunner.run(ThreadLeakControl.java:368)
	at com.carrotsearch.randomizedtesting.ThreadLeakControl.forkTimeoutingTask(ThreadLeakControl.java:817)
	at com.carrotsearch.randomizedtesting.ThreadLeakControl$3.evaluate(ThreadLeakControl.java:468)
	at com.carrotsearch.randomizedtesting.RandomizedRunner.runSingleTest(RandomizedRunner.java:943)
	at com.carrotsearch.randomizedtesting.RandomizedRunner$5.evaluate(RandomizedRunner.java:829)
	at com.carrotsearch.randomizedtesting.RandomizedRunner$6.evaluate(RandomizedRunner.java:879)
	at com.carrotsearch.randomizedtesting.RandomizedRunner$7.evaluate(RandomizedRunner.java:890)
	at com.carrotsearch.randomizedtesting.rules.StatementAdapter.evaluate(StatementAdapter.java:36)
	at com.carrotsearch.randomizedtesting.rules.SystemPropertiesRestoreRule$1.evaluate(SystemPropertiesRestoreRule.java:57)
	at org.apache.lucene.util.AbstractBeforeAfterRule$1.evaluate(AbstractBeforeAfterRule.java:45)
	at com.carrotsearch.randomizedtesting.rules.StatementAdapter.evaluate(StatementAdapter.java:36)
	at org.apache.lucene.util.TestRuleStoreClassName$1.evaluate(TestRuleStoreClassName.java:41)
	at com.carrotsearch.randomizedtesting.rules.NoShadowingOrOverridesOnMethodsRule$1.evaluate(NoShadowingOrOverridesOnMethodsRule.java:40)
	at com.carrotsearch.randomizedtesting.rules.NoShadowingOrOverridesOnMethodsRule$1.evaluate(NoShadowingOrOverridesOnMethodsRule.java:40)
	at com.carrotsearch.randomizedtesting.rules.StatementAdapter.evaluate(StatementAdapter.java:36)
	at com.carrotsearch.randomizedtesting.rules.StatementAdapter.evaluate(StatementAdapter.java:36)
	at org.apache.lucene.util.TestRuleAssertionsRequired$1.evaluate(TestRuleAssertionsRequired.java:53)
	at org.apache.lucene.util.TestRuleMarkFailure$1.evaluate(TestRuleMarkFailure.java:47)
	at org.apache.lucene.util.TestRuleIgnoreAfterMaxFailures$1.evaluate(TestRuleIgnoreAfterMaxFailures.java:64)
	at org.apache.lucene.util.TestRuleIgnoreTestSuites$1.evaluate(TestRuleIgnoreTestSuites.java:54)
	at com.carrotsearch.randomizedtesting.rules.StatementAdapter.evaluate(StatementAdapter.java:36)
	at com.carrotsearch.randomizedtesting.ThreadLeakControl$StatementRunner.run(ThreadLeakControl.java:368)
	at java.base/java.lang.Thread.run(Thread.java:844)
Caused by: org.apache.http.NoHttpResponseException: 127.0.0.1:39079 failed to respond
	at org.apache.http.impl.conn.DefaultHttpResponseParser.parseHead(DefaultHttpResponseParser.java:141)
	at org.apache.http.impl.conn.DefaultHttpResponseParser.parseHead(DefaultHttpResponseParser.java:56)
	at org.apache.http.impl.io.AbstractMessageParser.parse(AbstractMessageParser.java:259)
	at org.apache.http.impl.DefaultBHttpClientConnection.receiveResponseHeader(DefaultBHttpClientConnection.java:163)
	at org.apache.http.impl.conn.CPoolProxy.receiveResponseHeader(CPoolProxy.java:165)
	at org.apache.http.protocol.HttpRequestExecutor.doReceiveResponse(HttpRequestExecutor.java:273)
	at org.apache.http.protocol.HttpRequestExecutor.execute(HttpRequestExecutor.java:125)
	at org.apache.http.impl.execchain.MainClientExec.execute(MainClientExec.java:272)
	at org.apache.http.impl.execchain.ProtocolExec.execute(ProtocolExec.java:185)
	at org.apache.http.impl.execchain.RetryExec.execute(RetryExec.java:89)
	at org.apache.http.impl.execchain.RedirectExec.execute(RedirectExec.java:111)
	at org.apache.http.impl.client.InternalHttpClient.doExecute(InternalHttpClient.java:185)
	at org.apache.http.impl.client.CloseableHttpClient.execute(CloseableHttpClient.java:83)
	at org.apache.http.impl.client.CloseableHttpClient.execute(CloseableHttpClient.java:56)
	at org.apache.solr.client.solrj.impl.HttpSolrClient.executeMethod(HttpSolrClient.java:542)
	... 46 more


FAILED:  org.apache.solr.ltr.TestLTRReRankingPipeline.testDifferentTopN

Error Message:
expected:<1.0> but was:<0.0>

Stack Trace:
java.lang.AssertionError: expected:<1.0> but was:<0.0>
	at __randomizedtesting.SeedInfo.seed([14E5015B295B2A13:E544730B1CE0E081]:0)
	at org.junit.Assert.fail(Assert.java:93)
	at org.junit.Assert.failNotEquals(Assert.java:647)
	at org.junit.Assert.assertEquals(Assert.java:443)
	at org.junit.Assert.assertEquals(Assert.java:512)
	at org.apache.solr.ltr.TestLTRReRankingPipeline.testDifferentTopN(TestLTRReRankingPipeline.java:255)
	at java.base/jdk.internal.reflect.NativeMethodAccessorImpl.invoke0(Native Method)
	at java.base/jdk.internal.reflect.NativeMethodAccessorImpl.invoke(NativeMethodAccessorImpl.java:62)
	at java.base/jdk.internal.reflect.DelegatingMethodAccessorImpl.invoke(DelegatingMethodAccessorImpl.java:43)
	at java.base/java.lang.reflect.Method.invoke(Method.java:564)
	at com.carrotsearch.randomizedtesting.RandomizedRunner.invoke(RandomizedRunner.java:1737)
	at com.carrotsearch.randomizedtesting.RandomizedRunner$8.evaluate(RandomizedRunner.java:934)
	at com.carrotsearch.randomizedtesting.RandomizedRunner$9.evaluate(RandomizedRunner.java:970)
	at com.carrotsearch.randomizedtesting.RandomizedRunner$10.evaluate(RandomizedRunner.java:984)
	at org.apache.lucene.util.TestRuleSetupTeardownChained$1.evaluate(TestRuleSetupTeardownChained.java:49)
	at org.apache.lucene.util.AbstractBeforeAfterRule$1.evaluate(AbstractBeforeAfterRule.java:45)
	at org.apache.lucene.util.TestRuleThreadAndTestName$1.evaluate(TestRuleThreadAndTestName.java:48)
	at org.apache.lucene.util.TestRuleIgnoreAfterMaxFailures$1.evaluate(TestRuleIgnoreAfterMaxFailures.java:64)
	at org.apache.lucene.util.TestRuleMarkFailure$1.evaluate(TestRuleMarkFailure.java:47)
	at com.carrotsearch.randomizedtesting.rules.StatementAdapter.evaluate(StatementAdapter.java:36)
	at com.carrotsearch.randomizedtesting.ThreadLeakControl$StatementRunner.run(ThreadLeakControl.java:368)
	at com.carrotsearch.randomizedtesting.ThreadLeakControl.forkTimeoutingTask(ThreadLeakControl.java:817)
	at com.carrotsearch.randomizedtesting.ThreadLeakControl$3.evaluate(ThreadLeakControl.java:468)
	at com.carrotsearch.randomizedtesting.RandomizedRunner.runSingleTest(RandomizedRunner.java:943)
	at com.carrotsearch.randomizedtesting.RandomizedRunner$5.evaluate(RandomizedRunner.java:829)
	at com.carrotsearch.randomizedtesting.RandomizedRunner$6.evaluate(RandomizedRunner.java:879)
	at com.carrotsearch.randomizedtesting.RandomizedRunner$7.evaluate(RandomizedRunner.java:890)
	at org.apache.lucene.util.AbstractBeforeAfterRule$1.evaluate(AbstractBeforeAfterRule.java:45)
	at com.carrotsearch.randomizedtesting.rules.StatementAdapter.evaluate(StatementAdapter.java:36)
	at org.apache.lucene.util.TestRuleStoreClassName$1.evaluate(TestRuleStoreClassName.java:41)
	at com.carrotsearch.randomizedtesting.rules.NoShadowingOrOverridesOnMethodsRule$1.evaluate(NoShadowingOrOverridesOnMethodsRule.java:40)
	at com.carrotsearch.randomizedtesting.rules.NoShadowingOrOverridesOnMethodsRule$1.evaluate(NoShadowingOrOverridesOnMethodsRule.java:40)
	at com.carrotsearch.randomizedtesting.rules.StatementAdapter.evaluate(StatementAdapter.java:36)
	at com.carrotsearch.randomizedtesting.rules.StatementAdapter.evaluate(StatementAdapter.java:36)
	at org.apache.lucene.util.TestRuleAssertionsRequired$1.evaluate(TestRuleAssertionsRequired.java:53)
	at org.apache.lucene.util.TestRuleMarkFailure$1.evaluate(TestRuleMarkFailure.java:47)
	at org.apache.lucene.util.TestRuleIgnoreAfterMaxFailures$1.evaluate(TestRuleIgnoreAfterMaxFailures.java:64)
	at org.apache.lucene.util.TestRuleIgnoreTestSuites$1.evaluate(TestRuleIgnoreTestSuites.java:54)
	at com.carrotsearch.randomizedtesting.rules.StatementAdapter.evaluate(StatementAdapter.java:36)
	at com.carrotsearch.randomizedtesting.ThreadLeakControl$StatementRunner.run(ThreadLeakControl.java:368)
	at java.base/java.lang.Thread.run(Thread.java:844)




Build Log:
[...truncated 12736 lines...]
   [junit4] Suite: org.apache.solr.cloud.ZkControllerTest
   [junit4]   2> Creating dataDir: /home/jenkins/workspace/Lucene-Solr-7.x-Linux/solr/build/solr-core/test/J1/temp/solr.cloud.ZkControllerTest_3AEE099F1D713112-001/init-core-data-001
   [junit4]   2> 905562 WARN  (SUITE-ZkControllerTest-seed#[3AEE099F1D713112]-worker) [    ] o.a.s.SolrTestCaseJ4 startTrackingSearchers: numOpens=30 numCloses=30
   [junit4]   2> 905562 INFO  (SUITE-ZkControllerTest-seed#[3AEE099F1D713112]-worker) [    ] o.a.s.SolrTestCaseJ4 Using PointFields (NUMERIC_POINTS_SYSPROP=true) w/NUMERIC_DOCVALUES_SYSPROP=false
   [junit4]   2> 905563 INFO  (SUITE-ZkControllerTest-seed#[3AEE099F1D713112]-worker) [    ] o.a.s.SolrTestCaseJ4 Randomized ssl (false) and clientAuth (false) via: @org.apache.solr.SolrTestCaseJ4$SuppressSSL(bugUrl="None")
   [junit4]   2> 905563 INFO  (SUITE-ZkControllerTest-seed#[3AEE099F1D713112]-worker) [    ] o.a.s.SolrTestCaseJ4 SecureRandom sanity checks: test.solr.allowed.securerandom=null & java.security.egd=file:/dev/./urandom
   [junit4]   2> 905564 INFO  (TEST-ZkControllerTest.testReadConfigName-seed#[3AEE099F1D713112]) [    ] o.a.s.SolrTestCaseJ4 ###Starting testReadConfigName
   [junit4]   2> 905564 INFO  (TEST-ZkControllerTest.testReadConfigName-seed#[3AEE099F1D713112]) [    ] o.a.s.c.ZkTestServer STARTING ZK TEST SERVER
   [junit4]   2> 905564 INFO  (Thread-2295) [    ] o.a.s.c.ZkTestServer client port:0.0.0.0/0.0.0.0:0
   [junit4]   2> 905564 INFO  (Thread-2295) [    ] o.a.s.c.ZkTestServer Starting server
   [junit4]   2> 905566 ERROR (Thread-2295) [    ] o.a.z.s.ZooKeeperServer ZKShutdownHandler is not registered, so ZooKeeper server won't take any action on ERROR or SHUTDOWN server state changes
   [junit4]   2> 905664 INFO  (TEST-ZkControllerTest.testReadConfigName-seed#[3AEE099F1D713112]) [    ] o.a.s.c.ZkTestServer start zk server on port:46131
   [junit4]   2> 905666 INFO  (zkConnectionManagerCallback-1923-thread-1) [    ] o.a.s.c.c.ConnectionManager zkClient has connected
   [junit4]   2> 905668 INFO  (zkConnectionManagerCallback-1925-thread-1) [    ] o.a.s.c.c.ConnectionManager zkClient has connected
   [junit4]   2> 905671 INFO  (zkConnectionManagerCallback-1927-thread-1) [    ] o.a.s.c.c.ConnectionManager zkClient has connected
   [junit4]   2> 905675 INFO  (TEST-ZkControllerTest.testReadConfigName-seed#[3AEE099F1D713112]) [    ] o.a.s.c.SolrXmlConfig MBean server found: com.sun.jmx.mbeanserver.JmxMBeanServer@477c9adc, but no JMX reporters were configured - adding default JMX reporter.
   [junit4]   2> 905678 INFO  (zkConnectionManagerCallback-1931-thread-1-processing-n:127.0.0.1:8983_solr) [n:127.0.0.1:8983_solr    ] o.a.s.c.c.ConnectionManager zkClient has connected
   [junit4]   2> 905704 INFO  (TEST-ZkControllerTest.testReadConfigName-seed#[3AEE099F1D713112]) [n:127.0.0.1:8983_solr    ] o.a.s.c.Overseer Overseer (id=null) closing
   [junit4]   2> 905704 INFO  (TEST-ZkControllerTest.testReadConfigName-seed#[3AEE099F1D713112]) [n:127.0.0.1:8983_solr    ] o.a.s.c.OverseerElectionContext I am going to be the leader 127.0.0.1:8983_solr
   [junit4]   2> 905704 INFO  (TEST-ZkControllerTest.testReadConfigName-seed#[3AEE099F1D713112]) [n:127.0.0.1:8983_solr    ] o.a.s.c.Overseer Overseer (id=72220883833651203-127.0.0.1:8983_solr-n_0000000000) starting
   [junit4]   2> 905707 INFO  (TEST-ZkControllerTest.testReadConfigName-seed#[3AEE099F1D713112]) [n:127.0.0.1:8983_solr    ] o.a.s.c.ZkController Register node as live in ZooKeeper:/live_nodes/127.0.0.1:8983_solr
   [junit4]   2> 905707 INFO  (zkCallback-1930-thread-1-processing-n:127.0.0.1:8983_solr) [n:127.0.0.1:8983_solr    ] o.a.s.c.c.ZkStateReader Updated live nodes from ZooKeeper... (0) -> (1)
   [junit4]   2> 905707 INFO  (TEST-ZkControllerTest.testReadConfigName-seed#[3AEE099F1D713112]) [n:127.0.0.1:8983_solr    ] o.a.s.c.Overseer Overseer (id=72220883833651203-127.0.0.1:8983_solr-n_0000000000) closing
   [junit4]   2> 905708 INFO  (OverseerStateUpdate-72220883833651203-127.0.0.1:8983_solr-n_0000000000) [n:127.0.0.1:8983_solr    ] o.a.s.c.Overseer Overseer Loop exiting : 127.0.0.1:8983_solr
   [junit4]   2> 905708 WARN  (OverseerExitThread) [n:127.0.0.1:8983_solr    ] o.a.s.c.Overseer I'm exiting, but I'm still the leader
   [junit4]   2> 905709 WARN  (OverseerAutoScalingTriggerThread-72220883833651203-127.0.0.1:8983_solr-n_0000000000) [n:127.0.0.1:8983_solr    ] o.a.s.c.a.OverseerTriggerThread Error removing old nodeAdded markers
   [junit4]   2> java.lang.InterruptedException
   [junit4]   2> 	at java.base/java.lang.Object.wait(Native Method)
   [junit4]   2> 	at java.base/java.lang.Object.wait(Object.java:516)
   [junit4]   2> 	at org.apache.zookeeper.ClientCnxn.submitRequest(ClientCnxn.java:1409)
   [junit4]   2> 	at org.apache.zookeeper.ZooKeeper.getChildren(ZooKeeper.java:1533)
   [junit4]   2> 	at org.apache.solr.common.cloud.SolrZkClient.lambda$getChildren$4(SolrZkClient.java:328)
   [junit4]   2> 	at org.apache.solr.common.cloud.ZkCmdExecutor.retryOperation(ZkCmdExecutor.java:60)
   [junit4]   2> 	at org.apache.solr.common.cloud.SolrZkClient.getChildren(SolrZkClient.java:328)
   [junit4]   2> 	at org.apache.solr.client.solrj.impl.ZkDistribStateManager.listData(ZkDistribStateManager.java:67)
   [junit4]   2> 	at org.apache.solr.client.solrj.impl.ZkDistribStateManager.listData(ZkDistribStateManager.java:77)
   [junit4]   2> 	at org.apache.solr.cloud.autoscaling.OverseerTriggerThread.run(OverseerTriggerThread.java:254)
   [junit4]   2> 	at java.base/java.lang.Thread.run(Thread.java:844)
   [junit4]   2> 905709 WARN  (OverseerAutoScalingTriggerThread-72220883833651203-127.0.0.1:8983_solr-n_0000000000) [n:127.0.0.1:8983_solr    ] o.a.s.c.a.OverseerTriggerThread OverseerTriggerThread has been closed, exiting.
   [junit4]   2> 905709 WARN  (zkCallback-1930-thread-1-processing-n:127.0.0.1:8983_solr) [n:127.0.0.1:8983_solr    ] o.a.s.c.c.ZkStateReader ZooKeeper watch triggered, but Solr cannot talk to ZK: [KeeperErrorCode = Session expired for /live_nodes]
   [junit4]   2> 905709 INFO  (TEST-ZkControllerTest.testReadConfigName-seed#[3AEE099F1D713112]) [n:127.0.0.1:8983_solr    ] o.a.s.c.CoreContainer Shutting down CoreContainer instance=695812809
   [junit4]   2> 905709 ERROR (TEST-ZkControllerTest.testReadConfigName-seed#[3AEE099F1D713112]) [n:127.0.0.1:8983_solr    ] o.a.s.c.SolrCores No transient handler has been defined. Check solr.xml to see if an attempt to provide a custom TransientSolrCoreCacheFactory was done incorrectly since the default should have been used otherwise.
   [junit4]   2> 905710 ERROR (TEST-ZkControllerTest.testReadConfigName-seed#[3AEE099F1D713112]) [n:127.0.0.1:8983_solr    ] o.a.z.s.ZooKeeperServer ZKShutdownHandler is not registered, so ZooKeeper server won't take any action on ERROR or SHUTDOWN server state changes
   [junit4]   2> 905710 INFO  (TEST-ZkControllerTest.testReadConfigName-seed#[3AEE099F1D713112]) [n:127.0.0.1:8983_solr    ] o.a.s.c.ZkTestServer connecting to 127.0.0.1:46131 46131
   [junit4]   2> 907209 WARN  (OverseerExitThread) [n:127.0.0.1:8983_solr    ] o.a.s.c.Overseer Unable to rejoinElection 
   [junit4]   2> org.apache.solr.common.SolrException: Unable to rejoin election
   [junit4]   2> 	at org.apache.solr.cloud.ZkController.rejoinOverseerElection(ZkController.java:2053)
   [junit4]   2> 	at org.apache.solr.cloud.Overseer$ClusterStateUpdater.checkIfIamStillLeader(Overseer.java:331)
   [junit4]   2> 	at java.base/java.lang.Thread.run(Thread.java:844)
   [junit4]   2> Caused by: org.apache.zookeeper.KeeperException$SessionExpiredException: KeeperErrorCode = Session expired for /overseer_elect/election
   [junit4]   2> 	at org.apache.zookeeper.KeeperException.create(KeeperException.java:130)
   [junit4]   2> 	at org.apache.zookeeper.KeeperException.create(KeeperException.java:54)
   [junit4]   2> 	at org.apache.zookeeper.ZooKeeper.getChildren(ZooKeeper.java:1535)
   [junit4]   2> 	at org.apache.solr.common.cloud.SolrZkClient.lambda$getChildren$4(SolrZkClient.java:328)
   [junit4]   2> 	at org.apache.solr.common.cloud.ZkCmdExecutor.retryOperation(ZkCmdExecutor.java:60)
   [junit4]   2> 	at org.apache.solr.common.cloud.SolrZkClient.getChildren(SolrZkClient.java:328)
   [junit4]   2> 	at org.apache.solr.cloud.LeaderElector.checkIfIamLeader(LeaderElector.java:105)
   [junit4]   2> 	at org.apache.solr.cloud.LeaderElector.joinElection(LeaderElector.java:307)
   [junit4]   2> 	at org.apache.solr.cloud.LeaderElector.retryElection(LeaderElector.java:393)
   [junit4]   2> 	at org.apache.solr.cloud.ZkController.rejoinOverseerElection(ZkController.java:2050)
   [junit4]   2> 	... 2 more
   [junit4]   2> 910848 INFO  (Thread-2295) [    ] o.a.s.c.ZkTestServer connecting to 127.0.0.1:46131 46131
   [junit4]   2> 910849 INFO  (TEST-ZkControllerTest.testReadConfigName-seed#[3AEE099F1D713112]) [n:127.0.0.1:8983_solr    ] o.a.s.SolrTestCaseJ4 ###Ending testReadConfigName
   [junit4]   2> 910850 INFO  (TEST-ZkControllerTest.testNodeNameUrlConversion-seed#[3AEE099F1D713112]) [n:127.0.0.1:8983_solr    ] o.a.s.SolrTestCaseJ4 ###Starting testNodeNameUrlConversion
   [junit4]   2> 910850 INFO  (TEST-ZkControllerTest.testNodeNameUrlConversion-seed#[3AEE099F1D713112]) [n:127.0.0.1:8983_solr    ] o.a.s.c.ZkTestServer STARTING ZK TEST SERVER
   [junit4]   2> 910850 INFO  (Thread-2296) [n:127.0.0.1:8983_solr    ] o.a.s.c.ZkTestServer client port:0.0.0.0/0.0.0.0:0
   [junit4]   2> 910850 INFO  (Thread-2296) [n:127.0.0.1:8983_solr    ] o.a.s.c.ZkTestServer Starting server
   [junit4]   2> 910851 ERROR (Thread-2296) [n:127.0.0.1:8983_solr    ] o.a.z.s.ZooKeeperServer ZKShutdownHandler is not registered, so ZooKeeper server won't take any action on ERROR or SHUTDOWN server state changes
   [junit4]   2> 910950 INFO  (TEST-ZkControllerTest.testNodeNameUrlConversion-seed#[3AEE099F1D713112]) [n:127.0.0.1:8983_solr    ] o.a.s.c.ZkTestServer start zk server on port:46813
   [junit4]   2> 910952 INFO  (zkConnectionManagerCallback-1935-thread-1-processing-n:127.0.0.1:8983_solr) [n:127.0.0.1:8983_solr    ] o.a.s.c.c.ConnectionManager zkClient has connected
   [junit4]   2> 910955 INFO  (zkConnectionManagerCallback-1937-thread-1-processing-n:127.0.0.1:8983_solr) [n:127.0.0.1:8983_solr    ] o.a.s.c.c.ConnectionManager zkClient has connected
   [junit4]   2> 910957 INFO  (zkConnectionManagerCallback-1939-thread-1-processing-n:127.0.0.1:8983_solr) [n:127.0.0.1:8983_solr    ] o.a.s.c.c.ConnectionManager zkClient has connected
   [junit4]   2> 910983 ERROR (TEST-ZkControllerTest.testNodeNameUrlConversion-seed#[3AEE099F1D713112]) [n:127.0.0.1:8983_solr    ] o.a.z.s.ZooKeeperServer ZKShutdownHandler is not registered, so ZooKeeper server won't take any action on ERROR or SHUTDOWN server state changes
   [junit4]   2> 910983 INFO  (TEST-ZkControllerTest.testNodeNameUrlConversion-seed#[3AEE099F1D713112]) [n:127.0.0.1:8983_solr    ] o.a.s.c.ZkTestServer connecting to 127.0.0.1:46813 46813
   [junit4]   2> 911094 INFO  (Thread-2296) [n:127.0.0.1:8983_solr    ] o.a.s.c.ZkTestServer connecting to 127.0.0.1:46813 46813
   [junit4]   2> 911095 WARN  (Thread-2296) [n:127.0.0.1:8983_solr    ] o.a.s.c.ZkTestServer Watch limit violations: 
   [junit4]   2> Maximum concurrent create/delete watches above limit:
   [junit4]   2> 
   [junit4]   2> 	2	/solr/aliases.json
   [junit4]   2> 
   [junit4]   2> Maximum concurrent data watches above limit:
   [junit4]   2> 
   [junit4]   2> 	2	/solr/clusterstate.json
   [junit4]   2> 	2	/solr/clusterprops.json
   [junit4]   2> 
   [junit4]   2> Maximum concurrent children watches above limit:
   [junit4]   2> 
   [junit4]   2> 	2	/solr/live_nodes
   [junit4]   2> 	2	/solr/collections
   [junit4]   2> 
   [junit4]   2> 911095 INFO  (TEST-ZkControllerTest.testNodeNameUrlConversion-seed#[3AEE099F1D713112]) [n:127.0.0.1:8983_solr    ] o.a.s.SolrTestCaseJ4 ###Ending testNodeNameUrlConversion
   [junit4]   2> 911096 INFO  (TEST-ZkControllerTest.testGetHostName-seed#[3AEE099F1D713112]) [n:127.0.0.1:8983_solr    ] o.a.s.SolrTestCaseJ4 ###Starting testGetHostName
   [junit4]   2> 911096 INFO  (TEST-ZkControllerTest.testGetHostName-seed#[3AEE099F1D713112]) [n:127.0.0.1:8983_solr    ] o.a.s.c.ZkTestServer STARTING ZK TEST SERVER
   [junit4]   2> 911097 INFO  (Thread-2297) [n:127.0.0.1:8983_solr    ] o.a.s.c.ZkTestServer client port:0.0.0.0/0.0.0.0:0
   [junit4]   2> 911097 INFO  (Thread-2297) [n:127.0.0.1:8983_solr    ] o.a.s.c.ZkTestServer Starting server
   [junit4]   2> 911097 ERROR (Thread-2297) [n:127.0.0.1:8983_solr    ] o.a.z.s.ZooKeeperServer ZKShutdownHandler is not registered, so ZooKeeper server won't take any action on ERROR or SHUTDOWN server state changes
   [junit4]   2> 911197 INFO  (TEST-ZkControllerTest.testGetHostName-seed#[3AEE099F1D713112]) [n:127.0.0.1:8983_solr    ] o.a.s.c.ZkTestServer start zk server on port:41745
   [junit4]   2> 911198 INFO  (zkConnectionManagerCallback-1943-thread-1-processing-n:127.0.0.1:8983_solr) [n:127.0.0.1:8983_solr    ] o.a.s.c.c.ConnectionManager zkClient has connected
   [junit4]   2> 911200 INFO  (zkConnectionManagerCallback-1945-thread-1-processing-n:127.0.0.1:8983_solr) [n:127.0.0.1:8983_solr    ] o.a.s.c.c.ConnectionManager zkClient has connected
   [junit4]   2> 911209 INFO  (TEST-ZkControllerTest.testGetHostName-seed#[3AEE099F1D713112]) [n:127.0.0.1:8983_solr    ] o.a.s.c.SolrXmlConfig MBean server found: com.sun.jmx.mbeanserver.JmxMBeanServer@477c9adc, but no JMX reporters were configured - adding default JMX reporter.
   [junit4]   2> 911211 INFO  (zkConnectionManagerCallback-1949-thread-1-processing-n:127.0.0.1:8983_solr) [n:127.0.0.1:8983_solr    ] o.a.s.c.c.ConnectionManager zkClient has connected
   [junit4]   2> 911237 INFO  (TEST-ZkControllerTest.testGetHostName-seed#[3AEE099F1D713112]) [n:127.0.0.1:8983_solr    ] o.a.s.c.Overseer Overseer (id=null) closing
   [junit4]   2> 911237 INFO  (TEST-ZkControllerTest.testGetHostName-seed#[3AEE099F1D713112]) [n:127.0.0.1:8983_solr    ] o.a.s.c.OverseerElectionContext I am going to be the leader 127.0.0.1:8983_solr
   [junit4]   2> 911237 INFO  (TEST-ZkControllerTest.testGetHostName-seed#[3AEE099F1D713112]) [n:127.0.0.1:8983_solr    ] o.a.s.c.Overseer Overseer (id=72220884196261890-127.0.0.1:8983_solr-n_0000000000) starting
   [junit4]   2> 911240 INFO  (TEST-ZkControllerTest.testGetHostName-seed#[3AEE099F1D713112]) [n:127.0.0.1:8983_solr    ] o.a.s.c.ZkController Register node as live in ZooKeeper:/live_nodes/127.0.0.1:8983_solr
   [junit4]   2> 911240 INFO  (TEST-ZkControllerTest.testGetHostName-seed#[3AEE099F1D713112]) [n:127.0.0.1:8983_solr    ] o.a.s.c.Overseer Overseer (id=72220884196261890-127.0.0.1:8983_solr-n_0000000000) closing
   [junit4]   2> 911240 INFO  (zkCallback-1948-thread-1-processing-n:127.0.0.1:8983_solr) [n:127.0.0.1:8983_solr    ] o.a.s.c.c.ZkStateReader Updated live nodes from ZooKeeper... (0) -> (1)
   [junit4]   2> 911240 INFO  (OverseerStateUpdate-72220884196261890-127.0.0.1:8983_solr-n_0000000000) [n:127.0.0.1:8983_solr    ] o.a.s.c.Overseer Overseer Loop exiting : 127.0.0.1:8983_solr
   [junit4]   2> 911241 WARN  (OverseerExitThread) [n:127.0.0.1:8983_solr    ] o.a.s.c.Overseer I'm exiting, but I'm still the leader
   [junit4]   2> 911241 WARN  (zkCallback-1948-thread-1-processing-n:127.0.0.1:8983_solr) [n:127.0.0.1:8983_solr    ] o.a.s.c.c.ZkStateReader ZooKeeper watch triggered, but Solr cannot talk to ZK: [KeeperErrorCode = Session expired for /live_nodes]
   [junit4]   2> 911241 INFO  (TEST-ZkControllerTest.testGetHostName-seed#[3AEE099F1D713112]) [n:127.0.0.1:8983_solr    ] o.a.s.c.CoreContainer Shutting down CoreContainer instance=1116585933
   [junit4]   2> 911241 ERROR (TEST-ZkControllerTest.testGetHostName-seed#[3AEE099F1D713112]) [n:127.0.0.1:8983_solr    ] o.a.s.c.SolrCores No transient handler has been defined. Check solr.xml to see if an attempt to provide a custom TransientSolrCoreCacheFactory was done incorrectly since the default should have been used otherwise.
   [junit4]   2> 911242 ERROR (TEST-ZkControllerTest.testGetHostName-seed#[3AEE099F1D713112]) [n:127.0.0.1:8983_solr    ] o.a.z.s.ZooKeeperServer ZKShutdownHandler is not registered, so ZooKeeper server won't take any action on ERROR or SHUTDOWN server state changes
   [junit4]   2> 911242 INFO  (TEST-ZkControllerTest.testGetHostName-seed#[3AEE099F1D713112]) [n:127.0.0.1:8983_solr    ] o.a.s.c.ZkTestServer connecting to 127.0.0.1:41745 41745
   [junit4]   2> 912741 ERROR (OverseerExitThread) [n:127.0.0.1:8983_solr    ] o.a.s.c.Overseer Could not delete my leader node 
   [junit4]   2> org.apache.zookeeper.KeeperException$SessionExpiredException: KeeperErrorCode = Session expired for /overseer_elect/leader
   [junit4]   2> 	at org.apache.zookeeper.KeeperException.create(KeeperException.java:130)
   [junit4]   2> 	at org.apache.zookeeper.KeeperException.create(KeeperException.java:54)
   [junit4]   2> 	at org.apache.zookeeper.ZooKeeper.delete(ZooKeeper.java:876)
   [junit4]   2> 	at org.apache.solr.common.cloud.SolrZkClient.lambda$delete$1(SolrZkClient.java:244)
   [junit4]   2> 	at org.apache.solr.common.cloud.ZkCmdExecutor.retryOperation(ZkCmdExecutor.java:60)
   [junit4]   2> 	at org.apache.solr.common.cloud.SolrZkClient.delete(SolrZkClient.java:243)
   [junit4]   2> 	at org.apache.solr.cloud.Overseer$ClusterStateUpdater.checkIfIamStillLeader(Overseer.java:317)
   [junit4]   2> 	at java.base/java.lang.Thread.run(Thread.java:844)
   [junit4]   2> 912780 INFO  (Thread-2297) [n:127.0.0.1:8983_solr    ] o.a.s.c.ZkTestServer connecting to 127.0.0.1:41745 41745
   [junit4]   2> 912781 INFO  (TEST-ZkControllerTest.testGetHostName-seed#[3AEE099F1D713112]) [n:127.0.0.1:8983_solr    ] o.a.s.SolrTestCaseJ4 ###Ending testGetHostName
   [junit4]   2> 912782 INFO  (TEST-ZkControllerTest.testPublishAndWaitForDownStates-seed#[3AEE099F1D713112]) [n:127.0.0.1:8983_solr    ] o.a.s.SolrTestCaseJ4 ###Starting testPublishAndWaitForDownStates
   [junit4]   2> 912782 INFO  (TEST-ZkControllerTest.testPublishAndWaitForDownStates-seed#[3AEE099F1D713112]) [n:127.0.0.1:8983_solr    ] o.a.s.c.ZkTestServer STARTING ZK TEST SERVER
   [junit4]   2> 912783 INFO  (Thread-2298) [n:127.0.0.1:8983_solr    ] o.a.s.c.ZkTestServer client port:0.0.0.0/0.0.0.0:0
   [junit4]   2> 912783 INFO  (Thread-2298) [n:127.0.0.1:8983_solr    ] o.a.s.c.ZkTestServer Starting server
   [junit4]   2> 912784 ERROR (Thread-2298) [n:127.0.0.1:8983_solr    ] o.a.z.s.ZooKeeperServer ZKShutdownHandler is not registered, so ZooKeeper server won't take any action on ERROR or SHUTDOWN server state changes
   [junit4]   2> 912883 INFO  (TEST-ZkControllerTest.testPublishAndWaitForDownStates-seed#[3AEE099F1D713112]) [n:127.0.0.1:8983_solr    ] o.a.s.c.ZkTestServer start zk server on port:46119
   [junit4]   2> 912884 INFO  (zkConnectionManagerCallback-1953-thread-1-processing-n:127.0.0.1:8983_solr) [n:127.0.0.1:8983_solr    ] o.a.s.c.c.ConnectionManager zkClient has connected
   [junit4]   2> 912887 INFO  (zkConnectionManagerCallback-1955-thread-1-processing-n:127.0.0.1:8983_solr) [n:127.0.0.1:8983_solr    ] o.a.s.c.c.ConnectionManager zkClient has connected
   [junit4]   2> 912890 INFO  (TEST-ZkControllerTest.testPublishAndWaitForDownStates-seed#[3AEE099F1D713112]) [n:127.0.0.1:8983_solr    ] o.a.s.c.SolrXmlConfig MBean server found: com.sun.jmx.mbeanserver.JmxMBeanServer@477c9adc, but no JMX reporters were configured - adding default JMX reporter.
   [junit4]   2> 912891 INFO  (zkConnectionManagerCallback-1959-thread-1-processing-n:127.0.0.1:8983_solr) [n:127.0.0.1:8983_solr    ] o.a.s.c.c.ConnectionManager zkClient has connected
   [junit4]   2> 912917 INFO  (TEST-ZkControllerTest.testPublishAndWaitForDownStates-seed#[3AEE099F1D713112]) [n:127.0.0.1:8983_solr    ] o.a.s.c.Overseer Overseer (id=null) closing
   [junit4]   2> 912917 INFO  (TEST-ZkControllerTest.testPublishAndWaitForDownStates-seed#[3AEE099F1D713112]) [n:127.0.0.1:8983_solr    ] o.a.s.c.OverseerElectionContext I am going to be the leader 127.0.0.1:8983_solr
   [junit4]   2> 912917 INFO  (TEST-ZkControllerTest.testPublishAndWaitForDownStates-seed#[3AEE099F1D713112]) [n:127.0.0.1:8983_solr    ] o.a.s.c.Overseer Overseer (id=72220884306755586-127.0.0.1:8983_solr-n_0000000000) starting
   [junit4]   2> 912920 INFO  (TEST-ZkControllerTest.testPublishAndWaitForDownStates-seed#[3AEE099F1D713112]) [n:127.0.0.1:8983_solr    ] o.a.s.c.ZkController Register node as live in ZooKeeper:/live_nodes/127.0.0.1:8983_solr
   [junit4]   2> 912920 INFO  (OverseerStateUpdate-72220884306755586-127.0.0.1:8983_solr-n_0000000000) [n:127.0.0.1:8983_solr    ] o.a.s.c.c.ZkStateReader Updated live nodes from ZooKeeper... (0) -> (1)
   [junit4]   2> 912921 INFO  (TEST-ZkControllerTest.testPublishAndWaitForDownStates-seed#[3AEE099F1D713112]) [n:127.0.0.1:8983_solr    ] o.a.s.c.Overseer Overseer (id=72220884306755586-127.0.0.1:8983_solr-n_0000000000) closing
   [junit4]   2> 912922 WARN  (OverseerAutoScalingTriggerThread-72220884306755586-127.0.0.1:8983_solr-n_0000000000) [n:127.0.0.1:8983_solr    ] o.a.s.c.a.OverseerTriggerThread OverseerTriggerThread woken up but we are closed, exiting.
   [junit4]   2> 912922 INFO  (OverseerStateUpdate-72220884306755586-127.0.0.1:8983_solr-n_0000000000) [n:127.0.0.1:8983_solr    ] o.a.s.c.Overseer Overseer Loop exiting : 127.0.0.1:8983_solr
   [junit4]   2> 912923 WARN  (OverseerExitThread) [n:127.0.0.1:8983_solr    ] o.a.s.c.Overseer I'm exiting, but I'm still the leader
   [junit4]   2> 912923 ERROR (OverseerExitThread) [n:127.0.0.1:8983_solr    ] o.a.s.c.Overseer Could not delete my leader node 
   [junit4]   2> org.apache.zookeeper.KeeperException$SessionExpiredException: KeeperErrorCode = Session expired for /overseer_elect/leader
   [junit4]   2> 	at org.apache.zookeeper.KeeperException.create(KeeperException.java:130)
   [junit4]   2> 	at org.apache.zookeeper.KeeperException.create(KeeperException.java:54)
   [junit4]   2> 	at org.apache.zookeeper.ZooKeeper.delete(ZooKeeper.java:876)
   [junit4]   2> 	at org.apache.solr.common.cloud.SolrZkClient.lambda$delete$1(SolrZkClient.java:244)
   [junit4]   2> 	at org.apache.solr.common.cloud.ZkCmdExecutor.retryOperation(ZkCmdExecutor.java:60)
   [junit4]   2> 	at org.apache.solr.common.cloud.SolrZkClient.delete(SolrZkClient.java:243)
   [junit4]   2> 	at org.apache.solr.cloud.Overseer$ClusterStateUpdater.checkIfIamStillLeader(Overseer.java:317)
   [junit4]   2> 	at java.base/java.lang.Thread.run(Thread.java:844)
   [junit4]   2> 912923 WARN  (zkCallback-1958-thread-1-processing-n:127.0.0.1:8983_solr) [n:127.0.0.1:8983_solr    ] o.a.s.c.c.ZkStateReader ZooKeeper watch triggered, but Solr cannot talk to ZK: [KeeperErrorCode = Session expired for /live_nodes]
   [junit4]   2> 912923 WARN  (OverseerExitThread) [n:127.0.0.1:8983_solr    ] o.a.s.c.Overseer Unable to rejoinElection 
   [junit4]   2> org.apache.solr.common.SolrException: Unable to rejoin election
   [junit4]   2> 	at org.apache.solr.cloud.ZkController.rejoinOverseerElection(ZkController.java:2053)
   [junit4]   2> 	at org.apache.solr.cloud.Overseer$ClusterStateUpdater.checkIfIamStillLeader(Overseer.java:331)
   [junit4]   2> 	at java.base/java.lang.Thread.run(Thread.java:844)
   [junit4]   2> Caused by: org.apache.solr.common.SolrException: org.apache.zookeeper.KeeperException$SessionExpiredException: KeeperErrorCode = Session expired for /overseer_elect
   [junit4]   2> 	at org.apache.solr.cloud.OverseerElectionContext.<init>(ElectionContext.java:791)
   [junit4]   2> 	at org.apache.solr.cloud.OverseerElectionContext.copy(ElectionContext.java:834)
   [junit4]   2> 	at org.apache.solr.cloud.LeaderElector.retryElection(LeaderElector.java:385)
   [junit4]   2> 	at org.apache.solr.cloud.ZkController.rejoinOverseerElection(ZkController.java:2050)
   [junit4]   2> 	... 2 more
   [junit4]   2> Caused by: org.apache.zookeeper.KeeperException$SessionExpiredException: KeeperErrorCode = Session expired for /overseer_elect
   [junit4]   2> 	at org.apache.zookeeper.KeeperException.create(KeeperException.java:130)
   [junit4]   2> 	at org.apache.zookeeper.KeeperException.create(KeeperException.java:54)
   [junit4]   2> 	at org.apache.zookeeper.ZooKeeper.exists(ZooKeeper.java:1105)
   [junit4]   2> 	at org.apache.solr.common.cloud.SolrZkClient.lambda$exists$3(SolrZkClient.java:316)
   [junit4]   2> 	at org.apache.solr.common.cloud.ZkCmdExecutor.retryOperation(ZkCmdExecutor.java:60)
   [junit4]   2> 	at org.apache.solr.common.cloud.SolrZkClient.exists(SolrZkClient.java:316)
   [junit4]   2> 	at org.apache.solr.common.cloud.ZkCmdExecutor.ensureExists(ZkCmdExecutor.java:93)
   [junit4]   2> 	at org.apache.solr.common.cloud.ZkCmdExecutor.ensureExists(ZkCmdExecutor.java:78)
   [junit4]   2> 	at org.apache.solr.cloud.OverseerElectionContext.<init>(ElectionContext.java:789)
   [junit4]   2> 	... 5 more
   [junit4]   2> 912923 INFO  (TEST-ZkControllerTest.testPublishAndWaitForDownStates-seed#[3AEE099F1D713112]) [n:127.0.0.1:8983_solr    ] o.a.s.c.CoreContainer Shutting down CoreContainer instance=1093154942
   [junit4]   2> 912923 ERROR (TEST-ZkControllerTest.testPublishAndWaitForDownStates-seed#[3AEE099F1D713112]) [n:127.0.0.1:8983_solr    ] o.a.s.c.SolrCores No transient handler has been defined. Check solr.xml to see if an attempt to provide a custom TransientSolrCoreCacheFactory was done incorrectly since the default should have been used otherwise.
   [junit4]   2> 912923 ERROR (TEST-ZkControllerTest.testPublishAndWaitForDownStates-seed#[3AEE099F1D713112]) [n:127.0.0.1:8983_solr    ] o.a.z.s.ZooKeeperServer ZKShutdownHandler is not registered, so ZooKeeper server won't take any action on ERROR or SHUTDOWN server state changes
   [junit4]   2> 912924 INFO  (TEST-ZkControllerTest.testPublishAndWaitForDownStates-seed#[3AEE099F1D713112]) [n:127.0.0.1:8983_solr    ] o.a.s.c.ZkTestServer connecting to 127.0.0.1:46119 46119
   [junit4]   2> 913031 INFO  (Thread-2298) [n:127.0.0.1:8983_solr    ] o.a.s.c.ZkTestServer connecting to 127.0.0.1:46119 46119
   [junit4]   2> 913032 INFO  (TEST-ZkControllerTest.testPublishAndWaitForDownStates-seed#[3AEE099F1D713112]) [n:127.0.0.1:8983_solr    ] o.a.s.SolrTestCaseJ4 ###Ending testPublishAndWaitForDownStates
   [junit4]   2> NOTE: reproduce with: ant test  -Dtestcase=ZkControllerTest -Dtests.method=testPublishAndWaitForDownStates -Dtests.seed=3AEE099F1D713112 -Dtests.multiplier=3 -Dtests.slow=true -Dtests.locale=ar-MA -Dtests.timezone=America/Eirunepe -Dtests.asserts=true -Dtests.file.encoding=US-ASCII
   [junit4] FAILURE 0.25s J1 | ZkControllerTest.testPublishAndWaitForDownStates <<<
   [junit4]    > Throwable #1: java.lang.AssertionError: The ZkController.publishAndWaitForDownStates should have timed out but it didn't
   [junit4]    > 	at __randomizedtesting.SeedInfo.seed([3AEE099F1D713112:1DE16573BCE67E2D]:0)
   [junit4]    > 	at org.apache.solr.cloud.ZkControllerTest.testPublishAndWaitForDownStates(ZkControllerTest.java:306)
   [junit4]    > 	at java.base/jdk.internal.reflect.NativeMethodAccessorImpl.invoke0(Native Method)
   [junit4]    > 	at java.base/jdk.internal.reflect.NativeMethodAccessorImpl.invoke(NativeMethodAccessorImpl.java:62)
   [junit4]    > 	at java.base/jdk.internal.reflect.DelegatingMethodAccessorImpl.invoke(DelegatingMethodAccessorImpl.java:43)
   [junit4]    > 	at java.base/java.lang.reflect.Method.invoke(Method.java:564)
   [junit4]    > 	at java.base/java.lang.Thread.run(Thread.java:844)
   [junit4]   2> NOTE: leaving temporary files on disk at: /home/jenkins/workspace/Lucene-Solr-7.x-Linux/solr/build/solr-core/test/J1/temp/solr.cloud.ZkControllerTest_3AEE099F1D713112-001
   [junit4]   2> NOTE: test params are: codec=Asserting(Lucene70): {}, docValues:{}, maxPointsInLeafNode=980, maxMBSortInHeap=7.7476494842234285, sim=RandomSimilarity(queryNorm=true): {}, locale=ar-MA, timezone=America/Eirunepe
   [junit4]   2> NOTE: Linux 4.13.0-32-generic amd64/Oracle Corporation 9.0.4 (64-bit)/cpus=8,threads=1,free=361959248,total=536870912
   [junit4]   2> NOTE: All tests run in this JVM: [SyncSliceTest, SolrInfoBeanTest, AddReplicaTest, ConfigSetsAPITest, TestPartialUpdateDeduplication, CSVRequestHandlerTest, TestSolrCoreSnapshots, DistributedQueryComponentOptimizationTest, TestDynamicFieldCollectionResource, TestFieldResource, TermsComponentTest, BitVectorTest, TestRandomRequestDistribution, SortSpecParsingTest, QueryParsingTest, TestUninvertingReader, SliceStateTest, DistributedFacetPivotSmallTest, ReplaceNodeNoTargetTest, TestManagedStopFilterFactory, TestComplexPhraseLeadingWildcard, FastVectorHighlighterTest, SpatialHeatmapFacetsTest, HttpTriggerListenerTest, TestLegacyFieldCache, TestStressVersions, TestSweetSpotSimilarityFactory, CdcrRequestHandlerTest, ZkStateReaderTest, CollectionsAPIDistributedZkTest, TestSimpleTrackingShardHandler, IndexSchemaTest, TestLRUStatsCache, TestReqParamsAPI, TestNestedDocsSort, TestElisionMultitermQuery, TestFunctionQuery, HttpSolrCallGetCoreTest, ChaosMonkeySafeLeaderTest, TestRecovery, DistributedFacetSimpleRefinementLongTailTest, TestRawTransformer, CollectionReloadTest, TestComputePlanAction, TestSSLRandomization, TestRuleBasedAuthorizationPlugin, TestDirectoryFactory, TestCoreBackup, SaslZkACLProviderTest, JvmMetricsTest, TestTolerantUpdateProcessorCloud, PolyFieldTest, TestQueryUtils, HighlighterMaxOffsetTest, TestCollectionAPI, SimplePostToolTest, TestSolrIndexConfig, PrimitiveFieldTypeTest, PropertiesRequestHandlerTest, TestFileDictionaryLookup, SolrJmxReporterTest, RestartWhileUpdatingTest, RequiredFieldsTest, TestBM25SimilarityFactory, TestSystemCollAutoCreate, UpdateLogTest, EnumFieldTest, TestLeaderElectionZkExpiry, SolrIndexMetricsTest, TestLRUCache, SchemaApiFailureTest, TestSystemIdResolver, CdcrUpdateLogTest, SignatureUpdateProcessorFactoryTest, TestMacroExpander, TestSolrJ, TestRTGBase, TestPerFieldSimilarityWithDefaultOverride, JsonLoaderTest, AutoAddReplicasIntegrationTest, TestDeleteCollectionOnDownNodes, SuggesterFSTTest, ClassificationUpdateProcessorIntegrationTest, TestConfigSetsAPIExclusivity, AutoscalingHistoryHandlerTest, PeerSyncReplicationTest, SuggesterTest, TestEmbeddedSolrServerAdminHandler, TestPerFieldSimilarity, HighlighterTest, TestMiniSolrCloudClusterSSL, TestFoldingMultitermQuery, TestConfigOverlay, TestStressRecovery, TestReloadAndDeleteDocs, SolrShardReporterTest, TestSearchPerf, DeleteStatusTest, TestSchemaVersionResource, TestNumericRangeQuery64, TestCursorMarkWithoutUniqueKey, HdfsThreadLeakTest, TestReversedWildcardFilterFactory, QueryElevationComponentTest, ZkControllerTest]
   [junit4] Completed [192/777 (1!)] on J1 in 7.48s, 4 tests, 1 failure <<< FAILURES!

[...truncated 91 lines...]
   [junit4] Suite: org.apache.solr.core.TestJmxIntegration
   [junit4]   2> Creating dataDir: /home/jenkins/workspace/Lucene-Solr-7.x-Linux/solr/build/solr-core/test/J2/temp/solr.core.TestJmxIntegration_3AEE099F1D713112-001/init-core-data-001
   [junit4]   2> 1142808 INFO  (SUITE-TestJmxIntegration-seed#[3AEE099F1D713112]-worker) [    ] o.a.s.SolrTestCaseJ4 Using PointFields (NUMERIC_POINTS_SYSPROP=true) w/NUMERIC_DOCVALUES_SYSPROP=false
   [junit4]   2> 1142809 INFO  (SUITE-TestJmxIntegration-seed#[3AEE099F1D713112]-worker) [    ] o.a.s.SolrTestCaseJ4 Randomized ssl (true) and clientAuth (false) via: @org.apache.solr.util.RandomizeSSL(reason="", ssl=0.0/0.0, value=0.0/0.0, clientAuth=0.0/0.0)
   [junit4]   2> 1142809 INFO  (SUITE-TestJmxIntegration-seed#[3AEE099F1D713112]-worker) [    ] o.a.s.SolrTestCaseJ4 SecureRandom sanity checks: test.solr.allowed.securerandom=null & java.security.egd=file:/dev/./urandom
   [junit4]   2> 1142810 INFO  (SUITE-TestJmxIntegration-seed#[3AEE099F1D713112]-worker) [    ] o.a.s.SolrTestCaseJ4 ####initCore
   [junit4]   2> 1142810 INFO  (SUITE-TestJmxIntegration-seed#[3AEE099F1D713112]-worker) [    ] o.a.s.c.SolrResourceLoader [null] Added 2 libs to classloader, from paths: [/home/jenkins/workspace/Lucene-Solr-7.x-Linux/solr/core/src/test-files/solr/collection1/lib, /home/jenkins/workspace/Lucene-Solr-7.x-Linux/solr/core/src/test-files/solr/collection1/lib/classes]
   [junit4]   2> 1142824 INFO  (SUITE-TestJmxIntegration-seed#[3AEE099F1D713112]-worker) [    ] o.a.s.c.SolrConfig Using Lucene MatchVersion: 7.3.0
   [junit4]   2> 1142837 INFO  (SUITE-TestJmxIntegration-seed#[3AEE099F1D713112]-worker) [    ] o.a.s.s.IndexSchema [null] Schema name=test
   [junit4]   2> 1142936 INFO  (SUITE-TestJmxIntegration-seed#[3AEE099F1D713112]-worker) [    ] o.a.s.s.IndexSchema Loaded schema test/1.0 with uniqueid field id
   [junit4]   2> 1142963 INFO  (SUITE-TestJmxIntegration-seed#[3AEE099F1D713112]-worker) [    ] o.a.s.m.r.SolrJmxReporter JMX monitoring for 'solr.node' (registry 'solr.node') enabled at server: com.sun.jmx.mbeanserver.JmxMBeanServer@2c91fbac
   [junit4]   2> 1142969 INFO  (SUITE-TestJmxIntegration-seed#[3AEE099F1D713112]-worker) [    ] o.a.s.m.r.SolrJmxReporter JMX monitoring for 'solr.jvm' (registry 'solr.jvm') enabled at server: com.sun.jmx.mbeanserver.JmxMBeanServer@2c91fbac
   [junit4]   2> 1142969 INFO  (SUITE-TestJmxIntegration-seed#[3AEE099F1D713112]-worker) [    ] o.a.s.m.r.SolrJmxReporter JMX monitoring for 'solr.jetty' (registry 'solr.jetty') enabled at server: com.sun.jmx.mbeanserver.JmxMBeanServer@2c91fbac
   [junit4]   2> 1142970 INFO  (coreLoadExecutor-2920-thread-1) [    ] o.a.s.c.TransientSolrCoreCacheDefault Allocating transient cache for 2147483647 transient cores
   [junit4]   2> 1142970 INFO  (coreLoadExecutor-2920-thread-1) [    x:collection1] o.a.s.c.SolrResourceLoader [null] Added 2 libs to classloader, from paths: [/home/jenkins/workspace/Lucene-Solr-7.x-Linux/solr/core/src/test-files/solr/collection1/lib, /home/jenkins/workspace/Lucene-Solr-7.x-Linux/solr/core/src/test-files/solr/collection1/lib/classes]
   [junit4]   2> 1142985 INFO  (coreLoadExecutor-2920-thread-1) [    x:collection1] o.a.s.c.SolrConfig Using Lucene MatchVersion: 7.3.0
   [junit4]   2> 1143000 INFO  (coreLoadExecutor-2920-thread-1) [    x:collection1] o.a.s.s.IndexSchema [collection1] Schema name=test
   [junit4]   2> 1143073 INFO  (coreLoadExecutor-2920-thread-1) [    x:collection1] o.a.s.s.IndexSchema Loaded schema test/1.0 with uniqueid field id
   [junit4]   2> 1143078 INFO  (coreLoadExecutor-2920-thread-1) [    x:collection1] o.a.s.c.CoreContainer Creating SolrCore 'collection1' using configuration from instancedir /home/jenkins/workspace/Lucene-Solr-7.x-Linux/solr/core/src/test-files/solr/collection1, trusted=true
   [junit4]   2> 1143078 INFO  (coreLoadExecutor-2920-thread-1) [    x:collection1] o.a.s.m.r.SolrJmxReporter JMX monitoring for 'solr.core.collection1' (registry 'solr.core.collection1') enabled at server: com.sun.jmx.mbeanserver.JmxMBeanServer@2c91fbac
   [junit4]   2> 1143078 INFO  (coreLoadExecutor-2920-thread-1) [    x:collection1] o.a.s.c.SolrCore solr.RecoveryStrategy.Builder
   [junit4]   2> 1143078 INFO  (coreLoadExecutor-2920-thread-1) [    x:collection1] o.a.s.c.SolrCore [[collection1] ] Opening new SolrCore at [/home/jenkins/workspace/Lucene-Solr-7.x-Linux/solr/core/src/test-files/solr/collection1], dataDir=[/home/jenkins/workspace/Lucene-Solr-7.x-Linux/solr/build/solr-core/test/J2/temp/solr.core.TestJmxIntegration_3AEE099F1D713112-001/init-core-data-001/]
   [junit4]   2> 1143079 INFO  (coreLoadExecutor-2920-thread-1) [    x:collection1] o.a.s.u.RandomMergePolicy RandomMergePolicy wrapping class org.apache.lucene.index.LogByteSizeMergePolicy: [LogByteSizeMergePolicy: minMergeSize=1677721, mergeFactor=35, maxMergeSize=2147483648, maxMergeSizeForForcedMerge=9223372036854775807, calibrateSizeByDeletes=false, maxMergeDocs=2147483647, maxCFSSegmentSizeMB=8.796093022207999E12, noCFSRatio=1.0]
   [junit4]   2> 1143110 INFO  (coreLoadExecutor-2920-thread-1) [    x:collection1] o.a.s.u.UpdateHandler Using UpdateLog implementation: org.apache.solr.update.UpdateLog
   [junit4]   2> 1143110 INFO  (coreLoadExecutor-2920-thread-1) [    x:collection1] o.a.s.u.UpdateLog Initializing UpdateLog: dataDir= defaultSyncLevel=FLUSH numRecordsToKeep=100 maxNumLogsToKeep=10 numVersionBuckets=65536
   [junit4]   2> 1143115 INFO  (coreLoadExecutor-2920-thread-1) [    x:collection1] o.a.s.u.CommitTracker Hard AutoCommit: disabled
   [junit4]   2> 1143115 INFO  (coreLoadExecutor-2920-thread-1) [    x:collection1] o.a.s.u.CommitTracker Soft AutoCommit: disabled
   [junit4]   2> 1143116 INFO  (coreLoadExecutor-2920-thread-1) [    x:collection1] o.a.s.u.RandomMergePolicy RandomMergePolicy wrapping class org.apache.lucene.index.TieredMergePolicy: [TieredMergePolicy: maxMergeAtOnce=17, maxMergeAtOnceExplicit=26, maxMergedSegmentMB=62.3857421875, floorSegmentMB=0.3955078125, forceMergeDeletesPctAllowed=10.967961453247748, segmentsPerTier=28.0, maxCFSSegmentSizeMB=8.796093022207999E12, noCFSRatio=0.0
   [junit4]   2> 1143116 INFO  (coreLoadExecutor-2920-thread-1) [    x:collection1] o.a.s.s.SolrIndexSearcher Opening [Searcher@6bfb586[collection1] main]
   [junit4]   2> 1143117 INFO  (coreLoadExecutor-2920-thread-1) [    x:collection1] o.a.s.h.c.SpellCheckComponent Initializing spell checkers
   [junit4]   2> 1143283 INFO  (coreLoadExecutor-2920-thread-1) [    x:collection1] o.a.s.s.DirectSolrSpellChecker init: {name=direct,classname=DirectSolrSpellChecker,field=lowerfilt,minQueryLength=3}
   [junit4]   2> 1143690 INFO  (coreLoadExecutor-2920-thread-1) [    x:collection1] o.a.s.h.ReplicationHandler Commits will be reserved for 10000ms.
   [junit4]   2> 1143690 INFO  (searcherExecutor-2921-thread-1-processing-x:collection1) [    x:collection1] o.a.s.h.c.SpellCheckComponent Loading spell index for spellchecker: default
   [junit4]   2> 1143691 INFO  (coreLoadExecutor-2920-thread-1) [    x:collection1] o.a.s.u.UpdateLog Could not find max version in index or recent updates, using new clock 1593551021050691584
   [junit4]   2> 1143691 INFO  (searcherExecutor-2921-thread-1-processing-x:collection1) [    x:collection1] o.a.s.h.c.SpellCheckComponent Loading spell index for spellchecker: direct
   [junit4]   2> 1143691 INFO  (searcherExecutor-2921-thread-1-processing-x:collection1) [    x:collection1] o.a.s.h.c.SpellCheckComponent Loading spell index for spellchecker: wordbreak
   [junit4]   2> 1143691 INFO  (searcherExecutor-2921-thread-1-processing-x:collection1) [    x:collection1] o.a.s.h.c.SpellCheckComponent Loading spell index for spellchecker: multipleFields
   [junit4]   2> 1143691 INFO  (searcherExecutor-2921-thread-1-processing-x:collection1) [    x:collection1] o.a.s.h.c.SpellCheckComponent Loading spell index for spellchecker: jarowinkler
   [junit4]   2> 1143691 INFO  (searcherExecutor-2921-thread-1-processing-x:collection1) [    x:collection1] o.a.s.h.c.SpellCheckComponent Loading spell index for spellchecker: external
   [junit4]   2> 1143691 INFO  (searcherExecutor-2921-thread-1-processing-x:collection1) [    x:collection1] o.a.s.h.c.SpellCheckComponent Loading spell index for spellchecker: freq
   [junit4]   2> 1143692 INFO  (searcherExecutor-2921-thread-1-processing-x:collection1) [    x:collection1] o.a.s.h.c.SpellCheckComponent Loading spell index for spellchecker: fqcn
   [junit4]   2> 1143692 INFO  (searcherExecutor-2921-thread-1-processing-x:collection1) [    x:collection1] o.a.s.h.c.SpellCheckComponent Loading spell index for spellchecker: perDict
   [junit4]   2> 1143692 INFO  (searcherExecutor-2921-thread-1-processing-x:collection1) [    x:collection1] o.a.s.c.SolrCore [collection1] Registered new searcher Searcher@6bfb586[collection1] main{ExitableDirectoryReader(UninvertingDirectoryReader())}
   [junit4]   2> 1143692 INFO  (SUITE-TestJmxIntegration-seed#[3AEE099F1D713112]-worker) [    ] o.a.s.SolrTestCaseJ4 ####initCore end
   [junit4]   2> 1143694 INFO  (TEST-TestJmxIntegration.testJmxUpdate-seed#[3AEE099F1D713112]) [    ] o.a.s.SolrTestCaseJ4 ###Starting testJmxUpdate
   [junit4]   2> 1143709 INFO  (TEST-TestJmxIntegration.testJmxUpdate-seed#[3AEE099F1D713112]) [    ] o.a.s.c.TestJmxIntegration Mbeans in server: [solr:dom1=jvm,name0=memory,name1=pools,name2=G1-Survivor-Space,name=used-after-gc, solr:dom1=core,dom2=collection1,category=QUERY,scope=/terms,name=serverErrors, solr:dom1=core,dom2=collection1,category=QUERY,scope=/dismax,name=handlerStart, solr:dom1=core,dom2=collection1,category=QUERY,scope=/mock,name=requests, java.lang:type=Threading, solr:dom1=node,category=QUERY,scope=/admin/metrics/collector,name=handlerStart, solr:dom1=node,category=ADMIN,scope=/admin/metrics,name=requests, solr:dom1=core,dom2=collection1,category=ADMIN,scope=/admin/mbeans,name=shardRequests, solr_37093:dom1=solr,dom2=jvm,name0=system,name=properties, solr_43183:dom1=solr,dom2=jvm,name0=system,name=properties, solr:dom1=core,dom2=collection1,category=QUERY,scope=/mock,name=errors, solr:dom1=jvm,name0=os,name=systemLoadAverage, solr:dom1=core,dom2=collection1,category=QUERY,scope=/get,name=errors, solr:dom1=core,dom2=collection1,category=QUERY,scope=/spellCheckCompRH1,name=requestTimes, solr:dom1=core,dom2=collection1,category=QUERY,scope=/defaults,name=serverErrors, solr:dom1=core,dom2=collection1,category=QUERY,scope=/search-facet-def,name=requestTimes, solr:dom1=core,dom2=collection1,category=UPDATE,scope=update,name=requestTimes, solr:dom1=core,dom2=collection1,category=UPDATE,scope=/update,name=timeouts, solr:dom1=core,dom2=collection1,category=QUERY,scope=/spellCheckWithWordbreak,name=shardRequests, solr:dom1=node,category=UPDATE,scope=updateShardHandler,name=threadPool.updateExecutor.running, solr:dom1=node,category=QUERY,scope=httpShardHandler,name=threadPool.httpShardExecutor.duration, solr:dom1=core,dom2=collection1,category=QUERY,scope=/mock,name=handlerStart, solr:dom1=node,category=ADMIN,scope=/admin/metrics,name=serverErrors, solr:dom1=core,dom2=collection1,category=UPDATE,scope=/update,name=handlerStart, solr:dom1=jvm,name0=buffers,name1=mapped,name=TotalCapacity, solr:dom1=core,dom2=collection1,category=UPDATE,scope=/update,name=totalTime, solr:dom1=core,dom2=collection1,category=ADMIN,scope=/admin/luke,name=requests, solr_37853:dom1=solr,dom2=jvm,name0=system,name=properties, solr:dom1=jvm,name0=memory,name1=pools,name2=CodeHeap-'non-profiled-nmethods',name=usage, solr:dom1=core,dom2=collection1,category=QUERY,scope=/search-facet-def,name=timeouts, solr:dom1=core,dom2=collection1,category=UPDATE,scope=updateHandler,name=rollbacks, solr_44399:dom1=solr,dom2=jvm,name0=system,name=properties, solr:dom1=node,category=UPDATE,scope=updateShardHandler,name=threadPool.recoveryExecutor.submitted, solr:dom1=node,category=ADMIN,scope=/admin/cores,name=serverErrors, solr:dom1=core,dom2=collection1,category=QUERY,scope=/stream,name=requestTimes, solr:dom1=core,dom2=collection1,category=ADMIN,scope=/admin/system,name=shardRequests, solr:dom1=core,dom2=collection1,category=QUERY,scope=/dismax,name=clientErrors, solr:dom1=node,category=CONTAINER,scope=threadPool,name=coreContainerWorkExecutor.running, solr:dom1=core,dom2=collection1,category=QUERY,scope=/graph,name=clientErrors, solr:dom1=core,dom2=collection1,category=UPDATE,scope=/update/json,name=timeouts, solr:dom1=core,dom2=collection1,category=QUERY,scope=/terms,name=timeouts, solr:dom1=core,dom2=collection1,category=QUERY,scope=/mltrh,name=shardRequests, solr:dom1=node,category=ADMIN,scope=/admin/collections,name=requestTimes, solr_37731:dom1=solr,dom2=jvm,name0=system,name=properties, solr:dom1=core,dom2=collection1,category=SEARCHER,scope=searcher,name=reader, solr:dom1=core,dom2=collection1,category=HIGHLIGHTER,scope=SolrFragmenter,name=gap.requests, solr_42867:dom1=solr,dom2=jvm,name0=system,name=properties, solr:dom1=core,dom2=collection1,category=QUERY,scope=/export,name=requestTimes, solr:dom1=core,dom2=collection1,category=HIGHLIGHTER,scope=SolrBoundaryScanner,name=breakIterator.requests, solr:dom1=node,category=ADMIN,scope=/admin/authorization,name=requestTimes, solr:dom1=core,dom2=collection1,category=QUERY,scope=/debug/dump,name=shardRequests, solr:dom1=node,category=ADMIN,scope=/admin/collections,name=handlerStart, solr:dom1=core,dom2=collection1,category=ADMIN,scope=/admin/segments,name=totalTime, solr:dom1=node,category=ADMIN,scope=/admin/autoscaling/history,name=clientErrors, solr:dom1=core,dom2=collection1,category=ADMIN,scope=/admin/ping,name=errors, solr:dom1=core,dom2=collection1,category=ADMIN,scope=/schema,name=clientErrors, solr:dom1=core,dom2=collection1,category=QUERY,scope=/stream,name=timeouts, solr_42529:dom1=solr,dom2=jvm,name0=system,name=properties, solr:dom1=core,dom2=collection1,category=UPDATE,scope=updateHandler,name=errors, solr:dom1=jvm,name0=memory,name1=pools,name2=G1-Eden-Space,name=init, solr:dom1=core,dom2=collection1,category=ADMIN,scope=/admin/file,name=errors, solr:dom1=core,dom2=collection1,category=QUERY,scope=/sql,name=requests, solr:dom1=core,dom2=collection1,category=ADMIN,scope=/admin/logging,name=shardRequests, solr:dom1=core,dom2=collection1,category=TLOG,name=state, solr:dom1=core,dom2=collection1,category=CORE,scope=fs,name=spins, solr_42677:dom1=solr,dom2=jvm,name0=system,name=properties, solr:dom1=jvm,name0=buffers,name1=direct,name=MemoryUsed, solr:dom1=jvm,name0=classes,name=unloaded, solr:dom1=jvm,name0=threads,name1=waiting,name=count, solr:dom1=core,dom2=collection1,category=QUERY,scope=/search-facet-def,name=errors, solr:dom1=node,category=ADMIN,scope=/admin/cores,name=threadPool.parallelCoreAdminExecutor.submitted, solr_45135:dom1=solr,dom2=jvm,name0=system,name=properties, solr:dom1=core,dom2=collection1,category=TLOG,scope=replay,name=remaining.bytes, so

[...truncated too long message...]

 [    ] o.a.s.l.TestLTRReRankingPipeline doc 0 in pos 0
   [junit4]   2> NOTE: reproduce with: ant test  -Dtestcase=TestLTRReRankingPipeline -Dtests.method=testDifferentTopN -Dtests.seed=14E5015B295B2A13 -Dtests.multiplier=3 -Dtests.slow=true -Dtests.locale=pt-AO -Dtests.timezone=BET -Dtests.asserts=true -Dtests.file.encoding=UTF-8
   [junit4] FAILURE 0.32s J0 | TestLTRReRankingPipeline.testDifferentTopN <<<
   [junit4]    > Throwable #1: java.lang.AssertionError: expected:<1.0> but was:<0.0>
   [junit4]    > 	at __randomizedtesting.SeedInfo.seed([14E5015B295B2A13:E544730B1CE0E081]:0)
   [junit4]    > 	at org.apache.solr.ltr.TestLTRReRankingPipeline.testDifferentTopN(TestLTRReRankingPipeline.java:255)
   [junit4]    > 	at java.base/jdk.internal.reflect.NativeMethodAccessorImpl.invoke0(Native Method)
   [junit4]    > 	at java.base/jdk.internal.reflect.NativeMethodAccessorImpl.invoke(NativeMethodAccessorImpl.java:62)
   [junit4]    > 	at java.base/jdk.internal.reflect.DelegatingMethodAccessorImpl.invoke(DelegatingMethodAccessorImpl.java:43)
   [junit4]    > 	at java.base/java.lang.reflect.Method.invoke(Method.java:564)
   [junit4]    > 	at java.base/java.lang.Thread.run(Thread.java:844)
   [junit4] OK      0.05s J0 | TestLTRReRankingPipeline.testRescorer
   [junit4]   2> NOTE: test params are: codec=Asserting(Lucene70): {field=PostingsFormat(name=LuceneFixedGap), id=PostingsFormat(name=LuceneVarGapDocFreqInterval), final-score=PostingsFormat(name=LuceneVarGapDocFreqInterval)}, docValues:{final-score=DocValuesFormat(name=Lucene70)}, maxPointsInLeafNode=1085, maxMBSortInHeap=7.538630838258374, sim=RandomSimilarity(queryNorm=false): {field=IB SPL-D2}, locale=pt-AO, timezone=BET
   [junit4]   2> NOTE: Linux 4.13.0-32-generic amd64/Oracle Corporation 9.0.4 (64-bit)/cpus=8,threads=1,free=511183712,total=536870912
   [junit4]   2> NOTE: All tests run in this JVM: [TestLTRReRankingPipeline]
   [junit4] Completed [3/5 (3!)] on J0 in 1.40s, 3 tests, 1 failure <<< FAILURES!
   [junit4] 
   [junit4] Duplicate suite name used with XML reports: org.apache.solr.ltr.TestLTRReRankingPipeline. This may confuse tools that process XML reports. Set 'ignoreDuplicateSuites' to true to skip this message.
   [junit4] Suite: org.apache.solr.ltr.TestLTRReRankingPipeline
   [junit4] OK      0.01s J1 | TestLTRReRankingPipeline.testDocParam
   [junit4]   2> 1275 INFO  (TEST-TestLTRReRankingPipeline.testDifferentTopN-seed#[14E5015B295B2A13]) [    ] o.a.s.l.TestLTRReRankingPipeline rerank 1 documents 
   [junit4]   2> 1276 INFO  (TEST-TestLTRReRankingPipeline.testDifferentTopN-seed#[14E5015B295B2A13]) [    ] o.a.s.l.TestLTRReRankingPipeline doc 0 in pos 0
   [junit4]   2> NOTE: reproduce with: ant test  -Dtestcase=TestLTRReRankingPipeline -Dtests.method=testDifferentTopN -Dtests.seed=14E5015B295B2A13 -Dtests.multiplier=3 -Dtests.slow=true -Dtests.locale=pt-AO -Dtests.timezone=BET -Dtests.asserts=true -Dtests.file.encoding=UTF-8
   [junit4] FAILURE 0.03s J1 | TestLTRReRankingPipeline.testDifferentTopN <<<
   [junit4]    > Throwable #1: java.lang.AssertionError: expected:<1.0> but was:<0.0>
   [junit4]    > 	at __randomizedtesting.SeedInfo.seed([14E5015B295B2A13:E544730B1CE0E081]:0)
   [junit4]    > 	at org.apache.solr.ltr.TestLTRReRankingPipeline.testDifferentTopN(TestLTRReRankingPipeline.java:255)
   [junit4]    > 	at java.base/jdk.internal.reflect.NativeMethodAccessorImpl.invoke0(Native Method)
   [junit4]    > 	at java.base/jdk.internal.reflect.NativeMethodAccessorImpl.invoke(NativeMethodAccessorImpl.java:62)
   [junit4]    > 	at java.base/jdk.internal.reflect.DelegatingMethodAccessorImpl.invoke(DelegatingMethodAccessorImpl.java:43)
   [junit4]    > 	at java.base/java.lang.reflect.Method.invoke(Method.java:564)
   [junit4]    > 	at java.base/java.lang.Thread.run(Thread.java:844)
   [junit4] OK      0.02s J1 | TestLTRReRankingPipeline.testRescorer
   [junit4]   2> NOTE: test params are: codec=Asserting(Lucene70): {field=PostingsFormat(name=LuceneFixedGap), id=PostingsFormat(name=LuceneVarGapDocFreqInterval), final-score=PostingsFormat(name=LuceneVarGapDocFreqInterval)}, docValues:{final-score=DocValuesFormat(name=Lucene70)}, maxPointsInLeafNode=1085, maxMBSortInHeap=7.538630838258374, sim=RandomSimilarity(queryNorm=false): {field=IB SPL-D2}, locale=pt-AO, timezone=BET
   [junit4]   2> NOTE: Linux 4.13.0-32-generic amd64/Oracle Corporation 9.0.4 (64-bit)/cpus=8,threads=1,free=494210616,total=536870912
   [junit4]   2> NOTE: All tests run in this JVM: [TestLTRReRankingPipeline, TestLTRReRankingPipeline]
   [junit4] Completed [4/5 (4!)] on J1 in 0.07s, 3 tests, 1 failure <<< FAILURES!
   [junit4] 
   [junit4] Suite: org.apache.solr.ltr.TestLTRReRankingPipeline
   [junit4] OK      0.01s J2 | TestLTRReRankingPipeline.testDocParam
   [junit4]   2> 1299 INFO  (TEST-TestLTRReRankingPipeline.testDifferentTopN-seed#[14E5015B295B2A13]) [    ] o.a.s.l.TestLTRReRankingPipeline rerank 1 documents 
   [junit4]   2> 1300 INFO  (TEST-TestLTRReRankingPipeline.testDifferentTopN-seed#[14E5015B295B2A13]) [    ] o.a.s.l.TestLTRReRankingPipeline doc 0 in pos 0
   [junit4]   2> NOTE: reproduce with: ant test  -Dtestcase=TestLTRReRankingPipeline -Dtests.method=testDifferentTopN -Dtests.seed=14E5015B295B2A13 -Dtests.multiplier=3 -Dtests.slow=true -Dtests.locale=pt-AO -Dtests.timezone=BET -Dtests.asserts=true -Dtests.file.encoding=UTF-8
   [junit4] FAILURE 0.02s J2 | TestLTRReRankingPipeline.testDifferentTopN <<<
   [junit4]    > Throwable #1: java.lang.AssertionError: expected:<1.0> but was:<0.0>
   [junit4]    > 	at __randomizedtesting.SeedInfo.seed([14E5015B295B2A13:E544730B1CE0E081]:0)
   [junit4]    > 	at org.apache.solr.ltr.TestLTRReRankingPipeline.testDifferentTopN(TestLTRReRankingPipeline.java:255)
   [junit4]    > 	at java.base/jdk.internal.reflect.NativeMethodAccessorImpl.invoke0(Native Method)
   [junit4]    > 	at java.base/jdk.internal.reflect.NativeMethodAccessorImpl.invoke(NativeMethodAccessorImpl.java:62)
   [junit4]    > 	at java.base/jdk.internal.reflect.DelegatingMethodAccessorImpl.invoke(DelegatingMethodAccessorImpl.java:43)
   [junit4]    > 	at java.base/java.lang.reflect.Method.invoke(Method.java:564)
   [junit4]    > 	at java.base/java.lang.Thread.run(Thread.java:844)
   [junit4] OK      0.02s J2 | TestLTRReRankingPipeline.testRescorer
   [junit4]   2> NOTE: test params are: codec=Asserting(Lucene70): {field=PostingsFormat(name=LuceneFixedGap), id=PostingsFormat(name=LuceneVarGapDocFreqInterval), final-score=PostingsFormat(name=LuceneVarGapDocFreqInterval)}, docValues:{final-score=DocValuesFormat(name=Lucene70)}, maxPointsInLeafNode=1085, maxMBSortInHeap=7.538630838258374, sim=RandomSimilarity(queryNorm=false): {field=IB SPL-D2}, locale=pt-AO, timezone=BET
   [junit4]   2> NOTE: Linux 4.13.0-32-generic amd64/Oracle Corporation 9.0.4 (64-bit)/cpus=8,threads=1,free=493867488,total=536870912
   [junit4]   2> NOTE: All tests run in this JVM: [TestLTRReRankingPipeline, TestLTRReRankingPipeline]
   [junit4] Completed [5/5 (5!)] on J2 in 0.09s, 3 tests, 1 failure <<< FAILURES!
   [junit4] 
   [junit4] 
   [junit4] Tests with failures [seed: 14E5015B295B2A13]:
   [junit4]   - org.apache.solr.ltr.TestLTRReRankingPipeline.testDifferentTopN
   [junit4]   - org.apache.solr.ltr.TestLTRReRankingPipeline.testDifferentTopN
   [junit4]   - org.apache.solr.ltr.TestLTRReRankingPipeline.testDifferentTopN
   [junit4]   - org.apache.solr.ltr.TestLTRReRankingPipeline.testDifferentTopN
   [junit4]   - org.apache.solr.ltr.TestLTRReRankingPipeline.testDifferentTopN
   [junit4] 
   [junit4] 
   [junit4] JVM J0:     0.68 ..     2.55 =     1.87s
   [junit4] JVM J1:     0.67 ..     3.03 =     2.37s
   [junit4] JVM J2:     0.67 ..     3.05 =     2.38s
   [junit4] Execution time total: 3.06 sec.
   [junit4] Tests summary: 5 suites, 15 tests, 5 failures

BUILD FAILED
/home/jenkins/workspace/Lucene-Solr-7.x-Linux/lucene/common-build.xml:1561: The following error occurred while executing this line:
/home/jenkins/workspace/Lucene-Solr-7.x-Linux/lucene/common-build.xml:1085: There were test failures: 5 suites, 15 tests, 5 failures [seed: 14E5015B295B2A13]

Total time: 4 seconds

[repro] Setting last failure code to 256

[repro] Failures:
[repro]   5/5 failed: org.apache.solr.cloud.SSLMigrationTest
[repro]   5/5 failed: org.apache.solr.cloud.ZkControllerTest
[repro]   5/5 failed: org.apache.solr.core.TestJmxIntegration
[repro]   5/5 failed: org.apache.solr.handler.TestReplicationHandler
[repro]   5/5 failed: org.apache.solr.ltr.TestLTRReRankingPipeline
[repro] Exiting with code 256
+ mv lucene/build lucene/build.repro
+ mv solr/build solr/build.repro
+ mv lucene/build.orig lucene/build
+ mv solr/build.orig solr/build
Archiving artifacts
Setting ANT_1_8_2_HOME=/var/lib/jenkins/tools/hudson.tasks.Ant_AntInstallation/ANT_1.8.2
[WARNINGS] Parsing warnings in console log with parser Java Compiler (javac)
Setting ANT_1_8_2_HOME=/var/lib/jenkins/tools/hudson.tasks.Ant_AntInstallation/ANT_1.8.2
Setting ANT_1_8_2_HOME=/var/lib/jenkins/tools/hudson.tasks.Ant_AntInstallation/ANT_1.8.2
<Git Blamer> Using GitBlamer to create author and commit information for all warnings.
<Git Blamer> GIT_COMMIT=3b6307368e16894d58a2b57c8b15674c6239a243, workspace=/var/lib/jenkins/workspace/Lucene-Solr-7.x-Linux
[WARNINGS] Computing warning deltas based on reference build #1438
Recording test results
Setting ANT_1_8_2_HOME=/var/lib/jenkins/tools/hudson.tasks.Ant_AntInstallation/ANT_1.8.2
Build step 'Publish JUnit test result report' changed build result to UNSTABLE
Email was triggered for: Unstable (Test Failures)
Sending email for trigger: Unstable (Test Failures)
Setting ANT_1_8_2_HOME=/var/lib/jenkins/tools/hudson.tasks.Ant_AntInstallation/ANT_1.8.2
Setting ANT_1_8_2_HOME=/var/lib/jenkins/tools/hudson.tasks.Ant_AntInstallation/ANT_1.8.2
Setting ANT_1_8_2_HOME=/var/lib/jenkins/tools/hudson.tasks.Ant_AntInstallation/ANT_1.8.2
Setting ANT_1_8_2_HOME=/var/lib/jenkins/tools/hudson.tasks.Ant_AntInstallation/ANT_1.8.2

Mime
View raw message