lucene-dev mailing list archives

Site index · List index
Message view « Date » · « Thread »
Top « Date » · « Thread »
From Apache Jenkins Server <jenk...@builds.apache.org>
Subject [JENKINS] Lucene-Solr-Tests-7.x - Build # 377 - Unstable
Date Mon, 12 Feb 2018 12:47:00 GMT
Build: https://builds.apache.org/job/Lucene-Solr-Tests-7.x/377/

1 tests failed.
FAILED:  org.apache.solr.cloud.autoscaling.TriggerIntegrationTest.testMetricTrigger

Error Message:


Stack Trace:
java.lang.NullPointerException
	at __randomizedtesting.SeedInfo.seed([19A25D8AA63753EE:A3AE6A05F9DF85A1]:0)
	at org.apache.solr.cloud.autoscaling.TriggerIntegrationTest.testMetricTrigger(TriggerIntegrationTest.java:1565)
	at sun.reflect.NativeMethodAccessorImpl.invoke0(Native Method)
	at sun.reflect.NativeMethodAccessorImpl.invoke(NativeMethodAccessorImpl.java:62)
	at sun.reflect.DelegatingMethodAccessorImpl.invoke(DelegatingMethodAccessorImpl.java:43)
	at java.lang.reflect.Method.invoke(Method.java:498)
	at com.carrotsearch.randomizedtesting.RandomizedRunner.invoke(RandomizedRunner.java:1737)
	at com.carrotsearch.randomizedtesting.RandomizedRunner$8.evaluate(RandomizedRunner.java:934)
	at com.carrotsearch.randomizedtesting.RandomizedRunner$9.evaluate(RandomizedRunner.java:970)
	at com.carrotsearch.randomizedtesting.RandomizedRunner$10.evaluate(RandomizedRunner.java:984)
	at com.carrotsearch.randomizedtesting.rules.SystemPropertiesRestoreRule$1.evaluate(SystemPropertiesRestoreRule.java:57)
	at org.apache.lucene.util.TestRuleSetupTeardownChained$1.evaluate(TestRuleSetupTeardownChained.java:49)
	at org.apache.lucene.util.AbstractBeforeAfterRule$1.evaluate(AbstractBeforeAfterRule.java:45)
	at org.apache.lucene.util.TestRuleThreadAndTestName$1.evaluate(TestRuleThreadAndTestName.java:48)
	at org.apache.lucene.util.TestRuleIgnoreAfterMaxFailures$1.evaluate(TestRuleIgnoreAfterMaxFailures.java:64)
	at org.apache.lucene.util.TestRuleMarkFailure$1.evaluate(TestRuleMarkFailure.java:47)
	at com.carrotsearch.randomizedtesting.rules.StatementAdapter.evaluate(StatementAdapter.java:36)
	at com.carrotsearch.randomizedtesting.ThreadLeakControl$StatementRunner.run(ThreadLeakControl.java:368)
	at com.carrotsearch.randomizedtesting.ThreadLeakControl.forkTimeoutingTask(ThreadLeakControl.java:817)
	at com.carrotsearch.randomizedtesting.ThreadLeakControl$3.evaluate(ThreadLeakControl.java:468)
	at com.carrotsearch.randomizedtesting.RandomizedRunner.runSingleTest(RandomizedRunner.java:943)
	at com.carrotsearch.randomizedtesting.RandomizedRunner$5.evaluate(RandomizedRunner.java:829)
	at com.carrotsearch.randomizedtesting.RandomizedRunner$6.evaluate(RandomizedRunner.java:879)
	at com.carrotsearch.randomizedtesting.RandomizedRunner$7.evaluate(RandomizedRunner.java:890)
	at com.carrotsearch.randomizedtesting.rules.StatementAdapter.evaluate(StatementAdapter.java:36)
	at com.carrotsearch.randomizedtesting.rules.SystemPropertiesRestoreRule$1.evaluate(SystemPropertiesRestoreRule.java:57)
	at org.apache.lucene.util.AbstractBeforeAfterRule$1.evaluate(AbstractBeforeAfterRule.java:45)
	at com.carrotsearch.randomizedtesting.rules.StatementAdapter.evaluate(StatementAdapter.java:36)
	at org.apache.lucene.util.TestRuleStoreClassName$1.evaluate(TestRuleStoreClassName.java:41)
	at com.carrotsearch.randomizedtesting.rules.NoShadowingOrOverridesOnMethodsRule$1.evaluate(NoShadowingOrOverridesOnMethodsRule.java:40)
	at com.carrotsearch.randomizedtesting.rules.NoShadowingOrOverridesOnMethodsRule$1.evaluate(NoShadowingOrOverridesOnMethodsRule.java:40)
	at com.carrotsearch.randomizedtesting.rules.StatementAdapter.evaluate(StatementAdapter.java:36)
	at com.carrotsearch.randomizedtesting.rules.StatementAdapter.evaluate(StatementAdapter.java:36)
	at com.carrotsearch.randomizedtesting.rules.StatementAdapter.evaluate(StatementAdapter.java:36)
	at org.apache.lucene.util.TestRuleAssertionsRequired$1.evaluate(TestRuleAssertionsRequired.java:53)
	at org.apache.lucene.util.TestRuleMarkFailure$1.evaluate(TestRuleMarkFailure.java:47)
	at org.apache.lucene.util.TestRuleIgnoreAfterMaxFailures$1.evaluate(TestRuleIgnoreAfterMaxFailures.java:64)
	at org.apache.lucene.util.TestRuleIgnoreTestSuites$1.evaluate(TestRuleIgnoreTestSuites.java:54)
	at com.carrotsearch.randomizedtesting.rules.StatementAdapter.evaluate(StatementAdapter.java:36)
	at com.carrotsearch.randomizedtesting.ThreadLeakControl$StatementRunner.run(ThreadLeakControl.java:368)
	at java.lang.Thread.run(Thread.java:748)




Build Log:
[...truncated 14156 lines...]
   [junit4] Suite: org.apache.solr.cloud.autoscaling.TriggerIntegrationTest
   [junit4]   2> 2803492 INFO  (SUITE-TriggerIntegrationTest-seed#[19A25D8AA63753EE]-worker) [    ] o.a.s.SolrTestCaseJ4 SecureRandom sanity checks: test.solr.allowed.securerandom=null & java.security.egd=file:/dev/./urandom
   [junit4]   2> Creating dataDir: /x1/jenkins/jenkins-slave/workspace/Lucene-Solr-Tests-7.x/solr/build/solr-core/test/J0/temp/solr.cloud.autoscaling.TriggerIntegrationTest_19A25D8AA63753EE-001/init-core-data-001
   [junit4]   2> 2803493 WARN  (SUITE-TriggerIntegrationTest-seed#[19A25D8AA63753EE]-worker) [    ] o.a.s.SolrTestCaseJ4 startTrackingSearchers: numOpens=21 numCloses=21
   [junit4]   2> 2803493 INFO  (SUITE-TriggerIntegrationTest-seed#[19A25D8AA63753EE]-worker) [    ] o.a.s.SolrTestCaseJ4 Using PointFields (NUMERIC_POINTS_SYSPROP=true) w/NUMERIC_DOCVALUES_SYSPROP=false
   [junit4]   2> 2803494 INFO  (SUITE-TriggerIntegrationTest-seed#[19A25D8AA63753EE]-worker) [    ] o.a.s.SolrTestCaseJ4 Randomized ssl (false) and clientAuth (false) via: @org.apache.solr.util.RandomizeSSL(reason=, value=NaN, ssl=NaN, clientAuth=NaN)
   [junit4]   2> 2803495 INFO  (SUITE-TriggerIntegrationTest-seed#[19A25D8AA63753EE]-worker) [    ] o.a.s.c.MiniSolrCloudCluster Starting cluster of 2 servers in /x1/jenkins/jenkins-slave/workspace/Lucene-Solr-Tests-7.x/solr/build/solr-core/test/J0/temp/solr.cloud.autoscaling.TriggerIntegrationTest_19A25D8AA63753EE-001/tempDir-001
   [junit4]   2> 2803495 INFO  (SUITE-TriggerIntegrationTest-seed#[19A25D8AA63753EE]-worker) [    ] o.a.s.c.ZkTestServer STARTING ZK TEST SERVER
   [junit4]   2> 2803495 INFO  (Thread-4550) [    ] o.a.s.c.ZkTestServer client port:0.0.0.0/0.0.0.0:0
   [junit4]   2> 2803495 INFO  (Thread-4550) [    ] o.a.s.c.ZkTestServer Starting server
   [junit4]   2> 2803499 ERROR (Thread-4550) [    ] o.a.z.s.ZooKeeperServer ZKShutdownHandler is not registered, so ZooKeeper server won't take any action on ERROR or SHUTDOWN server state changes
   [junit4]   2> 2803595 INFO  (SUITE-TriggerIntegrationTest-seed#[19A25D8AA63753EE]-worker) [    ] o.a.s.c.ZkTestServer start zk server on port:39971
   [junit4]   2> 2803599 INFO  (zkConnectionManagerCallback-6649-thread-1) [    ] o.a.s.c.c.ConnectionManager zkClient has connected
   [junit4]   2> 2803603 WARN  (NIOServerCxn.Factory:0.0.0.0/0.0.0.0:0) [    ] o.a.z.s.NIOServerCnxn Unable to read additional data from client sessionid 0x1045a032a8e0000, likely client has closed socket
   [junit4]   2> 2803605 INFO  (jetty-launcher-6646-thread-1) [    ] o.e.j.s.Server jetty-9.4.8.v20171121, build timestamp: 2017-11-21T22:27:37+01:00, git hash: 82b8fb23f757335bb3329d540ce37a2a2615f0a8
   [junit4]   2> 2803605 INFO  (jetty-launcher-6646-thread-2) [    ] o.e.j.s.Server jetty-9.4.8.v20171121, build timestamp: 2017-11-21T22:27:37+01:00, git hash: 82b8fb23f757335bb3329d540ce37a2a2615f0a8
   [junit4]   2> 2803612 INFO  (jetty-launcher-6646-thread-1) [    ] o.e.j.s.session DefaultSessionIdManager workerName=node0
   [junit4]   2> 2803612 INFO  (jetty-launcher-6646-thread-1) [    ] o.e.j.s.session No SessionScavenger set, using defaults
   [junit4]   2> 2803612 INFO  (jetty-launcher-6646-thread-2) [    ] o.e.j.s.session DefaultSessionIdManager workerName=node0
   [junit4]   2> 2803612 INFO  (jetty-launcher-6646-thread-1) [    ] o.e.j.s.session Scavenging every 600000ms
   [junit4]   2> 2803612 INFO  (jetty-launcher-6646-thread-2) [    ] o.e.j.s.session No SessionScavenger set, using defaults
   [junit4]   2> 2803613 INFO  (jetty-launcher-6646-thread-2) [    ] o.e.j.s.session Scavenging every 600000ms
   [junit4]   2> 2803613 INFO  (jetty-launcher-6646-thread-1) [    ] o.e.j.s.h.ContextHandler Started o.e.j.s.ServletContextHandler@4737a08d{/solr,null,AVAILABLE}
   [junit4]   2> 2803613 INFO  (jetty-launcher-6646-thread-2) [    ] o.e.j.s.h.ContextHandler Started o.e.j.s.ServletContextHandler@43bda44e{/solr,null,AVAILABLE}
   [junit4]   2> 2803618 INFO  (jetty-launcher-6646-thread-2) [    ] o.e.j.s.AbstractConnector Started ServerConnector@15dcf6ee{HTTP/1.1,[http/1.1]}{127.0.0.1:40113}
   [junit4]   2> 2803618 INFO  (jetty-launcher-6646-thread-2) [    ] o.e.j.s.Server Started @2807823ms
   [junit4]   2> 2803618 INFO  (jetty-launcher-6646-thread-2) [    ] o.a.s.c.s.e.JettySolrRunner Jetty properties: {hostContext=/solr, hostPort=40113}
   [junit4]   2> 2803618 INFO  (jetty-launcher-6646-thread-1) [    ] o.e.j.s.AbstractConnector Started ServerConnector@2cc524b4{HTTP/1.1,[http/1.1]}{127.0.0.1:53121}
   [junit4]   2> 2803618 INFO  (jetty-launcher-6646-thread-1) [    ] o.e.j.s.Server Started @2807823ms
   [junit4]   2> 2803618 INFO  (jetty-launcher-6646-thread-1) [    ] o.a.s.c.s.e.JettySolrRunner Jetty properties: {hostContext=/solr, hostPort=53121}
   [junit4]   2> 2803619 ERROR (jetty-launcher-6646-thread-1) [    ] o.a.s.u.StartupLoggingUtils Missing Java Option solr.log.dir. Logging may be missing or incomplete.
   [junit4]   2> 2803619 INFO  (jetty-launcher-6646-thread-1) [    ] o.a.s.s.SolrDispatchFilter  ___      _       Welcome to Apache Solr™ version 7.3.0
   [junit4]   2> 2803619 INFO  (jetty-launcher-6646-thread-1) [    ] o.a.s.s.SolrDispatchFilter / __| ___| |_ _   Starting in cloud mode on port null
   [junit4]   2> 2803619 INFO  (jetty-launcher-6646-thread-1) [    ] o.a.s.s.SolrDispatchFilter \__ \/ _ \ | '_|  Install dir: null
   [junit4]   2> 2803619 INFO  (jetty-launcher-6646-thread-1) [    ] o.a.s.s.SolrDispatchFilter |___/\___/_|_|    Start time: 2018-02-12T12:21:58.126Z
   [junit4]   2> 2803620 ERROR (jetty-launcher-6646-thread-2) [    ] o.a.s.u.StartupLoggingUtils Missing Java Option solr.log.dir. Logging may be missing or incomplete.
   [junit4]   2> 2803620 INFO  (jetty-launcher-6646-thread-2) [    ] o.a.s.s.SolrDispatchFilter  ___      _       Welcome to Apache Solr™ version 7.3.0
   [junit4]   2> 2803620 INFO  (jetty-launcher-6646-thread-2) [    ] o.a.s.s.SolrDispatchFilter / __| ___| |_ _   Starting in cloud mode on port null
   [junit4]   2> 2803620 INFO  (jetty-launcher-6646-thread-2) [    ] o.a.s.s.SolrDispatchFilter \__ \/ _ \ | '_|  Install dir: null
   [junit4]   2> 2803621 INFO  (jetty-launcher-6646-thread-2) [    ] o.a.s.s.SolrDispatchFilter |___/\___/_|_|    Start time: 2018-02-12T12:21:58.128Z
   [junit4]   2> 2803622 INFO  (zkConnectionManagerCallback-6651-thread-1) [    ] o.a.s.c.c.ConnectionManager zkClient has connected
   [junit4]   2> 2803623 INFO  (jetty-launcher-6646-thread-1) [    ] o.a.s.s.SolrDispatchFilter solr.xml found in ZooKeeper. Loading...
   [junit4]   2> 2803623 INFO  (zkConnectionManagerCallback-6653-thread-1) [    ] o.a.s.c.c.ConnectionManager zkClient has connected
   [junit4]   2> 2803624 INFO  (jetty-launcher-6646-thread-2) [    ] o.a.s.s.SolrDispatchFilter solr.xml found in ZooKeeper. Loading...
   [junit4]   2> 2803635 INFO  (jetty-launcher-6646-thread-1) [    ] o.a.s.c.ZkContainer Zookeeper client=127.0.0.1:39971/solr
   [junit4]   2> 2803639 INFO  (jetty-launcher-6646-thread-2) [    ] o.a.s.c.ZkContainer Zookeeper client=127.0.0.1:39971/solr
   [junit4]   2> 2803642 INFO  (zkConnectionManagerCallback-6661-thread-1) [    ] o.a.s.c.c.ConnectionManager zkClient has connected
   [junit4]   2> 2803649 INFO  (zkConnectionManagerCallback-6658-thread-1) [    ] o.a.s.c.c.ConnectionManager zkClient has connected
   [junit4]   2> 2803653 INFO  (zkConnectionManagerCallback-6663-thread-1-processing-n:127.0.0.1:40113_solr) [n:127.0.0.1:40113_solr    ] o.a.s.c.c.ConnectionManager zkClient has connected
   [junit4]   2> 2803654 INFO  (zkConnectionManagerCallback-6665-thread-1-processing-n:127.0.0.1:53121_solr) [n:127.0.0.1:53121_solr    ] o.a.s.c.c.ConnectionManager zkClient has connected
   [junit4]   2> 2803732 INFO  (jetty-launcher-6646-thread-2) [n:127.0.0.1:40113_solr    ] o.a.s.c.Overseer Overseer (id=null) closing
   [junit4]   2> 2803733 INFO  (jetty-launcher-6646-thread-2) [n:127.0.0.1:40113_solr    ] o.a.s.c.OverseerElectionContext I am going to be the leader 127.0.0.1:40113_solr
   [junit4]   2> 2803733 INFO  (jetty-launcher-6646-thread-2) [n:127.0.0.1:40113_solr    ] o.a.s.c.Overseer Overseer (id=73282463590121477-127.0.0.1:40113_solr-n_0000000000) starting
   [junit4]   2> 2803734 INFO  (jetty-launcher-6646-thread-1) [n:127.0.0.1:53121_solr    ] o.a.s.c.Overseer Overseer (id=null) closing
   [junit4]   2> 2803735 INFO  (jetty-launcher-6646-thread-1) [n:127.0.0.1:53121_solr    ] o.a.s.c.ZkController Register node as live in ZooKeeper:/live_nodes/127.0.0.1:53121_solr
   [junit4]   2> 2803736 INFO  (zkCallback-6662-thread-1-processing-n:127.0.0.1:40113_solr) [n:127.0.0.1:40113_solr    ] o.a.s.c.c.ZkStateReader Updated live nodes from ZooKeeper... (0) -> (1)
   [junit4]   2> 2803739 INFO  (zkCallback-6664-thread-1-processing-n:127.0.0.1:53121_solr) [n:127.0.0.1:53121_solr    ] o.a.s.c.c.ZkStateReader Updated live nodes from ZooKeeper... (0) -> (1)
   [junit4]   2> 2803742 DEBUG (OverseerAutoScalingTriggerThread-73282463590121477-127.0.0.1:40113_solr-n_0000000000) [n:127.0.0.1:40113_solr    ] o.a.s.c.a.OverseerTriggerThread Adding .autoAddReplicas trigger
   [junit4]   2> 2803743 INFO  (jetty-launcher-6646-thread-2) [n:127.0.0.1:40113_solr    ] o.a.s.c.ZkController Register node as live in ZooKeeper:/live_nodes/127.0.0.1:40113_solr
   [junit4]   2> 2803743 DEBUG (OverseerAutoScalingTriggerThread-73282463590121477-127.0.0.1:40113_solr-n_0000000000) [n:127.0.0.1:40113_solr    ] o.a.s.c.a.OverseerTriggerThread Refreshing /autoscaling.json with znode version 1
   [junit4]   2> 2803746 DEBUG (OverseerAutoScalingTriggerThread-73282463590121477-127.0.0.1:40113_solr-n_0000000000) [n:127.0.0.1:40113_solr    ] o.a.s.c.a.NodeLostTrigger Initial livenodes: [127.0.0.1:53121_solr]
   [junit4]   2> 2803746 DEBUG (OverseerAutoScalingTriggerThread-73282463590121477-127.0.0.1:40113_solr-n_0000000000) [n:127.0.0.1:40113_solr    ] o.a.s.c.a.OverseerTriggerThread Current znodeVersion 1, lastZnodeVersion -1
   [junit4]   2> 2803747 DEBUG (OverseerAutoScalingTriggerThread-73282463590121477-127.0.0.1:40113_solr-n_0000000000) [n:127.0.0.1:40113_solr    ] o.a.s.c.a.OverseerTriggerThread Processed trigger updates upto znodeVersion 1
   [junit4]   2> 2803750 INFO  (zkCallback-6662-thread-1-processing-n:127.0.0.1:40113_solr) [n:127.0.0.1:40113_solr    ] o.a.s.c.c.ZkStateReader Updated live nodes from ZooKeeper... (1) -> (2)
   [junit4]   2> 2803751 INFO  (zkCallback-6664-thread-1-processing-n:127.0.0.1:53121_solr) [n:127.0.0.1:53121_solr    ] o.a.s.c.c.ZkStateReader Updated live nodes from ZooKeeper... (1) -> (2)
   [junit4]   2> 2803752 DEBUG (OverseerAutoScalingTriggerThread-73282463590121477-127.0.0.1:40113_solr-n_0000000000) [n:127.0.0.1:40113_solr    ] o.a.s.c.a.OverseerTriggerThread -- clean old nodeAdded markers
   [junit4]   2> 2803753 DEBUG (OverseerAutoScalingTriggerThread-73282463590121477-127.0.0.1:40113_solr-n_0000000000) [n:127.0.0.1:40113_solr    ] o.a.s.c.a.OverseerTriggerThread Current znodeVersion 1, lastZnodeVersion 1
   [junit4]   2> 2803753 DEBUG (ScheduledTrigger-6854-thread-1) [n:127.0.0.1:40113_solr    ] o.a.s.c.a.NodeLostTrigger Running NodeLostTrigger: .auto_add_replicas with currently live nodes: 2
   [junit4]   2> 2803792 INFO  (jetty-launcher-6646-thread-1) [n:127.0.0.1:53121_solr    ] o.a.s.m.r.SolrJmxReporter JMX monitoring for 'solr_53121.solr.node' (registry 'solr.node') enabled at server: com.sun.jmx.mbeanserver.JmxMBeanServer@30215357
   [junit4]   2> 2803800 INFO  (jetty-launcher-6646-thread-1) [n:127.0.0.1:53121_solr    ] o.a.s.m.r.SolrJmxReporter JMX monitoring for 'solr_53121.solr.jvm' (registry 'solr.jvm') enabled at server: com.sun.jmx.mbeanserver.JmxMBeanServer@30215357
   [junit4]   2> 2803800 INFO  (jetty-launcher-6646-thread-1) [n:127.0.0.1:53121_solr    ] o.a.s.m.r.SolrJmxReporter JMX monitoring for 'solr_53121.solr.jetty' (registry 'solr.jetty') enabled at server: com.sun.jmx.mbeanserver.JmxMBeanServer@30215357
   [junit4]   2> 2803801 INFO  (jetty-launcher-6646-thread-1) [n:127.0.0.1:53121_solr    ] o.a.s.c.CorePropertiesLocator Found 0 core definitions underneath /x1/jenkins/jenkins-slave/workspace/Lucene-Solr-Tests-7.x/solr/build/solr-core/test/J0/temp/solr.cloud.autoscaling.TriggerIntegrationTest_19A25D8AA63753EE-001/tempDir-001/node1/.
   [junit4]   2> 2803845 INFO  (jetty-launcher-6646-thread-2) [n:127.0.0.1:40113_solr    ] o.a.s.m.r.SolrJmxReporter JMX monitoring for 'solr_40113.solr.node' (registry 'solr.node') enabled at server: com.sun.jmx.mbeanserver.JmxMBeanServer@30215357
   [junit4]   2> 2803852 INFO  (jetty-launcher-6646-thread-2) [n:127.0.0.1:40113_solr    ] o.a.s.m.r.SolrJmxReporter JMX monitoring for 'solr_40113.solr.jvm' (registry 'solr.jvm') enabled at server: com.sun.jmx.mbeanserver.JmxMBeanServer@30215357
   [junit4]   2> 2803852 INFO  (jetty-launcher-6646-thread-2) [n:127.0.0.1:40113_solr    ] o.a.s.m.r.SolrJmxReporter JMX monitoring for 'solr_40113.solr.jetty' (registry 'solr.jetty') enabled at server: com.sun.jmx.mbeanserver.JmxMBeanServer@30215357
   [junit4]   2> 2803853 INFO  (jetty-launcher-6646-thread-2) [n:127.0.0.1:40113_solr    ] o.a.s.c.CorePropertiesLocator Found 0 core definitions underneath /x1/jenkins/jenkins-slave/workspace/Lucene-Solr-Tests-7.x/solr/build/solr-core/test/J0/temp/solr.cloud.autoscaling.TriggerIntegrationTest_19A25D8AA63753EE-001/tempDir-001/node2/.
   [junit4]   2> 2803886 INFO  (zkConnectionManagerCallback-6671-thread-1) [    ] o.a.s.c.c.ConnectionManager zkClient has connected
   [junit4]   2> 2803889 INFO  (zkConnectionManagerCallback-6675-thread-1) [    ] o.a.s.c.c.ConnectionManager zkClient has connected
   [junit4]   2> 2803890 INFO  (SUITE-TriggerIntegrationTest-seed#[19A25D8AA63753EE]-worker) [    ] o.a.s.c.c.ZkStateReader Updated live nodes from ZooKeeper... (0) -> (2)
   [junit4]   2> 2803891 INFO  (SUITE-TriggerIntegrationTest-seed#[19A25D8AA63753EE]-worker) [    ] o.a.s.c.s.i.ZkClientClusterStateProvider Cluster at 127.0.0.1:39971/solr ready
   [junit4]   2> 2803913 INFO  (TEST-TriggerIntegrationTest.testListeners-seed#[19A25D8AA63753EE]) [    ] o.a.s.SolrTestCaseJ4 ###Starting testListeners
   [junit4]   2> 2803914 INFO  (TEST-TriggerIntegrationTest.testListeners-seed#[19A25D8AA63753EE]) [    ] o.a.s.c.a.TriggerIntegrationTest /autoscaling.json reset, new znode version 2
   [junit4]   2> 2803914 DEBUG (zkCallback-6662-thread-1-processing-n:127.0.0.1:40113_solr) [n:127.0.0.1:40113_solr    ] o.a.s.c.a.OverseerTriggerThread Refreshing /autoscaling.json with znode version 2
   [junit4]   2> 2803914 DEBUG (OverseerAutoScalingTriggerThread-73282463590121477-127.0.0.1:40113_solr-n_0000000000) [n:127.0.0.1:40113_solr    ] o.a.s.c.a.OverseerTriggerThread Processed trigger updates upto znodeVersion 2
   [junit4]   2> 2803915 DEBUG (OverseerAutoScalingTriggerThread-73282463590121477-127.0.0.1:40113_solr-n_0000000000) [n:127.0.0.1:40113_solr    ] o.a.s.c.a.OverseerTriggerThread -- clean old nodeLost markers
   [junit4]   2> 2803915 DEBUG (OverseerAutoScalingTriggerThread-73282463590121477-127.0.0.1:40113_solr-n_0000000000) [n:127.0.0.1:40113_solr    ] o.a.s.c.a.OverseerTriggerThread -- clean old nodeAdded markers
   [junit4]   2> 2803915 DEBUG (OverseerAutoScalingTriggerThread-73282463590121477-127.0.0.1:40113_solr-n_0000000000) [n:127.0.0.1:40113_solr    ] o.a.s.c.a.OverseerTriggerThread Current znodeVersion 2, lastZnodeVersion 2
   [junit4]   2> 2803923 INFO  (qtp196248133-27761) [n:127.0.0.1:40113_solr    ] o.a.s.s.HttpSolrCall [admin] webapp=null path=/admin/metrics params={prefix=CONTAINER.fs.usableSpace,CORE.coreName&wt=javabin&version=2&group=solr.node,solr.core} status=0 QTime=0
   [junit4]   2> 2803924 INFO  (qtp672620657-27767) [n:127.0.0.1:53121_solr    ] o.a.s.s.HttpSolrCall [admin] webapp=null path=/admin/metrics params={prefix=CONTAINER.fs.usableSpace,CORE.coreName&wt=javabin&version=2&group=solr.node,solr.core} status=0 QTime=0
   [junit4]   2> 2803924 DEBUG (qtp672620657-27760) [n:127.0.0.1:53121_solr    ] o.a.s.c.a.AutoScalingHandler Verified autoscaling configuration
   [junit4]   2> 2803925 INFO  (qtp672620657-27760) [n:127.0.0.1:53121_solr    ] o.a.s.s.HttpSolrCall [admin] webapp=null path=/cluster/autoscaling params={wt=javabin&version=2} status=0 QTime=4
   [junit4]   2> 2803925 DEBUG (zkCallback-6662-thread-1-processing-n:127.0.0.1:40113_solr) [n:127.0.0.1:40113_solr    ] o.a.s.c.a.OverseerTriggerThread Refreshing /autoscaling.json with znode version 3
   [junit4]   2> 2803926 DEBUG (zkCallback-6662-thread-1-processing-n:127.0.0.1:40113_solr) [n:127.0.0.1:40113_solr    ] o.a.s.c.a.NodeAddedTrigger Initial livenodes: [127.0.0.1:53121_solr, 127.0.0.1:40113_solr]
   [junit4]   2> 2803926 DEBUG (zkCallback-6662-thread-1-processing-n:127.0.0.1:40113_solr) [n:127.0.0.1:40113_solr    ] o.a.s.c.a.NodeAddedTrigger NodeAddedTrigger node_added_triggerL instantiated with properties: {event=nodeAdded, waitFor=1, actions=[{name=test, class=org.apache.solr.cloud.autoscaling.TriggerIntegrationTest$TestTriggerAction}, {name=test1, class=org.apache.solr.cloud.autoscaling.TriggerIntegrationTest$TestDummyAction}], enabled=true}
   [junit4]   2> 2803926 DEBUG (OverseerAutoScalingTriggerThread-73282463590121477-127.0.0.1:40113_solr-n_0000000000) [n:127.0.0.1:40113_solr    ] o.a.s.c.a.OverseerTriggerThread Processed trigger updates upto znodeVersion 3
   [junit4]   2> 2803927 INFO  (OverseerAutoScalingTriggerThread-73282463590121477-127.0.0.1:40113_solr-n_0000000000) [n:127.0.0.1:40113_solr    ] o.a.s.c.a.TriggerIntegrationTest TestTriggerAction init
   [junit4]   2> 2803928 DEBUG (OverseerAutoScalingTriggerThread-73282463590121477-127.0.0.1:40113_solr-n_0000000000) [n:127.0.0.1:40113_solr    ] o.a.s.c.a.OverseerTriggerThread -- clean old nodeLost markers
   [junit4]   2> 2803929 INFO  (qtp196248133-27766) [n:127.0.0.1:40113_solr    ] o.a.s.s.HttpSolrCall [admin] webapp=null path=/admin/metrics params={prefix=CONTAINER.fs.usableSpace,CORE.coreName&wt=javabin&version=2&group=solr.node,solr.core} status=0 QTime=0
   [junit4]   2> 2803930 DEBUG (OverseerAutoScalingTriggerThread-73282463590121477-127.0.0.1:40113_solr-n_0000000000) [n:127.0.0.1:40113_solr    ] o.a.s.c.a.OverseerTriggerThread Current znodeVersion 3, lastZnodeVersion 3
   [junit4]   2> 2803930 DEBUG (ScheduledTrigger-6854-thread-1) [n:127.0.0.1:40113_solr    ] o.a.s.c.a.NodeAddedTrigger Running NodeAddedTrigger node_added_triggerL
   [junit4]   2> 2803930 DEBUG (ScheduledTrigger-6854-thread-1) [n:127.0.0.1:40113_solr    ] o.a.s.c.a.NodeAddedTrigger Found livenodes: 2
   [junit4]   2> 2803930 INFO  (qtp672620657-27769) [n:127.0.0.1:53121_solr    ] o.a.s.s.HttpSolrCall [admin] webapp=null path=/admin/metrics params={prefix=CONTAINER.fs.usableSpace,CORE.coreName&wt=javabin&version=2&group=solr.node,solr.core} status=0 QTime=0
   [junit4]   2> 2803931 DEBUG (qtp672620657-27763) [n:127.0.0.1:53121_solr    ] o.a.s.c.a.AutoScalingHandler Verified autoscaling configuration
   [junit4]   2> 2803931 INFO  (qtp672620657-27763) [n:127.0.0.1:53121_solr    ] o.a.s.s.HttpSolrCall [admin] webapp=null path=/admin/autoscaling params={wt=javabin&version=2} status=0 QTime=2
   [junit4]   2> 2803931 DEBUG (zkCallback-6662-thread-1-processing-n:127.0.0.1:40113_solr) [n:127.0.0.1:40113_solr    ] o.a.s.c.a.OverseerTriggerThread Refreshing /autoscaling.json with znode version 4
   [junit4]   2> 2803931 DEBUG (zkCallback-6662-thread-1-processing-n:127.0.0.1:40113_solr) [n:127.0.0.1:40113_solr    ] o.a.s.c.a.NodeAddedTrigger Initial livenodes: [127.0.0.1:53121_solr, 127.0.0.1:40113_solr]
   [junit4]   2> 2803932 DEBUG (zkCallback-6662-thread-1-processing-n:127.0.0.1:40113_solr) [n:127.0.0.1:40113_solr    ] o.a.s.c.a.NodeAddedTrigger NodeAddedTrigger node_added_triggerL instantiated with properties: {event=nodeAdded, waitFor=1, actions=[{name=test, class=org.apache.solr.cloud.autoscaling.TriggerIntegrationTest$TestTriggerAction}, {name=test1, class=org.apache.solr.cloud.autoscaling.TriggerIntegrationTest$TestDummyAction}], enabled=true}
   [junit4]   2> 2803932 DEBUG (OverseerAutoScalingTriggerThread-73282463590121477-127.0.0.1:40113_solr-n_0000000000) [n:127.0.0.1:40113_solr    ] o.a.s.c.a.OverseerTriggerThread Processed trigger updates upto znodeVersion 4
   [junit4]   2> 2803932 DEBUG (OverseerAutoScalingTriggerThread-73282463590121477-127.0.0.1:40113_solr-n_0000000000) [n:127.0.0.1:40113_solr    ] o.a.s.c.a.OverseerTriggerThread -- clean old nodeLost markers
   [junit4]   2> 2803932 INFO  (qtp196248133-27770) [n:127.0.0.1:40113_solr    ] o.a.s.s.HttpSolrCall [admin] webapp=null path=/admin/metrics params={prefix=CONTAINER.fs.usableSpace,CORE.coreName&wt=javabin&version=2&group=solr.node,solr.core} status=0 QTime=0
   [junit4]   2> 2803932 DEBUG (OverseerAutoScalingTriggerThread-73282463590121477-127.0.0.1:40113_solr-n_0000000000) [n:127.0.0.1:40113_solr    ] o.a.s.c.a.OverseerTriggerThread Current znodeVersion 4, lastZnodeVersion 4
   [junit4]   2> 2803933 INFO  (qtp672620657-27771) [n:127.0.0.1:53121_solr    ] o.a.s.s.HttpSolrCall [admin] webapp=null path=/admin/metrics params={prefix=CONTAINER.fs.usableSpace,CORE.coreName&wt=javabin&version=2&group=solr.node,solr.core} status=0 QTime=0
   [junit4]   2> 2803933 DEBUG (qtp672620657-27767) [n:127.0.0.1:53121_solr    ] o.a.s.c.a.AutoScalingHandler Verified autoscaling configuration
   [junit4]   2> 2803933 INFO  (qtp672620657-27767) [n:127.0.0.1:53121_solr    ] o.a.s.s.HttpSolrCall [admin] webapp=null path=/admin/autoscaling params={wt=javabin&version=2} status=0 QTime=1
   [junit4]   2> 2803934 INFO  (TEST-TriggerIntegrationTest.testListeners-seed#[19A25D8AA63753EE]) [    ] o.e.j.s.Server jetty-9.4.8.v20171121, build timestamp: 2017-11-21T22:27:37+01:00, git hash: 82b8fb23f757335bb3329d540ce37a2a2615f0a8
   [junit4]   2> 2803934 DEBUG (zkCallback-6662-thread-1-processing-n:127.0.0.1:40113_solr) [n:127.0.0.1:40113_solr    ] o.a.s.c.a.OverseerTriggerThread Refreshing /autoscaling.json with znode version 5
   [junit4]   2> 2803934 DEBUG (zkCallback-6662-thread-1-processing-n:127.0.0.1:40113_solr) [n:127.0.0.1:40113_solr    ] o.a.s.c.a.NodeAddedTrigger Initial livenodes: [127.0.0.1:53121_solr, 127.0.0.1:40113_solr]
   [junit4]   2> 2803934 DEBUG (zkCallback-6662-thread-1-processing-n:127.0.0.1:40113_solr) [n:127.0.0.1:40113_solr    ] o.a.s.c.a.NodeAddedTrigger NodeAddedTrigger node_added_triggerL instantiated with properties: {event=nodeAdded, waitFor=1, actions=[{name=test, class=org.apache.solr.cloud.autoscaling.TriggerIntegrationTest$TestTriggerAction}, {name=test1, class=org.apache.solr.cloud.autoscaling.TriggerIntegrationTest$TestDummyAction}], enabled=true}
   [junit4]   2> 2803934 DEBUG (OverseerAutoScalingTriggerThread-73282463590121477-127.0.0.1:40113_solr-n_0000000000) [n:127.0.0.1:40113_solr    ] o.a.s.c.a.OverseerTriggerThread Processed trigger updates upto znodeVersion 5
   [junit4]   2> 2803935 INFO  (TEST-TriggerIntegrationTest.testListeners-seed#[19A25D8AA63753EE]) [    ] o.e.j.s.session DefaultSessionIdManager workerName=node0
   [junit4]   2> 2803935 INFO  (TEST-TriggerIntegrationTest.testListeners-seed#[19A25D8AA63753EE]) [    ] o.e.j.s.session No SessionScavenger set, using defaults
   [junit4]   2> 2803935 INFO  (TEST-TriggerIntegrationTest.testListeners-seed#[19A25D8AA63753EE]) [    ] o.e.j.s.session Scavenging every 660000ms
   [junit4]   2> 2803935 DEBUG (OverseerAutoScalingTriggerThread-73282463590121477-127.0.0.1:40113_solr-n_0000000000) [n:127.0.0.1:40113_solr    ] o.a.s.c.a.OverseerTriggerThread -- clean old nodeLost markers
   [junit4]   2> 2803935 INFO  (TEST-TriggerIntegrationTest.testListeners-seed#[19A25D8AA63753EE]) [    ] o.e.j.s.h.ContextHandler Started o.e.j.s.ServletContextHandler@4fc6d0b2{/solr,null,AVAILABLE}
   [junit4]   2> 2803935 DEBUG (OverseerAutoScalingTriggerThread-73282463590121477-127.0.0.1:40113_solr-n_0000000000) [n:127.0.0.1:40113_solr    ] o.a.s.c.a.OverseerTriggerThread Current znodeVersion 5, lastZnodeVersion 5
   [junit4]   2> 2803935 INFO  (TEST-TriggerIntegrationTest.testListeners-seed#[19A25D8AA63753EE]) [    ] o.e.j.s.AbstractConnector Started ServerConnector@3897b327{HTTP/1.1,[http/1.1]}{127.0.0.1:36618}
   [junit4]   2> 2803935 INFO  (TEST-TriggerIntegrationTest.testListeners-seed#[19A25D8AA63753EE]) [    ] o.e.j.s.Server Started @2808140ms
   [junit4]   2> 2803935 INFO  (TEST-TriggerIntegrationTest.testListeners-seed#[19A25D8AA63753EE]) [    ] o.a.s.c.s.e.JettySolrRunner Jetty properties: {hostContext=/solr, hostPort=36618}
   [junit4]   2> 2803935 ERROR (TEST-TriggerIntegrationTest.testListeners-seed#[19A25D8AA63753EE]) [    ] o.a.s.u.StartupLoggingUtils Missing Java Option solr.log.dir. Logging may be missing or incomplete.
   [junit4]   2> 2803936 INFO  (TEST-TriggerIntegrationTest.testListeners-seed#[19A25D8AA63753EE]) [    ] o.a.s.s.SolrDispatchFilter  ___      _       Welcome to Apache Solr™ version 7.3.0
   [junit4]   2> 2803936 INFO  (TEST-TriggerIntegrationTest.testListeners-seed#[19A25D8AA63753EE]) [    ] o.a.s.s.SolrDispatchFilter / __| ___| |_ _   Starting in cloud mode on port null
   [junit4]   2> 2803936 INFO  (TEST-TriggerIntegrationTest.testListeners-seed#[19A25D8AA63753EE]) [    ] o.a.s.s.SolrDispatchFilter \__ \/ _ \ | '_|  Install dir: null
   [junit4]   2> 2803936 INFO  (TEST-TriggerIntegrationTest.testListeners-seed#[19A25D8AA63753EE]) [    ] o.a.s.s.SolrDispatchFilter |___/\___/_|_|    Start time: 2018-02-12T12:21:58.443Z
   [junit4]   2> 2803937 INFO  (zkConnectionManagerCallback-6677-thread-1) [    ] o.a.s.c.c.ConnectionManager zkClient has connected
   [junit4]   2> 2803937 INFO  (TEST-TriggerIntegrationTest.testListeners-seed#[19A25D8AA63753EE]) [    ] o.a.s.s.SolrDispatchFilter solr.xml found in ZooKeeper. Loading...
   [junit4]   2> 2803944 INFO  (TEST-TriggerIntegrationTest.testListeners-seed#[19A25D8AA63753EE]) [    ] o.a.s.c.ZkContainer Zookeeper client=127.0.0.1:39971/solr
   [junit4]   2> 2803944 INFO  (zkConnectionManagerCallback-6681-thread-1) [    ] o.a.s.c.c.ConnectionManager zkClient has connected
   [junit4]   2> 2803946 INFO  (zkConnectionManagerCallback-6683-thread-1-processing-n:127.0.0.1:36618_solr) [n:127.0.0.1:36618_solr    ] o.a.s.c.c.ConnectionManager zkClient has connected
   [junit4]   2> 2803951 INFO  (TEST-TriggerIntegrationTest.testListeners-seed#[19A25D8AA63753EE]) [n:127.0.0.1:36618_solr    ] o.a.s.c.c.ZkStateReader Updated live nodes from ZooKeeper... (0) -> (2)
   [junit4]   2> 2803952 INFO  (TEST-TriggerIntegrationTest.testListeners-seed#[19A25D8AA63753EE]) [n:127.0.0.1:36618_solr    ] o.a.s.c.Overseer Overseer (id=null) closing
   [junit4]   2> 2803954 INFO  (TEST-TriggerIntegrationTest.testListeners-seed#[19A25D8AA63753EE]) [n:127.0.0.1:36618_solr    ] o.a.s.c.ZkController Register node as live in ZooKeeper:/live_nodes/127.0.0.1:36618_solr
   [junit4]   2> 2803958 INFO  (zkCallback-6662-thread-1-processing-n:127.0.0.1:40113_solr) [n:127.0.0.1:40113_solr    ] o.a.s.c.c.ZkStateReader Updated live nodes from ZooKeeper... (2) -> (3)
   [junit4]   2> 2803959 INFO  (zkCallback-6664-thread-1-processing-n:127.0.0.1:53121_solr) [n:127.0.0.1:53121_solr    ] o.a.s.c.c.ZkStateReader Updated live nodes from ZooKeeper... (2) -> (3)
   [junit4]   2> 2803960 INFO  (zkCallback-6674-thread-1) [    ] o.a.s.c.c.ZkStateReader Updated live nodes from ZooKeeper... (2) -> (3)
   [junit4]   2> 2803960 INFO  (zkCallback-6682-thread-1-processing-n:127.0.0.1:36618_solr) [n:127.0.0.1:36618_solr    ] o.a.s.c.c.ZkStateReader Updated live nodes from ZooKeeper... (2) -> (3)
   [junit4]   2> 2804005 INFO  (TEST-TriggerIntegrationTest.testListeners-seed#[19A25D8AA63753EE]) [n:127.0.0.1:36618_solr    ] o.a.s.m.r.SolrJmxReporter JMX monitoring for 'solr_36618.solr.node' (registry 'solr.node') enabled at server: com.sun.jmx.mbeanserver.JmxMBeanServer@30215357
   [junit4]   2> 2804013 INFO  (TEST-TriggerIntegrationTest.testListeners-seed#[19A25D8AA63753EE]) [n:127.0.0.1:36618_solr    ] o.a.s.m.r.SolrJmxReporter JMX monitoring for 'solr_36618.solr.jvm' (registry 'solr.jvm') enabled at server: com.sun.jmx.mbeanserver.JmxMBeanServer@30215357
   [junit4]   2> 2804013 INFO  (TEST-TriggerIntegrationTest.testListeners-seed#[19A25D8AA63753EE]) [n:127.0.0.1:36618_solr    ] o.a.s.m.r.SolrJmxReporter JMX monitoring for 'solr_36618.solr.jetty' (registry 'solr.jetty') enabled at server: com.sun.jmx.mbeanserver.JmxMBeanServer@30215357
   [junit4]   2> 2804014 INFO  (TEST-TriggerIntegrationTest.testListeners-seed#[19A25D8AA63753EE]) [n:127.0.0.1:36618_solr    ] o.a.s.c.CorePropertiesLocator Found 0 core definitions underneath /x1/jenkins/jenkins-slave/workspace/Lucene-Solr-Tests-7.x/solr/build/solr-core/test/J0/temp/solr.cloud.autoscaling.TriggerIntegrationTest_19A25D8AA63753EE-001/tempDir-001/node3/.
   [junit4]   2> 2804932 DEBUG (ScheduledTrigger-6854-thread-2) [n:127.0.0.1:40113_solr    ] o.a.s.c.a.NodeAddedTrigger Running NodeAddedTrigger node_added_triggerL
   [junit4]   2> 2804932 DEBUG (ScheduledTrigger-6854-thread-2) [n:127.0.0.1:40113_solr    ] o.a.s.c.a.NodeAddedTrigger Found livenodes: 3
   [junit4]   2> 2804932 DEBUG (ScheduledTrigger-6854-thread-2) [n:127.0.0.1:40113_solr    ] o.a.s.c.a.NodeAddedTrigger Tracking new node: 127.0.0.1:36618_solr at time 18690027561553857
   [junit4]   2> 2805933 DEBUG (ScheduledTrigger-6854-thread-2) [n:127.0.0.1:40113_solr    ] o.a.s.c.a.NodeAddedTrigger Running NodeAddedTrigger node_added_triggerL
   [junit4]   2> 2805933 DEBUG (ScheduledTrigger-6854-thread-2) [n:127.0.0.1:40113_solr    ] o.a.s.c.a.NodeAddedTrigger Found livenodes: 3
   [junit4]   2> 2805933 DEBUG (ScheduledTrigger-6854-thread-2) [n:127.0.0.1:40113_solr    ] o.a.s.c.a.NodeAddedTrigger NodeAddedTrigger node_added_triggerL firing registered processor for nodes: [127.0.0.1:36618_solr] added at times [18690027561553857], now=18690028562728089
   [junit4]   2> 2805933 DEBUG (ScheduledTrigger-6854-thread-2) [n:127.0.0.1:40113_solr    ] o.a.s.c.a.ScheduledTriggers ++++++++ Cooldown inactive - processing event: {
   [junit4]   2>   "id":"42667b25a60fc1Ta8oz6s9up00uhtvpyltiarvzy",
   [junit4]   2>   "source":"node_added_triggerL",
   [junit4]   2>   "eventTime":18690027561553857,
   [junit4]   2>   "eventType":"NODEADDED",
   [junit4]   2>   "properties":{
   [junit4]   2>     "eventTimes":[18690027561553857],
   [junit4]   2>     "nodeNames":["127.0.0.1:36618_solr"]}}
   [junit4]   2> 2805934 DEBUG (ScheduledTrigger-6854-thread-2) [n:127.0.0.1:40113_solr    ] o.a.s.c.a.ScheduledTriggers Pausing all triggers: [node_added_triggerL]
   [junit4]   2> 2805935 INFO  (ScheduledTrigger-6854-thread-2) [n:127.0.0.1:40113_solr    ] o.a.s.c.a.SystemLogListener Collection .system does not exist, disabling logging.
   [junit4]   2> 2805936 DEBUG (AutoscalingActionExecutor-6855-thread-1-processing-n:127.0.0.1:40113_solr) [n:127.0.0.1:40113_solr    ] o.a.s.c.a.ScheduledTriggers -- processing actions for {
   [junit4]   2>   "id":"42667b25a60fc1Ta8oz6s9up00uhtvpyltiarvzy",
   [junit4]   2>   "source":"node_added_triggerL",
   [junit4]   2>   "eventTime":18690027561553857,
   [junit4]   2>   "eventType":"NODEADDED",
   [junit4]   2>   "properties":{
   [junit4]   2>     "eventTimes":[18690027561553857],
   [junit4]   2>     "_enqueue_time_":18690028563917757,
   [junit4]   2>     "nodeNames":["127.0.0.1:36618_solr"]}}
   [junit4]   2> 2805939 DEBUG (AutoscalingActionExecutor-6855-thread-1-processing-n:127.0.0.1:40113_solr) [n:127.0.0.1:40113_solr    ] o.a.s.c.a.ScheduledTriggers Resuming trigger: node_added_triggerL after 5000ms
   [junit4]   2> 2805939 DEBUG (AutoscalingActionExecutor-6855-thread-1-processing-n:127.0.0.1:40113_solr) [n:127.0.0.1:40113_solr    ] o.a.s.c.a.ScheduledTriggers -- processing took 3 ms for event id=42667b25a60fc1Ta8oz6s9up00uhtvpyltiarvzy
   [junit4]   2> 2807940 INFO  (TEST-TriggerIntegrationTest.testListeners-seed#[19A25D8AA63753EE]) [    ] o.e.j.s.Server jetty-9.4.8.v20171121, build timestamp: 2017-11-21T22:27:37+01:00, git hash: 82b8fb23f757335bb3329d540ce37a2a2615f0a8
   [junit4]   2> 2807941 INFO  (TEST-TriggerIntegrationTest.testListeners-seed#[19A25D8AA63753EE]) [    ] o.e.j.s.session DefaultSessionIdManager workerName=node0
   [junit4]   2> 2807941 INFO  (TEST-TriggerIntegrationTest.testListeners-seed#[19A25D8AA63753EE]) [    ] o.e.j.s.session No SessionScavenger set, using defaults
   [junit4]   2> 2807941 INFO  (TEST-TriggerIntegrationTest.testListeners-seed#[19A25D8AA63753EE]) [    ] o.e.j.s.session Scavenging every 660000ms
   [junit4]   2> 2807942 INFO  (TEST-TriggerIntegrationTest.testListeners-seed#[19A25D8AA63753EE]) [    ] o.e.j.s.h.ContextHandler Started o.e.j.s.ServletContextHandler@744bef8e{/solr,null,AVAILABLE}
   [junit4]   2> 2807942 INFO  (TEST-TriggerIntegrationTest.testListeners-seed#[19A25D8AA63753EE]) [    ] o.e.j.s.AbstractConnector Started ServerConnector@4b509608{HTTP/1.1,[http/1.1]}{127.0.0.1:44674}
   [junit4]   2> 2807942 INFO  (TEST-TriggerIntegrationTest.testListeners-seed#[19A25D8AA63753EE]) [    ] o.e.j.s.Server Started @2812147ms
   [junit4]   2> 2807942 INFO  (TEST-TriggerIntegrationTest.testListeners-seed#[19A25D8AA63753EE]) [    ] o.a.s.c.s.e.JettySolrRunner Jetty properties: {hostContext=/solr, hostPort=44674}
   [junit4]   2> 2807943 ERROR (TEST-TriggerIntegrationTest.testListeners-seed#[19A25D8AA63753EE]) [    ] o.a.s.u.StartupLoggingUtils Missing Java Option solr.log.dir. Logging may be missing or incomplete.
   [junit4]   2> 2807943 INFO  (TEST-TriggerIntegrationTest.testListeners-seed#[19A25D8AA63753EE]) [    ] o.a.s.s.SolrDispatchFilter  ___      _       Welcome to Apache Solr™ version 7.3.0
   [junit4]   2> 2807943 INFO  (TEST-TriggerIntegrationTest.testListeners-seed#[19A25D8AA63753EE]) [    ] o.a.s.s.SolrDispatchFilter / __| ___| |_ _   Starting in cloud mode on port null
   [junit4]   2> 2807943 INFO  (TEST-TriggerIntegrationTest.testListeners-seed#[19A25D8AA63753EE]) [    ] o.a.s.s.SolrDispatchFilter \__ \/ _ \ | '_|  Install dir: null
   [junit4]   2> 2807943 INFO  (TEST-TriggerIntegrationTest.testListeners-seed#[19A25D8AA63753EE]) [    ] o.a.s.s.SolrDispatchFilter |___/\___/_|_|    Start time: 2018-02-12T12:22:02.450Z
   [junit4]   2> 2807944 INFO  (zkConnectionManagerCallback-6687-thread-1) [    ] o.a.s.c.c.ConnectionManager zkClient has connected
   [junit4]   2> 2807950 INFO  (TEST-TriggerIntegrationTest.testListeners-seed#[19A25D8AA63753EE]) [    ] o.a.s.s.SolrDispatchFilter solr.xml found in ZooKeeper. Loading...
   [junit4]   2> 2807957 INFO  (TEST-TriggerIntegrationTest.testListeners-seed#[19A25D8AA63753EE]) [    ] o.a.s.c.ZkContainer Zookeeper client=127.0.0.1:39971/solr
   [junit4]   2> 2807959 INFO  (zkConnectionManagerCallback-6691-thread-1) [    ] o.a.s.c.c.ConnectionManager zkClient has connected
   [junit4]   2> 2807961 INFO  (zkConnectionManagerCallback-6693-thread-1-processing-n:127.0.0.1:44674_solr) [n:127.0.0.1:44674_solr    ] o.a.s.c.c.ConnectionManager zkClient has connected
   [junit4]   2> 2807967 INFO  (TEST-TriggerIntegrationTest.testListeners-seed#[19A25D8AA63753EE]) [n:127.0.0.1:44674_solr    ] o.a.s.c.c.ZkStateReader Updated live nodes from ZooKeeper... (0) -> (3)
   [junit4]   2> 2807968 INFO  (TEST-TriggerIntegrationTest.testListeners-seed#[19A25D8AA63753EE]) [n:127.0.0.1:44674_solr    ] o.a.s.c.Overseer Overseer (id=null) closing
   [junit4]   2> 2807970 INFO  (TEST-TriggerIntegrationTest.testListeners-seed#[19A25D8AA63753EE]) [n:127.0.0.1:44674_solr    ] o.a.s.c.ZkController Register node as live in ZooKeeper:/live_nodes/127.0.0.1:44674_solr
   [junit4]   2> 2807971 INFO  (zkCallback-6674-thread-1) [    ] o.a.s.c.c.ZkStateReader Updated live nodes from ZooKeeper... (3) -> (4)
   [junit4]   2> 2807974 INFO  (zkCallback-6664-thread-1-processing-n:127.0.0.1:53121_solr) [n:127.0.0.1:53121_solr    ] o.a.s.c.c.ZkStateReader Updated live nodes from ZooKeeper... (3) -> (4)
   [junit4]   2> 2807974 INFO  (zkCallback-6682-thread-1-processing-n:127.0.0.1:36618_solr) [n:127.0.0.1:36618_solr    ] o.a.s.c.c.ZkStateReader Updated live nodes from ZooKeeper... (3) -> (4)
   [junit4]   2> 2807975 INFO  (zkCallback-6692-thread-1-processing-n:127.0.0.1:44674_solr) [n:127.0.0.1:44674_solr    ] o.a.s.c.c.ZkStateReader Updated live nodes from ZooKeeper... (3) -> (4)
   [junit4]   2> 2807975 INFO  (zkCallback-6662-thread-1-processing-n:127.0.0.1:40113_solr) [n:127.0.0.1:40113_solr    ] o.a.s.c.c.ZkStateReader Updated live nodes from ZooKeeper... (3) -> (4)
   [junit4]   2> 2808053 INFO  (TEST-TriggerIntegrationTest.testListeners-seed#[19A25D8AA63753EE]) [n:127.0.0.1:44674_solr    ] o.a.s.m.r.SolrJmxReporter JMX monitoring for 'solr_44674.solr.node' (registry 'solr.node') enabled at server: com.sun.jmx.mbeanserver.JmxMBeanServer@30215357
   [junit4]   2> 2808062 INFO  (TEST-TriggerIntegrationTest.testListeners-seed#[19A25D8AA63753EE]) [n:127.0.0.1:44674_solr    ] o.a.s.m.r.SolrJmxReporter JMX monitoring for 'solr_44674.solr.jvm' (registry 'solr.jvm') enabled at server: com.sun.jmx.mbeanserver.JmxMBeanServer@30215357
   [junit4]   2> 2808063 INFO  (TEST-TriggerIntegrationTest.testListeners-seed#[19A25D8AA63753EE]) [n:127.0.0.1:44674_solr    ] o.a.s.m.r.SolrJmxReporter JMX monitoring for 'solr_44674.solr.jetty' (registry 'solr.jetty') enabled at server: com.sun.jmx.mbeanserver.JmxMBeanServer@30215357
   [junit4]   2> 2808064 INFO  (TEST-TriggerIntegrationTest.testListeners-seed#[19A25D8AA63753EE]) [n:127.0.0.1:44674_solr    ] o.a.s.c.CorePropertiesLocator Found 0 core definitions underneath /x1/jenkins/jenkins-slave/workspace/Lucene-Solr-Tests-7.x/solr/build/solr-core/test/J0/temp/solr.cloud.autoscaling.TriggerIntegrationTest_19A25D8AA63753EE-001/tempDir-001/node4/.
   [junit4]   2> 2810940 DEBUG (ScheduledTrigger-6854-thread-1) [n:127.0.0.1:40113_solr    ] o.a.s.c.a.NodeAddedTrigger Running NodeAddedTrigger node_added_triggerL
   [junit4]   2> 2810940 DEBUG (ScheduledTrigger-6854-thread-1) [n:127.0.0.1:40113_solr    ] o.a.s.c.a.NodeAddedTrigger Found livenodes: 4
   [junit4]   2> 2810940 DEBUG (ScheduledTrigger-6854-thread-1) [n:127.0.0.1:40113_solr    ] o.a.s.c.a.NodeAddedTrigger Tracking new node: 127.0.0.1:44674_solr at time 18690033569546848
   [junit4]   2> 2811941 DEBUG (ScheduledTrigger-6854-thread-1) [n:127.0.0.1:40113_solr    ] o.a.s.c.a.NodeAddedTrigger Running NodeAddedTrigger node_added_triggerL
   [junit4]   2> 2811941 DEBUG (ScheduledTrigger-6854-thread-1) [n:127.0.0.1:40113_solr    ] o.a.s.c.a.NodeAddedTrigger Found livenodes: 4
   [junit4]   2> 2811941 DEBUG (ScheduledTrigger-6854-thread-1) [n:127.0.0.1:40113_solr    ] o.a.s.c.a.NodeAddedTrigger NodeAddedTrigger node_added_triggerL firing registered processor for nodes: [127.0.0.1:44674_solr] added at times [18690033569546848], now=18690034571014618
   [junit4]   2> 2811941 DEBUG (ScheduledTrigger-6854-thread-1) [n:127.0.0.1:40113_solr    ] o.a.s.c.a.ScheduledTriggers ++++++++ Cooldown inactive - processing event: {
   [junit4]   2>   "id":"42667c8bc0c260Ta8oz6s9up00uhtvpyltiarw00",
   [junit4]   2>   "source":"node_added_triggerL",
   [junit4]   2>   "eventTime":18690033569546848,
   [junit4]   2>   "eventType":"NODEADDED",
   [junit4]   2>   "properties":{
   [junit4]   2>     "eventTimes":[18690033569546848],
   [junit4]   2>     "nodeNames":["127.0.0.1:44674_solr"]}}
   [junit4]   2> 2811942 DEBUG (ScheduledTrigger-6854-thread-1) [n:127.0.0.1:40113_solr    ] o.a.s.c.a.ScheduledTriggers Pausing all triggers: [node_added_triggerL]
   [junit4]   2> 2811942 DEBUG (AutoscalingActionExecutor-6855-thread-1-processing-n:127.0.0.1:40113_solr) [n:127.0.0.1:40113_solr    ] o.a.s.c.a.ScheduledTriggers -- processing actions for {
   [junit4]   2>   "id":"42667c8bc0c260Ta8oz6s9up00uhtvpyltiarw00",
   [junit4]   2>   "source":"node_added_triggerL",
   [junit4]   2>   "eventTime":18690033569546848,
   [junit4]   2>   "eventType":"NODEADDED",
   [junit4]   2>   "properties":{
   [junit4]   2>     "eventTimes":[18690033569546848],
   [junit4]   2>     "_enqueue_time_":18690034571324861,
   [junit4]   2>     "nodeNames":["127.0.0.1:44674_solr"]}}
   [junit4]   2> 2811943 WARN  (AutoscalingActionExecutor-6855-thread-1-processing-n:127.0.0.1:40113_solr) [n:127.0.0.1:40113_solr    ] o.a.s.c.a.ScheduledTriggers Exception executing actions
   [junit4]   2> java.lang.Exception: Error executing action: test1 for trigger event: {
   [junit4]   2>   "id":"42667c8bc0c260Ta8oz6s9up00uhtvpyltiarw00",
   [junit4]   2>   "source":"node_added_triggerL",
   [junit4]   2>   "eventTime":18690033569546848,
   [junit4]   2>   "eventType":"NODEADDED",
   [junit4]   2>   "properties":{
   [junit4]   2>     "eventTimes":[18690033569546848],
   [junit4]   2>     "_enqueue_time_":18690034571324861,
   [junit4]   2>     "nodeNames":["127.0.0.1:44674_solr"]}}
   [junit4]   2> 	at org.apache.solr.cloud.autoscaling.ScheduledTriggers.lambda$null$3(ScheduledTriggers.java:303)
   [junit4]   2> 	at java.util.concurrent.Executors$RunnableAdapter.call(Executors.java:511)
   [junit4]   2> 	at java.util.concurrent.FutureTask.run(FutureTask.java:266)
   [junit4]   2> 	at org.apache.solr.common.util.ExecutorUtil$MDCAwareThreadPoolExecutor.lambda$execute$0(ExecutorUtil.java:188)
   [junit4]   2> 	at java.util.concurrent.ThreadPoolExecutor.runWorker(ThreadPoolExecutor.java:1149)
   [junit4]   2> 	at java.util.concurrent.ThreadPoolExecutor$Worker.run(ThreadPoolExecutor.java:624)
   [junit4]   2> 	at java.lang.Thread.run(Thread.java:748)
   [junit4]   2> Caused by: java.lang.RuntimeException: failure
   [junit4]   2> 	at org.apache.solr.cloud.autoscaling.TriggerIntegrationTest$TestDummyAction.process(TriggerIntegrationTest.java:989)
   [junit4]   2> 	at org.apache.solr.cloud.autoscaling.ScheduledTriggers.lambda$null$3(ScheduledTriggers.java:300)
   [junit4]   2> 	... 6 more
   [junit4]   2> 2811945 DEBUG (AutoscalingActionExecutor-6855-thread-1-processing-n:127.0.0.1:40113_solr) [n:127.0.0.1:40113_solr    ] o.a.s.c.a.ScheduledTriggers Resuming trigger: node_added_triggerL after 5000ms
   [junit4]   2> 2811945 DEBUG (AutoscalingActionExecutor-6855-thread-1-processing-n:127.0.0.1:40113_solr) [n:127.0.0.1:40113_solr    ] o.a.s.c.a.ScheduledTriggers -- processing took 2 ms for event id=42667c8bc0c260Ta8oz6s9up00uhtvpyltiarw00
   [junit4]   2> 2813943 INFO  (TEST-TriggerIntegrationTest.testListeners-seed#[19A25D8AA63753EE]) [    ] o.a.s.SolrTestCaseJ4 ###Ending testListeners
   [junit4]   2> 2813992 INFO  (TEST-TriggerIntegrationTest.testEventFromRestoredState-seed#[19A25D8AA63753EE]) [    ] o.a.s.SolrTestCaseJ4 ###Starting testEventFromRestoredState
   [junit4]   2> 2813992 INFO  (TEST-TriggerIntegrationTest.testEventFromRestoredState-seed#[19A25D8AA63753EE]) [    ] o.a.s.c.a.TriggerIntegrationTest /autoscaling.json reset, new znode version 6
   [junit4]   2> 2813992 DEBUG (zkCallback-6662-thread-1-processing-n:127.0.0.1:40113_solr) [n:127.0.0.1:40113_solr    ] o.a.s.c.a.OverseerTriggerThread Refreshing /autoscaling.json with znode version 6
   [junit4]   2> 2813993 DEBUG (OverseerAutoScalingTriggerThread-73282463590121477-127.0.0.1:40113_solr-n_0000000000) [n:127.0.0.1:40113_solr    ] o.a.s.c.a.OverseerTriggerThread Processed trigger updates upto znodeVersion 6
   [junit4]   2> 2813994 DEBUG (OverseerAutoScalingTriggerThread-73282463590121477-127.0.0.1:40113_solr-n_0000000000) [n:127.0.0.1:40113_solr    ] o.a.s.c.a.OverseerTriggerThread -- clean old nodeLost markers
   [junit4]   2> 2813994 DEBUG (OverseerAutoScalingTriggerThread-73282463590121477-127.0.0.1:40113_solr-n_0000000000) [n:127.0.0.1:40113_solr    ] o.a.s.c.a.OverseerTriggerThread -- clean old nodeAdded markers
   [junit4]   2> 2813994 DEBUG (OverseerAutoScalingTriggerThread-73282463590121477-127.0.0.1:40113_solr-n_0000000000) [n:127.0.0.1:40113_solr    ] o.a.s.c.a.OverseerTriggerThread Current znodeVersion 6, lastZnodeVersion 6
   [junit4]   2> 2813998 INFO  (qtp1473312374-27823) [n:127.0.0.1:36618_solr    ] o.a.s.s.HttpSolrCall [admin] webapp=null path=/admin/metrics params={prefix=CONTAINER.fs.usableSpace,CORE.coreName&wt=javabin&version=2&group=solr.node,solr.core} status=0 QTime=0
   [junit4]   2> 2813999 INFO  (qtp196248133-27770) [n:127.0.0.1:40113_solr    ] o.a.s.s.HttpSolrCall [admin] webapp=null path=/admin/metrics params={prefix=CONTAINER.fs.usableSpace,CORE.coreName&wt=javabin&version=2&group=solr.node,solr.core} status=0 QTime=0
   [junit4]   2> 2814000 INFO  (qtp2140365613-27853) [n:127.0.0.1:44674_solr    ] o.a.s.s.HttpSolrCall [admin] webapp=null path=/admin/metrics params={prefix=CONTAINER.fs.usableSpace,CORE.coreName&wt=javabin&version=2&group=solr.node,solr.core} status=0 QTime=0
   [junit4]   2> 2814000 INFO  (qtp672620657-27767) [n:127.0.0.1:53121_solr    ] o.a.s.s.HttpSolrCall [admin] webapp=null path=/admin/metrics params={prefix=CONTAINER.fs.usableSpace,CORE.coreName&wt=javabin&version=2&group=solr.node,solr.core} status=0 QTime=0
   [junit4]   2> 2814001 DEBUG (qtp2140365613-27849) [n:127.0.0.1:44674_solr    ] o.a.s.c.a.AutoScalingHandler Verified autoscaling configuration
   [junit4]   2> 2814001 INFO  (qtp2140365613-27849) [n:127.0.0.1:44674_solr    ] o.a.s.s.HttpSolrCall [admin] webapp=null path=/cluster/autoscaling params={wt=javabin&version=2} status=0 QTime=5
   [junit4]   2> 2814002 DEBUG (zkCallback-6662-thread-1-processing-n:127.0.0.1:40113_solr) [n:127.0.0.1:40113_solr    ] o.a.s.c.a.OverseerTriggerThread Refreshing /autoscaling.json with znode version 7
   [junit4]   2> 2814003 DEBUG (zkCallback-6662-thread-1-processing-n:127.0.0.1:40113_solr) [n:127.0.0.1:40113_solr    ] o.a.s.c.a.NodeAddedTrigger Initial livenodes: [127.0.0.1:44674_solr, 127.0.0.1:53121_solr, 127.0.0.1:36618_solr, 127.0.0.1:40113_solr]
   [junit4]   2> 2814003 DEBUG (zkCallback-6662-thread-1-processing-n:127.0.0.1:40113_solr) [n:127.0.0.1:40113_solr    ] o.a.s.c.a.NodeAddedTrigger NodeAddedTrigger node_added_triggerEFRS instantiated with properties: {event=nodeAdded, waitFor=10, actions=[{name=test, class=org.apache.solr.cloud.autoscaling.TriggerIntegrationTest$TestTriggerAction}], enabled=true}
   [junit4]   2> 2814003 DEBUG (OverseerAutoScalingTriggerThread-73282463590121477-127.0.0.1:40113_solr-n_0000000000) [n:127.0.0.1:40113_solr    ] o.a.s.c.a.OverseerTriggerThread Processed trigger updates upto znodeVersion 7
   [junit4]   2> 2814004 INFO  (OverseerAutoScalingTriggerThread-73282463590121477-127.0.0.1:40113_solr-n_0000000000) [n:127.0.0.1:40113_solr    ] o.a.s.c.a.TriggerIntegrationTest TestTriggerAction init
   [junit4]   2> 2814004 DEBUG (OverseerAutoScalingTriggerThread-73282463590121477-127.0.0.1:40113_solr-n_0000000000) [n:127.0.0.1:40113_solr    ] o.a.s.c.a.OverseerTriggerThread -- clean old nodeLost markers
   [junit4]   2> 2814005 DEBUG (OverseerAutoScalingTriggerThread-73282463590121477-127.0.0.1:40113_solr-n_0000000000) [n:127.0.0.1:40113_solr    ] o.a.s.c.a.OverseerTriggerThread Current znodeVersion 7, lastZnodeVersion 7
   [junit4]   2> 2814005 INFO  (qtp1473312374-27823) [n:127.0.0.1:36618_solr    ] o.a.s.h.a.CollectionsHandler Invoked Collection Action :overseerstatus with params action=OVERSEERSTATUS&wt=javabin&version=2 and sendToOCPQueue=true
   [junit4]   2> 2814005 DEBUG (ScheduledTrigger-6854-thread-2) [n:127.0.0.1:40113_solr    ] o.a.s.c.a.NodeAddedTrigger Running NodeAddedTrigger node_added_triggerEFRS
   [junit4]   2> 2814005 DEBUG (ScheduledTrigger-6854-thread-2) [n:127.0.0.1:40113_solr    ] o.a.s.c.a.NodeAddedTrigger Found livenodes: 4
   [junit4]   2> 2814011 INFO  (qtp1473312374-27823) [n:127.0.0.1:36618_solr    ] o.a.s.s.HttpSolrCall [admin] webapp=null path=/admin/collections params={action=OVERSEERSTATUS&wt=javabin&version=2} status=0 QTime=6
   [junit4]   2> 2814012 INFO  (TEST-TriggerIntegrationTest.testEventFromRestoredState-seed#[19A25D8AA63753EE]) [    ] o.e.j.s.Server jetty-9.4.8.v20171121, build timestamp: 2017-11-21T22:27:37+01:00, git hash: 82b8fb23f757335bb3329d540ce37a2a2615f0a8
   [junit4]   2> 2814013 INFO  (TEST-TriggerIntegrationTest.testEventFromRestoredState-seed#[19A25D8AA63753EE]) [    ] o.e.j.s.session DefaultSessionIdManager workerName=node0
   [junit4]   2> 2814013 INFO  (TEST-TriggerIntegrationTest.testEventFromRestoredState-seed#[19A25D8AA63753EE]) [    ] o.e.j.s.session No SessionScavenger set, using defaults
   [junit4]   2> 2814013 INFO  (TEST-TriggerIntegrationTest.testEventFromRestoredState-seed#[19A25D8AA63753EE]) [    ] o.e.j.s.session Scavenging every 660000ms
   [junit4]   2> 2814014 INFO  (TEST-TriggerIntegrationTest.testEventFromRestoredState-seed#[19A25D8AA63753EE]) [    ] o.e.j.s.h.ContextHandler Started o.e.j.s.ServletContextHandler@208832bf{/solr,null,AVAILABLE}
   [junit4]   2> 2814014 INFO  (TEST-TriggerIntegrationTest.testEventFromRestoredState-seed#[19A25D8AA63753EE]) [    ] o.e.j.s.AbstractConnector Started ServerConnector@1f3b6c19{HTTP/1.1,[http/1.1]}{127.0.0.1:48872}
   [junit4]   2> 2814014 INFO  (TEST-TriggerIntegrationTest.testEventFromRestoredState-seed#[19A25D8AA63753EE]) [    ] o.e.j.s.Server Started @2818219ms
   [junit4]   2> 2814014 INFO  (TEST-TriggerIntegrationTest.testEventFromRestoredState-seed#[19A25D8AA63753EE]) [    ] o.a.s.c.s.e.JettySolrRunner Jetty properties: {hostContext=/solr, hostPort=48872}
   [junit4]   2> 2814014 ERROR (TEST-TriggerIntegrationTest.testEventFromRestoredState-seed#[19A25D8AA63753EE]) [    ] o.a.s.u.StartupLoggingUtils Missing Java Option solr.log.dir. Logging may be missing or incomplete.
   [junit4]   2> 2814015 INFO  (TEST-TriggerIntegrationTest.testEventFromRestoredState-seed#[19A25D8AA63753EE]) [    ] o.a.s.s.SolrDispatchFilter  ___      _       Welcome to Apache Solr™ version 7.3.0
   [junit4]   2> 2814015 INFO  (TEST-TriggerIntegrationTest.testEventFromRestoredState-seed#[19A25D8AA63753EE]) [    ] o.a.s.s.SolrDispatchFilter / __| ___| |_ _   Starting in cloud mode on port null
   [junit4]   2> 2814016 INFO  (TEST-TriggerIntegrationTest.testEventFromRestoredState-seed#[19A25D8AA63753EE]) [    ] o.a.s.s.SolrDispatchFilter \__ \/ _ \ | '_|  Install dir: null
   [junit4]   2> 2814016 INFO  (TEST-TriggerIntegrationTest.testEventFromRestoredState-seed#[19A25D8AA63753EE]) [    ] o.a.s.s.SolrDispatchFilter |___/\___/_|_|    Start time: 2018-02-12T12:22:08.523Z
   [junit4]   2> 2814019 INFO  (zkConnectionManagerCallback-6697-thread-1) [    ] o.a.s.c.c.ConnectionManager zkClient has connected
   [junit4]   2> 2814019 INFO  (TEST-TriggerIntegrationTest.testEventFromRestoredState-seed#[19A25D8AA63753EE]) [    ] o.a.s.s.SolrDispatchFilter solr.xml found in ZooKeeper. Loading...
   [junit4]   2> 2814028 INFO  (TEST-TriggerIntegrationTest.testEventFromRestoredState-seed#[19A25D8AA63753EE]) [    ] o.a.s.c.ZkContainer Zookeeper client=127.0.0.1:39971/solr
   [junit4]   2> 2814029 INFO  (zkConnectionManagerCallback-6701-thread-1) [    ] o.a.s.c.c.ConnectionManager zkClient has connected
   [junit4]   2> 2814035 INFO  (zkConnectionManagerCallback-6703-thread-1-processing-n:127.0.0.1:48872_solr) [n:127.0.0.1:48872_solr    ] o.a.s.c.c.ConnectionManager zkClient has connected
   [junit4]   2> 2814039 INFO  (TEST-TriggerIntegrationTest.testEventFromRestoredState-seed#[19A25D8AA63753EE]) [n:127.0.0.1:48872_solr    ] o.a.s.c.c.ZkStateReader Updated live nodes from ZooKeeper... (0) -> (4)
   [junit4]   2> 2814040 INFO  (TEST-TriggerIntegrationTest.testEventFromRestoredState-seed#[19A25D8AA63753EE]) [n:127.0.0.1:48872_solr    ] o.a.s.c.Overseer Overseer (id=null) closing
   [junit4]   2> 2814042 INFO  (TEST-TriggerIntegrationTest.testEventFromRestoredState-seed#[19A25D8AA63753EE]) [n:127.0.0.1:48872_solr    ] o.a.s.c.ZkController Register node as live in ZooKeeper:/live_nodes/127.0.0.1:48872_solr
   [junit4]   2> 2814043 INFO  (zkCallback-6662-thread-1-processing-n:127.0.0.1:40113_solr) [n:127.0.0.1:40113_solr    ] o.a.s.c.c.ZkStateReader Updated live nodes from ZooKeeper... (4) -> (5)
   [junit4]   2> 2814043 INFO  (zkCallback-6682-thread-1-processing-n:127.0.0.1:36618_solr) [n:127.0.0.1:36618_solr    ] o.a.s.c.c.ZkStateReader Updated live nodes from ZooKeeper... (4) -> (5)
   [junit4]   2> 2814043 INFO  (zkCallback-6664-thread-1-processing-n:127.0.0.1:53121_solr) [n:127.0.0.1:53121_solr    ] o.a.s.c.c.ZkStateReader Updated live nodes from ZooKeeper... (4) -> (5)
   [junit4]   2> 2814043 INFO  (zkCallback-6674-thread-1) [    ] o.a.s.c.c.ZkStateReader Updated live nodes from ZooKeeper... (4) -> (5)
   [junit4]   2> 2814043 INFO  (zkCallback-6692-thread-1-processing-n:127.0.0.1:44674_solr) [n:127.0.0.1:44674_solr    ] o.a.s.c.c.ZkStateReader Updated live nodes from ZooKeeper... (4) -> (5)
   [junit4]   2> 2814050 INFO  (zkCallback-6702-thread-1-processing-n:127.0.0.1:48872_solr) [n:127.0.0.1:48872_solr    ] o.a.s.c.c.ZkStateReader Updated live nodes from ZooKeeper... (4) -> (5)
   [junit4]   2> 2814103 INFO  (TEST-TriggerIntegrationTest.testEventFromRestoredState-seed#[19A25D8AA63753EE]) [n:127.0.0.1:48872_solr    ] o.a.s.m.r.SolrJmxReporter JMX monitoring for 'solr_48872.solr.node' (registry 'solr.node') enabled at server: com.sun.jmx.mbeanserver.JmxMBeanServer@30215357
   [junit4]   2> 2814112 INFO  (TEST-TriggerIntegrationTest.testEventFromRestoredState-seed#[19A25D8AA63753EE]) [n:127.0.0.1:48872_solr    ] o.a.s.m.r.SolrJmxReporter JMX monitoring for 'solr_48872.solr.jvm' (registry 'solr.jvm') enabled at server: com.sun.jmx.mbeanserver.JmxMBeanServer@30215357
   [junit4]   2> 2814112 INFO  (TEST-TriggerIntegrationTest.testEventFromRestoredState-seed#[19A25D8AA63753EE]) [n:127.0.0.1:48872_solr    ] o.a.s.m.r.SolrJmxReporter JMX monitoring for 'solr_48872.solr.jetty' (registry 'solr.jetty') enabled at server: com.sun.jmx.mbeanserver.JmxMBeanServer@30215357
   [junit4]   2> 2814113 INFO  (TEST-TriggerIntegrationTest.testEventFromRestoredState-seed#[19A25D8AA63753EE]) [n:127.0.0.1:48872_solr    ] o.a.s.c.CorePropertiesLocator Found 0 core definitions underneath /x1/jenkins/jenkins-slave/workspace/Lucene-Solr-Tests-7.x/solr/build/solr-core/test/J0/temp/solr.cloud.autoscaling.TriggerIntegrationTest_19A25D8AA63753EE-001/tempDir-001/node5/.
   [junit4]   2> 2815006 DEBUG (ScheduledTrigger-6854-thread-2) [n:127.0.0.1:40113_solr    ] o.a.s.c.a.NodeAddedTrigger Running NodeAddedTrigger node_added_triggerEFRS
   [junit4]   2> 2815006 DEBUG (ScheduledTrigger-6854-thread-2) [n:127.0.0.1:40113_solr    ] o.a.s.c.a.NodeAddedTrigger Found livenodes: 5
   [junit4]   2> 2815006 DEBUG (ScheduledTrigger-6854-thread-2) [n:127.0.0.1:40113_solr    ] o.a.s.c.a.NodeAddedTrigger Tracking new node: 127.0.0.1:48872_solr at time 18690037635886273
   [junit4]   2> 2816007 DEBUG (ScheduledTrigger-6854-thread-2) [n:127.0.0.1:40113_solr    ] o.a.s.c.a.NodeAddedTrigger Running NodeAddedTrigger node_added_triggerEFRS
   [junit4]   2> 2816007 DEBUG (ScheduledTrigger-6854-thread-2) [n:127.0.0.1:40113_solr    ] o.a.s.c.a.NodeAddedTrigger Found livenodes: 5
   [junit4]   2> 2816008 INFO  (OverseerCollectionConfigSetProcessor-73282463590121477-127.0.0.1:40113_solr-n_0000000000) [n:127.0.0.1:40113_solr    ] o.a.s.c.OverseerTaskQueue Response ZK path: /overseer/collection-queue-work/qnr-0000000000 doesn't exist.  Requestor may have disconnected from ZooKeeper
   [junit4]   2> 2817008 DEBUG (ScheduledTrigger-6854-thread-2) [n:127.0.0.1:40113_solr    ] o.a.s.c.a.NodeAddedTrigger Running NodeAddedTrigger node_added_triggerEFRS
   [junit4]   2> 2817008 DEBUG (ScheduledTrigger-6854-thread-2) [n:127.0.0.1:40113_solr    ] o.a.s.c.a.NodeAddedTrigger Found livenodes: 5
   [junit4]   2> 2818008 DEBUG (ScheduledTrigger-6854-thread-2) [n:127.0.0.1:40113_solr    ] o.a.s.c.a.NodeAddedTrigger Running NodeAddedTrigger node_added_triggerEFRS
   [junit4]   2> 2818008 DEBUG (ScheduledTrigger-6854-thread-2) [n:127.0.0.1:40113_solr    ] o.a.s.c.a.NodeAddedTrigger Found livenodes: 5
   [junit4]   2> 2819009 DEBUG (ScheduledTrigger-6854-thread-2) [n:127.0.0.1:40113_solr    ] o.a.s.c.a.NodeAddedTrigger Running NodeAddedTrigger node_added_triggerEFRS
   [junit4]   2> 2819009 DEBUG (ScheduledTrigger-6854-thread-2) [n:127.0.0.1:40113_solr    ] o.a.s.c.a.NodeAddedTrigger Found livenodes: 5
   [junit4]   2> 2820009 DEBUG (ScheduledTrigger-6854-thread-2) [n:127.0.0.1:40113_solr    ] o.a.s.c.a.NodeAddedTrigger Running NodeAddedTrigger node_added_triggerEFRS
   [junit4]   2> 2820009 DEBUG (ScheduledTrigger-6854-thread-2) [n:127.0.0.1:40113_solr    ] o.a.s.c.a.NodeAddedTrigger Found livenodes: 5
   [junit4]   2> 2821009 DEBUG (ScheduledTrigger-6854-thread-2) [n:127.0.0.1:40113_solr    ] o.a.s.c.a.NodeAddedTrigger Running NodeAddedTrigger node_added_triggerEFRS
   [junit4]   2> 2821010 DEBUG (ScheduledTrigger-6854-thread-2) [n:127.0.0.1:40113_solr    ] o.a.s.c.a.NodeAddedTrigger Found livenodes: 5
   [junit4]   2> 2822010 DEBUG (ScheduledTrigger-6854-thread-2) [n:127.0.0.1:40113_solr    ] o.a.s.c.a.NodeAddedTrigger Running NodeAddedTrigger node_added_triggerEFRS
   [junit4]   2> 2822010 DEBUG (ScheduledTrigger-6854-thread-2) [n:127.0.0.1:40113_solr    ] o.a.s.c.a.NodeAddedTrigger Found livenodes: 5
   [junit4]   2> 2823010 DEBUG (ScheduledTrigger-6854-thread-2) [n:127.0.0.1:40113_solr    ] o.a.s.c.a.NodeAddedTrigger Running NodeAddedTrigger node_added_triggerEFRS
   [junit4]   2> 2823011 DEBUG (ScheduledTrigger-6854-thread-2) [n:127.0.0.1:40113_solr    ] o.a.s.c.a.NodeAddedTrigger Found livenodes: 5
   [junit4]   2> 2824011 DEBUG (ScheduledTrigger-6854-thread-2) [n:127.0.0.1:40113_solr    ] o.a.s.c.a.NodeAddedTrigger Running NodeAddedTrigger node_added_triggerEFRS
   [junit4]   2> 2824011 DEBUG (ScheduledTrigger-6854-thread-2) [n:127.0.0.1:40113_solr    ] o.a.s.c.a.NodeAddedTrigger Found livenodes: 5
   [junit4]   2> 2825011 DEBUG (ScheduledTrigger-6854-thread-2) [n:127.0.0.1:40113_solr    ] o.a.s.c.a.NodeAddedTrigger Running NodeAddedTrigger node_added_triggerEFRS
   [junit4]   2> 2825011 DEBUG (ScheduledTrigger-6854-thread-2) [n:127.0.0.1:40113_solr    ] o.a.s.c.a.NodeAddedTrigger Found livenodes: 5
   [junit4]   2> 2825011 DEBUG (ScheduledTrigger-6854-thread-2) [n:127.0.0.1:40113_solr    ] o.a.s.c.a.NodeAddedTrigger NodeAddedTrigger node_added_triggerEFRS firing registered processor for nodes: [127.0.0.1:48872_solr] added at times [18690037635886273], now=18690047641096265
   [junit4]   2> 2825012 DEBUG (ScheduledTrigger-6854-thread-2) [n:127.0.0.1:40113_solr    ] o.a.s.c.a.ScheduledTriggers ++++++++ Cooldown inactive - processing event: {
   [junit4]   2>   "id":"42667d7e202cc1Ta8oz6s9up00uhtvpyltiarw01",
   [junit4]   2>   "source":"node_added_triggerEFRS",
   [junit4]   2>   "eventTime":18690037635886273,
   [junit4]   2>   "eventType":"NODEADDED",
   [junit4]   2>   "properties":{
   [junit4]   2>     "eventTimes":[18690037635886273],
   [junit4]   2>     "nodeNames":["127.0.0.1:48872_solr"]}}
   [junit4]   2> 2825012 DEBUG (ScheduledTrigger-6854-thread-2) [n:127.0.0.1:40113_solr    ] o.a.s.c.a.ScheduledTriggers Pausing all triggers: [node_added_triggerEFRS]
   [junit4]   2> 2825013 INFO  (ScheduledTrigger-6854-thread-2) [n:127.0.0.1:40113_solr    ] o.a.s.c.a.SystemLogListener Collection .system does not exist, disabling logging.
   [junit4]   2> 2825013 DEBUG (AutoscalingActionExecutor-6855-thread-1-processing-n:127.0.0.1:40113_solr) [n:127.0.0.1:40113_solr    ] o.a.s.c.a.ScheduledTriggers -- processing actions for {
   [junit4]   2>   "id":"42667d7e202cc1Ta8oz6s9up00uhtvpyltiarw01",
   [junit4]   2>   "source":"node_added_triggerEFRS",
   [junit4]   2>   "eventTime":18690037635886273,
   [junit4]   2>   "eventType":"NODEADDED",
   [junit4]   2>   "properties":{
   [junit4]   2>     "eventTimes":[18690037635886273],
   [junit4]   2>     "_enqueue_time_":18690047641482712,
   [junit4]   2>     "nodeNames":["127.0.0.1:48872_solr"]}}
   [junit4]   2> 2825014 INFO  (TEST-TriggerIntegrationTest.testEventFromRestoredState-seed#[19A25D8AA63753EE]) [    ] o.e.j.s.Server jetty-9.4.8.v20171121, build timestamp: 2017-11-21T22:27:37+01:00, git hash: 82b8fb23f757335bb3329d540ce37a2a2615f0a8
   [junit4]   2> 2825014 DEBUG (AutoscalingActionExecutor-6855-thread-1-processing-n:127.0.0.1:40113_solr) [n:127.0.0.1:40113_solr    ] o.a.s.c.a.ScheduledTriggers Resuming trigger: node_added_triggerEFRS after 5000ms
   [junit4]   2> 2825014 DEBUG (AutoscalingActionExecutor-6855-thread-1-processing-n:127.0.0.1:40113_solr) [n:127.0.0.1:40113_solr    ] o.a.s.c.a.ScheduledTriggers -- processing took 1 ms for event id=42667d7e202cc1Ta8oz6s9up00uhtvpyltiarw01
   [junit4]   2> 2825015 INFO  (TEST-TriggerIntegrationTest.testEventFromRestoredState-seed#[19A25D8AA63753EE]) [    ] o.e.j.s.session DefaultSessionIdManager workerName=node0
   [junit4]   2> 2825015 INFO  (TEST-TriggerIntegrationTest.testEventFromRestoredState-seed#[19A25D8AA63753EE]) [    ] o.e.j.s.session No SessionScavenger set, using defaults
   [junit4]   2> 2825016 INFO  (TEST-TriggerIntegrationTest.testEventFromRestoredState-seed#[19A25D8AA63753EE]) [    ] o.e.j.s.session Scavenging every 600000ms
   [junit4]   2> 2825016 INFO  (TEST-TriggerIntegrationTest.testEventFromRestoredState-seed#[19A25D8AA63753EE]) [    ] o.e.j.s.h.ContextHandler Started o.e.j.s.ServletContextHandler@79b3b81d{/solr,null,AVAILABLE}
   [junit4]   2> 2825017 INFO  (TEST-TriggerIntegrationTest.testEventFromRestoredState-seed#[19A25D8AA63753EE]) [    ] o.e.j.s.AbstractConnector Started ServerConnector@5c628a18{HTTP/1.1,[http/1.1]}{127.0.0.1:57298}
   [junit4]   2> 2825017 INFO  (TEST-TriggerIntegrationTest.testEventFromRestoredState-seed#[19A25D8AA63753EE]) [    ] o.e.j.s.Server Started @2829221ms
   [junit4]   2> 2825017 INFO  (TEST-TriggerIntegrationTest.testEventFromRestoredState-seed#[19A25D8AA63753EE]) [    ] o.a.s.c.s.e.JettySolrRunner Jetty properties: {hostContext=/solr, hostPort=57298}
   [junit4]   2> 2825017 ERROR (TEST-TriggerIntegrationTest.testEventFromRestoredState-seed#[19A25D8AA63753EE]) [    ] o.a.s.u.StartupLoggingUtils Missing Java Option solr.log.dir. Logging may be missing or incomplete.
   [junit4]   2> 2825017 INFO  (TEST-TriggerIntegrationTest.testEventFromRestoredState-seed#[19A25D8AA63753EE]) [    ] o.a.s.s.SolrDispatchFilter  ___      _       Welcome to Apache Solr™ version 7.3.0
   [junit4]   2> 2825018 INFO  (TEST-TriggerIntegrationTest.testEventFromRestoredState-seed#[19A25D8AA63753EE]) [    ] o.a.s.s.SolrDispatchFilter / __| ___| |_ _   Starting in cloud mode on port null
   [junit4]   2> 2825018 INFO  (TEST-TriggerIntegrationTest.testEventFromRestoredState-seed#[19A25D8AA63753EE]) [    ] o.a.s.s.SolrDispatchFilter \__ \/ _ \ | '_|  Install dir: null
   [junit4]   2> 2825018 INFO  (TEST-TriggerIntegrationTest.testEventFromRestoredState-seed#[19A25D8AA63753EE]) [    ] o.a.s.s.SolrDispatchFilter |___/\___/_|_|    Start time: 2018-02-12T12:22:19.525Z
   [junit4]   2> 2825020 INFO  (zkConnectionManagerCallback-6707-thread-1) [    ] o.a.s.c.c.ConnectionManager zkClient has connected
   [junit4]   2> 2825020 INFO  (TEST-TriggerIntegrationTest.testEventFromRestoredState-seed#[19A25D8AA63753EE]) [    ] o.a.s.s.SolrDispatchFilter solr.xml found in ZooKeeper. Loading...
   [junit4]   2> 2825028 INFO  (TEST-TriggerIntegrationTest.testEventFromRestoredState-seed#[19A25D8AA63753EE]) [    ] o.a.s.c.ZkContainer Zookeeper client=127.0.0.1:39971/solr
   [junit4]   2> 2825029 INFO  (zkConnectionManagerCallback-6711-thread-1) [    ] o.a.s.c.c.ConnectionManager zkClient has connected
   [junit4]   2> 2825031 WARN  (NIOServerCxn.Factory:0.0.0.0/0.0.0.0:0) [    ] o.a.z.s.NIOServerCnxn Unable to read additional data from client sessionid 0x1045a032a8e0013, likely client has closed socket
   [junit4]   2> 2825035 INFO  (zkConnectionManagerCallback-6713-thread-1-processing-n:127.0.0.1:57298_solr) [n:127.0.0.1:57298_solr    ] o.a.s.c.c.ConnectionManager zkClient has connected
   [junit4]   2> 2825041 INFO  (TEST-TriggerIntegrationTest.testEventFromRestoredState-seed#[19A25D8AA63753EE]) [n:127.0.0.1:57298_solr    ] o.a.s.c.c.ZkStateReader Updated live nodes from ZooKeeper... (0) -> (5)
   [junit4]   2> 2825043 INFO  (TEST-TriggerIntegrationTest.testEventFromRestoredState-seed#[19A25D8AA63753EE]) [n:127.0.0.1:57298_solr    ] o.a.s.c.Overseer Overseer (id=null) closing
   [junit4]   2> 2825045 INFO  (TEST-TriggerIntegrationTest.testEventFromRestoredState-seed#[19A25D8AA63753EE]) [n:127.0.0.1:57298_solr    ] o.a.s.c.ZkController Register node as live in ZooKeeper:/live_nodes/127.0.0.1:57298_solr
   [junit4]   2> 2825047 INFO  (zkCallback-6692-thread-1-processing-n:127.0.0.1:44674_solr) [n:127.0.0.1:44674_solr    ] o.a.s.c.c.ZkStateReader Updated live nodes from ZooKeeper... (5) -> (6)
   [junit4]   2> 2825047 INFO  (zkCallback-6702-thread-1-processing-n:127.0.0.1:48872_solr) [n:127.0.0.1:48872_solr    ] o.a.s.c.c.ZkStateReader Updated live nodes from ZooKeeper... (5) -> (6)
   [junit4]   2> 2825047 INFO  (zkCallback-6664-thread-1-processing-n:127.0.0.1:53121_solr) [n:127.0.0.1:53121_solr    ] o.a.s.c.c.ZkStateReader Updated live nodes from ZooKeeper... (5) -> (6)
   [junit4]   2> 2825047 INFO  (zkCallback-6674-thread-1) [    ] o.a.s.c.c.ZkStateReader Updated live nodes from ZooKeeper... (5) -> (6)
   [junit4]   2> 2825047 INFO  (zkCallback-6682-thread-1-processing-n:127.0.0.1:36618_solr) [n:127.0.0.1:36618_solr    ] o.a.s.c.c.ZkStateReader Updated live nodes from ZooKeeper... (5) -> (6)
   [junit4]   2> 2825047 INFO  (zkCallback-6662-thread-1-processing-n:127.0.0.1:40113_solr) [n:127.0.0.1:40113_solr    ] o.a.s.c.c.ZkStateReader Updated live nodes from ZooKeeper... (5) -> (6)
   [junit4]   2> 2825048 INFO  (zkCallback-6712-thread-1-processing-n:127.0.0.1:57298_solr) [n:127.0.0.1:57298_solr    ] o.a.s.c.c.ZkStateReader Updated live nodes from ZooKeeper... (5) -> (6)
   [junit4]   2> 2825117 INFO  (TEST-TriggerIntegrationTest.testEventFromRestoredState-seed#[19A25D8AA63753EE]) [n:127.0.0.1:57298_solr    ] o.a.s.m.r.SolrJmxReporter JMX monitoring for 'solr_57298.solr.node' (registry 'solr.node') enabled at server: com.sun.jmx.mbeanserver.JmxMBeanServer@30215357
   [junit4]   2> 2825127 INFO  (TEST-TriggerIntegrationTest.testEventFromRestoredState-seed#[19A25D8AA63753EE]) [n:127.0.0.1:57298_solr    ] o.a.s.m.r.SolrJmxReporter JMX monitoring for 'solr_57298.solr.jvm' (registry 'solr.jvm') enabled at server: com.sun.jmx.mbeanserver.JmxMBeanServer@30215357
   [junit4]   2> 2825127 INFO  (TEST-TriggerIntegrationTest.testEventFromRestoredState-seed#[19A25D8AA63753EE]) [n:127.0.0.1:57298_solr    ] o.a.s.m.r.SolrJmxReporter JMX monitoring for 'solr_57298.solr.jetty' (registry 'solr.jetty') enabled at server: com.sun.jmx.mbeanserver.JmxMBeanServer@30215357
   [junit4]   2> 2825129 INFO  (TEST-TriggerIntegrationTest.testEventFromRestoredState-seed#[19A25D8AA63753EE]) [n:127.0.0.1:57298_solr    ] o.a.s.c.CorePropertiesLocator Found 0 core definitions underneath /x1/jenkins/jenkins-slave/workspace/Lucene-Solr-Tests-7.x/solr/build/solr-core/test/J0/temp/solr.cloud.autoscaling.TriggerIntegrationTest_19A25D8AA63753EE-001/tempDir-001/node6/.
   [junit4]   2> 2830016 DEBUG (ScheduledTrigger-6854-thread-1) [n:127.0.0.1:40113_solr    ] o.a.s.c.a.NodeAddedTrigger Running NodeAddedTrigger node_added_triggerEFRS
   [junit4]   2> 2830016 DEBUG (ScheduledTrigger-6854-thread-1) [n:127.0.0.1:40113_solr    ] o.a.s.c.a.NodeAddedTrigger Found livenodes: 6
   [junit4]   2> 2830017 DEBUG (ScheduledTrigger-6854-thread-1) [n:127.0.0.1:40113_solr    ] o.a.s.c.a.NodeAddedTrigger Tracking new node: 127.0.0.1:57298_solr at time 18690052646264667
   [junit4]   2> 2831017 DEBUG (ScheduledTrigger-6854-thread-1) [n:127.0.0.1:40113_solr    ] o.a.s.c.a.NodeAddedTrigger Running NodeAddedTrigger node_added_triggerEFRS
   [junit4]   2> 2831017 DEBUG (ScheduledTrigger-6854-thread-1) [n:127.0.0.1:40113_solr    ] o.a.s.c.a.NodeAddedTrigger Found livenodes: 6
   [junit4]   2> 2832017 DEBUG (ScheduledTrigger-6854-thread-1) [n:127.0.0.1:40113_solr    ] o.a.s.c.a.NodeAddedTrigger Running NodeAddedTrigger node_added_triggerEFRS
   [junit4]   2> 2832018 DEBUG (ScheduledTrigger-6854-thread-1) [n:127.0.0.1:40113_solr    ] o.a.s.c.a.NodeAddedTrigger Found livenodes: 6
   [junit4]   2> 2833018 DEBUG (ScheduledTrigger-6854-thread-1) [n:127.0.0.1:40113_solr    ] o.a.s.c.a.NodeAddedTrigger Running NodeAddedTrigger node_added_triggerEFRS
   [junit4]   2> 2833018 DEBUG (ScheduledTrigger-6854-thread-1) [n:127.0.0.1:40113_solr    ] o.a.s.c.a.NodeAddedTrigger Found livenodes: 6
   [junit4]   2> 2834018 DEBUG (ScheduledTrigger-6854-thread-1) [n:127.0.0.1:40113_solr    ] o.a.s.c.a.NodeAddedTrigger Running NodeAddedTrigger node_added_triggerEFRS
   [junit4]   2> 2834018 DEBUG (ScheduledTrigger-6854-thread-1) [n:127.0.0.1:40113_solr    ] o.a.s.c.a.NodeAddedTrigger Found livenodes: 6
   [junit4]   2> 2835018 DEBUG (ScheduledTrigger-6854-thread-1) [n:127.0.0.1:40113_solr    ] o.a.s.c.a.NodeAddedTrigger Running NodeAddedTrigger node_added_triggerEFRS
   [junit4]   2> 2835019 DEBUG (ScheduledTrigger-6854-thread-1) [n:127.0.0.1:40113_solr    ] o.a.s.c.a.NodeAddedTrigger Found livenodes: 6
   [junit4]   2> 2835190 INFO  (TEST-TriggerIntegrationTest.testEventFromRestoredState-seed#[19A25D8AA63753EE]) [    ] o.e.j.s.AbstractConnector Stopped ServerConnector@15dcf6ee{HTTP/1.1,[http/1.1]}{127.0.0.1:0}
   [junit4]   2> 2835195 INFO  (TEST-TriggerIntegrationTest.testEventFromRestoredState-seed#[19A25D8AA63753EE]) [    ] o.a.s.c.CoreContainer Shutting down CoreContainer instance=271407989
   [junit4]   2> 2835195 INFO  (TEST-TriggerIntegrationTest.testEventFromRestoredState-seed#[19A25D8AA63753EE]) [    ] o.a.s.m.SolrMetricManager Closing metric reporters for registry=solr.node, tag=null
   [junit4]   2> 2835196 INFO  (TEST-TriggerIntegrationTest.testEventFromRestoredState-seed#[19A25D8AA63753EE]) [    ] o.a.s.m.r.SolrJmxReporter Closing reporter [org.apache.solr.metrics.reporters.SolrJmxReporter@13a3d1c2: rootName = solr_40113, domain = solr.node, service url = null, agent id = null] for registry solr.node / com.codahale.metrics.MetricRegistry@dec242
   [junit4]   2> 2835203 INFO  (TEST-TriggerIntegrationTest.testEventFromRestoredState-seed#[19A25D8AA63753EE]) [    ] o.a.s.m.SolrMetricManager Closing metric reporters for registry=solr.jvm, tag=null
   [junit4]   2> 2835203 INFO  (TEST-TriggerIntegrationTest.testEventFromRestoredState-seed#[19A25D8AA63753EE]) [    ] o.a.s.m.r.SolrJmxReporter Closing reporter [org.apache.solr.metrics.reporters.SolrJmxReporter@5a4aaac6: rootName = solr_40113, domain = solr.jvm, service url = null, agent id = null] for registry solr.jvm / com.codahale.metrics.MetricRegistry@cb4d9f0
   [junit4]   2> 2835209 INFO  (TEST-TriggerIntegrationTest.testEventFromRestoredState-seed#[19A25D8AA63753EE]) [    ] o.a.s.m.SolrMetricManager Closing metric reporters for registry=solr.jetty, tag=null
   [junit4]   2> 2835209 INFO  (TEST-TriggerIntegrationTest.testEventFromRestoredState-seed#[19A25D8AA63753EE]) [    ] o.a.s.m.r.SolrJmxReporter Closing reporter [org.apache.solr.metrics.reporters.SolrJmxReporter@195d2840: rootName = solr_40113, domain = solr.jetty, service url = null, agent id = null] for registry solr.jetty / com.codahale.metrics.MetricRegistry@600296a9
   [junit4]   2> 2835210 INFO  (TEST-TriggerIntegrationTest.testEventFromRestoredState-seed#[19A25D8AA63753EE]) [    ] o.a.s.c.ZkController Remove node as live in ZooKeeper:/live_nodes/127.0.0.1:40113_solr
   [junit4]   2> 2835212 INFO  (TEST-TriggerIntegrationTest.testEventFromRestoredState-seed#[19A25D8AA63753EE]) [    ] o.a.s.m.SolrMetricManager Closing metric reporters for registry=solr.cluster, tag=null
   [junit4]   2> 2835212 INFO  (zkCallback-6682-thread-1-processing-n:127.0.0.1:36618_solr) [n:127.0.0.1:36618_solr    ] o.a.s.c.c.ZkStateReader Updated live nodes from ZooKeeper... (6) -> (5)
   [junit4]   2> 2835212 INFO  (zkCallback-6702-thread-1-processing-n:127.0.0.1:48872_solr) [n:127.0.0.1:48872_solr    ] o.a.s.c.c.ZkStateReader Updated live nodes from ZooKeeper... (6) -> (5)
   [junit4]   2> 2835212 INFO  (zkCallback-6674-thread-1) [    ] o.a.s.c.c.ZkStateReader Updated live nodes from ZooKeeper... (6) -> (5)
   [junit4]   2> 2835212 INFO  (zkCallback-6712-thread-1-processing-n:127.0.0.1:57298_solr) [n:127.0.0.1:57298_solr    ] o.a.s.c.c.ZkStateReader Updated live nodes from ZooKeeper... (6) -> (5)
   [junit4]   2> 2835212 INFO  (zkCallback-6692-thread-1-processing-n:127.0.0.1:44674_solr) [n:127.0.0.1:44674_solr    ] o.a.s.c.c.ZkStateReader Updated live nodes from ZooKeeper... (6) -> (5)
   [junit4]   2> 2835213 INFO  (zkCallback-6664-thread-1-processing-n:127.0.0.1:53121_solr) [n:127.0.0.1:53121_solr    ] o.a.s.c.c.ZkStateReader Updated live nodes from ZooKeeper... (6) -> (5)
   [junit4]   2> 2835213 INFO  (zkCallback-6662-thread-1-processing-n:127.0.0.1:40113_solr) [n:127.0.0.1:40113_solr    ] o.a.s.c.c.ZkStateReader Updated live nodes from ZooKeeper... (6) -> (5)
   [junit4]   2> 2835214 INFO  (TEST-TriggerIntegrationTest.testEventFromRestoredState-seed#[19A25D8AA63753EE]) [    ] o.a.s.c.TransientSolrCoreCacheDefault Allocating transient cache for 2147483647 transient cores
   [junit4]   2> 2835215 INFO  (TEST-TriggerIntegrationTest.testEventFromRestoredState-seed#[19A25D8AA63753EE]) [    ] o.a.s.c.Overseer Overseer (id=73282463590121477-127.0.0.1:40113_solr-n_0000000000) closing
   [junit4]   2> 2835215 INFO  (OverseerStateUpdate-73282463590121477-127.0.0.1:40113_solr-n_0000000000) [n:127.0.0.1:40113_solr    ] o.a.s.c.Overseer Overseer Loop exiting : 127.0.0.1:40113_solr
   [junit4]   2> 2835216 WARN  (OverseerAutoScalingTriggerThread-73282463590121477-127.0.0.1:40113_solr-n_0000000000) [n:127.0.0.1:40113_solr    ] o.a.s.c.a.OverseerTriggerThread OverseerTriggerThread woken up but we are closed, exiting.
   [junit4]   2> 2835219 DEBUG (TEST-TriggerIntegrationTest.testEventFromRestoredState-seed#[19A25D8AA63753EE]) [    ] o.a.s.c.a.OverseerTriggerThread OverseerTriggerThread has been closed explicitly
   [junit4]   2> 2835221 INFO  (zkCallback-6664-thread-1-processing-n:127.0.0.1:53121_solr) [n:127.0.0.1:53121_solr    ] o.a.s.c.OverseerElectionContext I am going to be the leader 127.0.0.1:53121_solr
   [junit4]   2> 2835222 INFO  (zkCallback-6664-thread-1-processing-n:127.0.0.1:53121_solr) [n:127.0.0.1:53121_solr    ] o.a.s.c.Overseer Overseer (id=73282463590121478-127.0.0.1:53121_solr-n_0000000001) starting
   [junit4]   2> 2835228 INFO  (TEST-TriggerIntegrationTest.testEventFromRestoredState-seed#[19A25D8AA63753EE]) [    ] o.e.j.s.h.ContextHandler Stopped o.e.j.s.ServletContextHandler@43bda44e{/solr,null,UNAVAILABLE}
   [junit4]   2> 2835237 INFO  (TEST-TriggerIntegrationTest.testEventFromRestoredState-seed#[19A25D8AA63753EE]) [    ] o.e.j.s.session Stopped scavenging
   [junit4]   2> 2835238 DEBUG (OverseerAutoScalingTriggerThread-73282463590121478-127.0.0.1:53121_solr-n_0000000001) [n:127.0.0.1:53121_solr    ] o.a.s.c.a.OverseerTriggerThread Adding .autoAddReplicas trigger
   [junit4]   2> 2835239 DEBUG (OverseerAutoScalingTriggerThread-73282463590121478-127.0.0.1:53121_solr-n_0000000001) [n:127.0.0.1:53121_solr    ] o.a.s.c.a.OverseerTriggerThread Refreshing /autoscaling.json with znode version 8
   [junit4]   2> 2835240 DEBUG (OverseerAutoScalingTriggerThread-73282463590121478-127.0.0.1:53121_solr-n_0000000001) [n:127.0.0.1:53121_solr    ] o.a.s.c.a.NodeAddedTrigger Initial livenodes: [127.0.0.1:44674_solr, 127.0.0.1:53121_solr, 127.0.0.1:57298_solr, 127.0.0.1:48872_solr, 127.0.0.1:36618_solr]
   [junit4]   2> 2835240 DEBUG (OverseerAutoScalingTriggerThread-73282463590121478-127.0.0.1:53121_solr-n_0000000001) [n:127.0.0.1:53121_solr    ] o.a.s.c.a.NodeAddedTrigger NodeAddedTrigger node_added_triggerEFRS instantiated with properties: {event=nodeAdded, waitFor=10, actions=[{name=test, class=org.apache.solr.cloud.autoscaling.TriggerIntegrationTest$TestTriggerAction}], enabled=true}
   [junit4]   2> 2835240 DEBUG (OverseerAutoScalingTriggerThread-73282463590121478-127.0.0.1:53121_solr-n_0000000001) [n:127.0.0.1:53121_solr    ] o.a.s.c.a.NodeLostTrigger Initial livenodes: [127.0.0.1:44674_solr, 127.0.0.1:53121_solr, 127.0.0.1:57298_solr, 127.0.0.1:48872_solr, 127.0.0.1:36618_solr]
   [junit4]   2> 2835240 DEBUG (OverseerAutoScalingTriggerThread-73282463590121478-127.0.0.1:53121_solr-n_0000000001) [n:127.0.0.1:53121_solr    ] o.a.s.c.a.OverseerTriggerThread Current znodeVersion 8, lastZnodeVersion -1
   [junit4]   2> 2835240 DEBUG (OverseerAutoScalingTriggerThread-73282463590121478-127.0.0.1:53121_solr-n_0000000001) [n:127.0.0.1:53121_solr    ] o.a.s.c.a.OverseerTriggerThread Processed trigger updates upto znodeVersion 8
   [junit4]   2> 2835241 INFO  (OverseerAutoScalingTriggerThread-73282463590121478-127.0.0.1:53121_solr-n_0000000001) [n:127.0.0.1:53121_solr    ] o.a.s.c.a.TriggerIntegrationTest TestTriggerAction init
   [junit4]   2> 2835241 DEBUG (OverseerAutoScalingTriggerThread-73282463590121478-127.0.0.1:53121_solr-n_0000000001) [n:127.0.0.1:53121_solr    ] o.a.s.c.a.NodeAddedTrigger Adding node from marker path: 127.0.0.1:57298_solr
   [junit4]   2> 2835242 DEBUG (ScheduledTrigger-6887-thread-1) [n:127.0.0.1:53121_solr    ] o.a.s.c.a.NodeAddedTrigger Running NodeAddedTrigger node_added_triggerEFRS
   [junit4]   2> 2835242 DEBUG (ScheduledTrigger-6887-thread-1) [n:127.0.0.1:53121_solr    ] o.a.s.c.a.NodeAddedTrigger Found livenodes: 5
   [junit4]   2> 2835259 DEBUG (OverseerAutoScalingTriggerThread-73282463590121478-127.0.0.1:53121_solr-n_0000000001) [n:127.0.0.1:53121_solr    ] o.a.s.c.a.OverseerTriggerThread Current znodeVersion 8, lastZnodeVersion 8
   [junit4]   2> 2835259 DEBUG (ScheduledTrigger-6887-thread-1) [n:127.0.0.1:53121_solr    ] o.a.s.c.a.NodeLostTrigger Running NodeLostTrigger: .auto_add_replicas with currently live nodes: 5
   [junit4]   2> 2836244 DEBUG (ScheduledTrigger-6887-thread-2) [n:127.0.0.1:53121_solr    ] o.a.s.c.a.NodeAddedTrigger Running NodeAddedTrigger node_added_triggerEFRS
   [junit4]   2> 2836244 DEBUG (ScheduledTrigger-6887-thread-2) [n:127.0.0.1:53121_solr    ] o.a.s.c.a.NodeAddedTrigger Found livenodes: 5
   [junit4]   2> 2836261 DEBUG (ScheduledTrigger-6887-thread-3) [n:127.0.0.1:53121_solr    ] o.a.s.c.a.NodeLostTrigger Running NodeLostTrigger: .auto_add_replicas with currently live nodes: 5
   [junit4]   2> 2837244 DEBUG (ScheduledTrigger-6887-thread-1) [n:127.0.0.1:53121_solr    ] o.a.s.c.a.NodeAddedTrigger Running NodeAddedTrigger node_added_triggerEFRS
   [junit4]   2> 2837244 DEBUG (ScheduledTrigger-6887-thread-1) [n:127.0.0.1:53121_solr    ] o.a.s.c.a.NodeAddedTrigger Found livenodes: 5
   [junit4]   2> 2837261 DEBUG (ScheduledTrigger-6887-thread-4) [n:127.0.0.1:53121_solr    ] o.a.s.c.a.NodeLostTrigger Running NodeLostTrigger: .auto_add_replicas with currently live nodes: 5
   [junit4]   2> 2838245 DEBUG (ScheduledTrigger-6887-thread-2) [n:127.0.0.1:53121_solr    ] o.a.s.c.a.NodeAddedTrigger Running NodeAddedTrigger node_added_triggerEFRS
   [junit4]   2> 2838245 DEBUG (ScheduledTrigger-6887-thread-2) [n:127.0.0.1:53121_solr    ] o.a.s.c.a.NodeAddedTrigger Found livenodes: 5
   [junit4]   2> 2838262 DEBUG (ScheduledTrigger-6887-thread-3) [n:127.0.0.1:53121_solr    ] o.a.s.c.a.NodeLostTrigger Running NodeLostTrigger: .auto_add_replicas with currently live nodes: 5
   [junit4]   2> 2839245 DEBUG (ScheduledTrigger-6887-thread-1) [n:127.0.0.1:53121_solr    ] o.a.s.c.a.NodeAddedTrigger Running NodeAddedTrigger node_added_triggerEFRS
   [junit4]   2> 2839245 DEBUG (ScheduledTrigger-6887-thread-1) [n:127.0.0.1:53121_solr    ] o.a.s.c.a.NodeAddedTrigger Found livenodes: 5
   [junit4]   2> 2839262 DEBUG (ScheduledTrigger-6887-thread-4) [n:127.0.0.1:53121_solr    ] o.a.s.c.a.NodeLostTrigger Running NodeLostTrigger: .auto_add_replicas with currently live nodes: 5
   [junit4]   2> 2840246 DEBUG (ScheduledTrigger-6887-thread-2) [n:127.0.0.1:53121_solr    ] o.a.s.c.a.NodeAddedTrigger Running NodeAddedTrigger node_added_triggerEFRS
   [junit4]   2> 2840246 DEBUG (ScheduledTrigger-6887-thread-2) [n:127.0.0.1:53121_solr    ] o.a.s.c.a.NodeAddedTrigger Found livenodes: 5
   [junit4]   2> 2840246 DEBUG (ScheduledTrigger-6887-thread-2) [n:127.0.0.1:53121_solr    ] o.a.s.c.a.NodeAddedTrigger NodeAddedTrigger node_added_triggerEFRS firing registered processor for nodes: [127.0.0.1:57298_solr] added at times [18690052646264667], now=18690062875578995
   [junit4]   2> 2840246 DEBUG (ScheduledTrigger-6887-thread-2) [n:127.0.0.1:53121_solr    ] o.a.s.c.a.ScheduledTriggers ++++++++ Cooldown inactive - processing event: {
   [junit4]   2>   "id":"426680fcd05f5bTa8oz6s9up00uhtvpyltiarw03",
   [junit4]   2>   "source":"node_added_triggerEFRS",
   [junit4]   2>   "eventTime":18690052646264667,
   [junit4]   2>   "eventType":"NODEADDED",
   [junit4]   2>   "properties":{
   [junit4]   2>     "eventTimes":[18690052646264667],
   [junit4]   2>     "nodeNames":["127.0.0.1:57298_solr"]}}
   [junit4]   2> 2840248 DEBUG (ScheduledTrigger-6887-thread-2) [n:127.0.0.1:53121_solr    ] o.a.s.c.a.ScheduledTriggers Pausing all triggers: [.auto_add_replicas, node_added_triggerEFRS]
   [junit4]   2> 2840249 INFO  (ScheduledTrigger-6887-thread-2) [n:127.0.0.1:53121_solr    ] o.a.s.c.a.SystemLogListener Collection .system does not exist, disabling logging.
   [junit4]   2> 2840249 DEBUG (AutoscalingActionExecutor-6888-thread-1-processing-n:127.0.0.1:53121_solr) [n:127.0.0.1:53121_solr    ] o.a.s.c.a.ScheduledTriggers -- processing actions for {
   [junit4]   2>   "id":"426680fcd05f5bTa8oz6s9up00uhtvpyltiarw03",
   [junit4]   2>   "source":"node_added_triggerEFRS",
   [junit4]   2>   "eventTime":18690052646264667,
   [junit4]   2>   "eventType":"NODEADDED",
   [junit4]   2>   "properties":{
   [junit4]   2>     "eventTimes":[18690052646264667],
   [junit4]   2>     "_enqueue_time_":18690062877376426,
   [junit4]   2>     "nodeNames":["127.0.0.1:57298_solr"]}}
   [junit4]   2> 2840250 INFO  (TEST-TriggerIntegrationTest.testEventFromRestoredState-seed#[19A25D8AA63753EE]) [    ] o.a.s.SolrTestCaseJ4 ###Ending testEventFromRestoredState
   [junit4]   2> 2840253 DEBUG (AutoscalingActionExecutor-6888-thread-1-processing-n:127.0.0.1:53121_solr) [n:127.0.0.1:53121_solr    ] o.a.s.c.a.ScheduledTriggers Resuming trigger: .auto_add_replicas after 5000ms
   [junit4]   2> 2840254 DEBUG (AutoscalingActionExecutor-6888-thread-1-processing-n:127.0.0.1:53121_solr) [n:127.0.0.1:53121_solr    ] o.a.s.c.a.ScheduledTriggers Resuming trigger: node_added_triggerEFRS after 5000ms
   [junit4]   2> 2840255 DEBUG (AutoscalingActionExecutor-6888-thread-1-processing-n:127.0.0.1:53121_solr) [n:127.0.0.1:53121_solr    ] o.a.s.c.a.ScheduledTriggers -- processing took 5 ms for event id=426680fcd05f5bTa8oz6s9up00uhtvpyltiarw03
   [junit4]   2> 2840309 INFO  (TEST-TriggerIntegrationTest.testEventQueue-seed#[19A25D8AA63753EE]) [    ] o.a.s.SolrTestCaseJ4 ###Starting testEventQueue
   [junit4]   2> 2840310 INFO  (TEST-TriggerIntegrationTest.testEventQueue-seed#[19A25D8AA63753EE]) [    ] o.a.s.c.a.TriggerIntegrationTest /autoscaling.json reset, new znode version 9
   [junit4]   2> 2840311 DEBUG (zkCallback-6664-thread-1-processing-n:127.0.0.1:53121_solr) [n:127.0.0.1:53121_solr    ] o.a.s.c.a.OverseerTriggerThread Refreshing /autoscaling.json with znode version 9
   [junit4]   2> 2840311 DEBUG (OverseerAutoScalingTriggerThread-73282463590121478-127.0.0.1:53121_solr-n_0000000001) [n:127.0.0.1:53121_solr    ] o.a.s.c.a.OverseerTriggerThread Processed trigger updates upto znodeVersion 9
   [junit4]   2> 2840314 DEBUG (OverseerAutoScalingTriggerThread-73282463590121478-127.0.0.1:53121_solr-n_0000000001) [n:127.0.0.1:53121_solr    ] o.a.s.c.a.OverseerTriggerThread -- clean old nodeLost markers
   [junit4]   2> 2840314 DEBUG (OverseerAutoScalingTriggerThread-73282463590121478-127.0.0.1:53121_solr-n_0000000001) [n:127.0.0.1:53121_solr    ] o.a.s.c.a.OverseerTriggerThread -- clean old nodeAdded markers
   [junit4]   2> 2840314 DEBUG (OverseerAutoScalingTriggerThread-73282463590121478-127.0.0.1:53121_solr-n_0000000001) [n:127.0.0.1:53121_solr    ] o.a.s.c.a.OverseerTriggerThread Current znodeVersion 9, lastZnodeVersion 9
   [junit4]   2> 2840316 INFO  (qtp1473312374-27828) [n:127.0.0.1:36618_solr    ] o.a.s.h.a.CollectionsHandler Invoked Collection Action :overseerstatus with params action=OVERSEERSTATUS&wt=javabin&version=2 and sendToOCPQueue=true
   [junit4]   2> 2840322 INFO  (qtp1473312374-27828) [n:127.0.0.1:36618_solr    ] o.a.s.s.HttpSolrCall [admin] webapp=null path=/admin/collections params={action=OVERSEERSTATUS&wt=javabin&version=2} status=0 QTime=5
   [junit4]   2> 2840324 INFO  (qtp1473312374-27829) [n:127.0.0.1:36618_solr    ] o.a.s.s.HttpSolrCall [admin] webapp=null path=/admin/metrics params={prefix=CONTAINER.fs.usableSpace,CORE.coreName&wt=javabin&version=2&group=solr.node,solr.core} status=0 QTime=0
   [junit4]   2> 2840326 INFO  (qtp2140365613-27853) [n:127.0.0.1:44674_solr    ] o.a.s.s.HttpSolrCall [admin] webapp=null path=/admin/metrics params={prefix=CONTAINER.fs.usableSpace,CORE.coreName&wt=javabin&version=2&group=solr.node,solr.core} status=0 QTime=0
   [junit4]   2> 2840327 INFO  (qtp334655666-27876) [n:127.0.0.1:48872_solr    ] o.a.s.s.HttpSolrCall [admin] webapp=null path=/admin/metrics params={prefix=CONTAINER.fs.usableSpace,CORE.coreName&wt=javabin&version=2&group=solr.node,solr.core} status=0 QTime=0
   [junit4]   2> 2840328 INFO  (qtp672620657-27767) [n:127.0.0.1:53121_solr    ] o.a.s.s.HttpSolrCall [admin] webapp=null path=/admin/metrics params={prefix=CONTAINER.fs.usableSpace,CORE.coreName&wt=javabin&version=2&group=solr.node,solr.core} status=0 QTime=0
   [junit4]   2> 2840329 INFO  (qtp1032615070-27900) [n:127.0.0.1:57298_solr    ] o.a.s.s.HttpSolrCall [admin] webapp=null path=/admin/metrics params={prefix=CONTAINER.fs.usableSpace,CORE.coreName&wt=javabin&version=2&group=solr.node,solr.

[...truncated too long message...]

1_solr c:testMetricTrigger s:shard2 r:core_node4 x:testMetricTrigger_shard2_replica_n2] o.a.s.m.SolrMetricManager Closing metric reporters for registry=solr.collection.testMetricTrigger.shard2.leader, tag=138074289
   [junit4]   2> 2998393 INFO  (coreCloseExecutor-7067-thread-1) [n:127.0.0.1:57298_solr c:collection1 s:shard1 r:core_node10 x:collection1_shard1_replica_n9] o.a.s.m.SolrMetricManager Closing metric reporters for registry=solr.collection.collection1.shard1.leader, tag=1008760465
   [junit4]   2> 2998394 INFO  (coreCloseExecutor-7067-thread-2) [n:127.0.0.1:57298_solr c:testMetricTrigger s:shard1 r:core_node3 x:testMetricTrigger_shard1_replica_n1] o.a.s.m.SolrMetricManager Closing metric reporters for registry=solr.collection.testMetricTrigger.shard1.leader, tag=1784303231
   [junit4]   2> 2998399 INFO  (jetty-closer-6647-thread-1) [    ] o.a.s.c.Overseer Overseer (id=73282463590121492-127.0.0.1:57298_solr-n_0000000005) closing
   [junit4]   2> 2998399 INFO  (OverseerStateUpdate-73282463590121492-127.0.0.1:57298_solr-n_0000000005) [n:127.0.0.1:57298_solr    ] o.a.s.c.Overseer Overseer Loop exiting : 127.0.0.1:57298_solr
   [junit4]   2> 2998399 INFO  (jetty-closer-6647-thread-6) [    ] o.e.j.s.h.ContextHandler Stopped o.e.j.s.ServletContextHandler@2a0b34f1{/solr,null,UNAVAILABLE}
   [junit4]   2> 2998406 INFO  (jetty-closer-6647-thread-6) [    ] o.e.j.s.session Stopped scavenging
   [junit4]   2> 2998407 DEBUG (jetty-closer-6647-thread-1) [    ] o.a.s.c.a.OverseerTriggerThread OverseerTriggerThread has been closed explicitly
   [junit4]   2> 2998407 WARN  (OverseerAutoScalingTriggerThread-73282463590121492-127.0.0.1:57298_solr-n_0000000005) [n:127.0.0.1:57298_solr    ] o.a.s.c.a.OverseerTriggerThread OverseerTriggerThread woken up but we are closed, exiting.
   [junit4]   2> 2998408 INFO  (jetty-closer-6647-thread-1) [    ] o.e.j.s.h.ContextHandler Stopped o.e.j.s.ServletContextHandler@79b3b81d{/solr,null,UNAVAILABLE}
   [junit4]   2> 2998408 INFO  (jetty-closer-6647-thread-1) [    ] o.e.j.s.session Stopped scavenging
   [junit4]   2> 2999776 INFO  (jetty-closer-6647-thread-12) [    ] o.e.j.s.h.ContextHandler Stopped o.e.j.s.ServletContextHandler@20925583{/solr,null,UNAVAILABLE}
   [junit4]   2> 2999776 INFO  (jetty-closer-6647-thread-12) [    ] o.e.j.s.session Stopped scavenging
   [junit4]   2> 2999875 INFO  (jetty-closer-6647-thread-4) [    ] o.e.j.s.h.ContextHandler Stopped o.e.j.s.ServletContextHandler@17ed06cf{/solr,null,UNAVAILABLE}
   [junit4]   2> 2999875 INFO  (jetty-closer-6647-thread-4) [    ] o.e.j.s.session Stopped scavenging
   [junit4]   2> 2999875 ERROR (SUITE-TriggerIntegrationTest-seed#[19A25D8AA63753EE]-worker) [    ] o.a.z.s.ZooKeeperServer ZKShutdownHandler is not registered, so ZooKeeper server won't take any action on ERROR or SHUTDOWN server state changes
   [junit4]   2> 2999876 INFO  (SUITE-TriggerIntegrationTest-seed#[19A25D8AA63753EE]-worker) [    ] o.a.s.c.ZkTestServer connecting to 127.0.0.1:39971 39971
   [junit4]   2> 2999976 INFO  (Thread-4550) [    ] o.a.s.c.ZkTestServer connecting to 127.0.0.1:39971 39971
   [junit4]   2> 2999979 WARN  (Thread-4550) [    ] o.a.s.c.ZkTestServer Watch limit violations: 
   [junit4]   2> Maximum concurrent create/delete watches above limit:
   [junit4]   2> 
   [junit4]   2> 	42	/solr/collections/collection1/terms/shard1
   [junit4]   2> 	22	/solr/clusterprops.json
   [junit4]   2> 	22	/solr/aliases.json
   [junit4]   2> 	21	/solr/security.json
   [junit4]   2> 	7	/solr/configs/conf
   [junit4]   2> 	2	/solr/collections/testMetricTrigger/terms/shard1
   [junit4]   2> 	2	/solr/collections/testMetricTrigger/terms/shard2
   [junit4]   2> 
   [junit4]   2> Maximum concurrent data watches above limit:
   [junit4]   2> 
   [junit4]   2> 	131	/solr/collections/collection1/state.json
   [junit4]   2> 	22	/solr/clusterstate.json
   [junit4]   2> 	15	/solr/collections/testMetricTrigger/state.json
   [junit4]   2> 	6	/solr/autoscaling.json
   [junit4]   2> 	3	/solr/overseer_elect/election/73282463590121516-127.0.0.1:56274_solr-n_0000000013
   [junit4]   2> 	2	/solr/overseer_elect/election/73282463590121532-127.0.0.1:39895_solr-n_0000000018
   [junit4]   2> 	2	/solr/overseer_elect/election/73282463590121513-127.0.0.1:45057_solr-n_0000000012
   [junit4]   2> 	2	/solr/overseer_elect/election/73282463590121504-127.0.0.1:42245_solr-n_0000000009
   [junit4]   2> 	2	/solr/overseer_elect/election/73282463590121526-127.0.0.1:58886_solr-n_0000000016
   [junit4]   2> 	2	/solr/collections/collection1/leader_elect/shard1/election/73282463590121498-core_node3-n_0000000000
   [junit4]   2> 	2	/solr/overseer_elect/election/73282463590121501-127.0.0.1:51567_solr-n_0000000008
   [junit4]   2> 	2	/solr/overseer_elect/election/73282463590121492-127.0.0.1:57298_solr-n_0000000005
   [junit4]   2> 
   [junit4]   2> Maximum concurrent children watches above limit:
   [junit4]   2> 
   [junit4]   2> 	22	/solr/live_nodes
   [junit4]   2> 	22	/solr/collections
   [junit4]   2> 	6	/solr/overseer/queue-work
   [junit4]   2> 	6	/solr/autoscaling/events/.auto_add_replicas
   [junit4]   2> 	6	/solr/overseer/queue
   [junit4]   2> 	6	/solr/overseer/collection-queue-work
   [junit4]   2> 	2	/solr/autoscaling/events/node_lost_triggerMR
   [junit4]   2> 	2	/solr/autoscaling/events/node_added_triggerCTOOR
   [junit4]   2> 
   [junit4]   2> NOTE: leaving temporary files on disk at: /x1/jenkins/jenkins-slave/workspace/Lucene-Solr-Tests-7.x/solr/build/solr-core/test/J0/temp/solr.cloud.autoscaling.TriggerIntegrationTest_19A25D8AA63753EE-001
   [junit4]   2> Feb 12, 2018 12:25:14 PM com.carrotsearch.randomizedtesting.ThreadLeakControl checkThreadLeaks
   [junit4]   2> WARNING: Will linger awaiting termination of 1 leaked thread(s).
   [junit4]   2> NOTE: test params are: codec=Asserting(Lucene70), sim=RandomSimilarity(queryNorm=true): {}, locale=ro, timezone=Asia/Choibalsan
   [junit4]   2> NOTE: Linux 3.13.0-88-generic amd64/Oracle Corporation 1.8.0_144 (64-bit)/cpus=4,threads=1,free=163224408,total=520617984
   [junit4]   2> NOTE: All tests run in this JVM: [TestMultiValuedNumericRangeQuery, BasicAuthIntegrationTest, TestConfig, TestPullReplica, CoreSorterTest, TestPushWriter, TestIBSimilarityFactory, TestShardHandlerFactory, IgnoreCommitOptimizeUpdateProcessorFactoryTest, TestHdfsBackupRestoreCore, CdcrRequestHandlerTest, TestSolr4Spatial2, TestSolrCloudWithHadoopAuthPlugin, TestFreeTextSuggestions, TestStressLucene, TestComputePlanAction, TestInitParams, MBeansHandlerTest, TestExpandComponent, DistributedSuggestComponentTest, HdfsChaosMonkeySafeLeaderTest, SolrIndexConfigTest, TestSizeLimitedDistributedMap, DistributedTermsComponentTest, TestCloudJSONFacetJoinDomain, VersionInfoTest, TestGenericDistributedQueue, TestFieldTypeCollectionResource, XmlUpdateRequestHandlerTest, StatsComponentTest, TestSolrCloudWithKerberosAlt, ClassificationUpdateProcessorTest, TestPHPSerializedResponseWriter, ShardRoutingTest, TestWriterPerf, OutputWriterTest, TestComponentsName, TestBlobHandler, TestDocSet, V2ApiIntegrationTest, TestSubQueryTransformer, TestTolerantUpdateProcessorCloud, TestIndexingPerformance, TestScoreJoinQPNoScore, TestPseudoReturnFields, TestManagedSchemaThreadSafety, TestNumericTerms32, RegexBytesRefFilterTest, OpenCloseCoreStressTest, BasicDistributedZkTest, DateRangeFieldTest, HLLUtilTest, SolrRequestParserTest, TestBinaryField, TestCloudManagedSchema, SynonymTokenizerTest, NodeLostTriggerTest, TestLMDirichletSimilarityFactory, TestNumericTokenStream, TestCSVLoader, AddBlockUpdateTest, DistributedQueryElevationComponentTest, TestInPlaceUpdatesDistrib, DefaultValueUpdateProcessorTest, TestCoreAdminApis, SimpleFacetsTest, TestHalfAndHalfDocValues, TestManagedSynonymFilterFactory, TestTriggerIntegration, TestHighlightDedupGrouping, HdfsLockFactoryTest, SolrIndexSplitterTest, ZkCLITest, DistributedFacetPivotWhiteBoxTest, CoreAdminCreateDiscoverTest, ReplicaListTransformerTest, FieldAnalysisRequestHandlerTest, TestSSLRandomization, RequestHandlersTest, HdfsRecoveryZkTest, TestExtendedDismaxParser, TestCollationField, BigEndianAscendingWordDeserializerTest, UpdateParamsTest, TermVectorComponentDistributedTest, SolrCoreCheckLockOnStartupTest, TestSolrDeletionPolicy1, DebugComponentTest, BinaryUpdateRequestHandlerTest, LeaderInitiatedRecoveryOnShardRestartTest, CreateCollectionCleanupTest, TestIntervalFaceting, CurrencyRangeFacetCloudTest, DistributedVersionInfoTest, TestInitQParser, TestSort, AssignBackwardCompatibilityTest, TestSha256AuthenticationProvider, TestUnifiedSolrHighlighter, TestAuthenticationFramework, ZkStateReaderTest, RAMDirectoryFactoryTest, HdfsWriteToMultipleCollectionsTest, TestSolrConfigHandlerCloud, TestBinaryResponseWriter, ManagedSchemaRoundRobinCloudTest, ReplicationFactorTest, SolrSlf4jReporterTest, SolrGraphiteReporterTest, TestQueryWrapperFilter, TestCollectionAPI, TestSearcherReuse, TestComplexPhraseQParserPlugin, PluginInfoTest, LeaderElectionContextKeyTest, AutoAddReplicasIntegrationTest, EchoParamsTest, DeleteShardTest, TestFieldCacheReopen, TestBulkSchemaAPI, HdfsDirectoryFactoryTest, TestGroupingSearch, TestAnalyzeInfixSuggestions, TestConfigSetsAPI, TestLegacyFieldReuse, RemoteQueryErrorTest, ReplaceNodeTest, TestCloudDeleteByQuery, TestCloudInspectUtil, TestCloudPivotFacet, TestConfigSetsAPIZkFailure, TestCryptoKeys, TestDownShardTolerantSearch, TestLeaderElectionWithEmptyReplica, TestPrepRecovery, TestRequestForwarding, TestSkipOverseerOperations, TestStressLiveNodes, TlogReplayBufferedWhileIndexingTest, ZkFailoverTest, ConcurrentDeleteAndCreateCollectionTest, CustomCollectionTest, HdfsCollectionsAPIDistributedZkTest, SimpleCollectionCreateDeleteTest, TestCollectionsAPIViaSolrCloudCluster, TestLocalFSCloudBackupRestore, TestRequestStatusCollectionAPI, AutoScalingHandlerTest, HdfsAutoAddReplicasIntegrationTest, TriggerIntegrationTest]
   [junit4] Completed [628/775 (1!)] on J0 in 197.12s, 14 tests, 1 error <<< FAILURES!

[...truncated 49024 lines...]

Mime
View raw message