lucene-dev mailing list archives

Site index · List index
Message view « Date » · « Thread »
Top « Date » · « Thread »
From Policeman Jenkins Server <jenk...@thetaphi.de>
Subject [JENKINS] Lucene-Solr-master-Windows (64bit/jdk1.8.0_144) - Build # 7196 - Still unstable!
Date Tue, 27 Feb 2018 23:27:17 GMT
Build: https://jenkins.thetaphi.de/job/Lucene-Solr-master-Windows/7196/
Java: 64bit/jdk1.8.0_144 -XX:+UseCompressedOops -XX:+UseParallelGC

4 tests failed.
FAILED:  junit.framework.TestSuite.org.apache.lucene.store.TestMultiMMap

Error Message:
Could not remove the following files (in the order of attempts):    C:\Users\jenkins\workspace\Lucene-Solr-master-Windows\lucene\build\core\test\J0\temp\lucene.store.TestMultiMMap_1DB91FC62943F0F4-001\testSeekSliceZero-006: java.nio.file.DirectoryNotEmptyException: C:\Users\jenkins\workspace\Lucene-Solr-master-Windows\lucene\build\core\test\J0\temp\lucene.store.TestMultiMMap_1DB91FC62943F0F4-001\testSeekSliceZero-006 

Stack Trace:
java.io.IOException: Could not remove the following files (in the order of attempts):
   C:\Users\jenkins\workspace\Lucene-Solr-master-Windows\lucene\build\core\test\J0\temp\lucene.store.TestMultiMMap_1DB91FC62943F0F4-001\testSeekSliceZero-006: java.nio.file.DirectoryNotEmptyException: C:\Users\jenkins\workspace\Lucene-Solr-master-Windows\lucene\build\core\test\J0\temp\lucene.store.TestMultiMMap_1DB91FC62943F0F4-001\testSeekSliceZero-006

	at __randomizedtesting.SeedInfo.seed([1DB91FC62943F0F4]:0)
	at org.apache.lucene.util.IOUtils.rm(IOUtils.java:329)
	at org.apache.lucene.util.TestRuleTemporaryFilesCleanup.afterAlways(TestRuleTemporaryFilesCleanup.java:216)
	at com.carrotsearch.randomizedtesting.rules.TestRuleAdapter$1.afterAlways(TestRuleAdapter.java:31)
	at com.carrotsearch.randomizedtesting.rules.StatementAdapter.evaluate(StatementAdapter.java:43)
	at com.carrotsearch.randomizedtesting.rules.StatementAdapter.evaluate(StatementAdapter.java:36)
	at org.apache.lucene.util.TestRuleAssertionsRequired$1.evaluate(TestRuleAssertionsRequired.java:53)
	at org.apache.lucene.util.TestRuleMarkFailure$1.evaluate(TestRuleMarkFailure.java:47)
	at org.apache.lucene.util.TestRuleIgnoreAfterMaxFailures$1.evaluate(TestRuleIgnoreAfterMaxFailures.java:64)
	at org.apache.lucene.util.TestRuleIgnoreTestSuites$1.evaluate(TestRuleIgnoreTestSuites.java:54)
	at com.carrotsearch.randomizedtesting.rules.StatementAdapter.evaluate(StatementAdapter.java:36)
	at com.carrotsearch.randomizedtesting.ThreadLeakControl$StatementRunner.run(ThreadLeakControl.java:368)
	at java.lang.Thread.run(Thread.java:748)


FAILED:  junit.framework.TestSuite.org.apache.solr.update.processor.TestOpenNLPExtractNamedEntitiesUpdateProcessorFactory

Error Message:
Could not remove the following files (in the order of attempts):    C:\Users\jenkins\workspace\Lucene-Solr-master-Windows\solr\build\contrib\solr-analysis-extras\test\J1\temp\solr.update.processor.TestOpenNLPExtractNamedEntitiesUpdateProcessorFactory_10BAE5C2625B3390-001\tempDir-001\collection1\conf: java.nio.file.DirectoryNotEmptyException: C:\Users\jenkins\workspace\Lucene-Solr-master-Windows\solr\build\contrib\solr-analysis-extras\test\J1\temp\solr.update.processor.TestOpenNLPExtractNamedEntitiesUpdateProcessorFactory_10BAE5C2625B3390-001\tempDir-001\collection1\conf    C:\Users\jenkins\workspace\Lucene-Solr-master-Windows\solr\build\contrib\solr-analysis-extras\test\J1\temp\solr.update.processor.TestOpenNLPExtractNamedEntitiesUpdateProcessorFactory_10BAE5C2625B3390-001\tempDir-001\collection1: java.nio.file.DirectoryNotEmptyException: C:\Users\jenkins\workspace\Lucene-Solr-master-Windows\solr\build\contrib\solr-analysis-extras\test\J1\temp\solr.update.processor.TestOpenNLPExtractNamedEntitiesUpdateProcessorFactory_10BAE5C2625B3390-001\tempDir-001\collection1    C:\Users\jenkins\workspace\Lucene-Solr-master-Windows\solr\build\contrib\solr-analysis-extras\test\J1\temp\solr.update.processor.TestOpenNLPExtractNamedEntitiesUpdateProcessorFactory_10BAE5C2625B3390-001\tempDir-001: java.nio.file.DirectoryNotEmptyException: C:\Users\jenkins\workspace\Lucene-Solr-master-Windows\solr\build\contrib\solr-analysis-extras\test\J1\temp\solr.update.processor.TestOpenNLPExtractNamedEntitiesUpdateProcessorFactory_10BAE5C2625B3390-001\tempDir-001    C:\Users\jenkins\workspace\Lucene-Solr-master-Windows\solr\build\contrib\solr-analysis-extras\test\J1\temp\solr.update.processor.TestOpenNLPExtractNamedEntitiesUpdateProcessorFactory_10BAE5C2625B3390-001\tempDir-001\collection1\conf\en-test-tokenizer.bin: java.nio.file.AccessDeniedException: C:\Users\jenkins\workspace\Lucene-Solr-master-Windows\solr\build\contrib\solr-analysis-extras\test\J1\temp\solr.update.processor.TestOpenNLPExtractNamedEntitiesUpdateProcessorFactory_10BAE5C2625B3390-001\tempDir-001\collection1\conf\en-test-tokenizer.bin    C:\Users\jenkins\workspace\Lucene-Solr-master-Windows\solr\build\contrib\solr-analysis-extras\test\J1\temp\solr.update.processor.TestOpenNLPExtractNamedEntitiesUpdateProcessorFactory_10BAE5C2625B3390-001\tempDir-001\collection1\conf\en-test-sent.bin: java.nio.file.AccessDeniedException: C:\Users\jenkins\workspace\Lucene-Solr-master-Windows\solr\build\contrib\solr-analysis-extras\test\J1\temp\solr.update.processor.TestOpenNLPExtractNamedEntitiesUpdateProcessorFactory_10BAE5C2625B3390-001\tempDir-001\collection1\conf\en-test-sent.bin    C:\Users\jenkins\workspace\Lucene-Solr-master-Windows\solr\build\contrib\solr-analysis-extras\test\J1\temp\solr.update.processor.TestOpenNLPExtractNamedEntitiesUpdateProcessorFactory_10BAE5C2625B3390-001\tempDir-001\collection1\conf\en-test-ner-person.bin: java.nio.file.AccessDeniedException: C:\Users\jenkins\workspace\Lucene-Solr-master-Windows\solr\build\contrib\solr-analysis-extras\test\J1\temp\solr.update.processor.TestOpenNLPExtractNamedEntitiesUpdateProcessorFactory_10BAE5C2625B3390-001\tempDir-001\collection1\conf\en-test-ner-person.bin    C:\Users\jenkins\workspace\Lucene-Solr-master-Windows\solr\build\contrib\solr-analysis-extras\test\J1\temp\solr.update.processor.TestOpenNLPExtractNamedEntitiesUpdateProcessorFactory_10BAE5C2625B3390-001: java.nio.file.DirectoryNotEmptyException: C:\Users\jenkins\workspace\Lucene-Solr-master-Windows\solr\build\contrib\solr-analysis-extras\test\J1\temp\solr.update.processor.TestOpenNLPExtractNamedEntitiesUpdateProcessorFactory_10BAE5C2625B3390-001 

Stack Trace:
java.io.IOException: Could not remove the following files (in the order of attempts):
   C:\Users\jenkins\workspace\Lucene-Solr-master-Windows\solr\build\contrib\solr-analysis-extras\test\J1\temp\solr.update.processor.TestOpenNLPExtractNamedEntitiesUpdateProcessorFactory_10BAE5C2625B3390-001\tempDir-001\collection1\conf: java.nio.file.DirectoryNotEmptyException: C:\Users\jenkins\workspace\Lucene-Solr-master-Windows\solr\build\contrib\solr-analysis-extras\test\J1\temp\solr.update.processor.TestOpenNLPExtractNamedEntitiesUpdateProcessorFactory_10BAE5C2625B3390-001\tempDir-001\collection1\conf
   C:\Users\jenkins\workspace\Lucene-Solr-master-Windows\solr\build\contrib\solr-analysis-extras\test\J1\temp\solr.update.processor.TestOpenNLPExtractNamedEntitiesUpdateProcessorFactory_10BAE5C2625B3390-001\tempDir-001\collection1: java.nio.file.DirectoryNotEmptyException: C:\Users\jenkins\workspace\Lucene-Solr-master-Windows\solr\build\contrib\solr-analysis-extras\test\J1\temp\solr.update.processor.TestOpenNLPExtractNamedEntitiesUpdateProcessorFactory_10BAE5C2625B3390-001\tempDir-001\collection1
   C:\Users\jenkins\workspace\Lucene-Solr-master-Windows\solr\build\contrib\solr-analysis-extras\test\J1\temp\solr.update.processor.TestOpenNLPExtractNamedEntitiesUpdateProcessorFactory_10BAE5C2625B3390-001\tempDir-001: java.nio.file.DirectoryNotEmptyException: C:\Users\jenkins\workspace\Lucene-Solr-master-Windows\solr\build\contrib\solr-analysis-extras\test\J1\temp\solr.update.processor.TestOpenNLPExtractNamedEntitiesUpdateProcessorFactory_10BAE5C2625B3390-001\tempDir-001
   C:\Users\jenkins\workspace\Lucene-Solr-master-Windows\solr\build\contrib\solr-analysis-extras\test\J1\temp\solr.update.processor.TestOpenNLPExtractNamedEntitiesUpdateProcessorFactory_10BAE5C2625B3390-001\tempDir-001\collection1\conf\en-test-tokenizer.bin: java.nio.file.AccessDeniedException: C:\Users\jenkins\workspace\Lucene-Solr-master-Windows\solr\build\contrib\solr-analysis-extras\test\J1\temp\solr.update.processor.TestOpenNLPExtractNamedEntitiesUpdateProcessorFactory_10BAE5C2625B3390-001\tempDir-001\collection1\conf\en-test-tokenizer.bin
   C:\Users\jenkins\workspace\Lucene-Solr-master-Windows\solr\build\contrib\solr-analysis-extras\test\J1\temp\solr.update.processor.TestOpenNLPExtractNamedEntitiesUpdateProcessorFactory_10BAE5C2625B3390-001\tempDir-001\collection1\conf\en-test-sent.bin: java.nio.file.AccessDeniedException: C:\Users\jenkins\workspace\Lucene-Solr-master-Windows\solr\build\contrib\solr-analysis-extras\test\J1\temp\solr.update.processor.TestOpenNLPExtractNamedEntitiesUpdateProcessorFactory_10BAE5C2625B3390-001\tempDir-001\collection1\conf\en-test-sent.bin
   C:\Users\jenkins\workspace\Lucene-Solr-master-Windows\solr\build\contrib\solr-analysis-extras\test\J1\temp\solr.update.processor.TestOpenNLPExtractNamedEntitiesUpdateProcessorFactory_10BAE5C2625B3390-001\tempDir-001\collection1\conf\en-test-ner-person.bin: java.nio.file.AccessDeniedException: C:\Users\jenkins\workspace\Lucene-Solr-master-Windows\solr\build\contrib\solr-analysis-extras\test\J1\temp\solr.update.processor.TestOpenNLPExtractNamedEntitiesUpdateProcessorFactory_10BAE5C2625B3390-001\tempDir-001\collection1\conf\en-test-ner-person.bin
   C:\Users\jenkins\workspace\Lucene-Solr-master-Windows\solr\build\contrib\solr-analysis-extras\test\J1\temp\solr.update.processor.TestOpenNLPExtractNamedEntitiesUpdateProcessorFactory_10BAE5C2625B3390-001: java.nio.file.DirectoryNotEmptyException: C:\Users\jenkins\workspace\Lucene-Solr-master-Windows\solr\build\contrib\solr-analysis-extras\test\J1\temp\solr.update.processor.TestOpenNLPExtractNamedEntitiesUpdateProcessorFactory_10BAE5C2625B3390-001

	at __randomizedtesting.SeedInfo.seed([10BAE5C2625B3390]:0)
	at org.apache.lucene.util.IOUtils.rm(IOUtils.java:329)
	at org.apache.lucene.util.TestRuleTemporaryFilesCleanup.afterAlways(TestRuleTemporaryFilesCleanup.java:216)
	at com.carrotsearch.randomizedtesting.rules.TestRuleAdapter$1.afterAlways(TestRuleAdapter.java:31)
	at com.carrotsearch.randomizedtesting.rules.StatementAdapter.evaluate(StatementAdapter.java:43)
	at com.carrotsearch.randomizedtesting.rules.StatementAdapter.evaluate(StatementAdapter.java:36)
	at org.apache.lucene.util.TestRuleAssertionsRequired$1.evaluate(TestRuleAssertionsRequired.java:53)
	at org.apache.lucene.util.TestRuleMarkFailure$1.evaluate(TestRuleMarkFailure.java:47)
	at org.apache.lucene.util.TestRuleIgnoreAfterMaxFailures$1.evaluate(TestRuleIgnoreAfterMaxFailures.java:64)
	at org.apache.lucene.util.TestRuleIgnoreTestSuites$1.evaluate(TestRuleIgnoreTestSuites.java:54)
	at com.carrotsearch.randomizedtesting.rules.StatementAdapter.evaluate(StatementAdapter.java:36)
	at com.carrotsearch.randomizedtesting.ThreadLeakControl$StatementRunner.run(ThreadLeakControl.java:368)
	at java.lang.Thread.run(Thread.java:748)


FAILED:  junit.framework.TestSuite.org.apache.solr.handler.JsonLoaderTest

Error Message:
Could not remove the following files (in the order of attempts):    C:\Users\jenkins\workspace\Lucene-Solr-master-Windows\solr\build\solr-core\test\J1\temp\solr.handler.JsonLoaderTest_D9C35ABB0435C747-001\init-core-data-001\tlog: java.nio.file.DirectoryNotEmptyException: C:\Users\jenkins\workspace\Lucene-Solr-master-Windows\solr\build\solr-core\test\J1\temp\solr.handler.JsonLoaderTest_D9C35ABB0435C747-001\init-core-data-001\tlog    C:\Users\jenkins\workspace\Lucene-Solr-master-Windows\solr\build\solr-core\test\J1\temp\solr.handler.JsonLoaderTest_D9C35ABB0435C747-001\init-core-data-001: java.nio.file.DirectoryNotEmptyException: C:\Users\jenkins\workspace\Lucene-Solr-master-Windows\solr\build\solr-core\test\J1\temp\solr.handler.JsonLoaderTest_D9C35ABB0435C747-001\init-core-data-001 

Stack Trace:
java.io.IOException: Could not remove the following files (in the order of attempts):
   C:\Users\jenkins\workspace\Lucene-Solr-master-Windows\solr\build\solr-core\test\J1\temp\solr.handler.JsonLoaderTest_D9C35ABB0435C747-001\init-core-data-001\tlog: java.nio.file.DirectoryNotEmptyException: C:\Users\jenkins\workspace\Lucene-Solr-master-Windows\solr\build\solr-core\test\J1\temp\solr.handler.JsonLoaderTest_D9C35ABB0435C747-001\init-core-data-001\tlog
   C:\Users\jenkins\workspace\Lucene-Solr-master-Windows\solr\build\solr-core\test\J1\temp\solr.handler.JsonLoaderTest_D9C35ABB0435C747-001\init-core-data-001: java.nio.file.DirectoryNotEmptyException: C:\Users\jenkins\workspace\Lucene-Solr-master-Windows\solr\build\solr-core\test\J1\temp\solr.handler.JsonLoaderTest_D9C35ABB0435C747-001\init-core-data-001

	at __randomizedtesting.SeedInfo.seed([D9C35ABB0435C747]:0)
	at org.apache.lucene.util.IOUtils.rm(IOUtils.java:329)
	at org.apache.lucene.util.TestRuleTemporaryFilesCleanup.afterAlways(TestRuleTemporaryFilesCleanup.java:216)
	at com.carrotsearch.randomizedtesting.rules.TestRuleAdapter$1.afterAlways(TestRuleAdapter.java:31)
	at com.carrotsearch.randomizedtesting.rules.StatementAdapter.evaluate(StatementAdapter.java:43)
	at com.carrotsearch.randomizedtesting.rules.StatementAdapter.evaluate(StatementAdapter.java:36)
	at org.apache.lucene.util.TestRuleAssertionsRequired$1.evaluate(TestRuleAssertionsRequired.java:53)
	at org.apache.lucene.util.TestRuleMarkFailure$1.evaluate(TestRuleMarkFailure.java:47)
	at org.apache.lucene.util.TestRuleIgnoreAfterMaxFailures$1.evaluate(TestRuleIgnoreAfterMaxFailures.java:64)
	at org.apache.lucene.util.TestRuleIgnoreTestSuites$1.evaluate(TestRuleIgnoreTestSuites.java:54)
	at com.carrotsearch.randomizedtesting.rules.StatementAdapter.evaluate(StatementAdapter.java:36)
	at com.carrotsearch.randomizedtesting.ThreadLeakControl$StatementRunner.run(ThreadLeakControl.java:368)
	at java.lang.Thread.run(Thread.java:748)


FAILED:  junit.framework.TestSuite.org.apache.solr.search.AnalyticsQueryTest

Error Message:
Could not remove the following files (in the order of attempts):    C:\Users\jenkins\workspace\Lucene-Solr-master-Windows\solr\build\solr-core\test\J0\temp\solr.search.AnalyticsQueryTest_D9C35ABB0435C747-001\init-core-data-001\tlog: java.nio.file.DirectoryNotEmptyException: C:\Users\jenkins\workspace\Lucene-Solr-master-Windows\solr\build\solr-core\test\J0\temp\solr.search.AnalyticsQueryTest_D9C35ABB0435C747-001\init-core-data-001\tlog    C:\Users\jenkins\workspace\Lucene-Solr-master-Windows\solr\build\solr-core\test\J0\temp\solr.search.AnalyticsQueryTest_D9C35ABB0435C747-001\init-core-data-001: java.nio.file.DirectoryNotEmptyException: C:\Users\jenkins\workspace\Lucene-Solr-master-Windows\solr\build\solr-core\test\J0\temp\solr.search.AnalyticsQueryTest_D9C35ABB0435C747-001\init-core-data-001    C:\Users\jenkins\workspace\Lucene-Solr-master-Windows\solr\build\solr-core\test\J0\temp\solr.search.AnalyticsQueryTest_D9C35ABB0435C747-001\init-core-data-001\tlog\tlog.0000000000000000001: java.nio.file.AccessDeniedException: C:\Users\jenkins\workspace\Lucene-Solr-master-Windows\solr\build\solr-core\test\J0\temp\solr.search.AnalyticsQueryTest_D9C35ABB0435C747-001\init-core-data-001\tlog\tlog.0000000000000000001    C:\Users\jenkins\workspace\Lucene-Solr-master-Windows\solr\build\solr-core\test\J0\temp\solr.search.AnalyticsQueryTest_D9C35ABB0435C747-001: java.nio.file.DirectoryNotEmptyException: C:\Users\jenkins\workspace\Lucene-Solr-master-Windows\solr\build\solr-core\test\J0\temp\solr.search.AnalyticsQueryTest_D9C35ABB0435C747-001 

Stack Trace:
java.io.IOException: Could not remove the following files (in the order of attempts):
   C:\Users\jenkins\workspace\Lucene-Solr-master-Windows\solr\build\solr-core\test\J0\temp\solr.search.AnalyticsQueryTest_D9C35ABB0435C747-001\init-core-data-001\tlog: java.nio.file.DirectoryNotEmptyException: C:\Users\jenkins\workspace\Lucene-Solr-master-Windows\solr\build\solr-core\test\J0\temp\solr.search.AnalyticsQueryTest_D9C35ABB0435C747-001\init-core-data-001\tlog
   C:\Users\jenkins\workspace\Lucene-Solr-master-Windows\solr\build\solr-core\test\J0\temp\solr.search.AnalyticsQueryTest_D9C35ABB0435C747-001\init-core-data-001: java.nio.file.DirectoryNotEmptyException: C:\Users\jenkins\workspace\Lucene-Solr-master-Windows\solr\build\solr-core\test\J0\temp\solr.search.AnalyticsQueryTest_D9C35ABB0435C747-001\init-core-data-001
   C:\Users\jenkins\workspace\Lucene-Solr-master-Windows\solr\build\solr-core\test\J0\temp\solr.search.AnalyticsQueryTest_D9C35ABB0435C747-001\init-core-data-001\tlog\tlog.0000000000000000001: java.nio.file.AccessDeniedException: C:\Users\jenkins\workspace\Lucene-Solr-master-Windows\solr\build\solr-core\test\J0\temp\solr.search.AnalyticsQueryTest_D9C35ABB0435C747-001\init-core-data-001\tlog\tlog.0000000000000000001
   C:\Users\jenkins\workspace\Lucene-Solr-master-Windows\solr\build\solr-core\test\J0\temp\solr.search.AnalyticsQueryTest_D9C35ABB0435C747-001: java.nio.file.DirectoryNotEmptyException: C:\Users\jenkins\workspace\Lucene-Solr-master-Windows\solr\build\solr-core\test\J0\temp\solr.search.AnalyticsQueryTest_D9C35ABB0435C747-001

	at __randomizedtesting.SeedInfo.seed([D9C35ABB0435C747]:0)
	at org.apache.lucene.util.IOUtils.rm(IOUtils.java:329)
	at org.apache.lucene.util.TestRuleTemporaryFilesCleanup.afterAlways(TestRuleTemporaryFilesCleanup.java:216)
	at com.carrotsearch.randomizedtesting.rules.TestRuleAdapter$1.afterAlways(TestRuleAdapter.java:31)
	at com.carrotsearch.randomizedtesting.rules.StatementAdapter.evaluate(StatementAdapter.java:43)
	at com.carrotsearch.randomizedtesting.rules.StatementAdapter.evaluate(StatementAdapter.java:36)
	at org.apache.lucene.util.TestRuleAssertionsRequired$1.evaluate(TestRuleAssertionsRequired.java:53)
	at org.apache.lucene.util.TestRuleMarkFailure$1.evaluate(TestRuleMarkFailure.java:47)
	at org.apache.lucene.util.TestRuleIgnoreAfterMaxFailures$1.evaluate(TestRuleIgnoreAfterMaxFailures.java:64)
	at org.apache.lucene.util.TestRuleIgnoreTestSuites$1.evaluate(TestRuleIgnoreTestSuites.java:54)
	at com.carrotsearch.randomizedtesting.rules.StatementAdapter.evaluate(StatementAdapter.java:36)
	at com.carrotsearch.randomizedtesting.ThreadLeakControl$StatementRunner.run(ThreadLeakControl.java:368)
	at java.lang.Thread.run(Thread.java:748)




Build Log:
[...truncated 375 lines...]
   [junit4] Suite: org.apache.lucene.store.TestMultiMMap
   [junit4]   2> NOTE: test params are: codec=DummyCompressingStoredFields(storedFieldsFormat=CompressingStoredFieldsFormat(compressionMode=DUMMY, chunkSize=20161, maxDocsPerChunk=729, blockSize=649), termVectorsFormat=CompressingTermVectorsFormat(compressionMode=DUMMY, chunkSize=20161, blockSize=649)), sim=Asserting(org.apache.lucene.search.similarities.AssertingSimilarity@34a8fbe7), locale=zh, timezone=America/Argentina/Salta
   [junit4]   2> NOTE: Windows 10 10.0 amd64/Oracle Corporation 1.8.0_144 (64-bit)/cpus=3,threads=1,free=106174816,total=185597952
   [junit4]   2> NOTE: All tests run in this JVM: [TestBoolean2ScorerSupplier, TestFSTs, TestSpanOrQuery, TestFilterSpans, TestNGramPhraseQuery, TestCustomTermFreq, TestTermVectors, TestSPIClassIterator, TestMathUtil, TestBoostQuery, TestDuelingCodecsAtNight, TestSearchWithThreads, TestAutomaton, Test2BSortedDocValuesFixedSorted, TestIndexWriterLockRelease, TestTieredMergePolicy, TestGeoUtils, TestSameScoresWithThreads, TestPointValues, TestSpanMultiTermQueryWrapper, TestMultiMMap]
   [junit4]   2> NOTE: reproduce with: ant test  -Dtestcase=TestMultiMMap -Dtests.seed=1DB91FC62943F0F4 -Dtests.slow=true -Dtests.locale=zh -Dtests.timezone=America/Argentina/Salta -Dtests.asserts=true -Dtests.file.encoding=Cp1252
   [junit4] ERROR   0.00s J0 | TestMultiMMap (suite) <<<
   [junit4]    > Throwable #1: java.io.IOException: Could not remove the following files (in the order of attempts):
   [junit4]    >    C:\Users\jenkins\workspace\Lucene-Solr-master-Windows\lucene\build\core\test\J0\temp\lucene.store.TestMultiMMap_1DB91FC62943F0F4-001\testSeekSliceZero-006: java.nio.file.DirectoryNotEmptyException: C:\Users\jenkins\workspace\Lucene-Solr-master-Windows\lucene\build\core\test\J0\temp\lucene.store.TestMultiMMap_1DB91FC62943F0F4-001\testSeekSliceZero-006
   [junit4]    > 	at __randomizedtesting.SeedInfo.seed([1DB91FC62943F0F4]:0)
   [junit4]    > 	at org.apache.lucene.util.IOUtils.rm(IOUtils.java:329)
   [junit4]    > 	at java.lang.Thread.run(Thread.java:748)
   [junit4] Completed [39/486 (1!)] on J0 in 7.58s, 54 tests, 1 error <<< FAILURES!

[...truncated 11838 lines...]
   [junit4] Suite: org.apache.solr.search.AnalyticsQueryTest
   [junit4]   2> Creating dataDir: C:\Users\jenkins\workspace\Lucene-Solr-master-Windows\solr\build\solr-core\test\J0\temp\solr.search.AnalyticsQueryTest_D9C35ABB0435C747-001\init-core-data-001
   [junit4]   2> 195234 WARN  (SUITE-AnalyticsQueryTest-seed#[D9C35ABB0435C747]-worker) [    ] o.a.s.SolrTestCaseJ4 startTrackingSearchers: numOpens=1 numCloses=1
   [junit4]   2> 195234 INFO  (SUITE-AnalyticsQueryTest-seed#[D9C35ABB0435C747]-worker) [    ] o.a.s.SolrTestCaseJ4 Using PointFields (NUMERIC_POINTS_SYSPROP=true) w/NUMERIC_DOCVALUES_SYSPROP=false
   [junit4]   2> 195238 INFO  (SUITE-AnalyticsQueryTest-seed#[D9C35ABB0435C747]-worker) [    ] o.a.s.SolrTestCaseJ4 Randomized ssl (false) and clientAuth (false) via: @org.apache.solr.util.RandomizeSSL(reason=, value=NaN, ssl=NaN, clientAuth=NaN)
   [junit4]   2> 195238 INFO  (SUITE-AnalyticsQueryTest-seed#[D9C35ABB0435C747]-worker) [    ] o.a.s.SolrTestCaseJ4 SecureRandom sanity checks: test.solr.allowed.securerandom=null & java.security.egd=file:/dev/./urandom
   [junit4]   2> 195239 INFO  (SUITE-AnalyticsQueryTest-seed#[D9C35ABB0435C747]-worker) [    ] o.a.s.SolrTestCaseJ4 ####initCore
   [junit4]   2> 195240 INFO  (SUITE-AnalyticsQueryTest-seed#[D9C35ABB0435C747]-worker) [    ] o.a.s.c.SolrResourceLoader [null] Added 2 libs to classloader, from paths: [/C:/Users/jenkins/workspace/Lucene-Solr-master-Windows/solr/core/src/test-files/solr/collection1/lib, /C:/Users/jenkins/workspace/Lucene-Solr-master-Windows/solr/core/src/test-files/solr/collection1/lib/classes]
   [junit4]   2> 195287 INFO  (SUITE-AnalyticsQueryTest-seed#[D9C35ABB0435C747]-worker) [    ] o.a.s.c.SolrConfig Using Lucene MatchVersion: 8.0.0
   [junit4]   2> 195304 INFO  (SUITE-AnalyticsQueryTest-seed#[D9C35ABB0435C747]-worker) [    ] o.a.s.s.IndexSchema [null] Schema name=test
   [junit4]   2> 195383 INFO  (SUITE-AnalyticsQueryTest-seed#[D9C35ABB0435C747]-worker) [    ] o.a.s.s.IndexSchema Loaded schema test/1.6 with uniqueid field id
   [junit4]   2> 195472 INFO  (SUITE-AnalyticsQueryTest-seed#[D9C35ABB0435C747]-worker) [    ] o.a.s.m.r.SolrJmxReporter JMX monitoring for 'solr.node' (registry 'solr.node') enabled at server: com.sun.jmx.mbeanserver.JmxMBeanServer@4bafdf70
   [junit4]   2> 195477 INFO  (SUITE-AnalyticsQueryTest-seed#[D9C35ABB0435C747]-worker) [    ] o.a.s.m.r.SolrJmxReporter JMX monitoring for 'solr.jvm' (registry 'solr.jvm') enabled at server: com.sun.jmx.mbeanserver.JmxMBeanServer@4bafdf70
   [junit4]   2> 195477 INFO  (SUITE-AnalyticsQueryTest-seed#[D9C35ABB0435C747]-worker) [    ] o.a.s.m.r.SolrJmxReporter JMX monitoring for 'solr.jetty' (registry 'solr.jetty') enabled at server: com.sun.jmx.mbeanserver.JmxMBeanServer@4bafdf70
   [junit4]   2> 195478 INFO  (coreLoadExecutor-959-thread-1) [    ] o.a.s.c.TransientSolrCoreCacheDefault Allocating transient cache for 2147483647 transient cores
   [junit4]   2> 195480 INFO  (coreLoadExecutor-959-thread-1) [    x:collection1] o.a.s.c.SolrResourceLoader [null] Added 2 libs to classloader, from paths: [/C:/Users/jenkins/workspace/Lucene-Solr-master-Windows/solr/core/src/test-files/solr/collection1/lib, /C:/Users/jenkins/workspace/Lucene-Solr-master-Windows/solr/core/src/test-files/solr/collection1/lib/classes]
   [junit4]   2> 195534 INFO  (coreLoadExecutor-959-thread-1) [    x:collection1] o.a.s.c.SolrConfig Using Lucene MatchVersion: 8.0.0
   [junit4]   2> 195546 INFO  (coreLoadExecutor-959-thread-1) [    x:collection1] o.a.s.s.IndexSchema [collection1] Schema name=test
   [junit4]   2> 195615 INFO  (coreLoadExecutor-959-thread-1) [    x:collection1] o.a.s.s.IndexSchema Loaded schema test/1.6 with uniqueid field id
   [junit4]   2> 195627 INFO  (coreLoadExecutor-959-thread-1) [    x:collection1] o.a.s.c.CoreContainer Creating SolrCore 'collection1' using configuration from instancedir C:\Users\jenkins\workspace\Lucene-Solr-master-Windows\solr\core\src\test-files\solr\collection1, trusted=true
   [junit4]   2> 195627 INFO  (coreLoadExecutor-959-thread-1) [    x:collection1] o.a.s.m.r.SolrJmxReporter JMX monitoring for 'solr.core.collection1' (registry 'solr.core.collection1') enabled at server: com.sun.jmx.mbeanserver.JmxMBeanServer@4bafdf70
   [junit4]   2> 195627 INFO  (coreLoadExecutor-959-thread-1) [    x:collection1] o.a.s.c.SolrCore solr.RecoveryStrategy.Builder
   [junit4]   2> 195627 INFO  (coreLoadExecutor-959-thread-1) [    x:collection1] o.a.s.c.SolrCore [[collection1] ] Opening new SolrCore at [C:\Users\jenkins\workspace\Lucene-Solr-master-Windows\solr\core\src\test-files\solr\collection1], dataDir=[C:\Users\jenkins\workspace\Lucene-Solr-master-Windows\solr\build\solr-core\test\J0\temp\solr.search.AnalyticsQueryTest_D9C35ABB0435C747-001\init-core-data-001\]
   [junit4]   2> 195629 INFO  (coreLoadExecutor-959-thread-1) [    x:collection1] o.a.s.u.RandomMergePolicy RandomMergePolicy wrapping class org.apache.lucene.index.TieredMergePolicy: [TieredMergePolicy: maxMergeAtOnce=41, maxMergeAtOnceExplicit=20, maxMergedSegmentMB=29.7685546875, floorSegmentMB=2.09765625, forceMergeDeletesPctAllowed=1.1738803896842187, segmentsPerTier=50.0, maxCFSSegmentSizeMB=8.796093022207999E12, noCFSRatio=0.6444744651901528
   [junit4]   2> 195752 INFO  (coreLoadExecutor-959-thread-1) [    x:collection1] o.a.s.u.UpdateHandler Using UpdateLog implementation: org.apache.solr.update.UpdateLog
   [junit4]   2> 195752 INFO  (coreLoadExecutor-959-thread-1) [    x:collection1] o.a.s.u.UpdateLog Initializing UpdateLog: dataDir= defaultSyncLevel=FLUSH numRecordsToKeep=100 maxNumLogsToKeep=10 numVersionBuckets=65536
   [junit4]   2> 195754 INFO  (coreLoadExecutor-959-thread-1) [    x:collection1] o.a.s.u.CommitTracker Hard AutoCommit: disabled
   [junit4]   2> 195754 INFO  (coreLoadExecutor-959-thread-1) [    x:collection1] o.a.s.u.CommitTracker Soft AutoCommit: disabled
   [junit4]   2> 195755 INFO  (coreLoadExecutor-959-thread-1) [    x:collection1] o.a.s.u.RandomMergePolicy RandomMergePolicy wrapping class org.apache.lucene.index.TieredMergePolicy: [TieredMergePolicy: maxMergeAtOnce=24, maxMergeAtOnceExplicit=34, maxMergedSegmentMB=58.5703125, floorSegmentMB=1.4072265625, forceMergeDeletesPctAllowed=16.504976500354235, segmentsPerTier=32.0, maxCFSSegmentSizeMB=8.796093022207999E12, noCFSRatio=0.31081085250018714
   [junit4]   2> 195755 INFO  (coreLoadExecutor-959-thread-1) [    x:collection1] o.a.s.s.SolrIndexSearcher Opening [Searcher@7023dbae[collection1] main]
   [junit4]   2> 195755 WARN  (coreLoadExecutor-959-thread-1) [    x:collection1] o.a.s.r.ManagedResourceStorage Cannot write to config directory C:\Users\jenkins\workspace\Lucene-Solr-master-Windows\solr\core\src\test-files\solr\collection1\conf; switching to use InMemory storage instead.
   [junit4]   2> 195757 INFO  (coreLoadExecutor-959-thread-1) [    x:collection1] o.a.s.h.ReplicationHandler Commits will be reserved for 10000ms.
   [junit4]   2> 195758 INFO  (searcherExecutor-960-thread-1-processing-x:collection1) [    x:collection1] o.a.s.c.SolrCore [collection1] Registered new searcher Searcher@7023dbae[collection1] main{ExitableDirectoryReader(UninvertingDirectoryReader())}
   [junit4]   2> 195759 INFO  (coreLoadExecutor-959-thread-1) [    x:collection1] o.a.s.u.UpdateLog Could not find max version in index or recent updates, using new clock 1593593800249311232
   [junit4]   2> 195761 INFO  (SUITE-AnalyticsQueryTest-seed#[D9C35ABB0435C747]-worker) [    ] o.a.s.SolrTestCaseJ4 ####initCore end
   [junit4]   2> 195763 INFO  (TEST-AnalyticsQueryTest.testAnalyticsQuery-seed#[D9C35ABB0435C747]) [    ] o.a.s.SolrTestCaseJ4 ###Starting testAnalyticsQuery
   [junit4]   2> 195763 INFO  (TEST-AnalyticsQueryTest.testAnalyticsQuery-seed#[D9C35ABB0435C747]) [    ] o.a.s.u.DirectUpdateHandler2 [collection1] REMOVING ALL DOCUMENTS FROM INDEX
   [junit4]   2> 195764 INFO  (TEST-AnalyticsQueryTest.testAnalyticsQuery-seed#[D9C35ABB0435C747]) [    ] o.a.s.s.SolrIndexSearcher Opening [Searcher@30b90339[collection1] realtime]
   [junit4]   2> 195765 INFO  (TEST-AnalyticsQueryTest.testAnalyticsQuery-seed#[D9C35ABB0435C747]) [    ] o.a.s.u.p.LogUpdateProcessorFactory [collection1]  webapp=null path=null params={_version_=-9223372036854775807&update.distrib=FROMLEADER&versions=true&wt=json&indent=true}{deleteByQuery=*:* (-9223372036854775807)} 0 1
   [junit4]   2> 195765 INFO  (TEST-AnalyticsQueryTest.testAnalyticsQuery-seed#[D9C35ABB0435C747]) [    ] o.a.s.u.DirectUpdateHandler2 start commit{_version_=1593593800255602688,optimize=false,openSearcher=true,waitSearcher=true,expungeDeletes=false,softCommit=false,prepareCommit=false}
   [junit4]   2> 195765 INFO  (TEST-AnalyticsQueryTest.testAnalyticsQuery-seed#[D9C35ABB0435C747]) [    ] o.a.s.u.SolrIndexWriter Calling setCommitData with IW:org.apache.solr.update.SolrIndexWriter@1aafdf1a commitCommandVersion:1593593800255602688
   [junit4]   2> 195767 INFO  (TEST-AnalyticsQueryTest.testAnalyticsQuery-seed#[D9C35ABB0435C747]) [    ] o.a.s.s.SolrIndexSearcher Opening [Searcher@2e96b436[collection1] main]
   [junit4]   2> 195767 INFO  (TEST-AnalyticsQueryTest.testAnalyticsQuery-seed#[D9C35ABB0435C747]) [    ] o.a.s.u.DirectUpdateHandler2 end_commit_flush
   [junit4]   2> 195769 INFO  (searcherExecutor-960-thread-1) [    ] o.a.s.c.SolrCore [collection1] Registered new searcher Searcher@2e96b436[collection1] main{ExitableDirectoryReader(UninvertingDirectoryReader())}
   [junit4]   2> 195769 INFO  (TEST-AnalyticsQueryTest.testAnalyticsQuery-seed#[D9C35ABB0435C747]) [    ] o.a.s.u.p.LogUpdateProcessorFactory [collection1]  webapp=null path=null params={}{commit=} 0 3
   [junit4]   2> 195777 INFO  (TEST-AnalyticsQueryTest.testAnalyticsQuery-seed#[D9C35ABB0435C747]) [    ] o.a.s.u.p.LogUpdateProcessorFactory [collection1]  webapp=null path=null params={}{add=[1 (1593593800265039872)]} 0 2
   [junit4]   2> 195777 INFO  (TEST-AnalyticsQueryTest.testAnalyticsQuery-seed#[D9C35ABB0435C747]) [    ] o.a.s.u.DirectUpdateHandler2 start commit{_version_=1593593800268185600,optimize=false,openSearcher=true,waitSearcher=true,expungeDeletes=false,softCommit=false,prepareCommit=false}
   [junit4]   2> 195777 INFO  (TEST-AnalyticsQueryTest.testAnalyticsQuery-seed#[D9C35ABB0435C747]) [    ] o.a.s.u.SolrIndexWriter Calling setCommitData with IW:org.apache.solr.update.SolrIndexWriter@1aafdf1a commitCommandVersion:1593593800268185600
   [junit4]   2> 195806 INFO  (TEST-AnalyticsQueryTest.testAnalyticsQuery-seed#[D9C35ABB0435C747]) [    ] o.a.s.s.SolrIndexSearcher Opening [Searcher@5e06b9b[collection1] main]
   [junit4]   2> 195807 INFO  (TEST-AnalyticsQueryTest.testAnalyticsQuery-seed#[D9C35ABB0435C747]) [    ] o.a.s.u.DirectUpdateHandler2 end_commit_flush
   [junit4]   2> 195808 INFO  (searcherExecutor-960-thread-1) [    ] o.a.s.c.SolrCore [collection1] Registered new searcher Searcher@5e06b9b[collection1] main{ExitableDirectoryReader(UninvertingDirectoryReader(Uninverting(_0(8.0.0):c1)))}
   [junit4]   2> 195808 INFO  (TEST-AnalyticsQueryTest.testAnalyticsQuery-seed#[D9C35ABB0435C747]) [    ] o.a.s.u.p.LogUpdateProcessorFactory [collection1]  webapp=null path=null params={}{commit=} 0 30
   [junit4]   2> 195810 INFO  (TEST-AnalyticsQueryTest.testAnalyticsQuery-seed#[D9C35ABB0435C747]) [    ] o.a.s.u.p.LogUpdateProcessorFactory [collection1]  webapp=null path=null params={}{add=[2 (1593593800300691456)]} 0 1
   [junit4]   2> 195811 INFO  (TEST-AnalyticsQueryTest.testAnalyticsQuery-seed#[D9C35ABB0435C747]) [    ] o.a.s.u.p.LogUpdateProcessorFactory [collection1]  webapp=null path=null params={}{add=[3 (1593593800303837184)]} 0 0
   [junit4]   2> 195811 INFO  (TEST-AnalyticsQueryTest.testAnalyticsQuery-seed#[D9C35ABB0435C747]) [    ] o.a.s.u.DirectUpdateHandler2 start commit{_version_=1593593800303837185,optimize=false,openSearcher=true,waitSearcher=true,expungeDeletes=false,softCommit=false,prepareCommit=false}
   [junit4]   2> 195811 INFO  (TEST-AnalyticsQueryTest.testAnalyticsQuery-seed#[D9C35ABB0435C747]) [    ] o.a.s.u.SolrIndexWriter Calling setCommitData with IW:org.apache.solr.update.SolrIndexWriter@1aafdf1a commitCommandVersion:1593593800303837185
   [junit4]   2> 195817 INFO  (TEST-AnalyticsQueryTest.testAnalyticsQuery-seed#[D9C35ABB0435C747]) [    ] o.a.s.s.SolrIndexSearcher Opening [Searcher@7b85e358[collection1] main]
   [junit4]   2> 195820 INFO  (searcherExecutor-960-thread-1) [    ] o.a.s.c.SolrCore [collection1] Registered new searcher Searcher@7b85e358[collection1] main{ExitableDirectoryReader(UninvertingDirectoryReader(Uninverting(_0(8.0.0):c1) Uninverting(_1(8.0.0):c2)))}
   [junit4]   2> 195821 INFO  (TEST-AnalyticsQueryTest.testAnalyticsQuery-seed#[D9C35ABB0435C747]) [    ] o.a.s.u.DirectUpdateHandler2 end_commit_flush
   [junit4]   2> 195821 INFO  (TEST-AnalyticsQueryTest.testAnalyticsQuery-seed#[D9C35ABB0435C747]) [    ] o.a.s.u.p.LogUpdateProcessorFactory [collection1]  webapp=null path=null params={}{commit=} 0 9
   [junit4]   2> 195823 INFO  (TEST-AnalyticsQueryTest.testAnalyticsQuery-seed#[D9C35ABB0435C747]) [    ] o.a.s.u.p.LogUpdateProcessorFactory [collection1]  webapp=null path=null params={}{add=[4 (1593593800314322944)]} 0 2
   [junit4]   2> 195823 INFO  (TEST-AnalyticsQueryTest.testAnalyticsQuery-seed#[D9C35ABB0435C747]) [    ] o.a.s.u.p.LogUpdateProcessorFactory [collection1]  webapp=null path=null params={}{add=[5 (1593593800316420096)]} 0 0
   [junit4]   2> 195824 INFO  (TEST-AnalyticsQueryTest.testAnalyticsQuery-seed#[D9C35ABB0435C747]) [    ] o.a.s.u.DirectUpdateHandler2 start commit{_version_=1593593800317468672,optimize=false,openSearcher=true,waitSearcher=true,expungeDeletes=false,softCommit=false,prepareCommit=false}
   [junit4]   2> 195824 INFO  (TEST-AnalyticsQueryTest.testAnalyticsQuery-seed#[D9C35ABB0435C747]) [    ] o.a.s.u.SolrIndexWriter Calling setCommitData with IW:org.apache.solr.update.SolrIndexWriter@1aafdf1a commitCommandVersion:1593593800317468672
   [junit4]   2> 195835 INFO  (TEST-AnalyticsQueryTest.testAnalyticsQuery-seed#[D9C35ABB0435C747]) [    ] o.a.s.s.SolrIndexSearcher Opening [Searcher@5abfc084[collection1] main]
   [junit4]   2> 195836 INFO  (TEST-AnalyticsQueryTest.testAnalyticsQuery-seed#[D9C35ABB0435C747]) [    ] o.a.s.u.DirectUpdateHandler2 end_commit_flush
   [junit4]   2> 195837 INFO  (searcherExecutor-960-thread-1) [    ] o.a.s.c.SolrCore [collection1] Registered new searcher Searcher@5abfc084[collection1] main{ExitableDirectoryReader(UninvertingDirectoryReader(Uninverting(_0(8.0.0):c1) Uninverting(_1(8.0.0):c2) Uninverting(_2(8.0.0):c2)))}
   [junit4]   2> 195837 INFO  (TEST-AnalyticsQueryTest.testAnalyticsQuery-seed#[D9C35ABB0435C747]) [    ] o.a.s.u.p.LogUpdateProcessorFactory [collection1]  webapp=null path=null params={}{commit=} 0 12
   [junit4]   2> 195840 INFO  (TEST-AnalyticsQueryTest.testAnalyticsQuery-seed#[D9C35ABB0435C747]) [    ] o.a.s.u.p.LogUpdateProcessorFactory [collection1]  webapp=null path=null params={}{add=[6 (1593593800331100160)]} 0 2
   [junit4]   2> 195851 INFO  (TEST-AnalyticsQueryTest.testAnalyticsQuery-seed#[D9C35ABB0435C747]) [    ] o.a.s.u.DirectUpdateHandler2 start commit{_version_=1593593800345780224,optimize=false,openSearcher=true,waitSearcher=true,expungeDeletes=false,softCommit=false,prepareCommit=false}
   [junit4]   2> 195852 INFO  (TEST-AnalyticsQueryTest.testAnalyticsQuery-seed#[D9C35ABB0435C747]) [    ] o.a.s.u.SolrIndexWriter Calling setCommitData with IW:org.apache.solr.update.SolrIndexWriter@1aafdf1a commitCommandVersion:1593593800345780224
   [junit4]   2> 195865 INFO  (TEST-AnalyticsQueryTest.testAnalyticsQuery-seed#[D9C35ABB0435C747]) [    ] o.a.s.s.SolrIndexSearcher Opening [Searcher@671ab2b8[collection1] main]
   [junit4]   2> 195867 INFO  (searcherExecutor-960-thread-1) [    ] o.a.s.c.SolrCore [collection1] Registered new searcher Searcher@671ab2b8[collection1] main{ExitableDirectoryReader(UninvertingDirectoryReader(Uninverting(_0(8.0.0):c1) Uninverting(_1(8.0.0):c2) Uninverting(_2(8.0.0):c2) Uninverting(_3(8.0.0):c1)))}
   [junit4]   2> 195867 INFO  (TEST-AnalyticsQueryTest.testAnalyticsQuery-seed#[D9C35ABB0435C747]) [    ] o.a.s.u.DirectUpdateHandler2 end_commit_flush
   [junit4]   2> 195867 INFO  (TEST-AnalyticsQueryTest.testAnalyticsQuery-seed#[D9C35ABB0435C747]) [    ] o.a.s.u.p.LogUpdateProcessorFactory [collection1]  webapp=null path=null params={}{commit=} 0 27
   [junit4]   2> 195875 INFO  (TEST-AnalyticsQueryTest.testAnalyticsQuery-seed#[D9C35ABB0435C747]) [    ] o.a.s.c.S.Request [collection1]  webapp=null path=null params={q=*:*&fq={!count}} hits=6 status=0 QTime=7
   [junit4]   2> 195877 INFO  (TEST-AnalyticsQueryTest.testAnalyticsQuery-seed#[D9C35ABB0435C747]) [    ] o.a.s.c.S.Request [collection1]  webapp=null path=null params={q=id:(3+4)&fq={!count}} hits=2 status=0 QTime=1
   [junit4]   2> 195877 INFO  (TEST-AnalyticsQueryTest.testAnalyticsQuery-seed#[D9C35ABB0435C747]) [    ] o.a.s.SolrTestCaseJ4 ###Ending testAnalyticsQuery
   [junit4]   2> 195877 INFO  (SUITE-AnalyticsQueryTest-seed#[D9C35ABB0435C747]-worker) [    ] o.a.s.SolrTestCaseJ4 ###deleteCore
   [junit4]   2> 195879 INFO  (SUITE-AnalyticsQueryTest-seed#[D9C35ABB0435C747]-worker) [    ] o.a.s.c.CoreContainer Shutting down CoreContainer instance=400195420
   [junit4]   2> 195879 INFO  (SUITE-AnalyticsQueryTest-seed#[D9C35ABB0435C747]-worker) [    ] o.a.s.m.SolrMetricManager Closing metric reporters for registry=solr.node, tag=null
   [junit4]   2> 195879 INFO  (SUITE-AnalyticsQueryTest-seed#[D9C35ABB0435C747]-worker) [    ] o.a.s.m.r.SolrJmxReporter Closing reporter [org.apache.solr.metrics.reporters.SolrJmxReporter@5d670418: rootName = null, domain = solr.node, service url = null, agent id = null] for registry solr.node / com.codahale.metrics.MetricRegistry@1f5c5dcd
   [junit4]   2> 195881 INFO  (SUITE-AnalyticsQueryTest-seed#[D9C35ABB0435C747]-worker) [    ] o.a.s.m.SolrMetricManager Closing metric reporters for registry=solr.jvm, tag=null
   [junit4]   2> 195881 INFO  (SUITE-AnalyticsQueryTest-seed#[D9C35ABB0435C747]-worker) [    ] o.a.s.m.r.SolrJmxReporter Closing reporter [org.apache.solr.metrics.reporters.SolrJmxReporter@6a8e6697: rootName = null, domain = solr.jvm, service url = null, agent id = null] for registry solr.jvm / com.codahale.metrics.MetricRegistry@32fb749d
   [junit4]   2> 195887 INFO  (SUITE-AnalyticsQueryTest-seed#[D9C35ABB0435C747]-worker) [    ] o.a.s.m.SolrMetricManager Closing metric reporters for registry=solr.jetty, tag=null
   [junit4]   2> 195887 INFO  (SUITE-AnalyticsQueryTest-seed#[D9C35ABB0435C747]-worker) [    ] o.a.s.m.r.SolrJmxReporter Closing reporter [org.apache.solr.metrics.reporters.SolrJmxReporter@6789695d: rootName = null, domain = solr.jetty, service url = null, agent id = null] for registry solr.jetty / com.codahale.metrics.MetricRegistry@eaeb810
   [junit4]   2> 195890 INFO  (coreCloseExecutor-965-thread-1) [    x:collection1] o.a.s.c.SolrCore [collection1]  CLOSING SolrCore org.apache.solr.core.SolrCore@4e821dcd
   [junit4]   2> 195890 INFO  (coreCloseExecutor-965-thread-1) [    x:collection1] o.a.s.m.SolrMetricManager Closing metric reporters for registry=solr.core.collection1, tag=1317150157
   [junit4]   2> 195895 INFO  (coreCloseExecutor-965-thread-1) [    x:collection1] o.a.s.m.r.SolrJmxReporter Closing reporter [org.apache.solr.metrics.reporters.SolrJmxReporter@5e6b0961: rootName = null, domain = solr.core.collection1, service url = null, agent id = null] for registry solr.core.collection1 / com.codahale.metrics.MetricRegistry@17a0a59f
   [junit4]   2> 195910 INFO  (SUITE-AnalyticsQueryTest-seed#[D9C35ABB0435C747]-worker) [    ] o.a.s.SolrTestCaseJ4 ------------------------------------------------------- Done waiting for tracked resources to be released
   [junit4]   2> NOTE: test params are: codec=Asserting(Lucene70): {id=TestBloomFilteredLucenePostings(BloomFilteringPostingsFormat(Lucene50(blocksize=128)))}, docValues:{_version_=DocValuesFormat(name=Lucene70)}, maxPointsInLeafNode=1150, maxMBSortInHeap=5.369781070764265, sim=Asserting(org.apache.lucene.search.similarities.AssertingSimilarity@494a5116), locale=es-PR, timezone=America/Swift_Current
   [junit4]   2> NOTE: Windows 10 10.0 amd64/Oracle Corporation 1.8.0_144 (64-bit)/cpus=3,threads=1,free=195872536,total=283115520
   [junit4]   2> NOTE: All tests run in this JVM: [CloudExitableDirectoryReaderTest, DeleteShardTest, TestFieldSortValues, LeaderFailoverAfterPartitionTest, TestPayloadScoreQParserPlugin, TestReplicationHandler, RestartWhileUpdatingTest, QueryResultKeyTest, TestOverriddenPrefixQueryForCustomFieldType, TestSortableTextField, TestBinaryResponseWriter, DistributedQueryComponentOptimizationTest, NumericFieldsTest, ZkCLITest, MultiTermTest, SuggesterTSTTest, TestDownShardTolerantSearch, TestIndexSearcher, TestMaxTokenLenTokenizer, SolrGangliaReporterTest, AnalyticsQueryTest]
   [junit4]   2> NOTE: reproduce with: ant test  -Dtestcase=AnalyticsQueryTest -Dtests.seed=D9C35ABB0435C747 -Dtests.slow=true -Dtests.locale=es-PR -Dtests.timezone=America/Swift_Current -Dtests.asserts=true -Dtests.file.encoding=UTF-8
   [junit4] ERROR   0.00s J0 | AnalyticsQueryTest (suite) <<<
   [junit4]    > Throwable #1: java.io.IOException: Could not remove the following files (in the order of attempts):
   [junit4]    >    C:\Users\jenkins\workspace\Lucene-Solr-master-Windows\solr\build\solr-core\test\J0\temp\solr.search.AnalyticsQueryTest_D9C35ABB0435C747-001\init-core-data-001\tlog: java.nio.file.DirectoryNotEmptyException: C:\Users\jenkins\workspace\Lucene-Solr-master-Windows\solr\build\solr-core\test\J0\temp\solr.search.AnalyticsQueryTest_D9C35ABB0435C747-001\init-core-data-001\tlog
   [junit4]    >    C:\Users\jenkins\workspace\Lucene-Solr-master-Windows\solr\build\solr-core\test\J0\temp\solr.search.AnalyticsQueryTest_D9C35ABB0435C747-001\init-core-data-001: java.nio.file.DirectoryNotEmptyException: C:\Users\jenkins\workspace\Lucene-Solr-master-Windows\solr\build\solr-core\test\J0\temp\solr.search.AnalyticsQueryTest_D9C35ABB0435C747-001\init-core-data-001
   [junit4]    >    C:\Users\jenkins\workspace\Lucene-Solr-master-Windows\solr\build\solr-core\test\J0\temp\solr.search.AnalyticsQueryTest_D9C35ABB0435C747-001\init-core-data-001\tlog\tlog.0000000000000000001: java.nio.file.AccessDeniedException: C:\Users\jenkins\workspace\Lucene-Solr-master-Windows\solr\build\solr-core\test\J0\temp\solr.search.AnalyticsQueryTest_D9C35ABB0435C747-001\init-core-data-001\tlog\tlog.0000000000000000001
   [junit4]    >    C:\Users\jenkins\workspace\Lucene-Solr-master-Windows\solr\build\solr-core\test\J0\temp\solr.search.AnalyticsQueryTest_D9C35ABB0435C747-001: java.nio.file.DirectoryNotEmptyException: C:\Users\jenkins\workspace\Lucene-Solr-master-Windows\solr\build\solr-core\test\J0\temp\solr.search.AnalyticsQueryTest_D9C35ABB0435C747-001
   [junit4]    > 	at __randomizedtesting.SeedInfo.seed([D9C35ABB0435C747]:0)
   [junit4]    > 	at org.apache.lucene.util.IOUtils.rm(IOUtils.java:329)
   [junit4]    > 	at java.lang.Thread.run(Thread.java:748)
   [junit4] Completed [47/778 (1!)] on J0 in 0.70s, 1 test, 1 error <<< FAILURES!

[...truncated 632 lines...]
   [junit4] Suite: org.apache.solr.handler.JsonLoaderTest
   [junit4]   2> Creating dataDir: C:\Users\jenkins\workspace\Lucene-Solr-master-Windows\solr\build\solr-core\test\J1\temp\solr.handler.JsonLoaderTest_D9C35ABB0435C747-001\init-core-data-001
   [junit4]   2> 1012428 WARN  (SUITE-JsonLoaderTest-seed#[D9C35ABB0435C747]-worker) [    ] o.a.s.SolrTestCaseJ4 startTrackingSearchers: numOpens=15 numCloses=15
   [junit4]   2> 1012428 INFO  (SUITE-JsonLoaderTest-seed#[D9C35ABB0435C747]-worker) [    ] o.a.s.SolrTestCaseJ4 Using PointFields (NUMERIC_POINTS_SYSPROP=true) w/NUMERIC_DOCVALUES_SYSPROP=false
   [junit4]   2> 1012434 INFO  (SUITE-JsonLoaderTest-seed#[D9C35ABB0435C747]-worker) [    ] o.a.s.SolrTestCaseJ4 Randomized ssl (false) and clientAuth (false) via: @org.apache.solr.util.RandomizeSSL(reason=, value=NaN, ssl=NaN, clientAuth=NaN)
   [junit4]   2> 1012434 INFO  (SUITE-JsonLoaderTest-seed#[D9C35ABB0435C747]-worker) [    ] o.a.s.SolrTestCaseJ4 SecureRandom sanity checks: test.solr.allowed.securerandom=null & java.security.egd=file:/dev/./urandom
   [junit4]   2> 1012435 INFO  (SUITE-JsonLoaderTest-seed#[D9C35ABB0435C747]-worker) [    ] o.a.s.SolrTestCaseJ4 ####initCore
   [junit4]   2> 1012437 INFO  (SUITE-JsonLoaderTest-seed#[D9C35ABB0435C747]-worker) [    ] o.a.s.c.SolrResourceLoader [null] Added 2 libs to classloader, from paths: [/C:/Users/jenkins/workspace/Lucene-Solr-master-Windows/solr/core/src/test-files/solr/collection1/lib, /C:/Users/jenkins/workspace/Lucene-Solr-master-Windows/solr/core/src/test-files/solr/collection1/lib/classes]
   [junit4]   2> 1012481 INFO  (SUITE-JsonLoaderTest-seed#[D9C35ABB0435C747]-worker) [    ] o.a.s.c.SolrConfig Using Lucene MatchVersion: 8.0.0
   [junit4]   2> 1012495 INFO  (SUITE-JsonLoaderTest-seed#[D9C35ABB0435C747]-worker) [    ] o.a.s.s.IndexSchema [null] Schema name=test
   [junit4]   2> 1012562 INFO  (SUITE-JsonLoaderTest-seed#[D9C35ABB0435C747]-worker) [    ] o.a.s.s.IndexSchema Loaded schema test/1.0 with uniqueid field id
   [junit4]   2> 1012629 INFO  (SUITE-JsonLoaderTest-seed#[D9C35ABB0435C747]-worker) [    ] o.a.s.m.r.SolrJmxReporter JMX monitoring for 'solr.node' (registry 'solr.node') enabled at server: com.sun.jmx.mbeanserver.JmxMBeanServer@3a219215
   [junit4]   2> 1012635 INFO  (SUITE-JsonLoaderTest-seed#[D9C35ABB0435C747]-worker) [    ] o.a.s.m.r.SolrJmxReporter JMX monitoring for 'solr.jvm' (registry 'solr.jvm') enabled at server: com.sun.jmx.mbeanserver.JmxMBeanServer@3a219215
   [junit4]   2> 1012635 INFO  (SUITE-JsonLoaderTest-seed#[D9C35ABB0435C747]-worker) [    ] o.a.s.m.r.SolrJmxReporter JMX monitoring for 'solr.jetty' (registry 'solr.jetty') enabled at server: com.sun.jmx.mbeanserver.JmxMBeanServer@3a219215
   [junit4]   2> 1012636 INFO  (coreLoadExecutor-5034-thread-1) [    ] o.a.s.c.TransientSolrCoreCacheDefault Allocating transient cache for 2147483647 transient cores
   [junit4]   2> 1012637 INFO  (coreLoadExecutor-5034-thread-1) [    x:collection1] o.a.s.c.SolrResourceLoader [null] Added 2 libs to classloader, from paths: [/C:/Users/jenkins/workspace/Lucene-Solr-master-Windows/solr/core/src/test-files/solr/collection1/lib, /C:/Users/jenkins/workspace/Lucene-Solr-master-Windows/solr/core/src/test-files/solr/collection1/lib/classes]
   [junit4]   2> 1012681 INFO  (coreLoadExecutor-5034-thread-1) [    x:collection1] o.a.s.c.SolrConfig Using Lucene MatchVersion: 8.0.0
   [junit4]   2> 1012695 INFO  (coreLoadExecutor-5034-thread-1) [    x:collection1] o.a.s.s.IndexSchema [collection1] Schema name=test
   [junit4]   2> 1012762 INFO  (coreLoadExecutor-5034-thread-1) [    x:collection1] o.a.s.s.IndexSchema Loaded schema test/1.0 with uniqueid field id
   [junit4]   2> 1012770 INFO  (coreLoadExecutor-5034-thread-1) [    x:collection1] o.a.s.c.CoreContainer Creating SolrCore 'collection1' using configuration from instancedir C:\Users\jenkins\workspace\Lucene-Solr-master-Windows\solr\core\src\test-files\solr\collection1, trusted=true
   [junit4]   2> 1012770 INFO  (coreLoadExecutor-5034-thread-1) [    x:collection1] o.a.s.m.r.SolrJmxReporter JMX monitoring for 'solr.core.collection1' (registry 'solr.core.collection1') enabled at server: com.sun.jmx.mbeanserver.JmxMBeanServer@3a219215
   [junit4]   2> 1012770 INFO  (coreLoadExecutor-5034-thread-1) [    x:collection1] o.a.s.c.SolrCore solr.RecoveryStrategy.Builder
   [junit4]   2> 1012770 INFO  (coreLoadExecutor-5034-thread-1) [    x:collection1] o.a.s.c.SolrCore [[collection1] ] Opening new SolrCore at [C:\Users\jenkins\workspace\Lucene-Solr-master-Windows\solr\core\src\test-files\solr\collection1], dataDir=[C:\Users\jenkins\workspace\Lucene-Solr-master-Windows\solr\build\solr-core\test\J1\temp\solr.handler.JsonLoaderTest_D9C35ABB0435C747-001\init-core-data-001\]
   [junit4]   2> 1012771 INFO  (coreLoadExecutor-5034-thread-1) [    x:collection1] o.a.s.u.RandomMergePolicy RandomMergePolicy wrapping class org.apache.lucene.index.TieredMergePolicy: [TieredMergePolicy: maxMergeAtOnce=21, maxMergeAtOnceExplicit=11, maxMergedSegmentMB=59.0712890625, floorSegmentMB=1.724609375, forceMergeDeletesPctAllowed=6.101544705396779, segmentsPerTier=40.0, maxCFSSegmentSizeMB=8.796093022207999E12, noCFSRatio=1.0
   [junit4]   2> 1012841 INFO  (coreLoadExecutor-5034-thread-1) [    x:collection1] o.a.s.u.UpdateHandler Using UpdateLog implementation: org.apache.solr.update.UpdateLog
   [junit4]   2> 1012841 INFO  (coreLoadExecutor-5034-thread-1) [    x:collection1] o.a.s.u.UpdateLog Initializing UpdateLog: dataDir= defaultSyncLevel=FLUSH numRecordsToKeep=100 maxNumLogsToKeep=10 numVersionBuckets=65536
   [junit4]   2> 1012842 INFO  (coreLoadExecutor-5034-thread-1) [    x:collection1] o.a.s.u.CommitTracker Hard AutoCommit: disabled
   [junit4]   2> 1012842 INFO  (coreLoadExecutor-5034-thread-1) [    x:collection1] o.a.s.u.CommitTracker Soft AutoCommit: disabled
   [junit4]   2> 1012842 INFO  (coreLoadExecutor-5034-thread-1) [    x:collection1] o.a.s.u.RandomMergePolicy RandomMergePolicy wrapping class org.apache.lucene.index.LogDocMergePolicy: [LogDocMergePolicy: minMergeSize=1000, mergeFactor=34, maxMergeSize=9223372036854775807, maxMergeSizeForForcedMerge=9223372036854775807, calibrateSizeByDeletes=true, maxMergeDocs=2147483647, maxCFSSegmentSizeMB=8.796093022207999E12, noCFSRatio=0.0]
   [junit4]   2> 1012843 INFO  (coreLoadExecutor-5034-thread-1) [    x:collection1] o.a.s.s.SolrIndexSearcher Opening [Searcher@d9e101[collection1] main]
   [junit4]   2> 1012843 INFO  (coreLoadExecutor-5034-thread-1) [    x:collection1] o.a.s.h.c.SpellCheckComponent Initializing spell checkers
   [junit4]   2> 1012850 INFO  (coreLoadExecutor-5034-thread-1) [    x:collection1] o.a.s.s.DirectSolrSpellChecker init: {name=direct,classname=DirectSolrSpellChecker,field=lowerfilt,minQueryLength=3}
   [junit4]   2> 1012878 INFO  (coreLoadExecutor-5034-thread-1) [    x:collection1] o.a.s.h.ReplicationHandler Commits will be reserved for 10000ms.
   [junit4]   2> 1012878 INFO  (searcherExecutor-5035-thread-1-processing-x:collection1) [    x:collection1] o.a.s.h.c.SpellCheckComponent Loading spell index for spellchecker: default
   [junit4]   2> 1012878 INFO  (coreLoadExecutor-5034-thread-1) [    x:collection1] o.a.s.u.UpdateLog Could not find max version in index or recent updates, using new clock 1593594657251524608
   [junit4]   2> 1012879 INFO  (searcherExecutor-5035-thread-1-processing-x:collection1) [    x:collection1] o.a.s.h.c.SpellCheckComponent Loading spell index for spellchecker: direct
   [junit4]   2> 1012879 INFO  (searcherExecutor-5035-thread-1-processing-x:collection1) [    x:collection1] o.a.s.h.c.SpellCheckComponent Loading spell index for spellchecker: wordbreak
   [junit4]   2> 1012879 INFO  (searcherExecutor-5035-thread-1-processing-x:collection1) [    x:collection1] o.a.s.h.c.SpellCheckComponent Loading spell index for spellchecker: multipleFields
   [junit4]   2> 1012879 INFO  (searcherExecutor-5035-thread-1-processing-x:collection1) [    x:collection1] o.a.s.h.c.SpellCheckComponent Loading spell index for spellchecker: jarowinkler
   [junit4]   2> 1012880 INFO  (searcherExecutor-5035-thread-1-processing-x:collection1) [    x:collection1] o.a.s.h.c.SpellCheckComponent Loading spell index for spellchecker: external
   [junit4]   2> 1012880 INFO  (searcherExecutor-5035-thread-1-processing-x:collection1) [    x:collection1] o.a.s.h.c.SpellCheckComponent Loading spell index for spellchecker: freq
   [junit4]   2> 1012880 INFO  (searcherExecutor-5035-thread-1-processing-x:collection1) [    x:collection1] o.a.s.h.c.SpellCheckComponent Loading spell index for spellchecker: fqcn
   [junit4]   2> 1012880 INFO  (searcherExecutor-5035-thread-1-processing-x:collection1) [    x:collection1] o.a.s.h.c.SpellCheckComponent Loading spell index for spellchecker: perDict
   [junit4]   2> 1012881 INFO  (SUITE-JsonLoaderTest-seed#[D9C35ABB0435C747]-worker) [    ] o.a.s.SolrTestCaseJ4 ####initCore end
   [junit4]   2> 1012881 INFO  (searcherExecutor-5035-thread-1-processing-x:collection1) [    x:collection1] o.a.s.c.SolrCore [collection1] Registered new searcher Searcher@d9e101[collection1] main{ExitableDirectoryReader(UninvertingDirectoryReader())}
   [junit4]   2> 1012882 INFO  (TEST-JsonLoaderTest.testParsing-seed#[D9C35ABB0435C747]) [    ] o.a.s.SolrTestCaseJ4 ###Starting testParsing
   [junit4]   2> 1012883 WARN  (TEST-JsonLoaderTest.testParsing-seed#[D9C35ABB0435C747]) [    ] o.a.s.h.l.JsonLoader Ignoring field boost: 2.3 as index-time boosts are not supported anymore
   [junit4]   2> 1012883 INFO  (TEST-JsonLoaderTest.testParsing-seed#[D9C35ABB0435C747]) [    ] o.a.s.SolrTestCaseJ4 ###Ending testParsing
   [junit4]   2> 1012885 INFO  (TEST-JsonLoaderTest.testFewParentsJsonDoc-seed#[D9C35ABB0435C747]) [    ] o.a.s.SolrTestCaseJ4 ###Starting testFewParentsJsonDoc
   [junit4]   2> 1012898 INFO  (TEST-JsonLoaderTest.testFewParentsJsonDoc-seed#[D9C35ABB0435C747]) [    ] o.a.s.SolrTestCaseJ4 ###Ending testFewParentsJsonDoc
   [junit4]   2> 1012900 INFO  (TEST-JsonLoaderTest.testExtendedFieldValues-seed#[D9C35ABB0435C747]) [    ] o.a.s.SolrTestCaseJ4 ###Starting testExtendedFieldValues
   [junit4]   2> 1012900 INFO  (TEST-JsonLoaderTest.testExtendedFieldValues-seed#[D9C35ABB0435C747]) [    ] o.a.s.SolrTestCaseJ4 ###Ending testExtendedFieldValues
   [junit4]   2> 1012903 INFO  (TEST-JsonLoaderTest.testAddBigDecimalValueToTrieField-seed#[D9C35ABB0435C747]) [    ] o.a.s.SolrTestCaseJ4 ###Starting testAddBigDecimalValueToTrieField
   [junit4]   2> 1012905 INFO  (TEST-JsonLoaderTest.testAddBigDecimalValueToTrieField-seed#[D9C35ABB0435C747]) [    ] o.a.s.u.DirectUpdateHandler2 start commit{_version_=1593594657279836160,optimize=false,openSearcher=true,waitSearcher=true,expungeDeletes=false,softCommit=false,prepareCommit=false}
   [junit4]   2> 1012905 INFO  (TEST-JsonLoaderTest.testAddBigDecimalValueToTrieField-seed#[D9C35ABB0435C747]) [    ] o.a.s.u.SolrIndexWriter Calling setCommitData with IW:org.apache.solr.update.SolrIndexWriter@1c1fa127 commitCommandVersion:1593594657279836160
   [junit4]   2> 1012907 INFO  (TEST-JsonLoaderTest.testAddBigDecimalValueToTrieField-seed#[D9C35ABB0435C747]) [    ] o.a.s.s.SolrIndexSearcher Opening [Searcher@daa61b8[collection1] main]
   [junit4]   2> 1012908 INFO  (TEST-JsonLoaderTest.testAddBigDecimalValueToTrieField-seed#[D9C35ABB0435C747]) [    ] o.a.s.u.DirectUpdateHandler2 end_commit_flush
   [junit4]   2> 1012909 INFO  (searcherExecutor-5035-thread-1) [    ] o.a.s.c.SolrCore [collection1] Registered new searcher Searcher@daa61b8[collection1] main{ExitableDirectoryReader(UninvertingDirectoryReader(Uninverting(_0(8.0.0):c1)))}
   [junit4]   2> 1012909 INFO  (TEST-JsonLoaderTest.testAddBigDecimalValueToTrieField-seed#[D9C35ABB0435C747]) [    ] o.a.s.u.p.LogUpdateProcessorFactory [collection1]  webapp=null path=null params={commit=true&wt=json&indent=true}{add=[1 (1593594657277739008)],commit=} 0 5
   [junit4]   2> 1012909 INFO  (TEST-JsonLoaderTest.testAddBigDecimalValueToTrieField-seed#[D9C35ABB0435C747]) [    ] o.a.s.c.S.Request [collection1]  webapp=null path=null params={q=id:1&fl=big_decimal_td&wt=xml} hits=1 status=0 QTime=0
   [junit4]   2> 1012911 INFO  (TEST-JsonLoaderTest.testAddBigDecimalValueToTrieField-seed#[D9C35ABB0435C747]) [    ] o.a.s.u.DirectUpdateHandler2 start commit{_version_=1593594657286127616,optimize=false,openSearcher=true,waitSearcher=true,expungeDeletes=false,softCommit=false,prepareCommit=false}
   [junit4]   2> 1012911 INFO  (TEST-JsonLoaderTest.testAddBigDecimalValueToTrieField-seed#[D9C35ABB0435C747]) [    ] o.a.s.u.SolrIndexWriter Calling setCommitData with IW:org.apache.solr.update.SolrIndexWriter@1c1fa127 commitCommandVersion:1593594657286127616
   [junit4]   2> 1012912 INFO  (TEST-JsonLoaderTest.testAddBigDecimalValueToTrieField-seed#[D9C35ABB0435C747]) [    ] o.a.s.s.SolrIndexSearcher Opening [Searcher@62f0bf9e[collection1] main]
   [junit4]   2> 1012913 INFO  (TEST-JsonLoaderTest.testAddBigDecimalValueToTrieField-seed#[D9C35ABB0435C747]) [    ] o.a.s.u.DirectUpdateHandler2 end_commit_flush
   [junit4]   2> 1012914 INFO  (searcherExecutor-5035-thread-1) [    ] o.a.s.c.SolrCore [collection1] Registered new searcher Searcher@62f0bf9e[collection1] main{ExitableDirectoryReader(UninvertingDirectoryReader(Uninverting(_0(8.0.0):c1) Uninverting(_1(8.0.0):c1)))}
   [junit4]   2> 1012914 INFO  (TEST-JsonLoaderTest.testAddBigDecimalValueToTrieField-seed#[D9C35ABB0435C747]) [    ] o.a.s.u.p.LogUpdateProcessorFactory [collection1]  webapp=null path=null params={commit=true&wt=json&indent=true}{add=[2 (1593594657284030464)],commit=} 0 5
   [junit4]   2> 1012915 INFO  (TEST-JsonLoaderTest.testAddBigDecimalValueToTrieField-seed#[D9C35ABB0435C747]) [    ] o.a.s.c.S.Request [collection1]  webapp=null path=null params={q=id:2&fl=big_decimal_tf&wt=xml} hits=1 status=0 QTime=0
   [junit4]   2> 1012915 INFO  (TEST-JsonLoaderTest.testAddBigDecimalValueToTrieField-seed#[D9C35ABB0435C747]) [    ] o.a.s.SolrTestCaseJ4 ###Ending testAddBigDecimalValueToTrieField
   [junit4]   2> 1012918 INFO  (TEST-JsonLoaderTest.testInvalidJsonProducesBadRequestSolrException-seed#[D9C35ABB0435C747]) [    ] o.a.s.SolrTestCaseJ4 ###Starting testInvalidJsonProducesBadRequestSolrException
   [junit4]   2> 1012918 INFO  (TEST-JsonLoaderTest.testInvalidJsonProducesBadRequestSolrException-seed#[D9C35ABB0435C747]) [    ] o.a.s.SolrTestCaseJ4 ###Ending testInvalidJsonProducesBadRequestSolrException
   [junit4]   2> 1012921 INFO  (TEST-JsonLoaderTest.testDupKeysChildDocs-seed#[D9C35ABB0435C747]) [    ] o.a.s.SolrTestCaseJ4 ###Starting testDupKeysChildDocs
   [junit4]   2> 1012921 INFO  (TEST-JsonLoaderTest.testDupKeysChildDocs-seed#[D9C35ABB0435C747]) [    ] o.a.s.SolrTestCaseJ4 ###Ending testDupKeysChildDocs
   [junit4]   2> 1012923 INFO  (TEST-JsonLoaderTest.testSimpleFormat-seed#[D9C35ABB0435C747]) [    ] o.a.s.SolrTestCaseJ4 ###Starting testSimpleFormat
   [junit4]   2> 1012923 INFO  (TEST-JsonLoaderTest.testSimpleFormat-seed#[D9C35ABB0435C747]) [    ] o.a.s.SolrTestCaseJ4 ###Ending testSimpleFormat
   [junit4]   2> 1012925 INFO  (TEST-JsonLoaderTest.testFieldValueOrdering-seed#[D9C35ABB0435C747]) [    ] o.a.s.SolrTestCaseJ4 ###Starting testFieldValueOrdering
   [junit4]   2> 1012925 INFO  (TEST-JsonLoaderTest.testFieldValueOrdering-seed#[D9C35ABB0435C747]) [    ] o.a.s.SolrTestCaseJ4 ###Ending testFieldValueOrdering
   [junit4]   2> 1012927 INFO  (TEST-JsonLoaderTest.testDecimalValuesInAdd-seed#[D9C35ABB0435C747]) [    ] o.a.s.SolrTestCaseJ4 ###Starting testDecimalValuesInAdd
   [junit4]   2> 1012927 INFO  (TEST-JsonLoaderTest.testDecimalValuesInAdd-seed#[D9C35ABB0435C747]) [    ] o.a.s.SolrTestCaseJ4 ###Ending testDecimalValuesInAdd
   [junit4]   2> 1012929 INFO  (TEST-JsonLoaderTest.testSimpleFormatInAdd-seed#[D9C35ABB0435C747]) [    ] o.a.s.SolrTestCaseJ4 ###Starting testSimpleFormatInAdd
   [junit4]   2> 1012930 INFO  (TEST-JsonLoaderTest.testSimpleFormatInAdd-seed#[D9C35ABB0435C747]) [    ] o.a.s.SolrTestCaseJ4 ###Ending testSimpleFormatInAdd
   [junit4]   2> 1012932 INFO  (TEST-JsonLoaderTest.testIntegerValuesInAdd-seed#[D9C35ABB0435C747]) [    ] o.a.s.SolrTestCaseJ4 ###Starting testIntegerValuesInAdd
   [junit4]   2> 1012932 INFO  (TEST-JsonLoaderTest.testIntegerValuesInAdd-seed#[D9C35ABB0435C747]) [    ] o.a.s.SolrTestCaseJ4 ###Ending testIntegerValuesInAdd
   [junit4]   2> 1012934 INFO  (TEST-JsonLoaderTest.testBigIntegerValuesInAdd-seed#[D9C35ABB0435C747]) [    ] o.a.s.SolrTestCaseJ4 ###Starting testBigIntegerValuesInAdd
   [junit4]   2> 1012934 INFO  (TEST-JsonLoaderTest.testBigIntegerValuesInAdd-seed#[D9C35ABB0435C747]) [    ] o.a.s.SolrTestCaseJ4 ###Ending testBigIntegerValuesInAdd
   [junit4]   2> 1012935 INFO  (TEST-JsonLoaderTest.testSimpleChildDocs-seed#[D9C35ABB0435C747]) [    ] o.a.s.SolrTestCaseJ4 ###Starting testSimpleChildDocs
   [junit4]   2> 1012935 INFO  (TEST-JsonLoaderTest.testSimpleChildDocs-seed#[D9C35ABB0435C747]) [    ] o.a.s.SolrTestCaseJ4 ###Ending testSimpleChildDocs
   [junit4]   2> 1012937 INFO  (TEST-JsonLoaderTest.testGrandChildDocs-seed#[D9C35ABB0435C747]) [    ] o.a.s.SolrTestCaseJ4 ###Starting testGrandChildDocs
   [junit4]   2> 1012937 INFO  (TEST-JsonLoaderTest.testGrandChildDocs-seed#[D9C35ABB0435C747]) [    ] o.a.s.SolrTestCaseJ4 ###Ending testGrandChildDocs
   [junit4]   2> 1012938 INFO  (TEST-JsonLoaderTest.testBigDecimalValuesInAdd-seed#[D9C35ABB0435C747]) [    ] o.a.s.SolrTestCaseJ4 ###Starting testBigDecimalValuesInAdd
   [junit4]   2> 1012940 INFO  (TEST-JsonLoaderTest.testBigDecimalValuesInAdd-seed#[D9C35ABB0435C747]) [    ] o.a.s.SolrTestCaseJ4 ###Ending testBigDecimalValuesInAdd
   [junit4]   2> 1012942 INFO  (TEST-JsonLoaderTest.testNullValues-seed#[D9C35ABB0435C747]) [    ] o.a.s.SolrTestCaseJ4 ###Starting testNullValues
   [junit4]   2> 1012944 INFO  (TEST-JsonLoaderTest.testNullValues-seed#[D9C35ABB0435C747]) [    ] o.a.s.u.DirectUpdateHandler2 start commit{_version_=1593594657320730624,optimize=false,openSearcher=true,waitSearcher=true,expungeDeletes=false,softCommit=false,prepareCommit=false}
   [junit4]   2> 1012944 INFO  (TEST-JsonLoaderTest.testNullValues-seed#[D9C35ABB0435C747]) [    ] o.a.s.u.SolrIndexWriter Calling setCommitData with IW:org.apache.solr.update.SolrIndexWriter@1c1fa127 commitCommandVersion:1593594657320730624
   [junit4]   2> 1012945 INFO  (TEST-JsonLoaderTest.testNullValues-seed#[D9C35ABB0435C747]) [    ] o.a.s.s.SolrIndexSearcher Opening [Searcher@300f7693[collection1] main]
   [junit4]   2> 1012946 INFO  (TEST-JsonLoaderTest.testNullValues-seed#[D9C35ABB0435C747]) [    ] o.a.s.u.DirectUpdateHandler2 end_commit_flush
   [junit4]   2> 1012947 INFO  (searcherExecutor-5035-thread-1) [    ] o.a.s.c.SolrCore [collection1] Registered new searcher Searcher@300f7693[collection1] main{ExitableDirectoryReader(UninvertingDirectoryReader(Uninverting(_0(8.0.0):c1) Uninverting(_1(8.0.0):c1) Uninverting(_2(8.0.0):c1)))}
   [junit4]   2> 1012947 INFO  (TEST-JsonLoaderTest.testNullValues-seed#[D9C35ABB0435C747]) [    ] o.a.s.u.p.LogUpdateProcessorFactory [collection1]  webapp=null path=null params={commit=true&wt=json&indent=true}{add=[10 (1593594657318633472)],commit=} 0 5
   [junit4]   2> 1012947 INFO  (TEST-JsonLoaderTest.testNullValues-seed#[D9C35ABB0435C747]) [    ] o.a.s.c.S.Request [collection1]  webapp=null path=null params={q=id:10&fl=foo_s,foo2_s&wt=xml} hits=1 status=0 QTime=0
   [junit4]   2> 1012947 INFO  (TEST-JsonLoaderTest.testNullValues-seed#[D9C35ABB0435C747]) [    ] o.a.s.SolrTestCaseJ4 ###Ending testNullValues
   [junit4]   2> 1012951 INFO  (TEST-JsonLoaderTest.testAddNonStringValues-seed#[D9C35ABB0435C747]) [    ] o.a.s.SolrTestCaseJ4 ###Starting testAddNonStringValues
   [junit4]   2> 1012953 INFO  (TEST-JsonLoaderTest.testAddNonStringValues-seed#[D9C35ABB0435C747]) [    ] o.a.s.u.DirectUpdateHandler2 start commit{_version_=1593594657330167808,optimize=false,openSearcher=true,waitSearcher=true,expungeDeletes=false,softCommit=false,prepareCommit=false}
   [junit4]   2> 1012953 INFO  (TEST-JsonLoaderTest.testAddNonStringValues-seed#[D9C35ABB0435C747]) [    ] o.a.s.u.SolrIndexWriter Calling setCommitData with IW:org.apache.solr.update.SolrIndexWriter@1c1fa127 commitCommandVersion:1593594657330167808
   [junit4]   2> 1012955 INFO  (TEST-JsonLoaderTest.testAddNonStringValues-seed#[D9C35ABB0435C747]) [    ] o.a.s.s.SolrIndexSearcher Opening [Searcher@38749862[collection1] main]
   [junit4]   2> 1012955 INFO  (TEST-JsonLoaderTest.testAddNonStringValues-seed#[D9C35ABB0435C747]) [    ] o.a.s.u.DirectUpdateHandler2 end_commit_flush
   [junit4]   2> 1012956 INFO  (searcherExecutor-5035-thread-1) [    ] o.a.s.c.SolrCore [collection1] Registered new searcher Searcher@38749862[collection1] main{ExitableDirectoryReader(UninvertingDirectoryReader(Uninverting(_1(8.0.0):c1) Uninverting(_2(8.0.0):c1) Uninverting(_3(8.0.0):c1)))}
   [junit4]   2> 1012956 INFO  (TEST-JsonLoaderTest.testAddNonStringValues-seed#[D9C35ABB0435C747]) [    ] o.a.s.u.p.LogUpdateProcessorFactory [collection1]  webapp=null path=null params={commit=true&wt=json&indent=true}{add=[1 (1593594657328070656)],commit=} 0 5
   [junit4]   2> 1012956 INFO  (TEST-JsonLoaderTest.testAddNonStringValues-seed#[D9C35ABB0435C747]) [    ] o.a.s.c.S.Request [collection1]  webapp=null path=null params={q=id:1&fl=boolean_b,long_l,double_d,big_integer_s,big_decimal_s&wt=xml} hits=1 status=0 QTime=0
   [junit4]   2> 1012956 INFO  (TEST-JsonLoaderTest.testAddNonStringValues-seed#[D9C35ABB0435C747]) [    ] o.a.s.SolrTestCaseJ4 ###Ending testAddNonStringValues
   [junit4]   2> 1012960 INFO  (TEST-JsonLoaderTest.testEmptyChildDocs-seed#[D9C35ABB0435C747]) [    ] o.a.s.SolrTestCaseJ4 ###Starting testEmptyChildDocs
   [junit4]   2> 1012960 INFO  (TEST-JsonLoaderTest.testEmptyChildDocs-seed#[D9C35ABB0435C747]) [    ] o.a.s.SolrTestCaseJ4 ###Ending testEmptyChildDocs
   [junit4]   2> 1012962 INFO  (TEST-JsonLoaderTest.testBooleanValuesInAdd-seed#[D9C35ABB0435C747]) [    ] o.a.s.SolrTestCaseJ4 ###Starting testBooleanValuesInAdd
   [junit4]   2> 1012962 INFO  (TEST-JsonLoaderTest.testBooleanValuesInAdd-seed#[D9C35ABB0435C747]) [    ] o.a.s.SolrTestCaseJ4 ###Ending testBooleanValuesInAdd
   [junit4]   2> 1012964 INFO  (TEST-JsonLoaderTest.testAddBigIntegerValueToTrieField-seed#[D9C35ABB0435C747]) [    ] o.a.s.SolrTestCaseJ4 ###Starting testAddBigIntegerValueToTrieField
   [junit4]   2> 1012964 INFO  (TEST-JsonLoaderTest.testAddBigIntegerValueToTrieField-seed#[D9C35ABB0435C747]) [    ] o.a.s.u.p.LogUpdateProcessorFactory [collection1]  webapp=null path=null params={wt=json&indent=true}{} 0 0
   [junit4]   2> 1012965 INFO  (TEST-JsonLoaderTest.testAddBigIntegerValueToTrieField-seed#[D9C35ABB0435C747]) [    ] o.a.s.h.RequestHandlerBase Ignoring exception matching big_integer_t
   [junit4]   2> 1012965 INFO  (TEST-JsonLoaderTest.testAddBigIntegerValueToTrieField-seed#[D9C35ABB0435C747]) [    ] o.a.s.u.p.LogUpdateProcessorFactory [collection1]  webapp=null path=null params={wt=json&indent=true}{} 0 0
   [junit4]   2> 1012965 INFO  (TEST-JsonLoaderTest.testAddBigIntegerValueToTrieField-seed#[D9C35ABB0435C747]) [    ] o.a.s.h.RequestHandlerBase Ignoring exception matching big_integer_t
   [junit4]   2> 1012965 INFO  (TEST-JsonLoaderTest.testAddBigIntegerValueToTrieField-seed#[D9C35ABB0435C747]) [    ] o.a.s.SolrTestCaseJ4 ###Ending testAddBigIntegerValueToTrieField
   [junit4]   2> 1012967 INFO  (TEST-JsonLoaderTest.testJsonDocFormat-seed#[D9C35ABB0435C747]) [    ] o.a.s.SolrTestCaseJ4 ###Starting testJsonDocFormat
   [junit4]   2> 1012968 INFO  (TEST-JsonLoaderTest.testJsonDocFormat-seed#[D9C35ABB0435C747]) [    ] o.a.s.SolrTestCaseJ4 ###Ending testJsonDocFormat
   [junit4]   2> 1012971 INFO  (TEST-JsonLoaderTest.testDeleteSyntax-seed#[D9C35ABB0435C747]) [    ] o.a.s.SolrTestCaseJ4 ###Starting testDeleteSyntax
   [junit4]   2> 1012971 INFO  (TEST-JsonLoaderTest.testDeleteSyntax-seed#[D9C35ABB0435C747]) [    ] o.a.s.SolrTestCaseJ4 ###Ending testDeleteSyntax
   [junit4]   2> 1012971 INFO  (SUITE-JsonLoaderTest-seed#[D9C35ABB0435C747]-worker) [    ] o.a.s.SolrTestCaseJ4 ###deleteCore
   [junit4]   2> 1012971 INFO  (SUITE-JsonLoaderTest-seed#[D9C35ABB0435C747]-worker) [    ] o.a.s.c.CoreContainer Shutting down CoreContainer instance=1300668288
   [junit4]   2> 1012972 INFO  (SUITE-JsonLoaderTest-seed#[D9C35ABB0435C747]-worker) [    ] o.a.s.m.SolrMetricManager Closing metric reporters for registry=solr.node, tag=null
   [junit4]   2> 1012972 INFO  (SUITE-JsonLoaderTest-seed#[D9C35ABB0435C747]-worker) [    ] o.a.s.m.r.SolrJmxReporter Closing reporter [org.apache.solr.metrics.reporters.SolrJmxReporter@c22784f: rootName = null, domain = solr.node, service url = null, agent id = null] for registry solr.node / com.codahale.metrics.MetricRegistry@6b5f9403
   [junit4]   2> 1012974 INFO  (SUITE-JsonLoaderTest-seed#[D9C35ABB0435C747]-worker) [    ] o.a.s.m.SolrMetricManager Closing metric reporters for registry=solr.jvm, tag=null
   [junit4]   2> 1012974 INFO  (SUITE-JsonLoaderTest-seed#[D9C35ABB0435C747]-worker) [    ] o.a.s.m.r.SolrJmxReporter Closing reporter [org.apache.solr.metrics.reporters.SolrJmxReporter@7d6138c8: rootName = null, domain = solr.jvm, service url = null, agent id = null] for registry solr.jvm / com.codahale.metrics.MetricRegistry@6b10d384
   [junit4]   2> 1012975 INFO  (SUITE-JsonLoaderTest-seed#[D9C35ABB0435C747]-worker) [    ] o.a.s.m.SolrMetricManager Closing metric reporters for registry=solr.jetty, tag=null
   [junit4]   2> 1012975 INFO  (SUITE-JsonLoaderTest-seed#[D9C35ABB0435C747]-worker) [    ] o.a.s.m.r.SolrJmxReporter Closing reporter [org.apache.solr.metrics.reporters.SolrJmxReporter@453bc0f2: rootName = null, domain = solr.jetty, service url = null, agent id = null] for registry solr.jetty / com.codahale.metrics.MetricRegistry@655a2911
   [junit4]   2> 1012975 INFO  (coreCloseExecutor-5040-thread-1) [    x:collection1] o.a.s.c.SolrCore [collection1]  CLOSING SolrCore org.apache.solr.core.SolrCore@719a0b0e
   [junit4]   2> 1012975 INFO  (coreCloseExecutor-5040-thread-1) [    x:collection1] o.a.s.m.SolrMetricManager Closing metric reporters for registry=solr.core.collection1, tag=1905920782
   [junit4]   2> 1012975 INFO  (coreCloseExecutor-5040-thread-1) [    x:collection1] o.a.s.m.r.SolrJmxReporter Closing reporter [org.apache.solr.metrics.reporters.SolrJmxReporter@7848fd12: rootName = null, domain = solr.core.collection1, service url = null, agent id = null] for registry solr.core.collection1 / com.codahale.metrics.MetricRegistry@610f62c1
   [junit4]   2> 1012992 INFO  (SUITE-JsonLoaderTest-seed#[D9C35ABB0435C747]-worker) [    ] o.a.s.SolrTestCaseJ4 ------------------------------------------------------- Done waiting for tracked resources to be released
   [junit4]   2> NOTE: test params are: codec=Asserting(Lucene70): {multiDefault=PostingsFormat(name=LuceneVarGapDocFreqInterval), big_integer_s=PostingsFormat(name=LuceneFixedGap), big_decimal_s=PostingsFormat(name=MockRandom), boolean_b=PostingsFormat(name=LuceneFixedGap), id=PostingsFormat(name=LuceneFixedGap), foo2_s=PostingsFormat(name=LuceneVarGapDocFreqInterval)}, docValues:{range_facet_l_dv=DocValuesFormat(name=Memory), _version_=DocValuesFormat(name=Lucene70), range_facet_i_dv=DocValuesFormat(name=Lucene70), intDvoDefault=DocValuesFormat(name=Asserting), timestamp=DocValuesFormat(name=Lucene70)}, maxPointsInLeafNode=1379, maxMBSortInHeap=7.978228019724216, sim=Asserting(org.apache.lucene.search.similarities.AssertingSimilarity@285b15a8), locale=en-GB, timezone=America/Sao_Paulo
   [junit4]   2> NOTE: Windows 10 10.0 amd64/Oracle Corporation 1.8.0_144 (64-bit)/cpus=3,threads=1,free=262751240,total=530055168
   [junit4]   2> NOTE: All tests run in this JVM: [ChaosMonkeyNothingIsSafeTest, CollectionStateFormat2Test, TestHashQParserPlugin, DocValuesNotIndexedTest, TestSearchPerf, TestCSVLoader, OverseerTaskQueueTest, ConfigureRecoveryStrategyTest, TestRecoveryHdfs, QueryParsingTest, TestCustomDocTransformer, DistributedDebugComponentTest, NotRequiredUniqueKeyTest, TestStressCloudBlindAtomicUpdates, IndexSchemaTest, BlockDirectoryTest, TestCloudJSONFacetJoinDomain, TestNoOpRegenerator, TestFastWriter, TestLegacyField, SolrGraphiteReporterTest, ReturnFieldsTest, TestHighFrequencyDictionaryFactory, HealthCheckHandlerTest, TestConfig, TestTrackingShardHandlerFactory, TestSolrCloudWithKerberosAlt, DirectUpdateHandlerTest, CleanupOldIndexTest, TestSchemalessBufferedUpdates, TestReversedWildcardFilterFactory, BlockJoinFacetDistribTest, BitVectorTest, NodeAddedTriggerTest, DistributedSpellCheckComponentTest, TestComplexPhraseLeadingWildcard, TestStressVersions, TestHdfsCloudBackupRestore, FileBasedSpellCheckerTest, TestSolrConfigHandlerCloud, CSVRequestHandlerTest, MissingSegmentRecoveryTest, DisMaxRequestHandlerTest, IgnoreCommitOptimizeUpdateProcessorFactoryTest, RegexBoostProcessorTest, HdfsRecoverLeaseTest, DefaultValueUpdateProcessorTest, DateRangeFieldTest, ActionThrottleTest, TestCloudDeleteByQuery, TestLuceneIndexBackCompat, PrimitiveFieldTypeTest, FullSolrCloudDistribCmdsTest, DistributedFacetExistsSmallTest, PreAnalyzedFieldManagedSchemaCloudTest, CircularListTest, TestClusterStateProvider, TestDefaultStatsCache, UpdateLogTest, ConjunctionSolrSpellCheckerTest, TestDistributedStatsComponentCardinality, DistanceFunctionTest, TestRandomDVFaceting, SortByFunctionTest, LegacyCloudClusterPropTest, TestSolrDeletionPolicy2, TestDistributedGrouping, TestCodecSupport, UpdateParamsTest, CoreAdminHandlerTest, TestPolicyCloud, TestShardHandlerFactory, SimpleMLTQParserTest, ClusterStateTest, TestDelegationWithHadoopAuth, TestDeleteCollectionOnDownNodes, TestCollectionAPIs, TestExactSharedStatsCache, TestAuthorizationFramework, SaslZkACLProviderTest, CoreAdminCreateDiscoverTest, RollingRestartTest, AutoAddReplicasIntegrationTest, TestSSLRandomization, TestInfoStreamLogging, TestLMJelinekMercerSimilarityFactory, TermVectorComponentTest, OverseerCollectionConfigSetProcessorTest, AutoScalingHandlerTest, TestDFISimilarityFactory, TestAnalyzedSuggestions, WrapperMergePolicyFactoryTest, TestSolrCloudWithHadoopAuthPlugin, MinimalSchemaTest, HdfsChaosMonkeySafeLeaderTest, TemplateUpdateProcessorTest, TestPHPSerializedResponseWriter, TestSearcherReuse, TestLeaderElectionZkExpiry, BadCopyFieldTest, TestCoreAdminApis, MetricsHandlerTest, TestCoreDiscovery, TestTrieFacet, TestLRUStatsCache, DataDrivenBlockJoinTest, AliasIntegrationTest, DebugComponentTest, SuggesterWFSTTest, PeerSyncTest, UUIDFieldTest, TestRawResponseWriter, TestUseDocValuesAsStored, TestFieldResource, DistributedTermsComponentTest, HdfsUnloadDistributedZkTest, MetricsConfigTest, AsyncCallRequestStatusResponseTest, TestDynamicFieldResource, SyncSliceTest, TimeZoneUtilsTest, TestRebalanceLeaders, TestRuleBasedAuthorizationPlugin, TestSolrConfigHandler, RegexBytesRefFilterTest, ExternalFileFieldSortTest, TestSQLHandler, SearchHandlerTest, SpellCheckComponentTest, TestNRTOpen, JsonLoaderTest]
   [junit4]   2> NOTE: reproduce with: ant test  -Dtestcase=JsonLoaderTest -Dtests.seed=D9C35ABB0435C747 -Dtests.slow=true -Dtests.locale=en-GB -Dtests.timezone=America/Sao_Paulo -Dtests.asserts=true -Dtests.file.encoding=UTF-8
   [junit4] ERROR   0.00s J1 | JsonLoaderTest (suite) <<<
   [junit4]    > Throwable #1: java.io.IOException: Could not remove the following files (in the order of attempts):
   [junit4]    >    C:\Users\jenkins\workspace\Lucene-Solr-master-Windows\solr\build\solr-core\test\J1\temp\solr.handler.JsonLoaderTest_D9C35ABB0435C747-001\init-core-data-001\tlog: java.nio.file.DirectoryNotEmptyException: C:\Users\jenkins\workspace\Lucene-Solr-master-Windows\solr\build\solr-core\test\J1\temp\solr.handler.JsonLoaderTest_D9C35ABB0435C747-001\init-core-data-001\tlog
   [junit4]    >    C:\Users\jenkins\workspace\Lucene-Solr-master-Windows\solr\build\solr-core\test\J1\temp\solr.handler.JsonLoaderTest_D9C35ABB0435C747-001\init-core-data-001: java.nio.file.DirectoryNotEmptyException: C:\Users\jenkins\workspace\Lucene-Solr-master-Windows\solr\build\solr-core\test\J1\temp\solr.handler.JsonLoaderTest_D9C35ABB0435C747-001\init-core-data-001
   [junit4]    > 	at __randomizedtesting.SeedInfo.seed([D9C35ABB0435C747]:0)
   [junit4]    > 	at org.apache.lucene.util.IOUtils.rm(IOUtils.java:329)
   [junit4]    > 	at java.lang.Thread.run(Thread.java:748)
   [junit4] Completed [225/778 (2!)] on J1 in 0.59s, 22 tests, 1 error <<< FAILURES!

[...truncated 4279 lines...]
   [junit4] Suite: org.apache.solr.update.processor.TestOpenNLPExtractNamedEntitiesUpdateProcessorFactory
   [junit4]   2> Creating dataDir: C:\Users\jenkins\workspace\Lucene-Solr-master-Windows\solr\build\contrib\solr-analysis-extras\test\J1\temp\solr.update.processor.TestOpenNLPExtractNamedEntitiesUpdateProcessorFactory_10BAE5C2625B3390-001\init-core-data-001
   [junit4]   2> log4j:WARN No appenders could be found for logger (org.apache.solr.SolrTestCaseJ4).
   [junit4]   2> log4j:WARN Please initialize the log4j system properly.
   [junit4]   2> log4j:WARN See http://logging.apache.org/log4j/1.2/faq.html#noconfig for more info.
   [junit4]   2> NOTE: test params are: codec=CheapBastard, sim=Asserting(org.apache.lucene.search.similarities.AssertingSimilarity@495ab5cb), locale=ro, timezone=Africa/Mogadishu
   [junit4]   2> NOTE: Windows 10 10.0 amd64/Oracle Corporation 1.8.0_144 (64-bit)/cpus=3,threads=1,free=60695056,total=77594624
   [junit4]   2> NOTE: All tests run in this JVM: [TestOpenNLPExtractNamedEntitiesUpdateProcessorFactory]
   [junit4]   2> NOTE: reproduce with: ant test  -Dtestcase=TestOpenNLPExtractNamedEntitiesUpdateProcessorFactory -Dtests.seed=10BAE5C2625B3390 -Dtests.slow=true -Dtests.locale=ro -Dtests.timezone=Africa/Mogadishu -Dtests.asserts=true -Dtests.file.encoding=Cp1252
   [junit4] ERROR   0.00s J1 | TestOpenNLPExtractNamedEntitiesUpdateProcessorFactory (suite) <<<
   [junit4]    > Throwable #1: java.io.IOException: Could not remove the following files (in the order of attempts):
   [junit4]    >    C:\Users\jenkins\workspace\Lucene-Solr-master-Windows\solr\build\contrib\solr-analysis-extras\test\J1\temp\solr.update.processor.TestOpenNLPExtractNamedEntitiesUpdateProcessorFactory_10BAE5C2625B3390-001\tempDir-001\collection1\conf: java.nio.file.DirectoryNotEmptyException: C:\Users\jenkins\workspace\Lucene-Solr-master-Windows\solr\build\contrib\solr-analysis-extras\test\J1\temp\solr.update.processor.TestOpenNLPExtractNamedEntitiesUpdateProcessorFactory_10BAE5C2625B3390-001\tempDir-001\collection1\conf
   [junit4]    >    C:\Users\jenkins\workspace\Lucene-Solr-master-Windows\solr\build\contrib\solr-analysis-extras\test\J1\temp\solr.update.processor.TestOpenNLPExtractNamedEntitiesUpdateProcessorFactory_10BAE5C2625B3390-001\tempDir-001\collection1: java.nio.file.DirectoryNotEmptyException: C:\Users\jenkins\workspace\Lucene-Solr-master-Windows\solr\build\contrib\solr-analysis-extras\test\J1\temp\solr.update.processor.TestOpenNLPExtractNamedEntitiesUpdateProcessorFactory_10BAE5C2625B3390-001\tempDir-001\collection1
   [junit4]    >    C:\Users\jenkins\workspace\Lucene-Solr-master-Windows\solr\build\contrib\solr-analysis-extras\test\J1\temp\solr.update.processor.TestOpenNLPExtractNamedEntitiesUpdateProcessorFactory_10BAE5C2625B3390-001\tempDir-001: java.nio.file.DirectoryNotEmptyException: C:\Users\jenkins\workspace\Lucene-Solr-master-Windows\solr\build\contrib\solr-analysis-extras\test\J1\temp\solr.update.processor.TestOpenNLPExtractNamedEntitiesUpdateProcessorFactory_10BAE5C2625B3390-001\tempDir-001
   [junit4]    >    C:\Users\jenkins\workspace\Lucene-Solr-master-Windows\solr\build\contrib\solr-analysis-extras\test\J1\temp\solr.update.processor.TestOpenNLPExtractNamedEntitiesUpdateProcessorFactory_10BAE5C2625B3390-001\tempDir-001\collection1\conf\en-test-tokenizer.bin: java.nio.file.AccessDeniedException: C:\Users\jenkins\workspace\Lucene-Solr-master-Windows\solr\build\contrib\solr-analysis-extras\test\J1\temp\solr.update.processor.TestOpenNLPExtractNamedEntitiesUpdateProcessorFactory_10BAE5C2625B3390-001\tempDir-001\collection1\conf\en-test-tokenizer.bin
   [junit4]    >    C:\Users\jenkins\workspace\Lucene-Solr-master-Windows\solr\build\contrib\solr-analysis-extras\test\J1\temp\solr.update.processor.TestOpenNLPExtractNamedEntitiesUpdateProcessorFactory_10BAE5C2625B3390-001\tempDir-001\collection1\conf\en-test-sent.bin: java.nio.file.AccessDeniedException: C:\Users\jenkins\workspace\Lucene-Solr-master-Windows\solr\build\contrib\solr-analysis-extras\test\J1\temp\solr.update.processor.TestOpenNLPExtractNamedEntitiesUpdateProcessorFactory_10BAE5C2625B3390-001\tempDir-001\collection1\conf\en-test-sent.bin
   [junit4]    >    C:\Users\jenkins\workspace\Lucene-Solr-master-Windows\solr\build\contrib\solr-analysis-extras\test\J1\temp\solr.update.processor.TestOpenNLPExtractNamedEntitiesUpdateProcessorFactory_10BAE5C2625B3390-001\tempDir-001\collection1\conf\en-test-ner-person.bin: java.nio.file.AccessDeniedException: C:\Users\jenkins\workspace\Lucene-Solr-master-Windows\solr\build\contrib\solr-analysis-extras\test\J1\temp\solr.update.processor.TestOpenNLPExtractNamedEntitiesUpdateProcessorFactory_10BAE5C2625B3390-001\tempDir-001\collection1\conf\en-test-ner-person.bin
   [junit4]    >    C:\Users\jenkins\workspace\Lucene-Solr-master-Windows\solr\build\contrib\solr-analysis-extras\test\J1\temp\solr.update.processor.TestOpenNLPExtractNamedEntitiesUpdateProcessorFactory_10BAE5C2625B3390-001: java.nio.file.DirectoryNotEmptyException: C:\Users\jenkins\workspace\Lucene-Solr-master-Windows\solr\build\contrib\solr-analysis-extras\test\J1\temp\solr.update.processor.TestOpenNLPExtractNamedEntitiesUpdateProcessorFactory_10BAE5C2625B3390-001
   [junit4]    > 	at __randomizedtesting.SeedInfo.seed([10BAE5C2625B3390]:0)
   [junit4]    > 	at org.apache.lucene.util.IOUtils.rm(IOUtils.java:329)
   [junit4]    > 	at java.lang.Thread.run(Thread.java:748)
   [junit4] Completed [1/5 (1!)] on J1 in 14.58s, 8 tests, 1 error <<< FAILURES!

[...truncated 45471 lines...]
[repro] Jenkins log URL: https://jenkins.thetaphi.de/job/Lucene-Solr-master-Windows/7196/consoleText

[repro] Revision: 98d85eadd4ed0ebab3e4c37aff88749350934524

[repro] Ant options: "-Dargs=-XX:+UseCompressedOops -XX:+UseParallelGC" -Dtests.badapples=false

[repro] ant clean

[...truncated 6 lines...]
[repro] Test suites by module:
[repro]    solr\contrib\analysis-extras
[repro]       TestOpenNLPExtractNamedEntitiesUpdateProcessorFactory
[repro]    solr\core
[repro]       AnalyticsQueryTest
[repro]       JsonLoaderTest
[repro]    lucene\core
[repro]       TestMultiMMap
[repro] ant compile-test

[...truncated 3658 lines...]
[repro] ant test-nocompile -Dtests.dups=5 -Dtests.maxfailures=5 -Dtests.class="*.TestOpenNLPExtractNamedEntitiesUpdateProcessorFactory" -Dtests.showOutput=onerror "-Dargs=-XX:+UseCompressedOops -XX:+UseParallelGC" -Dtests.badapples=false -Dtests.seed=10BAE5C2625B3390 -Dtests.slow=true -Dtests.locale=ro -Dtests.timezone=Africa/Mogadishu -Dtests.asserts=true -Dtests.file.encoding=Cp1252

[...truncated 32 lines...]
   [junit4] Suite: org.apache.solr.update.processor.TestOpenNLPExtractNamedEntitiesUpdateProcessorFactory
   [junit4]   2> Creating dataDir: C:\Users\jenkins\workspace\Lucene-Solr-master-Windows\solr\build\contrib\solr-analysis-extras\test\J0\temp\solr.update.processor.TestOpenNLPExtractNamedEntitiesUpdateProcessorFactory_10BAE5C2625B3390-001\init-core-data-001
   [junit4]   2> log4j:WARN No appenders could be found for logger (org.apache.solr.SolrTestCaseJ4).
   [junit4]   2> log4j:WARN Please initialize the log4j system properly.
   [junit4]   2> log4j:WARN See http://logging.apache.org/log4j/1.2/faq.html#noconfig for more info.
   [junit4] OK      0.38s J0 | TestOpenNLPExtractNamedEntitiesUpdateProcessorFactory.testEquivalentExtraction
   [junit4] OK      0.01s J0 | TestOpenNLPExtractNamedEntitiesUpdateProcessorFactory.testMultiExtract
   [junit4] OK      0.02s J0 | TestOpenNLPExtractNamedEntitiesUpdateProcessorFactory.testExtractFieldRegexReplaceAllWithEntityType
   [junit4] OK      0.02s J0 | TestOpenNLPExtractNamedEntitiesUpdateProcessorFactory.testMultipleExtracts
   [junit4] OK      0.01s J0 | TestOpenNLPExtractNamedEntitiesUpdateProcessorFactory.testExtractFieldRegexReplaceAll
   [junit4] OK      0.01s J0 | TestOpenNLPExtractNamedEntitiesUpdateProcessorFactory.testSimpleExtract
   [junit4] OK      0.01s J0 | TestOpenNLPExtractNamedEntitiesUpdateProcessorFactory.testArrayExtract
   [junit4] OK      0.01s J0 | TestOpenNLPExtractNamedEntitiesUpdateProcessorFactory.testSelectorExtract
   [junit4]   2> NOTE: test params are: codec=CheapBastard, sim=Asserting(org.apache.lucene.search.similarities.AssertingSimilarity@1028c434), locale=ro, timezone=Africa/Mogadishu
   [junit4]   2> NOTE: Windows 10 10.0 amd64/Oracle Corporation 1.8.0_144 (64-bit)/cpus=3,threads=1,free=89713776,total=119537664
   [junit4]   2> NOTE: All tests run in this JVM: [TestOpenNLPExtractNamedEntitiesUpdateProcessorFactory]
   [junit4]   2> NOTE: reproduce with: ant test  -Dtestcase=TestOpenNLPExtractNamedEntitiesUpdateProcessorFactory -Dtests.seed=10BAE5C2625B3390 -Dtests.slow=true -Dtests.locale=ro -Dtests.timezone=Africa/Mogadishu -Dtests.asserts=true -Dtests.file.encoding=Cp1252
   [junit4] ERROR   0.00s J0 | TestOpenNLPExtractNamedEntitiesUpdateProcessorFactory (suite) <<<
   [junit4]    > Throwable #1: java.io.IOException: Could not remove the following files (in the order of attempts):
   [junit4]    >    C:\Users\jenkins\workspace\Lucene-Solr-master-Windows\solr\build\contrib\solr-analysis-extras\test\J0\temp\solr.update.processor.TestOpenNLPExtractNamedEntitiesUpdateProcessorFactory_10BAE5C2625B3390-001\tempDir-001\collection1\conf: java.nio.file.DirectoryNotEmptyException: C:\Users\jenkins\workspace\Lucene-Solr-master-Windows\solr\build\contrib\solr-analysis-extras\test\J0\temp\solr.update.processor.TestOpenNLPExtractNamedEntitiesUpdateProcessorFactory_10BAE5C2625B3390-001\tempDir-001\collection1\conf
   [junit4]    >    C:\Users\jenkins\workspace\Lucene-Solr-master-Windows\solr\build\contrib\solr-analysis-extras\test\J0\temp\solr.update.processor.TestOpenNLPExtractNamedEntitiesUpdateProcessorFactory_10BAE5C2625B3390-001\tempDir-001\collection1: java.nio.file.DirectoryNotEmptyException: C:\Users\jenkins\workspace\Lucene-Solr-master-Windows\solr\build\contrib\solr-analysis-extras\test\J0\temp\solr.update.processor.TestOpenNLPExtractNamedEntitiesUpdateProcessorFactory_10BAE5C2625B3390-001\tempDir-001\collection1
   [junit4]    >    C:\Users\jenkins\workspace\Lucene-Solr-master-Windows\solr\build\contrib\solr-analysis-extras\test\J0\temp\solr.update.processor.TestOpenNLPExtractNamedEntitiesUpdateProcessorFactory_10BAE5C2625B3390-001\tempDir-001: java.nio.file.DirectoryNotEmptyException: C:\Users\jenkins\workspace\Lucene-Solr-master-Windows\solr\build\contrib\solr-analysis-extras\test\J0\temp\solr.update.processor.TestOpenNLPExtractNamedEntitiesUpdateProcessorFactory_10BAE5C2625B3390-001\tempDir-001
   [junit4]    >    C:\Users\jenkins\workspace\Lucene-Solr-master-Windows\solr\build\contrib\solr-analysis-extras\test\J0\temp\solr.update.processor.TestOpenNLPExtractNamedEntitiesUpdateProcessorFactory_10BAE5C2625B3390-001\tempDir-001\collection1\conf\en-test-tokenizer.bin: java.nio.file.AccessDeniedException: C:\Users\jenkins\workspace\Lucene-Solr-master-Windows\solr\build\contrib\solr-analysis-extras\test\J0\temp\solr.update.processor.TestOpenNLPExtractNamedEntitiesUpdateProcessorFactory_10BAE5C2625B3390-001\tempDir-001\collection1\conf\en-test-tokenizer.bin
   [junit4]    >    C:\Users\jenkins\workspace\Lucene-Solr-master-Windows\solr\build\contrib\solr-analysis-extras\test\J0\temp\solr.update.processor.TestOpenNLPExtractNamedEntitiesUpdateProcessorFactory_10BAE5C2625B3390-001\tempDir-001\collection1\conf\en-test-sent.bin: java.nio.file.AccessDeniedException: C:\Users\jenkins\workspace\Lucene-Solr-master-Windows\solr\build\contrib\solr-analysis-extras\test\J0\temp\solr.update.processor.TestOpenNLPExtractNamedEntitiesUpdateProcessorFactory_10BAE5C2625B3390-001\tempDir-001\collection1\conf\en-test-sent.bin
   [junit4]    >    C:\Users\jenkins\workspace\Lucene-Solr-master-Windows\solr\build\contrib\solr-analysis-extras\test\J0\temp\solr.update.processor.TestOpenNLPExtractNamedEntitiesUpdateProcessorFactory_10BAE5C2625B3390-001\tempDir-001\collection1\conf\en-test-ner-person.bin: java.nio.file.AccessDeniedException: C:\Users\jenkins\workspace\Lucene-Solr-master-Windows\solr\build\contrib\solr-analysis-extras\test\J0\temp\solr.update.processor.TestOpenNLPExtractNamedEntitiesUpdateProcessorFactory_10BAE5C2625B3390-001\tempDir-001\collection1\conf\en-test-ner-person.bin
   [junit4]    >    C:\Users\jenkins\workspace\Lucene-Solr-master-Windows\solr\build\contrib\solr-analysis-extras\test\J0\temp\solr.update.processor.TestOpenNLPExtractNamedEntitiesUpdateProcessorFactory_10BAE5C2625B3390-001: java.nio.file.DirectoryNotEmptyException: C:\Users\jenkins\workspace\Lucene-Solr-master-Windows\solr\build\contrib\solr-analysis-extras\test\J0\temp\solr.update.processor.TestOpenNLPExtractNamedEntitiesUpdateProcessorFactory_10BAE5C2625B3390-001
   [junit4]    > 	at __randomizedtesting.SeedInfo.seed([10BAE5C2625B3390]:0)
   [junit4]    > 	at org.apache.lucene.util.IOUtils.rm(IOUtils.java:329)
   [junit4]    > 	at java.lang.Thread.run(Thread.java:748)
   [junit4] Completed [1/5 (1!)] on J0 in 14.63s, 8 tests, 1 error <<< FAILURES!

[...truncated 1 lines...]
   [junit4] Suite: org.apache.solr.update.processor.TestOpenNLPExtractNamedEntitiesUpdateProcessorFactory
   [junit4]   2> Creating dataDir: C:\Users\jenkins\workspace\Lucene-Solr-master-Windows\solr\build\contrib\solr-analysis-extras\test\J1\temp\solr.update.processor.TestOpenNLPExtractNamedEntitiesUpdateProcessorFactory_10BAE5C2625B3390-001\init-core-data-001
   [junit4]   2> log4j:WARN No appenders could be found for logger (org.apache.solr.SolrTestCaseJ4).
   [junit4]   2> log4j:WARN Please initialize the log4j system properly

[...truncated too long message...]

4] OK      0.01s J0 | TestMultiMMap.testRandomShort
   [junit4] OK      2.87s J0 | TestMultiMMap.testThreadSafety
   [junit4] OK      0.01s J0 | TestMultiMMap.testListAllIsSorted
   [junit4] OK      0.00s J0 | TestMultiMMap.testSeekPastEOF
   [junit4] OK      0.00s J0 | TestMultiMMap.testCloneSliceSafety
   [junit4] OK      0.08s J0 | TestMultiMMap.testSeekZero
   [junit4] OK      0.09s J0 | TestMultiMMap.testSeekSliceZero
   [junit4] OK      0.04s J0 | TestMultiMMap.testCreateTempOutput
   [junit4] OK      0.00s J0 | TestMultiMMap.testSeekToEndOfFile
   [junit4] OK      0.05s J0 | TestMultiMMap.testSeekEnd
   [junit4] OK      0.27s J0 | TestMultiMMap.testRandomChunkSizes
   [junit4] OK      0.00s J0 | TestMultiMMap.testSeekToEOFThenBack
   [junit4] OK      0.00s J0 | TestMultiMMap.testVInt
   [junit4] OK      0.01s J0 | TestMultiMMap.testByte
   [junit4] OK      0.03s J0 | TestMultiMMap.testRandomByte
   [junit4] OK      0.01s J0 | TestMultiMMap.testChecksum
   [junit4] OK      0.00s J0 | TestMultiMMap.testSliceOutOfBounds
   [junit4] OK      0.00s J0 | TestMultiMMap.testMapOfStrings
   [junit4] OK      0.03s J0 | TestMultiMMap.testRandomLong
   [junit4] OK      0.02s J0 | TestMultiMMap.testCopyFromDestination
   [junit4] OK      0.05s J0 | TestMultiMMap.testDirectoryFilter
   [junit4] OK      0.07s J0 | TestMultiMMap.testImplementations
   [junit4] OK      0.04s J0 | TestMultiMMap.testPendingDeletions
   [junit4] OK      0.13s J0 | TestMultiMMap.testSeekSliceEnd
   [junit4] OK      0.00s J0 | TestMultiMMap.testCloneSliceClose
   [junit4] OK      0.02s J0 | TestMultiMMap.testVLong
   [junit4] OK      0.00s J0 | TestMultiMMap.testLargeWrites
   [junit4] OK      0.01s J0 | TestMultiMMap.testSlicedSeeking
   [junit4] OK      0.01s J0 | TestMultiMMap.testCloneSafety
   [junit4] OK      0.01s J0 | TestMultiMMap.testZInt
   [junit4] OK      0.00s J0 | TestMultiMMap.testNoDir
   [junit4] OK      0.00s J0 | TestMultiMMap.testIndexOutputToString
   [junit4] OK      0.01s J0 | TestMultiMMap.testShort
   [junit4] OK      0.01s J0 | TestMultiMMap.testFsyncDoesntCreateNewFiles
   [junit4] OK      0.01s J0 | TestMultiMMap.testSeekBeyondEndOfFile
   [junit4] OK      0.01s J0 | TestMultiMMap.testRename
   [junit4] OK      0.00s J0 | TestMultiMMap.testString
   [junit4] OK      0.02s J0 | TestMultiMMap.testCopyBytes
   [junit4] OK      0.12s J0 | TestMultiMMap.testRandomInt
   [junit4] OK      0.00s J0 | TestMultiMMap.testDoubleCloseDirectory
   [junit4] OK      0.01s J0 | TestMultiMMap.testCopyFrom
   [junit4] OK      0.46s J0 | TestMultiMMap.testIllegalEOF
   [junit4] OK      0.05s J0 | TestMultiMMap.testLong
   [junit4] OK      0.00s J0 | TestMultiMMap.testDoubleCloseOutput
   [junit4] OK      0.00s J0 | TestMultiMMap.testSeeking
   [junit4] OK      0.00s J0 | TestMultiMMap.testDeleteFile
   [junit4] Completed [4/5] on J0 in 5.94s, 54 tests
   [junit4] 
   [junit4] Suite: org.apache.lucene.store.TestMultiMMap
   [junit4] OK      0.18s J1 | TestMultiMMap.testSliceOfSlice
   [junit4] OK      0.00s J1 | TestMultiMMap.testInt
   [junit4] OK      0.00s J1 | TestMultiMMap.testDetectClose
   [junit4] OK      0.00s J1 | TestMultiMMap.testSetOfStrings
   [junit4] OK      0.01s J1 | TestMultiMMap.testZLong
   [junit4] OK      0.01s J1 | TestMultiMMap.testCopyBytesWithThreads
   [junit4] OK      0.00s J1 | TestMultiMMap.testDoubleCloseInput
   [junit4] OK      0.00s J1 | TestMultiMMap.testCloneClose
   [junit4] OK      0.01s J1 | TestMultiMMap.testRandomShort
   [junit4] OK      0.40s J1 | TestMultiMMap.testThreadSafety
   [junit4] OK      0.01s J1 | TestMultiMMap.testListAllIsSorted
   [junit4] OK      0.00s J1 | TestMultiMMap.testSeekPastEOF
   [junit4] OK      0.00s J1 | TestMultiMMap.testCloneSliceSafety
   [junit4] OK      0.06s J1 | TestMultiMMap.testSeekZero
   [junit4] OK      0.06s J1 | TestMultiMMap.testSeekSliceZero
   [junit4] OK      0.03s J1 | TestMultiMMap.testCreateTempOutput
   [junit4] OK      0.00s J1 | TestMultiMMap.testSeekToEndOfFile
   [junit4] OK      0.03s J1 | TestMultiMMap.testSeekEnd
   [junit4] OK      0.15s J1 | TestMultiMMap.testRandomChunkSizes
   [junit4] OK      0.00s J1 | TestMultiMMap.testSeekToEOFThenBack
   [junit4] OK      0.00s J1 | TestMultiMMap.testVInt
   [junit4] OK      0.00s J1 | TestMultiMMap.testByte
   [junit4] OK      0.02s J1 | TestMultiMMap.testRandomByte
   [junit4] OK      0.00s J1 | TestMultiMMap.testChecksum
   [junit4] OK      0.00s J1 | TestMultiMMap.testSliceOutOfBounds
   [junit4] OK      0.00s J1 | TestMultiMMap.testMapOfStrings
   [junit4] OK      0.01s J1 | TestMultiMMap.testRandomLong
   [junit4] OK      0.00s J1 | TestMultiMMap.testCopyFromDestination
   [junit4] OK      0.00s J1 | TestMultiMMap.testDirectoryFilter
   [junit4] OK      0.02s J1 | TestMultiMMap.testImplementations
   [junit4] OK      0.02s J1 | TestMultiMMap.testPendingDeletions
   [junit4] OK      0.04s J1 | TestMultiMMap.testSeekSliceEnd
   [junit4] OK      0.00s J1 | TestMultiMMap.testCloneSliceClose
   [junit4] OK      0.00s J1 | TestMultiMMap.testVLong
   [junit4] OK      0.00s J1 | TestMultiMMap.testLargeWrites
   [junit4] OK      0.00s J1 | TestMultiMMap.testSlicedSeeking
   [junit4] OK      0.00s J1 | TestMultiMMap.testCloneSafety
   [junit4] OK      0.00s J1 | TestMultiMMap.testZInt
   [junit4] OK      0.00s J1 | TestMultiMMap.testNoDir
   [junit4] OK      0.00s J1 | TestMultiMMap.testIndexOutputToString
   [junit4] OK      0.00s J1 | TestMultiMMap.testShort
   [junit4] OK      0.00s J1 | TestMultiMMap.testFsyncDoesntCreateNewFiles
   [junit4] OK      0.00s J1 | TestMultiMMap.testSeekBeyondEndOfFile
   [junit4] OK      0.01s J1 | TestMultiMMap.testRename
   [junit4] OK      0.00s J1 | TestMultiMMap.testString
   [junit4] OK      0.01s J1 | TestMultiMMap.testCopyBytes
   [junit4] OK      0.01s J1 | TestMultiMMap.testRandomInt
   [junit4] OK      0.00s J1 | TestMultiMMap.testDoubleCloseDirectory
   [junit4] OK      0.00s J1 | TestMultiMMap.testCopyFrom
   [junit4] OK      0.00s J1 | TestMultiMMap.testIllegalEOF
   [junit4] OK      0.00s J1 | TestMultiMMap.testLong
   [junit4] OK      0.00s J1 | TestMultiMMap.testDoubleCloseOutput
   [junit4] OK      0.00s J1 | TestMultiMMap.testSeeking
   [junit4] OK      0.00s J1 | TestMultiMMap.testDeleteFile
   [junit4] Completed [5/5] on J1 in 1.78s, 54 tests
   [junit4] 
   [junit4] JVM J0:     0.62 ..    16.39 =    15.76s
   [junit4] JVM J1:     0.63 ..    17.94 =    17.31s
   [junit4] Execution time total: 17 seconds
   [junit4] Tests summary: 5 suites, 270 tests
   [junit4] Could not remove temporary path: C:\Users\jenkins\workspace\Lucene-Solr-master-Windows\lucene\build\core\test\J1 (java.nio.file.DirectoryNotEmptyException: Remaining files: [C:\Users\jenkins\workspace\Lucene-Solr-master-Windows\lucene\build\core\test\J1\temp])
   [junit4] Could not remove temporary path: C:\Users\jenkins\workspace\Lucene-Solr-master-Windows\lucene\build\core\test\J0 (java.nio.file.DirectoryNotEmptyException: Remaining files: [C:\Users\jenkins\workspace\Lucene-Solr-master-Windows\lucene\build\core\test\J0\temp])
     [echo] 5 slowest tests:
[junit4:tophints] 123.60s | org.apache.lucene.codecs.lucene70.TestLucene70DocValuesFormat
[junit4:tophints]  33.38s | org.apache.lucene.codecs.perfield.TestPerFieldDocValuesFormat
[junit4:tophints]  33.07s | org.apache.lucene.search.TestLRUQueryCache
[junit4:tophints]  30.33s | org.apache.lucene.index.TestIndexingSequenceNumbers
[junit4:tophints]  22.97s | org.apache.lucene.util.TestTimSorterWorstCase

-check-totals:

test-nocompile:

BUILD SUCCESSFUL
Total time: 20 seconds
[repro] Failures:
[repro]   0/5 failed: org.apache.lucene.store.TestMultiMMap
[repro]   0/5 failed: org.apache.solr.handler.JsonLoaderTest
[repro]   0/5 failed: org.apache.solr.search.AnalyticsQueryTest
[repro]   2/5 failed: org.apache.solr.update.processor.TestOpenNLPExtractNamedEntitiesUpdateProcessorFactory
[repro] Exiting with code 1

C:\Users\jenkins\workspace\Lucene-Solr-master-Windows>IF EXIST lucene\build move /y lucene\build lucene\build.repro 
        1 dir(s) moved.

C:\Users\jenkins\workspace\Lucene-Solr-master-Windows>IF EXIST solr\build move /y solr\build solr\build.repro 
        1 dir(s) moved.

C:\Users\jenkins\workspace\Lucene-Solr-master-Windows>IF EXIST lucene\build.orig move /y lucene\build.orig lucene\build 
        1 dir(s) moved.

C:\Users\jenkins\workspace\Lucene-Solr-master-Windows>IF EXIST solr\build.orig move /y solr\build.orig solr\build 
        1 dir(s) moved.

C:\Users\jenkins\workspace\Lucene-Solr-master-Windows>exit 0 
Archiving artifacts
Setting ANT_1_8_2_HOME=C:\Users\jenkins\tools\hudson.tasks.Ant_AntInstallation\ANT_1.8.2
[WARNINGS] Parsing warnings in console log with parser Java Compiler (javac)
Setting ANT_1_8_2_HOME=C:\Users\jenkins\tools\hudson.tasks.Ant_AntInstallation\ANT_1.8.2
Setting ANT_1_8_2_HOME=C:\Users\jenkins\tools\hudson.tasks.Ant_AntInstallation\ANT_1.8.2
<Git Blamer> Using GitBlamer to create author and commit information for all warnings.
<Git Blamer> GIT_COMMIT=98d85eadd4ed0ebab3e4c37aff88749350934524, workspace=C:\Users\jenkins\workspace\Lucene-Solr-master-Windows
[WARNINGS] Computing warning deltas based on reference build #7194
Recording test results
Setting ANT_1_8_2_HOME=C:\Users\jenkins\tools\hudson.tasks.Ant_AntInstallation\ANT_1.8.2
Build step 'Publish JUnit test result report' changed build result to UNSTABLE
Email was triggered for: Unstable (Test Failures)
Sending email for trigger: Unstable (Test Failures)
Setting ANT_1_8_2_HOME=C:\Users\jenkins\tools\hudson.tasks.Ant_AntInstallation\ANT_1.8.2
Setting ANT_1_8_2_HOME=C:\Users\jenkins\tools\hudson.tasks.Ant_AntInstallation\ANT_1.8.2
Setting ANT_1_8_2_HOME=C:\Users\jenkins\tools\hudson.tasks.Ant_AntInstallation\ANT_1.8.2
Setting ANT_1_8_2_HOME=C:\Users\jenkins\tools\hudson.tasks.Ant_AntInstallation\ANT_1.8.2

Mime
View raw message