lucene-dev mailing list archives

Site index · List index
Message view « Date » · « Thread »
Top « Date » · « Thread »
From Policeman Jenkins Server <jenk...@thetaphi.de>
Subject [JENKINS] Lucene-Solr-master-MacOSX (64bit/jdk1.8.0) - Build # 4456 - Failure!
Date Thu, 22 Feb 2018 14:14:26 GMT
Build: https://jenkins.thetaphi.de/job/Lucene-Solr-master-MacOSX/4456/
Java: 64bit/jdk1.8.0 -XX:-UseCompressedOops -XX:+UseConcMarkSweepGC

2 tests failed.
FAILED:  org.apache.solr.cloud.autoscaling.TriggerIntegrationTest.testScheduledTrigger

Error Message:
expected:<2> but was:<108>

Stack Trace:
java.lang.AssertionError: expected:<2> but was:<108>
	at __randomizedtesting.SeedInfo.seed([54F47F6708D5BAE4:C7EF37155628E1D0]:0)
	at org.junit.Assert.fail(Assert.java:93)
	at org.junit.Assert.failNotEquals(Assert.java:647)
	at org.junit.Assert.assertEquals(Assert.java:128)
	at org.junit.Assert.assertEquals(Assert.java:472)
	at org.junit.Assert.assertEquals(Assert.java:456)
	at org.apache.solr.cloud.autoscaling.TriggerIntegrationTest.testScheduledTrigger(TriggerIntegrationTest.java:1679)
	at sun.reflect.NativeMethodAccessorImpl.invoke0(Native Method)
	at sun.reflect.NativeMethodAccessorImpl.invoke(NativeMethodAccessorImpl.java:62)
	at sun.reflect.DelegatingMethodAccessorImpl.invoke(DelegatingMethodAccessorImpl.java:43)
	at java.lang.reflect.Method.invoke(Method.java:498)
	at com.carrotsearch.randomizedtesting.RandomizedRunner.invoke(RandomizedRunner.java:1737)
	at com.carrotsearch.randomizedtesting.RandomizedRunner$8.evaluate(RandomizedRunner.java:934)
	at com.carrotsearch.randomizedtesting.RandomizedRunner$9.evaluate(RandomizedRunner.java:970)
	at com.carrotsearch.randomizedtesting.RandomizedRunner$10.evaluate(RandomizedRunner.java:984)
	at com.carrotsearch.randomizedtesting.rules.SystemPropertiesRestoreRule$1.evaluate(SystemPropertiesRestoreRule.java:57)
	at org.apache.lucene.util.TestRuleSetupTeardownChained$1.evaluate(TestRuleSetupTeardownChained.java:49)
	at org.apache.lucene.util.AbstractBeforeAfterRule$1.evaluate(AbstractBeforeAfterRule.java:45)
	at org.apache.lucene.util.TestRuleThreadAndTestName$1.evaluate(TestRuleThreadAndTestName.java:48)
	at org.apache.lucene.util.TestRuleIgnoreAfterMaxFailures$1.evaluate(TestRuleIgnoreAfterMaxFailures.java:64)
	at org.apache.lucene.util.TestRuleMarkFailure$1.evaluate(TestRuleMarkFailure.java:47)
	at com.carrotsearch.randomizedtesting.rules.StatementAdapter.evaluate(StatementAdapter.java:36)
	at com.carrotsearch.randomizedtesting.ThreadLeakControl$StatementRunner.run(ThreadLeakControl.java:368)
	at com.carrotsearch.randomizedtesting.ThreadLeakControl.forkTimeoutingTask(ThreadLeakControl.java:817)
	at com.carrotsearch.randomizedtesting.ThreadLeakControl$3.evaluate(ThreadLeakControl.java:468)
	at com.carrotsearch.randomizedtesting.RandomizedRunner.runSingleTest(RandomizedRunner.java:943)
	at com.carrotsearch.randomizedtesting.RandomizedRunner$5.evaluate(RandomizedRunner.java:829)
	at com.carrotsearch.randomizedtesting.RandomizedRunner$6.evaluate(RandomizedRunner.java:879)
	at com.carrotsearch.randomizedtesting.RandomizedRunner$7.evaluate(RandomizedRunner.java:890)
	at com.carrotsearch.randomizedtesting.rules.StatementAdapter.evaluate(StatementAdapter.java:36)
	at com.carrotsearch.randomizedtesting.rules.SystemPropertiesRestoreRule$1.evaluate(SystemPropertiesRestoreRule.java:57)
	at org.apache.lucene.util.AbstractBeforeAfterRule$1.evaluate(AbstractBeforeAfterRule.java:45)
	at com.carrotsearch.randomizedtesting.rules.StatementAdapter.evaluate(StatementAdapter.java:36)
	at org.apache.lucene.util.TestRuleStoreClassName$1.evaluate(TestRuleStoreClassName.java:41)
	at com.carrotsearch.randomizedtesting.rules.NoShadowingOrOverridesOnMethodsRule$1.evaluate(NoShadowingOrOverridesOnMethodsRule.java:40)
	at com.carrotsearch.randomizedtesting.rules.NoShadowingOrOverridesOnMethodsRule$1.evaluate(NoShadowingOrOverridesOnMethodsRule.java:40)
	at com.carrotsearch.randomizedtesting.rules.StatementAdapter.evaluate(StatementAdapter.java:36)
	at com.carrotsearch.randomizedtesting.rules.StatementAdapter.evaluate(StatementAdapter.java:36)
	at com.carrotsearch.randomizedtesting.rules.StatementAdapter.evaluate(StatementAdapter.java:36)
	at org.apache.lucene.util.TestRuleAssertionsRequired$1.evaluate(TestRuleAssertionsRequired.java:53)
	at org.apache.lucene.util.TestRuleMarkFailure$1.evaluate(TestRuleMarkFailure.java:47)
	at org.apache.lucene.util.TestRuleIgnoreAfterMaxFailures$1.evaluate(TestRuleIgnoreAfterMaxFailures.java:64)
	at org.apache.lucene.util.TestRuleIgnoreTestSuites$1.evaluate(TestRuleIgnoreTestSuites.java:54)
	at com.carrotsearch.randomizedtesting.rules.StatementAdapter.evaluate(StatementAdapter.java:36)
	at com.carrotsearch.randomizedtesting.ThreadLeakControl$StatementRunner.run(ThreadLeakControl.java:368)
	at java.lang.Thread.run(Thread.java:748)


FAILED:  org.apache.solr.handler.admin.AutoscalingHistoryHandlerTest.testHistory

Error Message:
expected:<5> but was:<0>

Stack Trace:
java.lang.AssertionError: expected:<5> but was:<0>
	at __randomizedtesting.SeedInfo.seed([54F47F6708D5BAE4:3908DB9AB29D45E3]:0)
	at org.junit.Assert.fail(Assert.java:93)
	at org.junit.Assert.failNotEquals(Assert.java:647)
	at org.junit.Assert.assertEquals(Assert.java:128)
	at org.junit.Assert.assertEquals(Assert.java:472)
	at org.junit.Assert.assertEquals(Assert.java:456)
	at org.apache.solr.handler.admin.AutoscalingHistoryHandlerTest.testHistory(AutoscalingHistoryHandlerTest.java:312)
	at sun.reflect.NativeMethodAccessorImpl.invoke0(Native Method)
	at sun.reflect.NativeMethodAccessorImpl.invoke(NativeMethodAccessorImpl.java:62)
	at sun.reflect.DelegatingMethodAccessorImpl.invoke(DelegatingMethodAccessorImpl.java:43)
	at java.lang.reflect.Method.invoke(Method.java:498)
	at com.carrotsearch.randomizedtesting.RandomizedRunner.invoke(RandomizedRunner.java:1737)
	at com.carrotsearch.randomizedtesting.RandomizedRunner$8.evaluate(RandomizedRunner.java:934)
	at com.carrotsearch.randomizedtesting.RandomizedRunner$9.evaluate(RandomizedRunner.java:970)
	at com.carrotsearch.randomizedtesting.RandomizedRunner$10.evaluate(RandomizedRunner.java:984)
	at com.carrotsearch.randomizedtesting.rules.SystemPropertiesRestoreRule$1.evaluate(SystemPropertiesRestoreRule.java:57)
	at org.apache.lucene.util.TestRuleSetupTeardownChained$1.evaluate(TestRuleSetupTeardownChained.java:49)
	at org.apache.lucene.util.AbstractBeforeAfterRule$1.evaluate(AbstractBeforeAfterRule.java:45)
	at org.apache.lucene.util.TestRuleThreadAndTestName$1.evaluate(TestRuleThreadAndTestName.java:48)
	at org.apache.lucene.util.TestRuleIgnoreAfterMaxFailures$1.evaluate(TestRuleIgnoreAfterMaxFailures.java:64)
	at org.apache.lucene.util.TestRuleMarkFailure$1.evaluate(TestRuleMarkFailure.java:47)
	at com.carrotsearch.randomizedtesting.rules.StatementAdapter.evaluate(StatementAdapter.java:36)
	at com.carrotsearch.randomizedtesting.ThreadLeakControl$StatementRunner.run(ThreadLeakControl.java:368)
	at com.carrotsearch.randomizedtesting.ThreadLeakControl.forkTimeoutingTask(ThreadLeakControl.java:817)
	at com.carrotsearch.randomizedtesting.ThreadLeakControl$3.evaluate(ThreadLeakControl.java:468)
	at com.carrotsearch.randomizedtesting.RandomizedRunner.runSingleTest(RandomizedRunner.java:943)
	at com.carrotsearch.randomizedtesting.RandomizedRunner$5.evaluate(RandomizedRunner.java:829)
	at com.carrotsearch.randomizedtesting.RandomizedRunner$6.evaluate(RandomizedRunner.java:879)
	at com.carrotsearch.randomizedtesting.RandomizedRunner$7.evaluate(RandomizedRunner.java:890)
	at com.carrotsearch.randomizedtesting.rules.StatementAdapter.evaluate(StatementAdapter.java:36)
	at com.carrotsearch.randomizedtesting.rules.SystemPropertiesRestoreRule$1.evaluate(SystemPropertiesRestoreRule.java:57)
	at org.apache.lucene.util.AbstractBeforeAfterRule$1.evaluate(AbstractBeforeAfterRule.java:45)
	at com.carrotsearch.randomizedtesting.rules.StatementAdapter.evaluate(StatementAdapter.java:36)
	at org.apache.lucene.util.TestRuleStoreClassName$1.evaluate(TestRuleStoreClassName.java:41)
	at com.carrotsearch.randomizedtesting.rules.NoShadowingOrOverridesOnMethodsRule$1.evaluate(NoShadowingOrOverridesOnMethodsRule.java:40)
	at com.carrotsearch.randomizedtesting.rules.NoShadowingOrOverridesOnMethodsRule$1.evaluate(NoShadowingOrOverridesOnMethodsRule.java:40)
	at com.carrotsearch.randomizedtesting.rules.StatementAdapter.evaluate(StatementAdapter.java:36)
	at com.carrotsearch.randomizedtesting.rules.StatementAdapter.evaluate(StatementAdapter.java:36)
	at com.carrotsearch.randomizedtesting.rules.StatementAdapter.evaluate(StatementAdapter.java:36)
	at org.apache.lucene.util.TestRuleAssertionsRequired$1.evaluate(TestRuleAssertionsRequired.java:53)
	at org.apache.lucene.util.TestRuleMarkFailure$1.evaluate(TestRuleMarkFailure.java:47)
	at org.apache.lucene.util.TestRuleIgnoreAfterMaxFailures$1.evaluate(TestRuleIgnoreAfterMaxFailures.java:64)
	at org.apache.lucene.util.TestRuleIgnoreTestSuites$1.evaluate(TestRuleIgnoreTestSuites.java:54)
	at com.carrotsearch.randomizedtesting.rules.StatementAdapter.evaluate(StatementAdapter.java:36)
	at com.carrotsearch.randomizedtesting.ThreadLeakControl$StatementRunner.run(ThreadLeakControl.java:368)
	at java.lang.Thread.run(Thread.java:748)




Build Log:
[...truncated 12533 lines...]
   [junit4] Suite: org.apache.solr.cloud.autoscaling.TriggerIntegrationTest
   [junit4]   2> 613093 INFO  (SUITE-TriggerIntegrationTest-seed#[54F47F6708D5BAE4]-worker) [    ] o.a.s.SolrTestCaseJ4 SecureRandom sanity checks: test.solr.allowed.securerandom=null & java.security.egd=file:/dev/./urandom
   [junit4]   2> Creating dataDir: /Users/jenkins/workspace/Lucene-Solr-master-MacOSX/solr/build/solr-core/test/J1/temp/solr.cloud.autoscaling.TriggerIntegrationTest_54F47F6708D5BAE4-001/init-core-data-001
   [junit4]   2> 613094 WARN  (SUITE-TriggerIntegrationTest-seed#[54F47F6708D5BAE4]-worker) [    ] o.a.s.SolrTestCaseJ4 startTrackingSearchers: numOpens=2 numCloses=2
   [junit4]   2> 613094 INFO  (SUITE-TriggerIntegrationTest-seed#[54F47F6708D5BAE4]-worker) [    ] o.a.s.SolrTestCaseJ4 Using PointFields (NUMERIC_POINTS_SYSPROP=true) w/NUMERIC_DOCVALUES_SYSPROP=false
   [junit4]   2> 613098 INFO  (SUITE-TriggerIntegrationTest-seed#[54F47F6708D5BAE4]-worker) [    ] o.a.s.SolrTestCaseJ4 Randomized ssl (false) and clientAuth (false) via: @org.apache.solr.util.RandomizeSSL(reason=, value=NaN, ssl=NaN, clientAuth=NaN) w/ MAC_OS_X supressed clientAuth
   [junit4]   2> 613099 INFO  (SUITE-TriggerIntegrationTest-seed#[54F47F6708D5BAE4]-worker) [    ] o.a.s.c.MiniSolrCloudCluster Starting cluster of 2 servers in /Users/jenkins/workspace/Lucene-Solr-master-MacOSX/solr/build/solr-core/test/J1/temp/solr.cloud.autoscaling.TriggerIntegrationTest_54F47F6708D5BAE4-001/tempDir-001
   [junit4]   2> 613099 INFO  (SUITE-TriggerIntegrationTest-seed#[54F47F6708D5BAE4]-worker) [    ] o.a.s.c.ZkTestServer STARTING ZK TEST SERVER
   [junit4]   2> 613099 INFO  (Thread-903) [    ] o.a.s.c.ZkTestServer client port:0.0.0.0/0.0.0.0:0
   [junit4]   2> 613099 INFO  (Thread-903) [    ] o.a.s.c.ZkTestServer Starting server
   [junit4]   2> 613102 ERROR (Thread-903) [    ] o.a.z.s.ZooKeeperServer ZKShutdownHandler is not registered, so ZooKeeper server won't take any action on ERROR or SHUTDOWN server state changes
   [junit4]   2> 613203 INFO  (SUITE-TriggerIntegrationTest-seed#[54F47F6708D5BAE4]-worker) [    ] o.a.s.c.ZkTestServer start zk server on port:49472
   [junit4]   2> 613296 INFO  (zkConnectionManagerCallback-2633-thread-1) [    ] o.a.s.c.c.ConnectionManager zkClient has connected
   [junit4]   2> 613301 INFO  (jetty-launcher-2630-thread-1) [    ] o.e.j.s.Server jetty-9.4.8.v20171121, build timestamp: 2017-11-21T15:27:37-06:00, git hash: 82b8fb23f757335bb3329d540ce37a2a2615f0a8
   [junit4]   2> 613301 INFO  (jetty-launcher-2630-thread-2) [    ] o.e.j.s.Server jetty-9.4.8.v20171121, build timestamp: 2017-11-21T15:27:37-06:00, git hash: 82b8fb23f757335bb3329d540ce37a2a2615f0a8
   [junit4]   2> 613303 INFO  (jetty-launcher-2630-thread-1) [    ] o.e.j.s.session DefaultSessionIdManager workerName=node0
   [junit4]   2> 613303 INFO  (jetty-launcher-2630-thread-1) [    ] o.e.j.s.session No SessionScavenger set, using defaults
   [junit4]   2> 613303 INFO  (jetty-launcher-2630-thread-1) [    ] o.e.j.s.session Scavenging every 600000ms
   [junit4]   2> 613303 INFO  (jetty-launcher-2630-thread-1) [    ] o.e.j.s.h.ContextHandler Started o.e.j.s.ServletContextHandler@25a77c07{/solr,null,AVAILABLE}
   [junit4]   2> 613303 INFO  (jetty-launcher-2630-thread-2) [    ] o.e.j.s.session DefaultSessionIdManager workerName=node0
   [junit4]   2> 613303 INFO  (jetty-launcher-2630-thread-2) [    ] o.e.j.s.session No SessionScavenger set, using defaults
   [junit4]   2> 613303 INFO  (jetty-launcher-2630-thread-2) [    ] o.e.j.s.session Scavenging every 600000ms
   [junit4]   2> 613304 INFO  (jetty-launcher-2630-thread-2) [    ] o.e.j.s.h.ContextHandler Started o.e.j.s.ServletContextHandler@7343068f{/solr,null,AVAILABLE}
   [junit4]   2> 613305 INFO  (jetty-launcher-2630-thread-1) [    ] o.e.j.s.AbstractConnector Started ServerConnector@34bf105a{HTTP/1.1,[http/1.1]}{127.0.0.1:49482}
   [junit4]   2> 613305 INFO  (jetty-launcher-2630-thread-2) [    ] o.e.j.s.AbstractConnector Started ServerConnector@3a05d9ba{HTTP/1.1,[http/1.1]}{127.0.0.1:49483}
   [junit4]   2> 613305 INFO  (jetty-launcher-2630-thread-1) [    ] o.e.j.s.Server Started @617466ms
   [junit4]   2> 613305 INFO  (jetty-launcher-2630-thread-2) [    ] o.e.j.s.Server Started @617466ms
   [junit4]   2> 613305 INFO  (jetty-launcher-2630-thread-1) [    ] o.a.s.c.s.e.JettySolrRunner Jetty properties: {hostContext=/solr, hostPort=49482}
   [junit4]   2> 613305 INFO  (jetty-launcher-2630-thread-2) [    ] o.a.s.c.s.e.JettySolrRunner Jetty properties: {hostContext=/solr, hostPort=49483}
   [junit4]   2> 613305 ERROR (jetty-launcher-2630-thread-1) [    ] o.a.s.u.StartupLoggingUtils Missing Java Option solr.log.dir. Logging may be missing or incomplete.
   [junit4]   2> 613305 ERROR (jetty-launcher-2630-thread-2) [    ] o.a.s.u.StartupLoggingUtils Missing Java Option solr.log.dir. Logging may be missing or incomplete.
   [junit4]   2> 613305 INFO  (jetty-launcher-2630-thread-1) [    ] o.a.s.s.SolrDispatchFilter  ___      _       Welcome to Apache Solr™ version 8.0.0
   [junit4]   2> 613305 INFO  (jetty-launcher-2630-thread-1) [    ] o.a.s.s.SolrDispatchFilter / __| ___| |_ _   Starting in cloud mode on port null
   [junit4]   2> 613305 INFO  (jetty-launcher-2630-thread-2) [    ] o.a.s.s.SolrDispatchFilter  ___      _       Welcome to Apache Solr™ version 8.0.0
   [junit4]   2> 613305 INFO  (jetty-launcher-2630-thread-1) [    ] o.a.s.s.SolrDispatchFilter \__ \/ _ \ | '_|  Install dir: null
   [junit4]   2> 613305 INFO  (jetty-launcher-2630-thread-2) [    ] o.a.s.s.SolrDispatchFilter / __| ___| |_ _   Starting in cloud mode on port null
   [junit4]   2> 613305 INFO  (jetty-launcher-2630-thread-1) [    ] o.a.s.s.SolrDispatchFilter |___/\___/_|_|    Start time: 2018-02-22T12:55:38.197Z
   [junit4]   2> 613305 INFO  (jetty-launcher-2630-thread-2) [    ] o.a.s.s.SolrDispatchFilter \__ \/ _ \ | '_|  Install dir: null
   [junit4]   2> 613305 INFO  (jetty-launcher-2630-thread-2) [    ] o.a.s.s.SolrDispatchFilter |___/\___/_|_|    Start time: 2018-02-22T12:55:38.197Z
   [junit4]   2> 613307 INFO  (zkConnectionManagerCallback-2636-thread-1) [    ] o.a.s.c.c.ConnectionManager zkClient has connected
   [junit4]   2> 613308 INFO  (zkConnectionManagerCallback-2637-thread-1) [    ] o.a.s.c.c.ConnectionManager zkClient has connected
   [junit4]   2> 613308 INFO  (jetty-launcher-2630-thread-1) [    ] o.a.s.s.SolrDispatchFilter solr.xml found in ZooKeeper. Loading...
   [junit4]   2> 613308 INFO  (jetty-launcher-2630-thread-2) [    ] o.a.s.s.SolrDispatchFilter solr.xml found in ZooKeeper. Loading...
   [junit4]   2> 613317 INFO  (jetty-launcher-2630-thread-2) [    ] o.a.s.c.ZkContainer Zookeeper client=127.0.0.1:49472/solr
   [junit4]   2> 613317 INFO  (jetty-launcher-2630-thread-1) [    ] o.a.s.c.ZkContainer Zookeeper client=127.0.0.1:49472/solr
   [junit4]   2> 613319 INFO  (zkConnectionManagerCallback-2643-thread-1) [    ] o.a.s.c.c.ConnectionManager zkClient has connected
   [junit4]   2> 613319 INFO  (zkConnectionManagerCallback-2645-thread-1) [    ] o.a.s.c.c.ConnectionManager zkClient has connected
   [junit4]   2> 613322 INFO  (zkConnectionManagerCallback-2647-thread-1-processing-n:127.0.0.1:49482_solr) [n:127.0.0.1:49482_solr    ] o.a.s.c.c.ConnectionManager zkClient has connected
   [junit4]   2> 613323 INFO  (zkConnectionManagerCallback-2649-thread-1-processing-n:127.0.0.1:49483_solr) [n:127.0.0.1:49483_solr    ] o.a.s.c.c.ConnectionManager zkClient has connected
   [junit4]   2> 613477 INFO  (jetty-launcher-2630-thread-2) [n:127.0.0.1:49483_solr    ] o.a.s.c.Overseer Overseer (id=null) closing
   [junit4]   2> 613477 INFO  (jetty-launcher-2630-thread-1) [n:127.0.0.1:49482_solr    ] o.a.s.c.Overseer Overseer (id=null) closing
   [junit4]   2> 613478 INFO  (jetty-launcher-2630-thread-2) [n:127.0.0.1:49483_solr    ] o.a.s.c.OverseerElectionContext I am going to be the leader 127.0.0.1:49483_solr
   [junit4]   2> 613479 INFO  (jetty-launcher-2630-thread-1) [n:127.0.0.1:49482_solr    ] o.a.s.c.ZkController Register node as live in ZooKeeper:/live_nodes/127.0.0.1:49482_solr
   [junit4]   2> 613480 INFO  (jetty-launcher-2630-thread-2) [n:127.0.0.1:49483_solr    ] o.a.s.c.Overseer Overseer (id=72104285611098118-127.0.0.1:49483_solr-n_0000000000) starting
   [junit4]   2> 613483 INFO  (zkCallback-2648-thread-1-processing-n:127.0.0.1:49483_solr) [n:127.0.0.1:49483_solr    ] o.a.s.c.c.ZkStateReader Updated live nodes from ZooKeeper... (0) -> (1)
   [junit4]   2> 613483 INFO  (zkCallback-2646-thread-1-processing-n:127.0.0.1:49482_solr) [n:127.0.0.1:49482_solr    ] o.a.s.c.c.ZkStateReader Updated live nodes from ZooKeeper... (0) -> (1)
   [junit4]   2> 613495 DEBUG (OverseerAutoScalingTriggerThread-72104285611098118-127.0.0.1:49483_solr-n_0000000000) [n:127.0.0.1:49483_solr    ] o.a.s.c.a.OverseerTriggerThread Adding .autoAddReplicas trigger
   [junit4]   2> 613496 DEBUG (OverseerAutoScalingTriggerThread-72104285611098118-127.0.0.1:49483_solr-n_0000000000) [n:127.0.0.1:49483_solr    ] o.a.s.c.a.OverseerTriggerThread Refreshing /autoscaling.json with znode version 1
   [junit4]   2> 613497 INFO  (jetty-launcher-2630-thread-2) [n:127.0.0.1:49483_solr    ] o.a.s.c.ZkController Register node as live in ZooKeeper:/live_nodes/127.0.0.1:49483_solr
   [junit4]   2> 613497 DEBUG (OverseerAutoScalingTriggerThread-72104285611098118-127.0.0.1:49483_solr-n_0000000000) [n:127.0.0.1:49483_solr    ] o.a.s.c.a.NodeLostTrigger Initial livenodes: [127.0.0.1:49482_solr]
   [junit4]   2> 613497 DEBUG (OverseerAutoScalingTriggerThread-72104285611098118-127.0.0.1:49483_solr-n_0000000000) [n:127.0.0.1:49483_solr    ] o.a.s.c.a.OverseerTriggerThread Current znodeVersion 1, lastZnodeVersion -1
   [junit4]   2> 613497 DEBUG (OverseerAutoScalingTriggerThread-72104285611098118-127.0.0.1:49483_solr-n_0000000000) [n:127.0.0.1:49483_solr    ] o.a.s.c.a.OverseerTriggerThread Processed trigger updates upto znodeVersion 1
   [junit4]   2> 613499 INFO  (zkCallback-2648-thread-1-processing-n:127.0.0.1:49483_solr) [n:127.0.0.1:49483_solr    ] o.a.s.c.c.ZkStateReader Updated live nodes from ZooKeeper... (1) -> (2)
   [junit4]   2> 613499 INFO  (zkCallback-2646-thread-1-processing-n:127.0.0.1:49482_solr) [n:127.0.0.1:49482_solr    ] o.a.s.c.c.ZkStateReader Updated live nodes from ZooKeeper... (1) -> (2)
   [junit4]   2> 613501 DEBUG (OverseerAutoScalingTriggerThread-72104285611098118-127.0.0.1:49483_solr-n_0000000000) [n:127.0.0.1:49483_solr    ] o.a.s.c.a.OverseerTriggerThread -- clean old nodeAdded markers
   [junit4]   2> 613502 DEBUG (OverseerAutoScalingTriggerThread-72104285611098118-127.0.0.1:49483_solr-n_0000000000) [n:127.0.0.1:49483_solr    ] o.a.s.c.a.OverseerTriggerThread Current znodeVersion 1, lastZnodeVersion 1
   [junit4]   2> 613502 DEBUG (ScheduledTrigger-2200-thread-1) [n:127.0.0.1:49483_solr    ] o.a.s.c.a.NodeLostTrigger Running NodeLostTrigger: .auto_add_replicas with currently live nodes: 2
   [junit4]   2> 613613 INFO  (jetty-launcher-2630-thread-2) [n:127.0.0.1:49483_solr    ] o.a.s.m.r.SolrJmxReporter JMX monitoring for 'solr_49483.solr.node' (registry 'solr.node') enabled at server: com.sun.jmx.mbeanserver.JmxMBeanServer@343231f8
   [junit4]   2> 613615 INFO  (jetty-launcher-2630-thread-1) [n:127.0.0.1:49482_solr    ] o.a.s.m.r.SolrJmxReporter JMX monitoring for 'solr_49482.solr.node' (registry 'solr.node') enabled at server: com.sun.jmx.mbeanserver.JmxMBeanServer@343231f8
   [junit4]   2> 613620 INFO  (jetty-launcher-2630-thread-2) [n:127.0.0.1:49483_solr    ] o.a.s.m.r.SolrJmxReporter JMX monitoring for 'solr_49483.solr.jvm' (registry 'solr.jvm') enabled at server: com.sun.jmx.mbeanserver.JmxMBeanServer@343231f8
   [junit4]   2> 613620 INFO  (jetty-launcher-2630-thread-2) [n:127.0.0.1:49483_solr    ] o.a.s.m.r.SolrJmxReporter JMX monitoring for 'solr_49483.solr.jetty' (registry 'solr.jetty') enabled at server: com.sun.jmx.mbeanserver.JmxMBeanServer@343231f8
   [junit4]   2> 613621 INFO  (jetty-launcher-2630-thread-1) [n:127.0.0.1:49482_solr    ] o.a.s.m.r.SolrJmxReporter JMX monitoring for 'solr_49482.solr.jvm' (registry 'solr.jvm') enabled at server: com.sun.jmx.mbeanserver.JmxMBeanServer@343231f8
   [junit4]   2> 613621 INFO  (jetty-launcher-2630-thread-1) [n:127.0.0.1:49482_solr    ] o.a.s.m.r.SolrJmxReporter JMX monitoring for 'solr_49482.solr.jetty' (registry 'solr.jetty') enabled at server: com.sun.jmx.mbeanserver.JmxMBeanServer@343231f8
   [junit4]   2> 613621 INFO  (jetty-launcher-2630-thread-2) [n:127.0.0.1:49483_solr    ] o.a.s.c.CorePropertiesLocator Found 0 core definitions underneath /Users/jenkins/workspace/Lucene-Solr-master-MacOSX/solr/build/solr-core/test/J1/temp/solr.cloud.autoscaling.TriggerIntegrationTest_54F47F6708D5BAE4-001/tempDir-001/node2/.
   [junit4]   2> 613622 INFO  (jetty-launcher-2630-thread-1) [n:127.0.0.1:49482_solr    ] o.a.s.c.CorePropertiesLocator Found 0 core definitions underneath /Users/jenkins/workspace/Lucene-Solr-master-MacOSX/solr/build/solr-core/test/J1/temp/solr.cloud.autoscaling.TriggerIntegrationTest_54F47F6708D5BAE4-001/tempDir-001/node1/.
   [junit4]   2> 613666 INFO  (zkConnectionManagerCallback-2655-thread-1) [    ] o.a.s.c.c.ConnectionManager zkClient has connected
   [junit4]   2> 613670 INFO  (zkConnectionManagerCallback-2659-thread-1) [    ] o.a.s.c.c.ConnectionManager zkClient has connected
   [junit4]   2> 613672 INFO  (SUITE-TriggerIntegrationTest-seed#[54F47F6708D5BAE4]-worker) [    ] o.a.s.c.c.ZkStateReader Updated live nodes from ZooKeeper... (0) -> (2)
   [junit4]   2> 613674 INFO  (SUITE-TriggerIntegrationTest-seed#[54F47F6708D5BAE4]-worker) [    ] o.a.s.c.s.i.ZkClientClusterStateProvider Cluster at 127.0.0.1:49472/solr ready
   [junit4]   2> 613693 INFO  (TEST-TriggerIntegrationTest.testContinueTriggersOnOverseerRestart-seed#[54F47F6708D5BAE4]) [    ] o.a.s.SolrTestCaseJ4 ###Starting testContinueTriggersOnOverseerRestart
   [junit4]   2> 613696 INFO  (qtp552238129-7509) [n:127.0.0.1:49482_solr    ] o.a.s.h.a.CollectionsHandler Invoked Collection Action :overseerstatus with params action=OVERSEERSTATUS&wt=javabin&version=2 and sendToOCPQueue=true
   [junit4]   2> 613703 INFO  (qtp552238129-7509) [n:127.0.0.1:49482_solr    ] o.a.s.s.HttpSolrCall [admin] webapp=null path=/admin/collections params={action=OVERSEERSTATUS&wt=javabin&version=2} status=0 QTime=7
   [junit4]   2> 613704 INFO  (TEST-TriggerIntegrationTest.testContinueTriggersOnOverseerRestart-seed#[54F47F6708D5BAE4]) [    ] o.a.s.c.a.ScheduledTriggers -- removing trigger: .auto_add_replicas
   [junit4]   2> 613707 INFO  (TEST-TriggerIntegrationTest.testContinueTriggersOnOverseerRestart-seed#[54F47F6708D5BAE4]) [    ] o.a.s.c.a.TriggerIntegrationTest /autoscaling.json reset, new znode version 2
   [junit4]   2> 613707 DEBUG (zkCallback-2648-thread-1-processing-n:127.0.0.1:49483_solr) [n:127.0.0.1:49483_solr    ] o.a.s.c.a.OverseerTriggerThread Refreshing /autoscaling.json with znode version 2
   [junit4]   2> 613708 DEBUG (OverseerAutoScalingTriggerThread-72104285611098118-127.0.0.1:49483_solr-n_0000000000) [n:127.0.0.1:49483_solr    ] o.a.s.c.a.OverseerTriggerThread Processed trigger updates upto znodeVersion 2
   [junit4]   2> 613708 DEBUG (OverseerAutoScalingTriggerThread-72104285611098118-127.0.0.1:49483_solr-n_0000000000) [n:127.0.0.1:49483_solr    ] o.a.s.c.a.OverseerTriggerThread -- clean old nodeLost markers
   [junit4]   2> 613708 DEBUG (OverseerAutoScalingTriggerThread-72104285611098118-127.0.0.1:49483_solr-n_0000000000) [n:127.0.0.1:49483_solr    ] o.a.s.c.a.OverseerTriggerThread -- clean old nodeAdded markers
   [junit4]   2> 613708 DEBUG (OverseerAutoScalingTriggerThread-72104285611098118-127.0.0.1:49483_solr-n_0000000000) [n:127.0.0.1:49483_solr    ] o.a.s.c.a.OverseerTriggerThread Current znodeVersion 2, lastZnodeVersion 2
   [junit4]   2> 613709 INFO  (TEST-TriggerIntegrationTest.testContinueTriggersOnOverseerRestart-seed#[54F47F6708D5BAE4]) [    ] o.a.s.c.c.ZkStateReader Updated live nodes from ZooKeeper... (0) -> (2)
   [junit4]   2> 613711 INFO  (TEST-TriggerIntegrationTest.testContinueTriggersOnOverseerRestart-seed#[54F47F6708D5BAE4]) [    ] o.e.j.s.AbstractConnector Stopped ServerConnector@3a05d9ba{HTTP/1.1,[http/1.1]}{127.0.0.1:0}
   [junit4]   2> 613712 INFO  (TEST-TriggerIntegrationTest.testContinueTriggersOnOverseerRestart-seed#[54F47F6708D5BAE4]) [    ] o.a.s.c.CoreContainer Shutting down CoreContainer instance=818926883
   [junit4]   2> 613712 INFO  (TEST-TriggerIntegrationTest.testContinueTriggersOnOverseerRestart-seed#[54F47F6708D5BAE4]) [    ] o.a.s.m.SolrMetricManager Closing metric reporters for registry=solr.node, tag=null
   [junit4]   2> 613712 INFO  (TEST-TriggerIntegrationTest.testContinueTriggersOnOverseerRestart-seed#[54F47F6708D5BAE4]) [    ] o.a.s.m.r.SolrJmxReporter Closing reporter [org.apache.solr.metrics.reporters.SolrJmxReporter@7f0dc5fe: rootName = solr_49483, domain = solr.node, service url = null, agent id = null] for registry solr.node / com.codahale.metrics.MetricRegistry@4e3d22b
   [junit4]   2> 613721 INFO  (TEST-TriggerIntegrationTest.testContinueTriggersOnOverseerRestart-seed#[54F47F6708D5BAE4]) [    ] o.a.s.m.SolrMetricManager Closing metric reporters for registry=solr.jvm, tag=null
   [junit4]   2> 613721 INFO  (TEST-TriggerIntegrationTest.testContinueTriggersOnOverseerRestart-seed#[54F47F6708D5BAE4]) [    ] o.a.s.m.r.SolrJmxReporter Closing reporter [org.apache.solr.metrics.reporters.SolrJmxReporter@221e101b: rootName = solr_49483, domain = solr.jvm, service url = null, agent id = null] for registry solr.jvm / com.codahale.metrics.MetricRegistry@213a48a4
   [junit4]   2> 613725 INFO  (TEST-TriggerIntegrationTest.testContinueTriggersOnOverseerRestart-seed#[54F47F6708D5BAE4]) [    ] o.a.s.m.SolrMetricManager Closing metric reporters for registry=solr.jetty, tag=null
   [junit4]   2> 613726 INFO  (TEST-TriggerIntegrationTest.testContinueTriggersOnOverseerRestart-seed#[54F47F6708D5BAE4]) [    ] o.a.s.m.r.SolrJmxReporter Closing reporter [org.apache.solr.metrics.reporters.SolrJmxReporter@f547ab9: rootName = solr_49483, domain = solr.jetty, service url = null, agent id = null] for registry solr.jetty / com.codahale.metrics.MetricRegistry@4a181cbd
   [junit4]   2> 613728 INFO  (TEST-TriggerIntegrationTest.testContinueTriggersOnOverseerRestart-seed#[54F47F6708D5BAE4]) [    ] o.a.s.c.ZkController Remove node as live in ZooKeeper:/live_nodes/127.0.0.1:49483_solr
   [junit4]   2> 613729 INFO  (TEST-TriggerIntegrationTest.testContinueTriggersOnOverseerRestart-seed#[54F47F6708D5BAE4]) [    ] o.a.s.m.SolrMetricManager Closing metric reporters for registry=solr.cluster, tag=null
   [junit4]   2> 613729 INFO  (TEST-TriggerIntegrationTest.testContinueTriggersOnOverseerRestart-seed#[54F47F6708D5BAE4]) [    ] o.a.s.c.TransientSolrCoreCacheDefault Allocating transient cache for 2147483647 transient cores
   [junit4]   2> 613730 INFO  (TEST-TriggerIntegrationTest.testContinueTriggersOnOverseerRestart-seed#[54F47F6708D5BAE4]) [    ] o.a.s.c.Overseer Overseer (id=72104285611098118-127.0.0.1:49483_solr-n_0000000000) closing
   [junit4]   2> 613730 INFO  (zkCallback-2646-thread-1-processing-n:127.0.0.1:49482_solr) [n:127.0.0.1:49482_solr    ] o.a.s.c.c.ZkStateReader Updated live nodes from ZooKeeper... (2) -> (1)
   [junit4]   2> 613730 INFO  (zkCallback-2648-thread-1-processing-n:127.0.0.1:49483_solr) [n:127.0.0.1:49483_solr    ] o.a.s.c.c.ZkStateReader Updated live nodes from ZooKeeper... (2) -> (1)
   [junit4]   2> 613730 INFO  (OverseerStateUpdate-72104285611098118-127.0.0.1:49483_solr-n_0000000000) [n:127.0.0.1:49483_solr    ] o.a.s.c.Overseer Overseer Loop exiting : 127.0.0.1:49483_solr
   [junit4]   2> 613732 INFO  (zkCallback-2658-thread-1) [    ] o.a.s.c.c.ZkStateReader Updated live nodes from ZooKeeper... (2) -> (1)
   [junit4]   2> 613732 WARN  (OverseerAutoScalingTriggerThread-72104285611098118-127.0.0.1:49483_solr-n_0000000000) [n:127.0.0.1:49483_solr    ] o.a.s.c.a.OverseerTriggerThread OverseerTriggerThread woken up but we are closed, exiting.
   [junit4]   2> 613733 INFO  (zkCallback-2658-thread-2) [    ] o.a.s.c.c.ZkStateReader Updated live nodes from ZooKeeper... (2) -> (1)
   [junit4]   2> 613733 DEBUG (TEST-TriggerIntegrationTest.testContinueTriggersOnOverseerRestart-seed#[54F47F6708D5BAE4]) [    ] o.a.s.c.a.OverseerTriggerThread OverseerTriggerThread has been closed explicitly
   [junit4]   2> 613735 INFO  (zkCallback-2646-thread-1-processing-n:127.0.0.1:49482_solr) [n:127.0.0.1:49482_solr    ] o.a.s.c.OverseerElectionContext I am going to be the leader 127.0.0.1:49482_solr
   [junit4]   2> 613735 INFO  (TEST-TriggerIntegrationTest.testContinueTriggersOnOverseerRestart-seed#[54F47F6708D5BAE4]) [    ] o.e.j.s.h.ContextHandler Stopped o.e.j.s.ServletContextHandler@7343068f{/solr,null,UNAVAILABLE}
   [junit4]   2> 613735 INFO  (TEST-TriggerIntegrationTest.testContinueTriggersOnOverseerRestart-seed#[54F47F6708D5BAE4]) [    ] o.e.j.s.session Stopped scavenging
   [junit4]   2> 613737 INFO  (zkCallback-2646-thread-1-processing-n:127.0.0.1:49482_solr) [n:127.0.0.1:49482_solr    ] o.a.s.c.Overseer Overseer (id=72104285611098117-127.0.0.1:49482_solr-n_0000000001) starting
   [junit4]   2> 613747 DEBUG (OverseerAutoScalingTriggerThread-72104285611098117-127.0.0.1:49482_solr-n_0000000001) [n:127.0.0.1:49482_solr    ] o.a.s.c.a.OverseerTriggerThread Adding .autoAddReplicas trigger
   [junit4]   2> 613748 DEBUG (OverseerAutoScalingTriggerThread-72104285611098117-127.0.0.1:49482_solr-n_0000000001) [n:127.0.0.1:49482_solr    ] o.a.s.c.a.OverseerTriggerThread Refreshing /autoscaling.json with znode version 3
   [junit4]   2> 613748 DEBUG (OverseerAutoScalingTriggerThread-72104285611098117-127.0.0.1:49482_solr-n_0000000001) [n:127.0.0.1:49482_solr    ] o.a.s.c.a.NodeLostTrigger Initial livenodes: [127.0.0.1:49482_solr]
   [junit4]   2> 613748 DEBUG (OverseerAutoScalingTriggerThread-72104285611098117-127.0.0.1:49482_solr-n_0000000001) [n:127.0.0.1:49482_solr    ] o.a.s.c.a.OverseerTriggerThread Current znodeVersion 3, lastZnodeVersion -1
   [junit4]   2> 613748 DEBUG (OverseerAutoScalingTriggerThread-72104285611098117-127.0.0.1:49482_solr-n_0000000001) [n:127.0.0.1:49482_solr    ] o.a.s.c.a.OverseerTriggerThread Processed trigger updates upto znodeVersion 3
   [junit4]   2> 613752 DEBUG (OverseerAutoScalingTriggerThread-72104285611098117-127.0.0.1:49482_solr-n_0000000001) [n:127.0.0.1:49482_solr    ] o.a.s.c.a.OverseerTriggerThread -- clean old nodeAdded markers
   [junit4]   2> 613752 DEBUG (OverseerAutoScalingTriggerThread-72104285611098117-127.0.0.1:49482_solr-n_0000000001) [n:127.0.0.1:49482_solr    ] o.a.s.c.a.OverseerTriggerThread Current znodeVersion 3, lastZnodeVersion 3
   [junit4]   2> 613753 DEBUG (ScheduledTrigger-2209-thread-1) [n:127.0.0.1:49482_solr    ] o.a.s.c.a.NodeLostTrigger Running NodeLostTrigger: .auto_add_replicas with currently live nodes: 1
   [junit4]   2> 614764 DEBUG (ScheduledTrigger-2209-thread-1) [n:127.0.0.1:49482_solr    ] o.a.s.c.a.NodeLostTrigger Running NodeLostTrigger: .auto_add_replicas with currently live nodes: 1
   [junit4]   2> 615767 DEBUG (ScheduledTrigger-2209-thread-2) [n:127.0.0.1:49482_solr    ] o.a.s.c.a.NodeLostTrigger Running NodeLostTrigger: .auto_add_replicas with currently live nodes: 1
   [junit4]   2> 616777 DEBUG (ScheduledTrigger-2209-thread-1) [n:127.0.0.1:49482_solr    ] o.a.s.c.a.NodeLostTrigger Running NodeLostTrigger: .auto_add_replicas with currently live nodes: 1
   [junit4]   2> 617781 DEBUG (ScheduledTrigger-2209-thread-1) [n:127.0.0.1:49482_solr    ] o.a.s.c.a.NodeLostTrigger Running NodeLostTrigger: .auto_add_replicas with currently live nodes: 1
   [junit4]   2> 618738 INFO  (TEST-TriggerIntegrationTest.testContinueTriggersOnOverseerRestart-seed#[54F47F6708D5BAE4]) [    ] o.e.j.s.Server jetty-9.4.8.v20171121, build timestamp: 2017-11-21T15:27:37-06:00, git hash: 82b8fb23f757335bb3329d540ce37a2a2615f0a8
   [junit4]   2> 618740 INFO  (TEST-TriggerIntegrationTest.testContinueTriggersOnOverseerRestart-seed#[54F47F6708D5BAE4]) [    ] o.e.j.s.session DefaultSessionIdManager workerName=node0
   [junit4]   2> 618741 INFO  (TEST-TriggerIntegrationTest.testContinueTriggersOnOverseerRestart-seed#[54F47F6708D5BAE4]) [    ] o.e.j.s.session No SessionScavenger set, using defaults
   [junit4]   2> 618741 INFO  (TEST-TriggerIntegrationTest.testContinueTriggersOnOverseerRestart-seed#[54F47F6708D5BAE4]) [    ] o.e.j.s.session Scavenging every 600000ms
   [junit4]   2> 618741 INFO  (TEST-TriggerIntegrationTest.testContinueTriggersOnOverseerRestart-seed#[54F47F6708D5BAE4]) [    ] o.e.j.s.h.ContextHandler Started o.e.j.s.ServletContextHandler@299b06bf{/solr,null,AVAILABLE}
   [junit4]   2> 618742 INFO  (TEST-TriggerIntegrationTest.testContinueTriggersOnOverseerRestart-seed#[54F47F6708D5BAE4]) [    ] o.e.j.s.AbstractConnector Started ServerConnector@7f905835{HTTP/1.1,[http/1.1]}{127.0.0.1:49678}
   [junit4]   2> 618742 INFO  (TEST-TriggerIntegrationTest.testContinueTriggersOnOverseerRestart-seed#[54F47F6708D5BAE4]) [    ] o.e.j.s.Server Started @622903ms
   [junit4]   2> 618742 INFO  (TEST-TriggerIntegrationTest.testContinueTriggersOnOverseerRestart-seed#[54F47F6708D5BAE4]) [    ] o.a.s.c.s.e.JettySolrRunner Jetty properties: {hostContext=/solr, hostPort=49678}
   [junit4]   2> 618742 ERROR (TEST-TriggerIntegrationTest.testContinueTriggersOnOverseerRestart-seed#[54F47F6708D5BAE4]) [    ] o.a.s.u.StartupLoggingUtils Missing Java Option solr.log.dir. Logging may be missing or incomplete.
   [junit4]   2> 618744 INFO  (TEST-TriggerIntegrationTest.testContinueTriggersOnOverseerRestart-seed#[54F47F6708D5BAE4]) [    ] o.a.s.s.SolrDispatchFilter  ___      _       Welcome to Apache Solr™ version 8.0.0
   [junit4]   2> 618744 INFO  (TEST-TriggerIntegrationTest.testContinueTriggersOnOverseerRestart-seed#[54F47F6708D5BAE4]) [    ] o.a.s.s.SolrDispatchFilter / __| ___| |_ _   Starting in cloud mode on port null
   [junit4]   2> 618744 INFO  (TEST-TriggerIntegrationTest.testContinueTriggersOnOverseerRestart-seed#[54F47F6708D5BAE4]) [    ] o.a.s.s.SolrDispatchFilter \__ \/ _ \ | '_|  Install dir: null
   [junit4]   2> 618745 INFO  (TEST-TriggerIntegrationTest.testContinueTriggersOnOverseerRestart-seed#[54F47F6708D5BAE4]) [    ] o.a.s.s.SolrDispatchFilter |___/\___/_|_|    Start time: 2018-02-22T12:55:43.636Z
   [junit4]   2> 618748 INFO  (zkConnectionManagerCallback-2662-thread-1) [    ] o.a.s.c.c.ConnectionManager zkClient has connected
   [junit4]   2> 618749 INFO  (TEST-TriggerIntegrationTest.testContinueTriggersOnOverseerRestart-seed#[54F47F6708D5BAE4]) [    ] o.a.s.s.SolrDispatchFilter solr.xml found in ZooKeeper. Loading...
   [junit4]   2> 618760 INFO  (TEST-TriggerIntegrationTest.testContinueTriggersOnOverseerRestart-seed#[54F47F6708D5BAE4]) [    ] o.a.s.c.ZkContainer Zookeeper client=127.0.0.1:49472/solr
   [junit4]   2> 618761 INFO  (zkConnectionManagerCallback-2666-thread-1) [    ] o.a.s.c.c.ConnectionManager zkClient has connected
   [junit4]   2> 618765 INFO  (zkConnectionManagerCallback-2668-thread-1-processing-n:127.0.0.1:49678_solr) [n:127.0.0.1:49678_solr    ] o.a.s.c.c.ConnectionManager zkClient has connected
   [junit4]   2> 618777 INFO  (TEST-TriggerIntegrationTest.testContinueTriggersOnOverseerRestart-seed#[54F47F6708D5BAE4]) [n:127.0.0.1:49678_solr    ] o.a.s.c.c.ZkStateReader Updated live nodes from ZooKeeper... (0) -> (1)
   [junit4]   2> 618780 INFO  (TEST-TriggerIntegrationTest.testContinueTriggersOnOverseerRestart-seed#[54F47F6708D5BAE4]) [n:127.0.0.1:49678_solr    ] o.a.s.c.Overseer Overseer (id=null) closing
   [junit4]   2> 618784 INFO  (TEST-TriggerIntegrationTest.testContinueTriggersOnOverseerRestart-seed#[54F47F6708D5BAE4]) [n:127.0.0.1:49678_solr    ] o.a.s.c.ZkController Register node as live in ZooKeeper:/live_nodes/127.0.0.1:49678_solr
   [junit4]   2> 618790 DEBUG (ScheduledTrigger-2209-thread-1) [n:127.0.0.1:49482_solr    ] o.a.s.c.a.NodeLostTrigger Running NodeLostTrigger: .auto_add_replicas with currently live nodes: 1
   [junit4]   2> 618790 INFO  (zkCallback-2646-thread-1-processing-n:127.0.0.1:49482_solr) [n:127.0.0.1:49482_solr    ] o.a.s.c.c.ZkStateReader Updated live nodes from ZooKeeper... (1) -> (2)
   [junit4]   2> 618790 INFO  (zkCallback-2658-thread-2) [    ] o.a.s.c.c.ZkStateReader Updated live nodes from ZooKeeper... (1) -> (2)
   [junit4]   2> 618790 INFO  (zkCallback-2658-thread-1) [    ] o.a.s.c.c.ZkStateReader Updated live nodes from ZooKeeper... (1) -> (2)
   [junit4]   2> 618791 INFO  (zkCallback-2667-thread-1-processing-n:127.0.0.1:49678_solr) [n:127.0.0.1:49678_solr    ] o.a.s.c.c.ZkStateReader Updated live nodes from ZooKeeper... (1) -> (2)
   [junit4]   2> 618897 INFO  (TEST-TriggerIntegrationTest.testContinueTriggersOnOverseerRestart-seed#[54F47F6708D5BAE4]) [n:127.0.0.1:49678_solr    ] o.a.s.m.r.SolrJmxReporter JMX monitoring for 'solr_49678.solr.node' (registry 'solr.node') enabled at server: com.sun.jmx.mbeanserver.JmxMBeanServer@343231f8
   [junit4]   2> 618907 INFO  (TEST-TriggerIntegrationTest.testContinueTriggersOnOverseerRestart-seed#[54F47F6708D5BAE4]) [n:127.0.0.1:49678_solr    ] o.a.s.m.r.SolrJmxReporter JMX monitoring for 'solr_49678.solr.jvm' (registry 'solr.jvm') enabled at server: com.sun.jmx.mbeanserver.JmxMBeanServer@343231f8
   [junit4]   2> 618907 INFO  (TEST-TriggerIntegrationTest.testContinueTriggersOnOverseerRestart-seed#[54F47F6708D5BAE4]) [n:127.0.0.1:49678_solr    ] o.a.s.m.r.SolrJmxReporter JMX monitoring for 'solr_49678.solr.jetty' (registry 'solr.jetty') enabled at server: com.sun.jmx.mbeanserver.JmxMBeanServer@343231f8
   [junit4]   2> 618909 INFO  (TEST-TriggerIntegrationTest.testContinueTriggersOnOverseerRestart-seed#[54F47F6708D5BAE4]) [n:127.0.0.1:49678_solr    ] o.a.s.c.CorePropertiesLocator Found 0 core definitions underneath /Users/jenkins/workspace/Lucene-Solr-master-MacOSX/solr/build/solr-core/test/J1/temp/solr.cloud.autoscaling.TriggerIntegrationTest_54F47F6708D5BAE4-001/tempDir-001/node3/.
   [junit4]   2> 618951 INFO  (qtp552238129-7511) [n:127.0.0.1:49482_solr    ] o.a.s.h.a.CollectionsHandler Invoked Collection Action :overseerstatus with params action=OVERSEERSTATUS&wt=javabin&version=2 and sendToOCPQueue=true
   [junit4]   2> 618958 INFO  (qtp552238129-7511) [n:127.0.0.1:49482_solr    ] o.a.s.s.HttpSolrCall [admin] webapp=null path=/admin/collections params={action=OVERSEERSTATUS&wt=javabin&version=2} status=0 QTime=7
   [junit4]   2> 618964 INFO  (qtp552238129-7511) [n:127.0.0.1:49482_solr    ] o.a.s.s.HttpSolrCall [admin] webapp=null path=/admin/metrics params={prefix=CONTAINER.fs.usableSpace,CORE.coreName&wt=javabin&version=2&group=solr.node,solr.core} status=0 QTime=0
   [junit4]   2> 618966 INFO  (qtp1500863989-7586) [n:127.0.0.1:49678_solr    ] o.a.s.s.HttpSolrCall [admin] webapp=null path=/admin/metrics params={prefix=CONTAINER.fs.usableSpace,CORE.coreName&wt=javabin&version=2&group=solr.node,solr.core} status=0 QTime=0
   [junit4]   2> 618966 DEBUG (qtp1500863989-7582) [n:127.0.0.1:49678_solr    ] o.a.s.c.a.AutoScalingHandler Verified autoscaling configuration
   [junit4]   2> 618967 INFO  (qtp1500863989-7582) [n:127.0.0.1:49678_solr    ] o.a.s.s.HttpSolrCall [admin] webapp=null path=/cluster/autoscaling params={wt=javabin&version=2} status=0 QTime=5
   [junit4]   2> 618968 DEBUG (zkCallback-2646-thread-1-processing-n:127.0.0.1:49482_solr) [n:127.0.0.1:49482_solr    ] o.a.s.c.a.OverseerTriggerThread Refreshing /autoscaling.json with znode version 4
   [junit4]   2> 618968 DEBUG (zkCallback-2646-thread-1-processing-n:127.0.0.1:49482_solr) [n:127.0.0.1:49482_solr    ] o.a.s.c.a.NodeAddedTrigger Initial livenodes: [127.0.0.1:49482_solr, 127.0.0.1:49678_solr]
   [junit4]   2> 618968 DEBUG (zkCallback-2646-thread-1-processing-n:127.0.0.1:49482_solr) [n:127.0.0.1:49482_solr    ] o.a.s.c.a.NodeAddedTrigger NodeAddedTrigger node_added_triggerCTOOR instantiated with properties: {event=nodeAdded, waitFor=3, actions=[{name=test, class=org.apache.solr.cloud.autoscaling.TriggerIntegrationTest$TestTriggerAction}], enabled=true}
   [junit4]   2> 618969 DEBUG (zkCallback-2646-thread-1-processing-n:127.0.0.1:49482_solr) [n:127.0.0.1:49482_solr    ] o.a.s.c.a.NodeLostTrigger Initial livenodes: [127.0.0.1:49482_solr, 127.0.0.1:49678_solr]
   [junit4]   2> 618969 DEBUG (OverseerAutoScalingTriggerThread-72104285611098117-127.0.0.1:49482_solr-n_0000000001) [n:127.0.0.1:49482_solr    ] o.a.s.c.a.OverseerTriggerThread Processed trigger updates upto znodeVersion 4
   [junit4]   2> 618971 INFO  (OverseerAutoScalingTriggerThread-72104285611098117-127.0.0.1:49482_solr-n_0000000001) [n:127.0.0.1:49482_solr    ] o.a.s.c.a.TriggerIntegrationTest TestTriggerAction init
   [junit4]   2> 618973 DEBUG (ScheduledTrigger-2209-thread-3) [n:127.0.0.1:49482_solr    ] o.a.s.c.a.NodeAddedTrigger Running NodeAddedTrigger node_added_triggerCTOOR
   [junit4]   2> 618973 DEBUG (ScheduledTrigger-2209-thread-3) [n:127.0.0.1:49482_solr    ] o.a.s.c.a.NodeAddedTrigger Found livenodes: 2
   [junit4]   2> 618974 DEBUG (OverseerAutoScalingTriggerThread-72104285611098117-127.0.0.1:49482_solr-n_0000000001) [n:127.0.0.1:49482_solr    ] o.a.s.c.a.OverseerTriggerThread Current znodeVersion 4, lastZnodeVersion 4
   [junit4]   2> 618974 INFO  (TEST-TriggerIntegrationTest.testContinueTriggersOnOverseerRestart-seed#[54F47F6708D5BAE4]) [    ] o.e.j.s.AbstractConnector Stopped ServerConnector@34bf105a{HTTP/1.1,[http/1.1]}{127.0.0.1:0}
   [junit4]   2> 618975 INFO  (TEST-TriggerIntegrationTest.testContinueTriggersOnOverseerRestart-seed#[54F47F6708D5BAE4]) [    ] o.a.s.c.CoreContainer Shutting down CoreContainer instance=396635959
   [junit4]   2> 618975 INFO  (TEST-TriggerIntegrationTest.testContinueTriggersOnOverseerRestart-seed#[54F47F6708D5BAE4]) [    ] o.a.s.m.SolrMetricManager Closing metric reporters for registry=solr.node, tag=null
   [junit4]   2> 618975 INFO  (TEST-TriggerIntegrationTest.testContinueTriggersOnOverseerRestart-seed#[54F47F6708D5BAE4]) [    ] o.a.s.m.r.SolrJmxReporter Closing reporter [org.apache.solr.metrics.reporters.SolrJmxReporter@3b7ba7cf: rootName = solr_49482, domain = solr.node, service url = null, agent id = null] for registry solr.node / com.codahale.metrics.MetricRegistry@372f5603
   [junit4]   2> 618981 INFO  (TEST-TriggerIntegrationTest.testContinueTriggersOnOverseerRestart-seed#[54F47F6708D5BAE4]) [    ] o.a.s.m.SolrMetricManager Closing metric reporters for registry=solr.jvm, tag=null
   [junit4]   2> 618986 INFO  (TEST-TriggerIntegrationTest.testContinueTriggersOnOverseerRestart-seed#[54F47F6708D5BAE4]) [    ] o.a.s.m.r.SolrJmxReporter Closing reporter [org.apache.solr.metrics.reporters.SolrJmxReporter@62e746e0: rootName = solr_49482, domain = solr.jvm, service url = null, agent id = null] for registry solr.jvm / com.codahale.metrics.MetricRegistry@213a48a4
   [junit4]   2> 618989 INFO  (TEST-TriggerIntegrationTest.testContinueTriggersOnOverseerRestart-seed#[54F47F6708D5BAE4]) [    ] o.a.s.m.SolrMetricManager Closing metric reporters for registry=solr.jetty, tag=null
   [junit4]   2> 618989 INFO  (TEST-TriggerIntegrationTest.testContinueTriggersOnOverseerRestart-seed#[54F47F6708D5BAE4]) [    ] o.a.s.m.r.SolrJmxReporter Closing reporter [org.apache.solr.metrics.reporters.SolrJmxReporter@17462851: rootName = solr_49482, domain = solr.jetty, service url = null, agent id = null] for registry solr.jetty / com.codahale.metrics.MetricRegistry@4a181cbd
   [junit4]   2> 618991 INFO  (TEST-TriggerIntegrationTest.testContinueTriggersOnOverseerRestart-seed#[54F47F6708D5BAE4]) [    ] o.a.s.c.ZkController Remove node as live in ZooKeeper:/live_nodes/127.0.0.1:49482_solr
   [junit4]   2> 618993 INFO  (zkCallback-2667-thread-1-processing-n:127.0.0.1:49678_solr) [n:127.0.0.1:49678_solr    ] o.a.s.c.c.ZkStateReader Updated live nodes from ZooKeeper... (2) -> (1)
   [junit4]   2> 618993 INFO  (zkCallback-2658-thread-1) [    ] o.a.s.c.c.ZkStateReader Updated live nodes from ZooKeeper... (2) -> (1)
   [junit4]   2> 618994 INFO  (zkCallback-2646-thread-1-processing-n:127.0.0.1:49482_solr) [n:127.0.0.1:49482_solr    ] o.a.s.c.c.ZkStateReader Updated live nodes from ZooKeeper... (2) -> (1)
   [junit4]   2> 618994 INFO  (zkCallback-2658-thread-2) [    ] o.a.s.c.c.ZkStateReader Updated live nodes from ZooKeeper... (2) -> (1)
   [junit4]   2> 618994 INFO  (TEST-TriggerIntegrationTest.testContinueTriggersOnOverseerRestart-seed#[54F47F6708D5BAE4]) [    ] o.a.s.m.SolrMetricManager Closing metric reporters for registry=solr.cluster, tag=null
   [junit4]   2> 618995 INFO  (TEST-TriggerIntegrationTest.testContinueTriggersOnOverseerRestart-seed#[54F47F6708D5BAE4]) [    ] o.a.s.c.TransientSolrCoreCacheDefault Allocating transient cache for 2147483647 transient cores
   [junit4]   2> 618995 INFO  (TEST-TriggerIntegrationTest.testContinueTriggersOnOverseerRestart-seed#[54F47F6708D5BAE4]) [    ] o.a.s.c.Overseer Overseer (id=72104285611098117-127.0.0.1:49482_solr-n_0000000001) closing
   [junit4]   2> 618995 INFO  (OverseerStateUpdate-72104285611098117-127.0.0.1:49482_solr-n_0000000001) [n:127.0.0.1:49482_solr    ] o.a.s.c.Overseer Overseer Loop exiting : 127.0.0.1:49482_solr
   [junit4]   2> 618997 WARN  (OverseerAutoScalingTriggerThread-72104285611098117-127.0.0.1:49482_solr-n_0000000001) [n:127.0.0.1:49482_solr    ] o.a.s.c.a.OverseerTriggerThread OverseerTriggerThread woken up but we are closed, exiting.
   [junit4]   2> 618998 DEBUG (TEST-TriggerIntegrationTest.testContinueTriggersOnOverseerRestart-seed#[54F47F6708D5BAE4]) [    ] o.a.s.c.a.OverseerTriggerThread OverseerTriggerThread has been closed explicitly
   [junit4]   2> 619000 INFO  (zkCallback-2667-thread-1-processing-n:127.0.0.1:49678_solr) [n:127.0.0.1:49678_solr    ] o.a.s.c.OverseerElectionContext I am going to be the leader 127.0.0.1:49678_solr
   [junit4]   2> 619000 INFO  (TEST-TriggerIntegrationTest.testContinueTriggersOnOverseerRestart-seed#[54F47F6708D5BAE4]) [    ] o.e.j.s.h.ContextHandler Stopped o.e.j.s.ServletContextHandler@25a77c07{/solr,null,UNAVAILABLE}
   [junit4]   2> 619001 INFO  (TEST-TriggerIntegrationTest.testContinueTriggersOnOverseerRestart-seed#[54F47F6708D5BAE4]) [    ] o.e.j.s.session Stopped scavenging
   [junit4]   2> 619001 INFO  (zkCallback-2667-thread-1-processing-n:127.0.0.1:49678_solr) [n:127.0.0.1:49678_solr    ] o.a.s.c.Overseer Overseer (id=72104285611098123-127.0.0.1:49678_solr-n_0000000002) starting
   [junit4]   2> 619011 DEBUG (OverseerAutoScalingTriggerThread-72104285611098123-127.0.0.1:49678_solr-n_0000000002) [n:127.0.0.1:49678_solr    ] o.a.s.c.a.OverseerTriggerThread Refreshing /autoscaling.json with znode version 4
   [junit4]   2> 619012 DEBUG (OverseerAutoScalingTriggerThread-72104285611098123-127.0.0.1:49678_solr-n_0000000002) [n:127.0.0.1:49678_solr    ] o.a.s.c.a.NodeAddedTrigger Initial livenodes: [127.0.0.1:49678_solr]
   [junit4]   2> 619012 DEBUG (OverseerAutoScalingTriggerThread-72104285611098123-127.0.0.1:49678_solr-n_0000000002) [n:127.0.0.1:49678_solr    ] o.a.s.c.a.NodeAddedTrigger NodeAddedTrigger node_added_triggerCTOOR instantiated with properties: {event=nodeAdded, waitFor=3, actions=[{name=test, class=org.apache.solr.cloud.autoscaling.TriggerIntegrationTest$TestTriggerAction}], enabled=true}
   [junit4]   2> 619012 DEBUG (OverseerAutoScalingTriggerThread-72104285611098123-127.0.0.1:49678_solr-n_0000000002) [n:127.0.0.1:49678_solr    ] o.a.s.c.a.NodeLostTrigger Initial livenodes: [127.0.0.1:49678_solr]
   [junit4]   2> 619012 DEBUG (OverseerAutoScalingTriggerThread-72104285611098123-127.0.0.1:49678_solr-n_0000000002) [n:127.0.0.1:49678_solr    ] o.a.s.c.a.OverseerTriggerThread Current znodeVersion 4, lastZnodeVersion -1
   [junit4]   2> 619012 DEBUG (OverseerAutoScalingTriggerThread-72104285611098123-127.0.0.1:49678_solr-n_0000000002) [n:127.0.0.1:49678_solr    ] o.a.s.c.a.OverseerTriggerThread Processed trigger updates upto znodeVersion 4
   [junit4]   2> 619013 INFO  (OverseerAutoScalingTriggerThread-72104285611098123-127.0.0.1:49678_solr-n_0000000002) [n:127.0.0.1:49678_solr    ] o.a.s.c.a.TriggerIntegrationTest TestTriggerAction init
   [junit4]   2> 619015 DEBUG (OverseerAutoScalingTriggerThread-72104285611098123-127.0.0.1:49678_solr-n_0000000002) [n:127.0.0.1:49678_solr    ] o.a.s.c.a.NodeLostTrigger Adding lost node from marker path: 127.0.0.1:49482_solr
   [junit4]   2> 619015 DEBUG (ScheduledTrigger-2220-thread-1) [n:127.0.0.1:49678_solr    ] o.a.s.c.a.NodeAddedTrigger Running NodeAddedTrigger node_added_triggerCTOOR
   [junit4]   2> 619015 DEBUG (ScheduledTrigger-2220-thread-1) [n:127.0.0.1:49678_solr    ] o.a.s.c.a.NodeAddedTrigger Found livenodes: 1
   [junit4]   2> 619016 DEBUG (OverseerAutoScalingTriggerThread-72104285611098123-127.0.0.1:49678_solr-n_0000000002) [n:127.0.0.1:49678_solr    ] o.a.s.c.a.OverseerTriggerThread Current znodeVersion 4, lastZnodeVersion 4
   [junit4]   2> 619017 DEBUG (ScheduledTrigger-2220-thread-2) [n:127.0.0.1:49678_solr    ] o.a.s.c.a.NodeLostTrigger Running NodeLostTrigger: .auto_add_replicas with currently live nodes: 1
   [junit4]   2> 620026 DEBUG (ScheduledTrigger-2220-thread-1) [n:127.0.0.1:49678_solr    ] o.a.s.c.a.NodeAddedTrigger Running NodeAddedTrigger node_added_triggerCTOOR
   [junit4]   2> 620027 DEBUG (ScheduledTrigger-2220-thread-1) [n:127.0.0.1:49678_solr    ] o.a.s.c.a.NodeAddedTrigger Found livenodes: 1
   [junit4]   2> 620027 DEBUG (ScheduledTrigger-2220-thread-3) [n:127.0.0.1:49678_solr    ] o.a.s.c.a.NodeLostTrigger Running NodeLostTrigger: .auto_add_replicas with currently live nodes: 1
   [junit4]   2> 621037 DEBUG (ScheduledTrigger-2220-thread-1) [n:127.0.0.1:49678_solr    ] o.a.s.c.a.NodeAddedTrigger Running NodeAddedTrigger node_added_triggerCTOOR
   [junit4]   2> 621037 DEBUG (ScheduledTrigger-2220-thread-4) [n:127.0.0.1:49678_solr    ] o.a.s.c.a.NodeLostTrigger Running NodeLostTrigger: .auto_add_replicas with currently live nodes: 1
   [junit4]   2> 621037 DEBUG (ScheduledTrigger-2220-thread-1) [n:127.0.0.1:49678_solr    ] o.a.s.c.a.NodeAddedTrigger Found livenodes: 1
   [junit4]   2> 622040 DEBUG (ScheduledTrigger-2220-thread-4) [n:127.0.0.1:49678_solr    ] o.a.s.c.a.NodeLostTrigger Running NodeLostTrigger: .auto_add_replicas with currently live nodes: 1
   [junit4]   2> 622041 DEBUG (ScheduledTrigger-2220-thread-3) [n:127.0.0.1:49678_solr    ] o.a.s.c.a.NodeAddedTrigger Running NodeAddedTrigger node_added_triggerCTOOR
   [junit4]   2> 622041 DEBUG (ScheduledTrigger-2220-thread-3) [n:127.0.0.1:49678_solr    ] o.a.s.c.a.NodeAddedTrigger Found livenodes: 1
   [junit4]   2> 623043 DEBUG (ScheduledTrigger-2220-thread-4) [n:127.0.0.1:49678_solr    ] o.a.s.c.a.NodeLostTrigger Running NodeLostTrigger: .auto_add_replicas with currently live nodes: 1
   [junit4]   2> 623043 DEBUG (ScheduledTrigger-2220-thread-4) [n:127.0.0.1:49678_solr    ] o.a.s.c.a.NodeAddedTrigger Running NodeAddedTrigger node_added_triggerCTOOR
   [junit4]   2> 623043 DEBUG (ScheduledTrigger-2220-thread-4) [n:127.0.0.1:49678_solr    ] o.a.s.c.a.NodeAddedTrigger Found livenodes: 1
   [junit4]   2> 624045 DEBUG (ScheduledTrigger-2220-thread-4) [n:127.0.0.1:49678_solr    ] o.a.s.c.a.NodeLostTrigger Running NodeLostTrigger: .auto_add_replicas with currently live nodes: 1
   [junit4]   2> 624045 DEBUG (ScheduledTrigger-2220-thread-3) [n:127.0.0.1:49678_solr    ] o.a.s.c.a.NodeAddedTrigger Running NodeAddedTrigger node_added_triggerCTOOR
   [junit4]   2> 624045 DEBUG (ScheduledTrigger-2220-thread-3) [n:127.0.0.1:49678_solr    ] o.a.s.c.a.NodeAddedTrigger Found livenodes: 1
   [junit4]   2> 625045 DEBUG (ScheduledTrigger-2220-thread-4) [n:127.0.0.1:49678_solr    ] o.a.s.c.a.NodeLostTrigger Running NodeLostTrigger: .auto_add_replicas with currently live nodes: 1
   [junit4]   2> 625045 DEBUG (ScheduledTrigger-2220-thread-2) [n:127.0.0.1:49678_solr    ] o.a.s.c.a.NodeAddedTrigger Running NodeAddedTrigger node_added_triggerCTOOR
   [junit4]   2> 625046 DEBUG (ScheduledTrigger-2220-thread-2) [n:127.0.0.1:49678_solr    ] o.a.s.c.a.NodeAddedTrigger Found livenodes: 1
   [junit4]   2> 626049 DEBUG (ScheduledTrigger-2220-thread-4) [n:127.0.0.1:49678_solr    ] o.a.s.c.a.NodeLostTrigger Running NodeLostTrigger: .auto_add_replicas with currently live nodes: 1
   [junit4]   2> 626049 DEBUG (ScheduledTrigger-2220-thread-1) [n:127.0.0.1:49678_solr    ] o.a.s.c.a.NodeAddedTrigger Running NodeAddedTrigger node_added_triggerCTOOR
   [junit4]   2> 626049 DEBUG (ScheduledTrigger-2220-thread-1) [n:127.0.0.1:49678_solr    ] o.a.s.c.a.NodeAddedTrigger Found livenodes: 1
   [junit4]   2> 627052 DEBUG (ScheduledTrigger-2220-thread-4) [n:127.0.0.1:49678_solr    ] o.a.s.c.a.NodeLostTrigger Running NodeLostTrigger: .auto_add_replicas with currently live nodes: 1
   [junit4]   2> 627052 DEBUG (ScheduledTrigger-2220-thread-2) [n:127.0.0.1:49678_solr    ] o.a.s.c.a.NodeAddedTrigger Running NodeAddedTrigger node_added_triggerCTOOR
   [junit4]   2> 627052 DEBUG (ScheduledTrigger-2220-thread-2) [n:127.0.0.1:49678_solr    ] o.a.s.c.a.NodeAddedTrigger Found livenodes: 1
   [junit4]   2> 628062 DEBUG (ScheduledTrigger-2220-thread-4) [n:127.0.0.1:49678_solr    ] o.a.s.c.a.NodeLostTrigger Running NodeLostTrigger: .auto_add_replicas with currently live nodes: 1
   [junit4]   2> 628062 DEBUG (ScheduledTrigger-2220-thread-4) [n:127.0.0.1:49678_solr    ] o.a.s.c.a.NodeAddedTrigger Running NodeAddedTrigger node_added_triggerCTOOR
   [junit4]   2> 628063 DEBUG (ScheduledTrigger-2220-thread-4) [n:127.0.0.1:49678_solr    ] o.a.s.c.a.NodeAddedTrigger Found livenodes: 1
   [junit4]   2> 629009 INFO  (TEST-TriggerIntegrationTest.testContinueTriggersOnOverseerRestart-seed#[54F47F6708D5BAE4]) [    ] o.e.j.s.Server jetty-9.4.8.v20171121, build timestamp: 2017-11-21T15:27:37-06:00, git hash: 82b8fb23f757335bb3329d540ce37a2a2615f0a8
   [junit4]   2> 629014 INFO  (TEST-TriggerIntegrationTest.testContinueTriggersOnOverseerRestart-seed#[54F47F6708D5BAE4]) [    ] o.e.j.s.session DefaultSessionIdManager workerName=node0
   [junit4]   2> 629014 INFO  (TEST-TriggerIntegrationTest.testContinueTriggersOnOverseerRestart-seed#[54F47F6708D5BAE4]) [    ] o.e.j.s.session No SessionScavenger set, using defaults
   [junit4]   2> 629014 INFO  (TEST-TriggerIntegrationTest.testContinueTriggersOnOverseerRestart-seed#[54F47F6708D5BAE4]) [    ] o.e.j.s.session Scavenging every 660000ms
   [junit4]   2> 629016 INFO  (TEST-TriggerIntegrationTest.testContinueTriggersOnOverseerRestart-seed#[54F47F6708D5BAE4]) [    ] o.e.j.s.h.ContextHandler Started o.e.j.s.ServletContextHandler@163adea0{/solr,null,AVAILABLE}
   [junit4]   2> 629017 INFO  (TEST-TriggerIntegrationTest.testContinueTriggersOnOverseerRestart-seed#[54F47F6708D5BAE4]) [    ] o.e.j.s.AbstractConnector Started ServerConnector@1d13153f{HTTP/1.1,[http/1.1]}{127.0.0.1:49694}
   [junit4]   2> 629017 INFO  (TEST-TriggerIntegrationTest.testContinueTriggersOnOverseerRestart-seed#[54F47F6708D5BAE4]) [    ] o.e.j.s.Server Started @633178ms
   [junit4]   2> 629017 INFO  (TEST-TriggerIntegrationTest.testContinueTriggersOnOverseerRestart-seed#[54F47F6708D5BAE4]) [    ] o.a.s.c.s.e.JettySolrRunner Jetty properties: {hostContext=/solr, hostPort=49694}
   [junit4]   2> 629017 ERROR (TEST-TriggerIntegrationTest.testContinueTriggersOnOverseerRestart-seed#[54F47F6708D5BAE4]) [    ] o.a.s.u.StartupLoggingUtils Missing Java Option solr.log.dir. Logging may be missing or incomplete.
   [junit4]   2> 629019 INFO  (TEST-TriggerIntegrationTest.testContinueTriggersOnOverseerRestart-seed#[54F47F6708D5BAE4]) [    ] o.a.s.s.SolrDispatchFilter  ___      _       Welcome to Apache Solr™ version 8.0.0
   [junit4]   2> 629019 INFO  (TEST-TriggerIntegrationTest.testContinueTriggersOnOverseerRestart-seed#[54F47F6708D5BAE4]) [    ] o.a.s.s.SolrDispatchFilter / __| ___| |_ _   Starting in cloud mode on port null
   [junit4]   2> 629019 INFO  (TEST-TriggerIntegrationTest.testContinueTriggersOnOverseerRestart-seed#[54F47F6708D5BAE4]) [    ] o.a.s.s.SolrDispatchFilter \__ \/ _ \ | '_|  Install dir: null
   [junit4]   2> 629019 INFO  (TEST-TriggerIntegrationTest.testContinueTriggersOnOverseerRestart-seed#[54F47F6708D5BAE4]) [    ] o.a.s.s.SolrDispatchFilter |___/\___/_|_|    Start time: 2018-02-22T12:55:53.911Z
   [junit4]   2> 629022 INFO  (zkConnectionManagerCallback-2672-thread-1) [    ] o.a.s.c.c.ConnectionManager zkClient has connected
   [junit4]   2> 629023 INFO  (TEST-TriggerIntegrationTest.testContinueTriggersOnOverseerRestart-seed#[54F47F6708D5BAE4]) [    ] o.a.s.s.SolrDispatchFilter solr.xml found in ZooKeeper. Loading...
   [junit4]   2> 629039 INFO  (TEST-TriggerIntegrationTest.testContinueTriggersOnOverseerRestart-seed#[54F47F6708D5BAE4]) [    ] o.a.s.c.ZkContainer Zookeeper client=127.0.0.1:49472/solr
   [junit4]   2> 629040 INFO  (zkConnectionManagerCallback-2676-thread-1) [    ] o.a.s.c.c.ConnectionManager zkClient has connected
   [junit4]   2> 629044 INFO  (zkConnectionManagerCallback-2678-thread-1-processing-n:127.0.0.1:49694_solr) [n:127.0.0.1:49694_solr    ] o.a.s.c.c.ConnectionManager zkClient has connected
   [junit4]   2> 629058 INFO  (TEST-TriggerIntegrationTest.testContinueTriggersOnOverseerRestart-seed#[54F47F6708D5BAE4]) [n:127.0.0.1:49694_solr    ] o.a.s.c.c.ZkStateReader Updated live nodes from ZooKeeper... (0) -> (1)
   [junit4]   2> 629063 DEBUG (ScheduledTrigger-2220-thread-4) [n:127.0.0.1:49678_solr    ] o.a.s.c.a.NodeLostTrigger Running NodeLostTrigger: .auto_add_replicas with currently live nodes: 1
   [junit4]   2> 629063 DEBUG (ScheduledTrigger-2220-thread-2) [n:127.0.0.1:49678_solr    ] o.a.s.c.a.NodeAddedTrigger Running NodeAddedTrigger node_added_triggerCTOOR
   [junit4]   2> 629063 DEBUG (ScheduledTrigger-2220-thread-2) [n:127.0.0.1:49678_solr    ] o.a.s.c.a.NodeAddedTrigger Found livenodes: 1
   [junit4]   2> 629063 INFO  (TEST-TriggerIntegrationTest.testContinueTriggersOnOverseerRestart-seed#[54F47F6708D5BAE4]) [n:127.0.0.1:49694_solr    ] o.a.s.c.Overseer Overseer (id=null) closing
   [junit4]   2> 629067 INFO  (TEST-TriggerIntegrationTest.testContinueTriggersOnOverseerRestart-seed#[54F47F6708D5BAE4]) [n:127.0.0.1:49694_solr    ] o.a.s.c.ZkController Register node as live in ZooKeeper:/live_nodes/127.0.0.1:49694_solr
   [junit4]   2> 629070 INFO  (zkCallback-2658-thread-2) [    ] o.a.s.c.c.ZkStateReader Updated live nodes from ZooKeeper... (1) -> (2)
   [junit4]   2> 629070 INFO  (zkCallback-2658-thread-1) [    ] o.a.s.c.c.ZkStateReader Updated live nodes from ZooKeeper... (1) -> (2)
   [junit4]   2> 629071 INFO  (zkCallback-2667-thread-1-processing-n:127.0.0.1:49678_solr) [n:127.0.0.1:49678_solr    ] o.a.s.c.c.ZkStateReader Updated live nodes from ZooKeeper... (1) -> (2)
   [junit4]   2> 629071 INFO  (zkCallback-2677-thread-1-processing-n:127.0.0.1:49694_solr) [n:127.0.0.1:49694_solr    ] o.a.s.c.c.ZkStateReader Updated live nodes from ZooKeeper... (1) -> (2)
   [junit4]   2> 629256 INFO  (TEST-TriggerIntegrationTest.testContinueTriggersOnOverseerRestart-seed#[54F47F6708D5BAE4]) [n:127.0.0.1:49694_solr    ] o.a.s.m.r.SolrJmxReporter JMX monitoring for 'solr_49694.solr.node' (registry 'solr.node') enabled at server: com.sun.jmx.mbeanserver.JmxMBeanServer@343231f8
   [junit4]   2> 629267 INFO  (TEST-TriggerIntegrationTest.testContinueTriggersOnOverseerRestart-seed#[54F47F6708D5BAE4]) [n:127.0.0.1:49694_solr    ] o.a.s.m.r.SolrJmxReporter JMX monitoring for 'solr_49694.solr.jvm' (registry 'solr.jvm') enabled at server: com.sun.jmx.mbeanserver.JmxMBeanServer@343231f8
   [junit4]   2> 629267 INFO  (TEST-TriggerIntegrationTest.testContinueTriggersOnOverseerRestart-seed#[54F47F6708D5BAE4]) [n:127.0.0.1:49694_solr    ] o.a.s.m.r.SolrJmxReporter JMX monitoring for 'solr_49694.solr.jetty' (registry 'solr.jetty') enabled at server: com.sun.jmx.mbeanserver.JmxMBeanServer@343231f8
   [junit4]   2> 629269 INFO  (TEST-TriggerIntegrationTest.testContinueTriggersOnOverseerRestart-seed#[54F47F6708D5BAE4]) [n:127.0.0.1:49694_solr    ] o.a.s.c.CorePropertiesLocator Found 0 core definitions underneath /Users/jenkins/workspace/Lucene-Solr-master-MacOSX/solr/build/solr-core/test/J1/temp/solr.cloud.autoscaling.TriggerIntegrationTest_54F47F6708D5BAE4-001/tempDir-001/node4/.
   [junit4]   2> 630069 DEBUG (ScheduledTrigger-2220-thread-4) [n:127.0.0.1:49678_solr    ] o.a.s.c.a.NodeLostTrigger Running NodeLostTrigger: .auto_add_replicas with currently live nodes: 2
   [junit4]   2> 630069 DEBUG (ScheduledTrigger-2220-thread-1) [n:127.0.0.1:49678_solr    ] o.a.s.c.a.NodeAddedTrigger Running NodeAddedTrigger node_added_triggerCTOOR
   [junit4]   2> 630069 DEBUG (ScheduledTrigger-2220-thread-1) [n:127.0.0.1:49678_solr    ] o.a.s.c.a.NodeAddedTrigger Found livenodes: 2
   [junit4]   2> 630069 DEBUG (ScheduledTrigger-2220-thread-1) [n:127.0.0.1:49678_solr    ] o.a.s.c.a.NodeAddedTrigger Tracking new node: 127.0.0.1:49694_solr at time 712473834718701
   [junit4]   2> 631070 DEBUG (ScheduledTrigger-2220-thread-4) [n:127.0.0.1:49678_solr    ] o.a.s.c.a.NodeLostTrigger Running NodeLostTrigger: .auto_add_replicas with currently live nodes: 2
   [junit4]   2> 631070 DEBUG (ScheduledTrigger-2220-thread-4) [n:127.0.0.1:49678_solr    ] o.a.s.c.a.NodeAddedTrigger Running NodeAddedTrigger node_added_triggerCTOOR
   [junit4]   2> 631070 DEBUG (ScheduledTrigger-2220-thread-4) [n:127.0.0.1:49678_solr    ] o.a.s.c.a.NodeAddedTrigger Found livenodes: 2
   [junit4]   2> 632072 DEBUG (ScheduledTrigger-2220-thread-4) [n:127.0.0.1:49678_solr    ] o.a.s.c.a.NodeLostTrigger Running NodeLostTrigger: .auto_add_replicas with currently live nodes: 2
   [junit4]   2> 632072 DEBUG (ScheduledTrigger-2220-thread-1) [n:127.0.0.1:49678_solr    ] o.a.s.c.a.NodeAddedTrigger Running NodeAddedTrigger node_added_triggerCTOOR
   [junit4]   2> 632072 DEBUG (ScheduledTrigger-2220-thread-1) [n:127.0.0.1:49678_solr    ] o.a.s.c.a.NodeAddedTrigger Found livenodes: 2
   [junit4]   2> 633073 DEBUG (ScheduledTrigger-2220-thread-4) [n:127.0.0.1:49678_solr    ] o.a.s.c.a.NodeLostTrigger Running NodeLostTrigger: .auto_add_replicas with currently live nodes: 2
   [junit4]   2> 633073 DEBUG (ScheduledTrigger-2220-thread-2) [n:127.0.0.1:49678_solr    ] o.a.s.c.a.NodeAddedTrigger Running NodeAddedTrigger node_added_triggerCTOOR
   [junit4]   2> 633073 DEBUG (ScheduledTrigger-2220-thread-2) [n:127.0.0.1:49678_solr    ] o.a.s.c.a.NodeAddedTrigger Found livenodes: 2
   [junit4]   2> 633073 DEBUG (ScheduledTrigger-2220-thread-2) [n:127.0.0.1:49678_solr    ] o.a.s.c.a.NodeAddedTrigger NodeAddedTrigger node_added_triggerCTOOR firing registered processor for nodes: [127.0.0.1:49694_solr] added at times [712473834718701], now=712476839030116
   [junit4]   2> 633073 DEBUG (ScheduledTrigger-2220-thread-2) [n:127.0.0.1:49678_solr    ] o.a.s.c.a.ScheduledTriggers ++++++++ Cooldown inactive - processing event: {
   [junit4]   2>   "id":"287fdbdd485edT9w99e7gkpgkf7okkwm1pzk3e1",
   [junit4]   2>   "source":"node_added_triggerCTOOR",
   [junit4]   2>   "eventTime":712473834718701,
   [junit4]   2>   "eventType":"NODEADDED",
   [junit4]   2>   "properties":{
   [junit4]   2>     "eventTimes":[712473834718701],
   [junit4]   2>     "nodeNames":["127.0.0.1:49694_solr"]}}
   [junit4]   2> 633074 DEBUG (ScheduledTrigger-2220-thread-2) [n:127.0.0.1:49678_solr    ] o.a.s.c.a.ScheduledTriggers Pausing all triggers: [.auto_add_replicas, node_added_triggerCTOOR]
   [junit4]   2> 633074 INFO  (ScheduledTrigger-2220-thread-2) [n:127.0.0.1:49678_solr    ] o.a.s.c.a.SystemLogListener Collection .system does not exist, disabling logging.
   [junit4]   2> 633075 DEBUG (AutoscalingActionExecutor-2221-thread-1-processing-n:127.0.0.1:49678_solr) [n:127.0.0.1:49678_solr    ] o.a.s.c.a.ScheduledTriggers -- processing actions for {
   [junit4]   2>   "id":"287fdbdd485edT9w99e7gkpgkf7okkwm1pzk3e1",
   [junit4]   2>   "source":"node_added_triggerCTOOR",
   [junit4]   2>   "eventTime":712473834718701,
   [junit4]   2>   "eventType":"NODEADDED",
   [junit4]   2>   "properties":{
   [junit4]   2>     "eventTimes":[712473834718701],
   [junit4]   2>     "_enqueue_time_":712476839592603,
   [junit4]   2>     "nodeNames":["127.0.0.1:49694_solr"]}}
   [junit4]   2> 633075 INFO  (TEST-TriggerIntegrationTest.testContinueTriggersOnOverseerRestart-seed#[54F47F6708D5BAE4]) [    ] o.a.s.SolrTestCaseJ4 ###Ending testContinueTriggersOnOverseerRestart
   [junit4]   2> 633081 DEBUG (AutoscalingActionExecutor-2221-thread-1-processing-n:127.0.0.1:49678_solr) [n:127.0.0.1:49678_solr    ] o.a.s.c.a.ScheduledTriggers Resuming trigger: .auto_add_replicas after 5000ms
   [junit4]   2> 633082 DEBUG (AutoscalingActionExecutor-2221-thread-1-processing-n:127.0.0.1:49678_solr) [n:127.0.0.1:49678_solr    ] o.a.s.c.a.ScheduledTriggers Resuming trigger: node_added_triggerCTOOR after 5000ms
   [junit4]   2> 633082 DEBUG (AutoscalingActionExecutor-2221-thread-1-processing-n:127.0.0.1:49678_solr) [n:127.0.0.1:49678_solr    ] o.a.s.c.a.ScheduledTriggers -- processing took 6 ms for event id=287fdbdd485edT9w99e7gkpgkf7okkwm1pzk3e1
   [junit4]   2> 633098 INFO  (TEST-TriggerIntegrationTest.testSetProperties-seed#[54F47F6708D5BAE4]) [    ] o.a.s.SolrTestCaseJ4 ###Starting testSetProperties
   [junit4]   2> 633100 INFO  (qtp1500863989-7584) [n:127.0.0.1:49678_solr    ] o.a.s.h.a.CollectionsHandler Invoked Collection Action :overseerstatus with params action=OVERSEERSTATUS&wt=javabin&version=2 and sendToOCPQueue=true
   [junit4]   2> 633108 INFO  (qtp1500863989-7584) [n:127.0.0.1:49678_solr    ] o.a.s.s.HttpSolrCall [admin] webapp=null path=/admin/collections params={action=OVERSEERSTATUS&wt=javabin&version=2} status=0 QTime=7
   [junit4]   2> 633108 INFO  (TEST-TriggerIntegrationTest.testSetProperties-seed#[54F47F6708D5BAE4]) [    ] o.a.s.c.a.ScheduledTriggers -- removing trigger: .auto_add_replicas
   [junit4]   2> 633113 INFO  (TEST-TriggerIntegrationTest.testSetProperties-seed#[54F47F6708D5BAE4]) [    ] o.a.s.c.a.ScheduledTriggers -- removing trigger: node_added_triggerCTOOR
   [junit4]   2> 633115 INFO  (TEST-TriggerIntegrationTest.testSetProperties-seed#[54F47F6708D5BAE4]) [    ] o.a.s.c.a.TriggerIntegrationTest /autoscaling.json reset, new znode version 5
   [junit4]   2> 633116 DEBUG (zkCallback-2667-thread-1-processing-n:127.0.0.1:49678_solr) [n:127.0.0.1:49678_solr    ] o.a.s.c.a.OverseerTriggerThread Refreshing /autoscaling.json with znode version 5
   [junit4]   2> 633116 DEBUG (OverseerAutoScalingTriggerThread-72104285611098123-127.0.0.1:49678_solr-n_0000000002) [n:127.0.0.1:49678_solr    ] o.a.s.c.a.OverseerTriggerThread Processed trigger updates upto znodeVersion 5
   [junit4]   2> 633116 DEBUG (OverseerAutoScalingTriggerThread-72104285611098123-127.0.0.1:49678_solr-n_0000000002) [n:127.0.0.1:49678_solr    ] o.a.s.c.a.OverseerTriggerThread -- clean old nodeLost markers
   [junit4]   2> 633116 DEBUG (OverseerAutoScalingTriggerThread-72104285611098123-127.0.0.1:49678_solr-n_0000000002) [n:127.0.0.1:49678_solr    ] o.a.s.c.a.OverseerTriggerThread -- clean old nodeAdded markers
   [junit4]   2> 633117 DEBUG (OverseerAutoScalingTriggerThread-72104285611098123-127.0.0.1:49678_solr-n_0000000002) [n:127.0.0.1:49678_solr    ] o.a.s.c.a.OverseerTriggerThread Current znodeVersion 5, lastZnodeVersion 5
   [junit4]   2> 633117 INFO  (TEST-TriggerIntegrationTest.testSetProperties-seed#[54F47F6708D5BAE4]) [    ] o.a.s.c.c.ZkStateReader Updated live nodes from ZooKeeper... (0) -> (2)
   [junit4]   2> 633121 INFO  (TEST-TriggerIntegrationTest.testSetProperties-seed#[54F47F6708D5BAE4]) [    ] o.e.j.s.AbstractConnector Stopped ServerConnector@7f905835{HTTP/1.1,[http/1.1]}{127.0.0.1:0}
   [junit4]   2> 633121 INFO  (TEST-TriggerIntegrationTest.testSetProperties-seed#[54F47F6708D5BAE4]) [    ] o.a.s.c.CoreContainer Shutting down CoreContainer instance=845514796
   [junit4]   2> 633121 INFO  (TEST-TriggerIntegrationTest.testSetProperties-seed#[54F47F6708D5BAE4]) [    ] o.a.s.m.SolrMetricManager Closing metric reporters for registry=solr.node, tag=null
   [junit4]   2> 633121 INFO  (TEST-TriggerIntegrationTest.testSetProperties-seed#[54F47F6708D5BAE4]) [    ] o.a.s.m.r.SolrJmxReporter Closing reporter [org.apache.solr.metrics.reporters.SolrJmxReporter@374ce7b6: rootName = solr_49678, domain = solr.node, service url = null, agent id = null] for registry solr.node / com.codahale.metrics.MetricRegistry@43cf27a7
   [junit4]   2> 633134 INFO  (TEST-TriggerIntegrationTest.testSetProperties-seed#[54F47F6708D5BAE4]) [    ] o.a.s.m.SolrMetricManager Closing metric reporters for registry=solr.jvm, tag=null
   [junit4]   2> 633134 INFO  (TEST-TriggerIntegrationTest.testSetProperties-seed#[54F47F6708D5BAE4]) [    ] o.a.s.m.r.SolrJmxReporter Closing reporter [org.apache.solr.metrics.reporters.SolrJmxReporter@134bf37f: rootName = solr_49678, domain = solr.jvm, service url = null, agent id = null] for registry solr.jvm / com.codahale.metrics.MetricRegistry@213a48a4
   [junit4]   2> 633139 INFO  (TEST-TriggerIntegrationTest.testSetProperties-seed#[54F47F6708D5BAE4]) [    ] o.a.s.m.SolrMetricManager Closing metric reporters for registry=solr.jetty, tag=null
   [junit4]   2> 633139 INFO  (TEST-TriggerIntegrationTest.testSetProperties-seed#[54F47F6708D5BAE4]) [    ] o.a.s.m.r.SolrJmxReporter Closing reporter [org.apache.solr.metrics.reporters.SolrJmxReporter@68bafbaa: rootName = solr_49678, domain = solr.jetty, service url = null, agent id = null] for registry solr.jetty / com.codahale.metrics.MetricRegistry@4a181cbd
   [junit4]   2> 633142 INFO  (TEST-TriggerIntegrationTest.testSetProperties-seed#[54F47F6708D5BAE4]) [    ] o.a.s.c.ZkController Remove node as live in ZooKeeper:/live_nodes/127.0.0.1:49678_solr
   [junit4]   2> 633144 INFO  (zkCallback-2677-thread-1-processing-n:127.0.0.1:49694_solr) [n:127.0.0.1:49694_solr    ] o.a.s.c.c.ZkStateReader Updated live nodes from ZooKeeper... (2) -> (1)
   [junit4]   2> 633144 INFO  (zkCallback-2658-thread-1) [    ] o.a.s.c.c.ZkStateReader Updated live nodes from ZooKeeper... (2) -> (1)
   [junit4]   2> 633144 INFO  (zkCallback-2667-thread-1-processing-n:127.0.0.1:49678_solr) [n:127.0.0.1:49678_solr    ] o.a.s.c.c.ZkStateReader Updated live nodes from ZooKeeper... (2) -> (1)
   [junit4]   2> 633144 INFO  (zkCallback-2658-thread-3) [    ] o.a.s.c.c.ZkStateReader Updated live nodes from ZooKeeper... (2) -> (1)
   [junit4]   2> 633145 INFO  (zkCallback-2658-thread-2) [    ] o.a.s.c.c.ZkStateReader Updated live nodes from ZooKeeper... (2) -> (1)
   [junit4]   2> 633145 INFO  (TEST-TriggerIntegrationTest.testSetProperties-seed#[54F47F6708D5BAE4]) [    ] o.a.s.m.SolrMetricManager Closing metric reporters for registry=solr.cluster, tag=null
   [junit4]   2> 633145 INFO  (TEST-TriggerIntegrationTest.testSetProperties-seed#[54F47F6708D5BAE4]) [    ] o.a.s.c.TransientSolrCoreCacheDefault Allocating transient cache for 2147483647 transient cores
   [junit4]   2> 633146 INFO  (TEST-TriggerIntegrationTest.testSetProperties-seed#[54F47F6708D5BAE4]) [    ] o.a.s.c.Overseer Overseer (id=72104285611098123-127.0.0.1:49678_solr-n_0000000002) closing
   [junit4]   2> 633146 INFO  (OverseerStateUpdate-72104285611098123-127.0.0.1:49678_solr-n_0000000002) [n:127.0.0.1:49678_solr    ] o.a.s.c.Overseer Overseer Loop exiting : 127.0.0.1:49678_solr
   [junit4]   2> 633146 WARN  (OverseerAutoScalingTriggerThread-72104285611098123-127.0.0.1:49678_solr-n_0000000002) [n:127.0.0.1:49678_solr    ] o.a.s.c.a.OverseerTriggerThread OverseerTriggerThread woken up but we are closed, exiting.
   [junit4]   2> 633147 DEBUG (TEST-TriggerIntegrationTest.testSetProperties-seed#[54F47F6708D5BAE4]) [    ] o.a.s.c.a.OverseerTriggerThread OverseerTriggerThread has been closed explicitly
   [junit4]   2> 633149 INFO  (zkCallback-2677-thread-1-processing-n:127.0.0.1:49694_solr) [n:127.0.0.1:49694_solr    ] o.a.s.c.OverseerElectionContext I am going to be the leader 127.0.0.1:49694_solr
   [junit4]   2> 633149 INFO  (TEST-TriggerIntegrationTest.testSetProperties-seed#[54F47F6708D5BAE4]) [    ] o.e.j.s.h.ContextHandler Stopped o.e.j.s.ServletContextHandler@299b06bf{/solr,null,UNAVAILABLE}
   [junit4]   2> 633149 INFO  (TEST-TriggerIntegrationTest.testSetProperties-seed#[54F47F6708D5BAE4]) [    ] o.e.j.s.session Stopped scavenging
   [junit4]   2> 633151 INFO  (zkCallback-2677-thread-1-processing-n:127.0.0.1:49694_solr) [n:127.0.0.1:49694_solr    ] o.a.s.c.Overseer Overseer (id=72104285611098126-127.0.0.1:49694_solr-n_0000000003) starting
   [junit4]   2> 633164 DEBUG (OverseerAutoScalingTriggerThread-72104285611098126-127.0.0.1:49694_solr-n_0000000003) [n:127.0.0.1:49694_solr    ] o.a.s.c.a.OverseerTriggerThread Adding .autoAddReplicas trigger
   [junit4]   2> 633165 DEBUG (OverseerAutoScalingTriggerThread-72104285611098126-127.0.0.1:49694_solr-n_0000000003) [n:127.0.0.1:49694_solr    ] o.a.s.c.a.OverseerTriggerThread Refreshing /autoscaling.json with znode version 6
   [junit4]   2> 633165 DEBUG (OverseerAutoScalingTriggerThread-72104285611098126-127.0.0.1:49694_solr-n_0000000003) [n:127.0.0.1:49694_solr    ] o.a.s.c.a.NodeLostTrigger Initial livenodes: [127.0.0.1:49694_solr]
   [junit4]   2> 633165 DEBUG (OverseerAutoScalingTriggerThread-72104285611098126-127.0.0.1:49694_solr-n_0000000003) [n:127.0.0.1:49694_solr    ] o.a.s.c.a.OverseerTriggerThread Current znodeVersion 6, lastZnodeVersion -1
   [junit4]   2> 633165 DEBUG (OverseerAutoScalingTriggerThread-72104285611098126-127.0.0.1:49694_solr-n_0000000003) [n:127.0.0.1:49694_solr    ] o.a.s.c.a.OverseerTriggerThread Processed trigger updates upto znodeVersion 6
   [junit4]   2> 633169 DEBUG (OverseerAutoScalingTriggerThread-72104285611098126-127.0.0.1:49694_solr-n_0000000003) [n:127.0.0.1:49694_solr    ] o.a.s.c.a.OverseerTriggerThread -- clean old nodeAdded markers
   [junit4]   2> 633169 DEBUG (OverseerAutoScalingTriggerThread-72104285611098126-127.0.0.1:49694_solr-n_0000000003) [n:127.0.0.1:49694_solr    ] o.a.s.c.a.OverseerTriggerThread Current znodeVersion 6, lastZnodeVersion 6
   [junit4]   2> 633169 DEBUG (ScheduledTrigger-2231-thread-1) [n:127.0.0.1:49694_solr    ] o.a.s.c.a.NodeLostTrigger Running NodeLostTrigger: .auto_add_replicas with currently live nodes: 1
   [junit4]   2> 634177 DEBUG (ScheduledTrigger-2231-thread-1) [n:127.0.0.1:49694_solr    ] o.a.s.c.a.NodeLostTrigger Running NodeLostTrigger: .auto_add_replicas with currently live nodes: 1
   [junit4]   2> 635188 DEBUG (ScheduledTrigger-2231-thread-2) [n:127.0.0.1:49694_solr    ] o.a.s.c.a.NodeLostTrigger Running NodeLostTrigger: .auto_add_replicas with currently live nodes: 1
   [junit4]   2> 636189 DEBUG (ScheduledTrigger-2231-thread-1) [n:127.0.0.1:49694_solr    ] o.a.s.c.a.NodeLostTrigger Running NodeLostTrigger: .auto_add_replicas with currently live nodes: 1
   [junit4]   2> 637197 DEBUG (ScheduledTrigger-2231-thread-1) [n:127.0.0.1:49694_solr    ] o.a.s.c.a.NodeLostTrigger Running NodeLostTrigger: .auto_add_replicas with currently live nodes: 1
   [junit4]   2> 638163 INFO  (TEST-TriggerIntegrationTest.testSetProperties-seed#[54F47F6708D5BAE4]) [    ] o.e.j.s.Server jetty-9.4.8.v20171121, build timestamp: 2017-11-21T15:27:37-06:00, git hash: 82b8fb23f757335bb3329d540ce37a2a2615f0a8
   [junit4]   2> 638164 INFO  (TEST-TriggerIntegrationTest.testSetProperties-seed#[54F47F6708D5BAE4]) [    ] o.e.j.s.session DefaultSessionIdManager workerName=node0
   [junit4]   2> 638164 INFO  (TEST-TriggerIntegrationTest.testSetProperties-seed#[54F47F6708D5BAE4]) [    ] o.e.j.s.session No SessionScavenger set, using defaults
   [junit4]   2> 638164 INFO  (TEST-TriggerIntegrationTest.testSetProperties-seed#[54F47F6708D5BAE4]) [    ] o.e.j.s.session Scavenging every 660000ms
   [junit4]   2> 638165 INFO  (TEST-TriggerIntegrationTest.testSetProperties-seed#[54F47F6708D5BAE4]) [    ] o.e.j.s.h.ContextHandler Started o.e.j.s.ServletContextHandler@3847d0cf{/solr,null,AVAILABLE}
   [junit4]   2> 638165 INFO  (TEST-TriggerIntegrationTest.testSetProperties-seed#[54F47F6708D5BAE4]) [    ] o.e.j.s.AbstractConnector Started ServerConnector@70560678{HTTP/1.1,[http/1.1]}{127.0.0.1:49726}
   [junit4]   2> 638165 INFO  (TEST-TriggerIntegrationTest.testSetProperties-seed#[54F47F6708D5BAE4]) [    ] o.e.j.s.Server Started @642326ms
   [junit4]   2> 638165 INFO  (TEST-TriggerIntegrationTest.testSetProperties-seed#[54F47F6708D5BAE4]) [    ] o.a.s.c.s.e.JettySolrRunner Jetty properties: {hostContext=/solr, hostPort=49726}
   [junit4]   2> 638165 ERROR (TEST-TriggerIntegrationTest.testSetProperties-seed#[54F47F6708D5BAE4]) [    ] o.a.s.u.StartupLoggingUtils Missing Java Option solr.log.dir. Logging may be missing or incomplete.
   [junit4]   2> 638166 INFO  (TEST-TriggerIntegrationTest.testSetProperties-seed#[54F47F6708D5BAE4]) [    ] o.a.s.s.SolrDispatchFilter  ___      _       Welcome to Apache Solr™ version 8.0.0
   [junit4]   2> 638166 INFO  (TEST-TriggerIntegrationTest.testSetProperties-seed#[54F47F6708D5BAE4]) [    ] o.a.s.s.SolrDispatchFilter / __| ___| |_ _   Starting in cloud mode on port null
   [junit4]   2> 638166 INFO  (TEST-TriggerIntegrationTest.testSetProperties-seed#[54F47F6708D5BAE4]) [    ] o.a.s.s.SolrDispatchFilter \__ \/ _ \ | '_|  Install dir: null
   [junit4]   2> 638166 INFO  (TEST-TriggerIntegrationTest.testSetProperties-seed#[54F47F6708D5BAE4]) [    ] o.a.s.s.SolrDispatchFilter |___/\___/_|_|    Start time: 2018-02-22T12:56:03.058Z
   [junit4]   2> 638168 INFO  (zkConnectionManagerCallback-2683-thread-1) [    ] o.a.s.c.c.ConnectionManager zkClient has connected
   [junit4]   2> 638169 INFO  (TEST-TriggerIntegrationTest.testSetProperties-seed#[54F47F6708D5BAE4]) [    ] o.a.s.s.SolrDispatchFilter solr.xml found in ZooKeeper. Loading...
   [junit4]   2> 638183 INFO  (TEST-TriggerIntegrationTest.testSetProperties-seed#[54F47F6708D5BAE4]) [    ] o.a.s.c.ZkContainer Zookeeper client=127.0.0.1:49472/solr
   [junit4]   2> 638185 INFO  (zkConnectionManagerCallback-2687-thread-1) [    ] o.a.s.c.c.ConnectionManager zkClient has connected
   [junit4]   2> 638188 INFO  (zkConnectionManagerCallback-2689-thread-1-processing-n:127.0.0.1:49726_solr) [n:127.0.0.1:49726_solr    ] o.a.s.c.c.ConnectionManager zkClient has connected
   [junit4]   2> 638197 DEBUG (ScheduledTrigger-2231-thread-1) [n:127.0.0.1:49694_solr    ] o.a.s.c.a.NodeLostTrigger Running NodeLostTrigger: .auto_add_replicas with currently live nodes: 1
   [junit4]   2> 638201 INFO  (TEST-TriggerIntegrationTest.testSetProperties-seed#[54F47F6708D5BAE4]) [n:127.0.0.1:49726_solr    ] o.a.s.c.c.ZkStateReader Updated live nodes from ZooKeeper... (0) -> (1)
   [junit4]   2> 638205 INFO  (TEST-TriggerIntegrationTest.testSetProperties-seed#[54F47F6708D5BAE4]) [n:127.0.0.1:49726_solr    ] o.a.s.c.Overseer Overseer (id=null) closing
   [junit4]   2> 638209 INFO  (TEST-TriggerIntegrationTest.testSetProperties-seed#[54F47F6708D5BAE4]) [n:127.0.0.1:49726_solr    ] o.a.s.c.ZkController Register node as live in ZooKeeper:/live_nodes/127.0.0.1:49726_solr
   [junit4]   2> 638211 INFO  (zkCallback-2677-thread-1-processing-n:127.0.0.1:49694_solr) [n:127.0.0.1:49694_solr    ] o.a.s.c.c.ZkStateReader Updated live nodes from ZooKeeper... (1) -> (2)
   [junit4]   2> 638211 INFO  (zkCallback-2658-thread-2) [    ] o.a.s.c.c.ZkStateReader Updated live nodes from ZooKeeper... (1) -> (2)
   [junit4]   2> 638211 INFO  (zkCallback-2658-thread-3) [    ] o.a.s.c.c.ZkStateReader Updated live nodes from ZooKeeper... (1) -> (2)
   [junit4]   2> 638211 INFO  (zkCallback-2658-thread-1) [    ] o.a.s.c.c.ZkStateReader Updated live nodes from ZooKeeper... (1) -> (2)
   [junit4]   2> 638212 INFO  (zkCallback-2688-thread-1-processing-n:127.0.0.1:49726_solr) [n:127.0.0.1:49726_solr    ] o.a.s.c.c.ZkStateReader Updated live nodes from ZooKeeper... (1) -> (2)
   [junit4]   2> 638325 INFO  (TEST-TriggerIntegrationTest.testSetProperties-seed#[54F47F6708D5BAE4]) [n:127.0.0.1:49726_solr    ] o.a.s.m.r.SolrJmxReporter JMX monitoring for 'solr_49726.solr.node' (registry 'solr.node') enabled at server: com.sun.jmx.mbeanserver.JmxMBeanServer@343231f8
   [junit4]   2> 638332 INFO  (TEST-TriggerIntegrationTest.testSetProperties-seed#[54F47F6708D5BAE4]) [n:127.0.0.1:49726_solr    ] o.a.s.m.r.SolrJmxReporter JMX monitoring for 'solr_49726.solr.jvm' (registry 'solr.jvm') enabled at server: com.sun.jmx.mbeanserver.JmxMBeanServer@343231f8
   [junit4]   2> 638332 INFO  (TEST-TriggerIntegrationTest.testSetProperties-seed#[54F47F6708D5BAE4]) [n:127.0.0.1:49726_solr    ] o.a.s.m.r.SolrJmxReporter JMX monitoring for 'solr_49726.solr.jetty' (registry 'solr.jetty') enabled at server: com.sun.jmx.mbeanserver.JmxMBeanServer@343231f8
   [junit4]   2> 638333 INFO  (TEST-TriggerIntegrationTest.testSetProperties-seed#[54F47F6708D5BAE4]) [n:127.0.0.1:49726_solr    ] o.a.s.c.CorePropertiesLocator Found 0 core definitions underneath /Users/jenkins/workspace/Lucene-Solr-master-MacOSX/solr/build/solr-core/test/J1/temp/solr.cloud.autoscaling.TriggerIntegrationTest_54F47F6708D5BAE4-001/tempDir-001/node5/.
   [junit4]   2> 639207 DEBUG (ScheduledTrigger-2231-thread-1) [n:127.0.0.1:49694_solr    ] o.a.s.c.a.NodeLostTrigger Running NodeLostTrigger: .auto_add_replicas with currently live nodes: 2
   [junit4]   2> 639376 DEBUG (TEST-TriggerIntegrationTest.testSetProperties-seed#[54F47F6708D5BAE4]) [    ] o.a.s.c.a.ScheduledTriggers Changing value of autoscaling property: triggerScheduleDelaySeconds from: 1 to: 4
   [junit4]   2> 640214 DEBUG (ScheduledTrigger-2231-thread-1) [n:127.0.0.1:49694_solr    ] o.a.s.c.a.NodeLostTrigger Running NodeLostTrigger: .auto_add_replicas with currently live nodes: 2
   [junit4]   2> 641225 DEBUG (ScheduledTrigger-2231-thread-1) [n:127.0.0.1:49694_solr    ] o.a.s.c.a.NodeLostTrigger Running NodeLostTrigger: .auto_add_replicas with currently live nodes: 2
   [junit4]   2> 642235 DEBUG (ScheduledTrigger-2231-thread-1) [n:127.0.0.1:49694_solr    ] o.a.s.c.a.NodeLostTrigger Running NodeLostTrigger: .auto_add_replicas with currently live nodes: 2
   [junit4]   2> 643239 DEBUG (ScheduledTrigger-2231-thread-1) [n:127.0.0.1:49694_solr    ] o.a.s.c.a.NodeLostTrigger Running NodeLostTrigger: .auto_add_replicas with currently live nodes: 2
   [junit4]   2> 643389 DEBUG (TEST-TriggerIntegrationTest.testSetProperties-seed#[54F47F6708D5BAE4]) [    ] o.a.s.c.a.ScheduledTriggers Changing value of autoscaling property: triggerScheduleDelaySeconds from: 4 to: 1
   [junit4]   2> 644249 DEBUG (ScheduledTrigger-2231-thread-1) [n:127.0.0.1:49694_solr    ] o.a.s.c.a.NodeLostTrigger Running NodeLostTrigger: .auto_add_replicas with currently live nodes: 2
   [junit4]   2> 645260 DEBUG (ScheduledTrigger-2231-thread-1) [n:127.0.0.1:49694_solr    ] o.a.s.c.a.NodeLostTrigger Running NodeLostTrigger: .auto_add_replicas with currently live nodes: 2
   [junit4]   2> 646270 DEBUG (ScheduledTrigger-2231-thread-1) [n:127.0.0.1:49694_solr    ] o.a.s.c.a.NodeLostTrigger Running NodeLostTrigger: .auto_add_replicas with currently live nodes: 2
   [junit4]   2> 647280 DEBUG (ScheduledTrigger-2231-thread-1) [n:127.0.0.1:49694_solr    ] o.a.s.c.a.NodeLostTrigger Running NodeLostTrigger: .auto_add_replicas with currently live nodes: 2
   [junit4]   2> 648285 DEBUG (ScheduledTrigger-2231-thread-1) [n:127.0.0.1:49694_solr    ] o.a.s.c.a.NodeLostTrigger Running NodeLostTrigger: .auto_add_replicas with currently live nodes: 2
   [junit4]   2> 649295 DEBUG (ScheduledTrigger-2231-thread-1) [n:127.0.0.1:49694_solr    ] o.a.s.c.a.NodeLostTrigger Running NodeLostTrigger: .auto_add_replicas with currently live nodes: 2
   [junit4]   2> 650305 DEBUG (ScheduledTrigger-2231-thread-1) [n:127.0.0.1:49694_solr    ] o.a.s.c.a.NodeLostTrigger Running NodeLostTrigger: .auto_add_replicas with currently live nodes: 2
   [junit4]   2> 651316 DEBUG (ScheduledTrigger-2231-thread-1) [n:127.0.0.1:49694_solr    ] o.a.s.c.a.NodeLostTrigger Running NodeLostTrigger: .auto_add_replicas with currently live nodes: 2
   [junit4]   2> 652326 DEBUG (ScheduledTrigger-2231-thread-1) [n:127.0.0.1:49694_solr    ] o.a.s.c.a.NodeLostTrigger Running NodeLostTrigger: .auto_add_replicas with currently live nodes: 2
   [junit4]   2> 653336 DEBUG (ScheduledTrigger-2231-thread-1) [n:127.0.0.1:49694_solr    ] o.a.s.c.a.NodeLostTrigger Running NodeLostTrigger: .auto_add_replicas with currently live nodes: 2
   [junit4]   2> 653420 DEBUG (TEST-TriggerIntegrationTest.testSetProperties-seed#[54F47F6708D5BAE4]) [    ] o.a.s.c.a.ScheduledTriggers Changing value of autoscaling property: triggerCorePoolSize from: 4 to: 6
   [junit4]   2> 654346 DEBUG (ScheduledTrigger-2231-thread-1) [n:127.0.0.1:49694_solr    ] o.a.s.c.a.NodeLostTrigger Running NodeLostTrigger: .auto_add_replicas with currently live nodes: 2
   [junit4]   2> 655357 DEBUG (ScheduledTrigger-2231-thread-1) [n:127.0.0.1:49694_solr    ] o.a.s.c.a.NodeLostTrigger Running NodeLostTrigger: .auto_add_replicas with currently live nodes: 2
   [junit4]   2> 656365 DEBUG (ScheduledTrigger-2231-thread-1) [n:127.0.0.1:49694_solr    ] o.a.s.c.a.NodeLostTrigger Running NodeLostTrigger: .auto_add_replicas with currently live nodes: 2
   [junit4]   2> 657375 DEBUG (ScheduledTrigger-2231-thread-1) [n:127.0.0.1:49694_solr    ] o.a.s.c.a.NodeLostTrigger Running NodeLostTrigger: .auto_add_replicas with currently live nodes: 2
   [junit4]   2> 658386 DEBUG (ScheduledTrigger-2231-thread-1) [n:127.0.0.1:49694_solr    ] o.a.s.c.a.NodeLostTrigger Running NodeLostTrigger: .auto_add_replicas with currently live nodes: 2
   [junit4]   2> 659388 DEBUG (ScheduledTrigger-2231-thread-1) [n:127.0.0.1:49694_solr    ] o.a.s.c.a.NodeLostTrigger Running NodeLostTrigger: .auto_add_replicas with currently live nodes: 2
   [junit4]   2> 660399 DEBUG (ScheduledTrigger-2231-thread-1) [n:127.0.0.1:49694_solr    ] o.a.s.c.a.NodeLostTrigger Running NodeLostTrigger: .auto_add_replicas with currently live nodes: 2
   [junit4]   2> 661409 DEBUG (ScheduledTrigger-2231-thread-1) [n:127.0.0.1:49694_solr    ] o.a.s.c.a.NodeLostTrigger Running NodeLostTrigger: .auto_add_replicas with currently live nodes: 2
   [junit4]   2> 662419 DEBUG (ScheduledTrigger-2231-thread-1) [n:127.0.0.1:49694_solr    ] o.a.s.c.a.NodeLostTrigger Running NodeLostTrigger: .auto_add_replicas with currently live nodes: 2
   [junit4]   2> 663420 DEBUG (ScheduledTrigger-2231-thread-1) [n:127.0.0.1:49694_solr    ] o.a.s.c.a.NodeLostTrigger Running NodeLostTrigger: .auto_add_replicas with currently live nodes: 2
   [junit4]   2> 663449 INFO  (TEST-TriggerIntegrationTest.testSetProperties-seed#[54F47F6708D5BAE4]) [    ] o.a.s.SolrTestCaseJ4 ###Ending testSetProperties
   [junit4]   2> 663466 INFO  (TEST-TriggerIntegrationTest.testNodeLostTrigger-seed#[54F47F6708D5BAE4]) [    ] o.a.s.SolrTestCaseJ4 ###Starting testNodeLostTrigger
   [junit4]   2> 663469 INFO  (qtp703754933-7616) [n:127.0.0.1:49694_solr    ] o.a.s.h.a.CollectionsHandler Invoked Collection Action :overseerstatus with params action=OVERSEERSTATUS&wt=javabin&version=2 and sendToOCPQueue=true
   [junit4]   2> 663477 INFO  (qtp703754933-7616) [n:127.0.0.1:49694_solr    ] o.a.s.s.HttpSolrCall [admin] webapp=null path=/admin/collections params={action=OVERSEERSTATUS&wt=javabin&version=2} status=0 QTime=7
   [junit4]   2> 663478 INFO  (TEST-TriggerIntegrationTest.testNodeLostTrigger-seed#[54F47F6708D5BAE4]) [    ] o.a.s.c.a.ScheduledTriggers -- removing trigger: .auto_add_replicas
   [junit4]   2> 663479 INFO  (TEST-TriggerIntegrationTest.testNodeLostTrigger-seed#[54F47F6708D5BAE4]) [    ] o.a.s.c.a.TriggerIntegrationTest /autoscaling.json reset, new znode version 7
   [junit4]   2> 663480 DEBUG (zkCallback-2677-thread-1-processing-n:127.0.0.1:49694_solr) [n:127.0.0.1:49694_solr    ] o.a.s.c.a.OverseerTriggerThread Refreshing /autoscaling.json with znode version 7
   [junit4]   2> 663480 DEBUG (OverseerAutoScalingTriggerThread-72104285611098126-127.0.0.1:49694_solr-n_0000000003) [n:127.0.0.1:49694_solr    ] o.a.s.c.a.OverseerTriggerThread Processed trigger updates upto znodeVersion 7
   [junit4]   2> 663480 DEBUG (OverseerAutoScalingTriggerThread-72104285611098126-127.0.0.1:49694_solr-n_0000000003) [n:127.0.0.1:49694_solr    ] o.a.s.c.a.OverseerTriggerThread -- clean old nodeLost markers
   [junit4]   2> 663480 DEBUG (OverseerAutoScalingTriggerThread-72104285611098126-127.0.0.1:49694_solr-n_0000000003) [n:127.0.0.1:49694_solr    ] o.a.s.c.a.OverseerTriggerThread -- clean old nodeAdded markers
   [junit4]   2> 663481 DEBUG (OverseerAutoScalingTriggerThread-72104285611098126-127.0.0.1:49694_solr-n_0000000003) [n:127.0.0.1:49694_solr    ] o.a.s.c.a.OverseerTriggerThread Current znodeVersion 7, lastZnodeVersion 7
   [junit4]   2> 663481 INFO  (TEST-TriggerIntegrationTest.testNodeLostTrigger-seed#[54F47F6708D5BAE4]) [    ] o.a.s.c.c.ZkStateReader Updated live nodes from ZooKeeper... (0) -> (2)
   [junit4]   2> 663484 INFO  (TEST-TriggerIntegrationTest.testNodeLostTrigger-seed#[54F47F6708D5BAE4]) [    ] o.e.j.s.AbstractConnector Stopped ServerConnector@1d13153f{HTTP/1.1,[http/1.1]}{127.0.0.1:0}
   [junit4]   2> 663484 INFO 

[...truncated too long message...]

hHandlerTest, TestSolrDeletionPolicy1, ComputePlanActionTest, WordBreakSolrSpellCheckerTest, TestPointFields, TestCloudInspectUtil, LukeRequestHandlerTest, DistribCursorPagingTest, HttpSolrCallGetCoreTest, TestLeaderElectionWithEmptyReplica, LIRRollingUpdatesTest, OverriddenZkACLAndCredentialsProvidersTest, TestSolrConfigHandler, RAMDirectoryFactoryTest, RegexBytesRefFilterTest, MoveReplicaHDFSFailoverTest, RemoteQueryErrorTest, TestConfigReload, ClassificationUpdateProcessorIntegrationTest, NodeLostTriggerTest, SolrInfoBeanTest, TestFieldCacheWithThreads, DistributedVersionInfoTest, TestIBSimilarityFactory, BasicDistributedZkTest, TestFunctionQuery, PingRequestHandlerTest, TestDocTermOrds, TestLRUStatsCache, RequestLoggingTest, TestDownShardTolerantSearch, TestReplicationHandler, TestAddFieldRealTimeGet, TestChildDocTransformer, StatsReloadRaceTest, LeaderFailoverAfterPartitionTest, TestEmbeddedSolrServerAdminHandler, BadCopyFieldTest, TestMacros, FastVectorHighlighterTest, MetricUtilsTest, TestPayloadCheckQParserPlugin, DistribJoinFromCollectionTest, CdcrReplicationDistributedZkTest, TestDelegationWithHadoopAuth, TestHashQParserPlugin, MigrateRouteKeyTest, DistributedMLTComponentTest, TestClusterStateProvider, TestScoreJoinQPNoScore, TestUninvertingReader, TestJavabinTupleStreamParser, FullHLLTest, TestPseudoReturnFields, DeleteInactiveReplicaTest, TestAuthorizationFramework, UtilsToolTest, CollectionReloadTest, DistributedDebugComponentTest, CollectionsAPIAsyncDistributedZkTest, SolrMetricManagerTest, TestMinMaxOnMultiValuedField, TestBM25SimilarityFactory, RecoveryZkTest, TestLegacyNumericRangeQueryBuilder, SolrIndexMetricsTest, TestNRTOpen, SolrGraphiteReporterTest, AnalysisErrorHandlingTest, RankQueryTest, TestEmbeddedSolrServerSchemaAPI, TestMiniSolrCloudClusterSSL, SpatialFilterTest, AtomicUpdatesTest, TestStressInPlaceUpdates, TestManagedSynonymFilterFactory, ShardRoutingCustomTest, DirectSolrSpellCheckerTest, TestHighFrequencyDictionaryFactory, FieldMutatingUpdateProcessorTest, TestConfigSetsAPIExclusivity, SolrMetricsIntegrationTest, TestJoin, TestAuthenticationFramework, TestFieldResource, StatsComponentTest, TestRuleBasedAuthorizationPlugin, SuggestComponentContextFilterQueryTest, HighlighterTest, TestGenericDistributedQueue, OverseerModifyCollectionTest, PathHierarchyTokenizerFactoryTest, TestClusterProperties, TestManagedSchemaAPI, IndexSchemaRuntimeFieldTest, TestQueryUtils, SolrCloudReportersTest, TestHttpShardHandlerFactory, DirectUpdateHandlerOptimizeTest, TestStandardQParsers, StressHdfsTest, V2StandaloneTest, ConnectionReuseTest, TestNoOpRegenerator, TestFieldCacheSortRandom, DistributedQueryComponentCustomSortTest, TermsComponentTest, TestPolicyCloud, HighlighterMaxOffsetTest, RestartWhileUpdatingTest, TestSolrCloudWithSecureImpersonation, TestTolerantSearch, CollectionsAPISolrJTest, CreateCollectionCleanupTest, TestSystemIdResolver, TestRequestStatusCollectionAPI, TestFoldingMultitermQuery, SolrIndexSplitterTest, TestExceedMaxTermLength, ConfigSetsAPITest, TestSweetSpotSimilarityFactory, TestSolrCoreParser, TestComplexPhraseLeadingWildcard, HdfsRestartWhileUpdatingTest, TestCustomStream, AnalyticsMergeStrategyTest, SharedFSAutoReplicaFailoverTest, TestExactSharedStatsCache, SecurityConfHandlerTest, TestSolrCLIRunExample, SolrPluginUtilsTest, TestSolrJ, TestSubQueryTransformerCrossCore, TestRetrieveFieldsOptimizer, BasicZkTest, TestRealTimeGet, NodeMutatorTest, TemplateUpdateProcessorTest, HdfsThreadLeakTest, DistributedQueryElevationComponentTest, ZkNodePropsTest, BigEndianAscendingWordDeserializerTest, TestSolrCloudSnapshots, CloudExitableDirectoryReaderTest, DistributedSuggestComponentTest, BlockJoinFacetDistribTest, OpenCloseCoreStressTest, TestDistributedStatsComponentCardinality, CopyFieldTest, InfixSuggestersTest, TestMergePolicyConfig, StatelessScriptUpdateProcessorFactoryTest, TestQueryWrapperFilter, TestCloudRecovery, TestDefaultStatsCache, TestTrieFacet, TestSolrCloudWithHadoopAuthPlugin, TestJsonRequest, ChaosMonkeyNothingIsSafeWithPullReplicasTest, TestRecoveryHdfs, SchemaVersionSpecificBehaviorTest, VMParamsZkACLAndCredentialsProvidersTest, DistributedFacetExistsSmallTest, CursorPagingTest, TestCollationField, TestNumericTerms32, SuggesterFSTTest, PeerSyncReplicationTest, TestFaceting, TestCryptoKeys, ChaosMonkeySafeLeaderTest, UnloadDistributedZkTest, SyncSliceTest, OverseerTest, FullSolrCloudDistribCmdsTest, TestZkChroot, ZkCLITest, TestRecovery, ZkControllerTest, TestStressReorder, TestReload, TestRangeQuery, TestSolr4Spatial, TestGroupingSearch, PeerSyncTest, TestIndexSearcher, ShowFileRequestHandlerTest, AnalysisAfterCoreReloadTest, SignatureUpdateProcessorFactoryTest, TestExtendedDismaxParser, SolrRequestParserTest, SuggesterTSTTest, SuggesterTest, TestStressLucene, TestTrie, PolyFieldTest, TestAtomicUpdateErrorCases, QueryEqualityTest, DefaultValueUpdateProcessorTest, SortByFunctionTest, TestRemoteStreaming, DocValuesMultiTest, DebugComponentTest, CacheHeaderTest, TestSurroundQueryParser, DisMaxRequestHandlerTest, DocumentAnalysisRequestHandlerTest, TestQueryTypes, PrimitiveFieldTypeTest, FileBasedSpellCheckerTest, XmlUpdateRequestHandlerTest, TestValueSourceCache, TestIndexingPerformance, MoreLikeThisHandlerTest, RequiredFieldsTest, RegexBoostProcessorTest, IndexSchemaTest, TestJmxIntegration, TestCSVResponseWriter, MBeansHandlerTest, QueryParsingTest, TestAnalyzedSuggestions, UniqFieldsUpdateProcessorFactoryTest, TestPartialUpdateDeduplication, SearchHandlerTest, TestLFUCache, SOLR749Test, TestQuerySenderListener, AlternateDirectoryTest, TestQuerySenderNoQuery, SolrIndexConfigTest, BadComponentTest, TestSolrDeletionPolicy2, MultiTermTest, SampleTest, TestBinaryField, TestSearchPerf, NumericFieldsTest, TestElisionMultitermQuery, OutputWriterTest, TestFuzzyAnalyzedSuggestions, TestSolrCoreProperties, TestPostingsSolrHighlighter, DirectSolrConnectionTest, TestPhraseSuggestions, SynonymTokenizerTest, TestXIncludeConfig, EchoParamsTest, TestPerFieldSimilarity, TestLMDirichletSimilarityFactory, TestFastWriter, ResourceLoaderTest, TestFastOutputStream, ScriptEngineTest, OpenExchangeRatesOrgProviderTest, PluginInfoTest, DateMathParserTest, ChaosMonkeyNothingIsSafeTest, AssignBackwardCompatibilityTest, AsyncCallRequestStatusResponseTest, CleanupOldIndexTest, CollectionStateFormat2Test, ConcurrentCreateRoutedAliasTest, DeleteLastCustomShardedReplicaTest, DeleteShardTest, DeleteStatusTest, ForceLeaderTest, LeaderInitiatedRecoveryOnShardRestartTest, LegacyCloudClusterPropTest, MultiThreadedOCPTest, ReplaceNodeTest, ReplicationFactorTest, RollingRestartTest, TestConfigSetsAPI, TestDistributedMap, TestLockTree, TestPrepRecovery, TestRandomFlRTGCloud, TestRandomRequestDistribution, TestShortCircuitedRequests, TestSkipOverseerOperations, TestTolerantUpdateProcessorCloud, TestTolerantUpdateProcessorRandomCloud, TestUtilizeNode, TlogReplayBufferedWhileIndexingTest, ZkFailoverTest, ConcurrentDeleteAndCreateCollectionTest, HdfsCollectionsAPIDistributedZkTest, ShardSplitTest, TestDistribStateManager, TestLargeCluster, CdcrReplicationHandlerTest, CdcrRequestHandlerTest, CdcrVersionReplicationTest, HDFSCollectionsAPITest, HdfsBasicDistributedZkTest, HdfsChaosMonkeyNothingIsSafeTest, HdfsChaosMonkeySafeLeaderTest, HdfsRecoverLeaseTest, HdfsSyncSliceTest, HdfsUnloadDistributedZkTest, HdfsWriteToMultipleCollectionsTest, TestClusterStateMutator, ZkStateReaderTest, ZkStateWriterTest, BlobRepositoryCloudTest, ConfigureRecoveryStrategyTest, CoreSorterTest, DirectoryFactoryTest, HdfsDirectoryFactoryTest, TestBackupRepositoryFactory, TestConfigSetImmutable, TestConfigSetProperties, TestDirectoryFactory, TestDynamicLoading, TestReqParamsAPI, TestSQLHandler, V2ApiIntegrationTest, AutoscalingHistoryHandlerTest]
   [junit4] Completed [642/779 (2!)] on J0 in 19.95s, 1 test, 1 failure <<< FAILURES!

[...truncated 25904 lines...]
-check-forbidden-all:
[forbidden-apis] Reading bundled API signatures: jdk-unsafe-1.8
[forbidden-apis] Reading bundled API signatures: jdk-deprecated-1.8
[forbidden-apis] Reading bundled API signatures: jdk-non-portable
[forbidden-apis] Reading bundled API signatures: jdk-reflection
[forbidden-apis] Reading bundled API signatures: commons-io-unsafe-2.5
[forbidden-apis] Reading API signatures: /Users/jenkins/workspace/Lucene-Solr-master-MacOSX/lucene/tools/forbiddenApis/base.txt
[forbidden-apis] Reading API signatures: /Users/jenkins/workspace/Lucene-Solr-master-MacOSX/lucene/tools/forbiddenApis/servlet-api.txt
[forbidden-apis] Reading API signatures: /Users/jenkins/workspace/Lucene-Solr-master-MacOSX/lucene/tools/forbiddenApis/solr.txt
[forbidden-apis] Loading classes to check...
[forbidden-apis] Scanning classes for violations...
[forbidden-apis] Forbidden method invocation: java.lang.System#currentTimeMillis() [Use RTimer/TimeOut/System.nanoTime for time comparisons, and `new Date()` output/debugging/stats of timestamps. If for some miscellaneous reason, you absolutely need to use this, use a SuppressForbidden.]
[forbidden-apis]   in org.apache.solr.cloud.autoscaling.ScheduledTriggerTest (ScheduledTriggerTest.java:80)
[forbidden-apis] Scanned 3978 class file(s) for forbidden API invocations (in 7.16s), 1 error(s).

BUILD FAILED
/Users/jenkins/workspace/Lucene-Solr-master-MacOSX/build.xml:618: The following error occurred while executing this line:
/Users/jenkins/workspace/Lucene-Solr-master-MacOSX/build.xml:117: The following error occurred while executing this line:
/Users/jenkins/workspace/Lucene-Solr-master-MacOSX/solr/build.xml:376: The following error occurred while executing this line:
/Users/jenkins/workspace/Lucene-Solr-master-MacOSX/solr/common-build.xml:535: Check for forbidden API calls failed, see log.

Total time: 109 minutes 35 seconds
Build step 'Invoke Ant' marked build as failure
Archiving artifacts
[WARNINGS] Skipping publisher since build result is FAILURE
Recording test results
Email was triggered for: Failure - Any
Sending email for trigger: Failure - Any

Mime
View raw message