lucene-dev mailing list archives

Site index · List index
Message view « Date » · « Thread »
Top « Date » · « Thread »
From Apache Jenkins Server <jenk...@builds.apache.org>
Subject [JENKINS] Lucene-Solr-Tests-7.x - Build # 345 - Still Unstable
Date Thu, 01 Feb 2018 01:48:53 GMT
Build: https://builds.apache.org/job/Lucene-Solr-Tests-7.x/345/

3 tests failed.
FAILED:  org.apache.solr.cloud.autoscaling.TriggerIntegrationTest.testNodeAddedTriggerRestoreState

Error Message:
The trigger did not fire at all

Stack Trace:
java.lang.AssertionError: The trigger did not fire at all
	at __randomizedtesting.SeedInfo.seed([70E0E3CC850E755D:F8DD6AB3BFCE94F0]:0)
	at org.junit.Assert.fail(Assert.java:93)
	at org.junit.Assert.assertTrue(Assert.java:43)
	at org.apache.solr.cloud.autoscaling.TriggerIntegrationTest.testNodeAddedTriggerRestoreState(TriggerIntegrationTest.java:426)
	at sun.reflect.NativeMethodAccessorImpl.invoke0(Native Method)
	at sun.reflect.NativeMethodAccessorImpl.invoke(NativeMethodAccessorImpl.java:62)
	at sun.reflect.DelegatingMethodAccessorImpl.invoke(DelegatingMethodAccessorImpl.java:43)
	at java.lang.reflect.Method.invoke(Method.java:498)
	at com.carrotsearch.randomizedtesting.RandomizedRunner.invoke(RandomizedRunner.java:1737)
	at com.carrotsearch.randomizedtesting.RandomizedRunner$8.evaluate(RandomizedRunner.java:934)
	at com.carrotsearch.randomizedtesting.RandomizedRunner$9.evaluate(RandomizedRunner.java:970)
	at com.carrotsearch.randomizedtesting.RandomizedRunner$10.evaluate(RandomizedRunner.java:984)
	at com.carrotsearch.randomizedtesting.rules.SystemPropertiesRestoreRule$1.evaluate(SystemPropertiesRestoreRule.java:57)
	at org.apache.lucene.util.TestRuleSetupTeardownChained$1.evaluate(TestRuleSetupTeardownChained.java:49)
	at org.apache.lucene.util.AbstractBeforeAfterRule$1.evaluate(AbstractBeforeAfterRule.java:45)
	at org.apache.lucene.util.TestRuleThreadAndTestName$1.evaluate(TestRuleThreadAndTestName.java:48)
	at org.apache.lucene.util.TestRuleIgnoreAfterMaxFailures$1.evaluate(TestRuleIgnoreAfterMaxFailures.java:64)
	at org.apache.lucene.util.TestRuleMarkFailure$1.evaluate(TestRuleMarkFailure.java:47)
	at com.carrotsearch.randomizedtesting.rules.StatementAdapter.evaluate(StatementAdapter.java:36)
	at com.carrotsearch.randomizedtesting.ThreadLeakControl$StatementRunner.run(ThreadLeakControl.java:368)
	at com.carrotsearch.randomizedtesting.ThreadLeakControl.forkTimeoutingTask(ThreadLeakControl.java:817)
	at com.carrotsearch.randomizedtesting.ThreadLeakControl$3.evaluate(ThreadLeakControl.java:468)
	at com.carrotsearch.randomizedtesting.RandomizedRunner.runSingleTest(RandomizedRunner.java:943)
	at com.carrotsearch.randomizedtesting.RandomizedRunner$5.evaluate(RandomizedRunner.java:829)
	at com.carrotsearch.randomizedtesting.RandomizedRunner$6.evaluate(RandomizedRunner.java:879)
	at com.carrotsearch.randomizedtesting.RandomizedRunner$7.evaluate(RandomizedRunner.java:890)
	at com.carrotsearch.randomizedtesting.rules.StatementAdapter.evaluate(StatementAdapter.java:36)
	at com.carrotsearch.randomizedtesting.rules.SystemPropertiesRestoreRule$1.evaluate(SystemPropertiesRestoreRule.java:57)
	at org.apache.lucene.util.AbstractBeforeAfterRule$1.evaluate(AbstractBeforeAfterRule.java:45)
	at com.carrotsearch.randomizedtesting.rules.StatementAdapter.evaluate(StatementAdapter.java:36)
	at org.apache.lucene.util.TestRuleStoreClassName$1.evaluate(TestRuleStoreClassName.java:41)
	at com.carrotsearch.randomizedtesting.rules.NoShadowingOrOverridesOnMethodsRule$1.evaluate(NoShadowingOrOverridesOnMethodsRule.java:40)
	at com.carrotsearch.randomizedtesting.rules.NoShadowingOrOverridesOnMethodsRule$1.evaluate(NoShadowingOrOverridesOnMethodsRule.java:40)
	at com.carrotsearch.randomizedtesting.rules.StatementAdapter.evaluate(StatementAdapter.java:36)
	at com.carrotsearch.randomizedtesting.rules.StatementAdapter.evaluate(StatementAdapter.java:36)
	at com.carrotsearch.randomizedtesting.rules.StatementAdapter.evaluate(StatementAdapter.java:36)
	at org.apache.lucene.util.TestRuleAssertionsRequired$1.evaluate(TestRuleAssertionsRequired.java:53)
	at org.apache.lucene.util.TestRuleMarkFailure$1.evaluate(TestRuleMarkFailure.java:47)
	at org.apache.lucene.util.TestRuleIgnoreAfterMaxFailures$1.evaluate(TestRuleIgnoreAfterMaxFailures.java:64)
	at org.apache.lucene.util.TestRuleIgnoreTestSuites$1.evaluate(TestRuleIgnoreTestSuites.java:54)
	at com.carrotsearch.randomizedtesting.rules.StatementAdapter.evaluate(StatementAdapter.java:36)
	at com.carrotsearch.randomizedtesting.ThreadLeakControl$StatementRunner.run(ThreadLeakControl.java:368)
	at java.lang.Thread.run(Thread.java:748)


FAILED:  org.apache.solr.cloud.autoscaling.TriggerIntegrationTest.testCooldown

Error Message:


Stack Trace:
java.lang.AssertionError
	at __randomizedtesting.SeedInfo.seed([70E0E3CC850E755D:415E8E28FBA400AF]:0)
	at org.junit.Assert.fail(Assert.java:92)
	at org.junit.Assert.assertTrue(Assert.java:43)
	at org.junit.Assert.assertTrue(Assert.java:54)
	at org.apache.solr.cloud.autoscaling.TriggerIntegrationTest.testCooldown(TriggerIntegrationTest.java:1177)
	at sun.reflect.NativeMethodAccessorImpl.invoke0(Native Method)
	at sun.reflect.NativeMethodAccessorImpl.invoke(NativeMethodAccessorImpl.java:62)
	at sun.reflect.DelegatingMethodAccessorImpl.invoke(DelegatingMethodAccessorImpl.java:43)
	at java.lang.reflect.Method.invoke(Method.java:498)
	at com.carrotsearch.randomizedtesting.RandomizedRunner.invoke(RandomizedRunner.java:1737)
	at com.carrotsearch.randomizedtesting.RandomizedRunner$8.evaluate(RandomizedRunner.java:934)
	at com.carrotsearch.randomizedtesting.RandomizedRunner$9.evaluate(RandomizedRunner.java:970)
	at com.carrotsearch.randomizedtesting.RandomizedRunner$10.evaluate(RandomizedRunner.java:984)
	at com.carrotsearch.randomizedtesting.rules.SystemPropertiesRestoreRule$1.evaluate(SystemPropertiesRestoreRule.java:57)
	at org.apache.lucene.util.TestRuleSetupTeardownChained$1.evaluate(TestRuleSetupTeardownChained.java:49)
	at org.apache.lucene.util.AbstractBeforeAfterRule$1.evaluate(AbstractBeforeAfterRule.java:45)
	at org.apache.lucene.util.TestRuleThreadAndTestName$1.evaluate(TestRuleThreadAndTestName.java:48)
	at org.apache.lucene.util.TestRuleIgnoreAfterMaxFailures$1.evaluate(TestRuleIgnoreAfterMaxFailures.java:64)
	at org.apache.lucene.util.TestRuleMarkFailure$1.evaluate(TestRuleMarkFailure.java:47)
	at com.carrotsearch.randomizedtesting.rules.StatementAdapter.evaluate(StatementAdapter.java:36)
	at com.carrotsearch.randomizedtesting.ThreadLeakControl$StatementRunner.run(ThreadLeakControl.java:368)
	at com.carrotsearch.randomizedtesting.ThreadLeakControl.forkTimeoutingTask(ThreadLeakControl.java:817)
	at com.carrotsearch.randomizedtesting.ThreadLeakControl$3.evaluate(ThreadLeakControl.java:468)
	at com.carrotsearch.randomizedtesting.RandomizedRunner.runSingleTest(RandomizedRunner.java:943)
	at com.carrotsearch.randomizedtesting.RandomizedRunner$5.evaluate(RandomizedRunner.java:829)
	at com.carrotsearch.randomizedtesting.RandomizedRunner$6.evaluate(RandomizedRunner.java:879)
	at com.carrotsearch.randomizedtesting.RandomizedRunner$7.evaluate(RandomizedRunner.java:890)
	at com.carrotsearch.randomizedtesting.rules.StatementAdapter.evaluate(StatementAdapter.java:36)
	at com.carrotsearch.randomizedtesting.rules.SystemPropertiesRestoreRule$1.evaluate(SystemPropertiesRestoreRule.java:57)
	at org.apache.lucene.util.AbstractBeforeAfterRule$1.evaluate(AbstractBeforeAfterRule.java:45)
	at com.carrotsearch.randomizedtesting.rules.StatementAdapter.evaluate(StatementAdapter.java:36)
	at org.apache.lucene.util.TestRuleStoreClassName$1.evaluate(TestRuleStoreClassName.java:41)
	at com.carrotsearch.randomizedtesting.rules.NoShadowingOrOverridesOnMethodsRule$1.evaluate(NoShadowingOrOverridesOnMethodsRule.java:40)
	at com.carrotsearch.randomizedtesting.rules.NoShadowingOrOverridesOnMethodsRule$1.evaluate(NoShadowingOrOverridesOnMethodsRule.java:40)
	at com.carrotsearch.randomizedtesting.rules.StatementAdapter.evaluate(StatementAdapter.java:36)
	at com.carrotsearch.randomizedtesting.rules.StatementAdapter.evaluate(StatementAdapter.java:36)
	at com.carrotsearch.randomizedtesting.rules.StatementAdapter.evaluate(StatementAdapter.java:36)
	at org.apache.lucene.util.TestRuleAssertionsRequired$1.evaluate(TestRuleAssertionsRequired.java:53)
	at org.apache.lucene.util.TestRuleMarkFailure$1.evaluate(TestRuleMarkFailure.java:47)
	at org.apache.lucene.util.TestRuleIgnoreAfterMaxFailures$1.evaluate(TestRuleIgnoreAfterMaxFailures.java:64)
	at org.apache.lucene.util.TestRuleIgnoreTestSuites$1.evaluate(TestRuleIgnoreTestSuites.java:54)
	at com.carrotsearch.randomizedtesting.rules.StatementAdapter.evaluate(StatementAdapter.java:36)
	at com.carrotsearch.randomizedtesting.ThreadLeakControl$StatementRunner.run(ThreadLeakControl.java:368)
	at java.lang.Thread.run(Thread.java:748)


FAILED:  org.apache.solr.cloud.autoscaling.sim.TestDistribStateManager.testGetSetRemoveData

Error Message:
Node watch should have fired!

Stack Trace:
java.lang.AssertionError: Node watch should have fired!
	at __randomizedtesting.SeedInfo.seed([70E0E3CC850E755D:56700C9ED180B357]:0)
	at org.junit.Assert.fail(Assert.java:93)
	at org.apache.solr.cloud.autoscaling.sim.TestDistribStateManager.testGetSetRemoveData(TestDistribStateManager.java:256)
	at sun.reflect.NativeMethodAccessorImpl.invoke0(Native Method)
	at sun.reflect.NativeMethodAccessorImpl.invoke(NativeMethodAccessorImpl.java:62)
	at sun.reflect.DelegatingMethodAccessorImpl.invoke(DelegatingMethodAccessorImpl.java:43)
	at java.lang.reflect.Method.invoke(Method.java:498)
	at com.carrotsearch.randomizedtesting.RandomizedRunner.invoke(RandomizedRunner.java:1737)
	at com.carrotsearch.randomizedtesting.RandomizedRunner$8.evaluate(RandomizedRunner.java:934)
	at com.carrotsearch.randomizedtesting.RandomizedRunner$9.evaluate(RandomizedRunner.java:970)
	at com.carrotsearch.randomizedtesting.RandomizedRunner$10.evaluate(RandomizedRunner.java:984)
	at com.carrotsearch.randomizedtesting.rules.SystemPropertiesRestoreRule$1.evaluate(SystemPropertiesRestoreRule.java:57)
	at org.apache.lucene.util.TestRuleSetupTeardownChained$1.evaluate(TestRuleSetupTeardownChained.java:49)
	at org.apache.lucene.util.AbstractBeforeAfterRule$1.evaluate(AbstractBeforeAfterRule.java:45)
	at org.apache.lucene.util.TestRuleThreadAndTestName$1.evaluate(TestRuleThreadAndTestName.java:48)
	at org.apache.lucene.util.TestRuleIgnoreAfterMaxFailures$1.evaluate(TestRuleIgnoreAfterMaxFailures.java:64)
	at org.apache.lucene.util.TestRuleMarkFailure$1.evaluate(TestRuleMarkFailure.java:47)
	at com.carrotsearch.randomizedtesting.rules.StatementAdapter.evaluate(StatementAdapter.java:36)
	at com.carrotsearch.randomizedtesting.ThreadLeakControl$StatementRunner.run(ThreadLeakControl.java:368)
	at com.carrotsearch.randomizedtesting.ThreadLeakControl.forkTimeoutingTask(ThreadLeakControl.java:817)
	at com.carrotsearch.randomizedtesting.ThreadLeakControl$3.evaluate(ThreadLeakControl.java:468)
	at com.carrotsearch.randomizedtesting.RandomizedRunner.runSingleTest(RandomizedRunner.java:943)
	at com.carrotsearch.randomizedtesting.RandomizedRunner$5.evaluate(RandomizedRunner.java:829)
	at com.carrotsearch.randomizedtesting.RandomizedRunner$6.evaluate(RandomizedRunner.java:879)
	at com.carrotsearch.randomizedtesting.RandomizedRunner$7.evaluate(RandomizedRunner.java:890)
	at com.carrotsearch.randomizedtesting.rules.StatementAdapter.evaluate(StatementAdapter.java:36)
	at com.carrotsearch.randomizedtesting.rules.SystemPropertiesRestoreRule$1.evaluate(SystemPropertiesRestoreRule.java:57)
	at org.apache.lucene.util.AbstractBeforeAfterRule$1.evaluate(AbstractBeforeAfterRule.java:45)
	at com.carrotsearch.randomizedtesting.rules.StatementAdapter.evaluate(StatementAdapter.java:36)
	at org.apache.lucene.util.TestRuleStoreClassName$1.evaluate(TestRuleStoreClassName.java:41)
	at com.carrotsearch.randomizedtesting.rules.NoShadowingOrOverridesOnMethodsRule$1.evaluate(NoShadowingOrOverridesOnMethodsRule.java:40)
	at com.carrotsearch.randomizedtesting.rules.NoShadowingOrOverridesOnMethodsRule$1.evaluate(NoShadowingOrOverridesOnMethodsRule.java:40)
	at com.carrotsearch.randomizedtesting.rules.StatementAdapter.evaluate(StatementAdapter.java:36)
	at com.carrotsearch.randomizedtesting.rules.StatementAdapter.evaluate(StatementAdapter.java:36)
	at com.carrotsearch.randomizedtesting.rules.StatementAdapter.evaluate(StatementAdapter.java:36)
	at org.apache.lucene.util.TestRuleAssertionsRequired$1.evaluate(TestRuleAssertionsRequired.java:53)
	at org.apache.lucene.util.TestRuleMarkFailure$1.evaluate(TestRuleMarkFailure.java:47)
	at org.apache.lucene.util.TestRuleIgnoreAfterMaxFailures$1.evaluate(TestRuleIgnoreAfterMaxFailures.java:64)
	at org.apache.lucene.util.TestRuleIgnoreTestSuites$1.evaluate(TestRuleIgnoreTestSuites.java:54)
	at com.carrotsearch.randomizedtesting.rules.StatementAdapter.evaluate(StatementAdapter.java:36)
	at com.carrotsearch.randomizedtesting.ThreadLeakControl$StatementRunner.run(ThreadLeakControl.java:368)
	at java.lang.Thread.run(Thread.java:748)




Build Log:
[...truncated 12285 lines...]
   [junit4] Suite: org.apache.solr.cloud.autoscaling.sim.TestDistribStateManager
   [junit4]   2> Creating dataDir: /home/jenkins/jenkins-slave/workspace/Lucene-Solr-Tests-7.x/solr/build/solr-core/test/J1/temp/solr.cloud.autoscaling.sim.TestDistribStateManager_70E0E3CC850E755D-001/init-core-data-001
   [junit4]   2> 1063171 INFO  (SUITE-TestDistribStateManager-seed#[70E0E3CC850E755D]-worker) [    ] o.a.s.SolrTestCaseJ4 Using PointFields (NUMERIC_POINTS_SYSPROP=true) w/NUMERIC_DOCVALUES_SYSPROP=false
   [junit4]   2> 1063172 INFO  (SUITE-TestDistribStateManager-seed#[70E0E3CC850E755D]-worker) [    ] o.a.s.SolrTestCaseJ4 Randomized ssl (true) and clientAuth (false) via: @org.apache.solr.util.RandomizeSSL(reason=, value=NaN, ssl=NaN, clientAuth=NaN)
   [junit4]   2> 1063173 INFO  (SUITE-TestDistribStateManager-seed#[70E0E3CC850E755D]-worker) [    ] o.a.s.SolrTestCaseJ4 SecureRandom sanity checks: test.solr.allowed.securerandom=null & java.security.egd=file:/dev/./urandom
   [junit4]   2> 1063186 INFO  (TEST-TestDistribStateManager.testCreateMode-seed#[70E0E3CC850E755D]) [    ] o.a.s.SolrTestCaseJ4 ###Starting testCreateMode
   [junit4]   2> 1063187 INFO  (TEST-TestDistribStateManager.testCreateMode-seed#[70E0E3CC850E755D]) [    ] o.a.s.c.ZkTestServer STARTING ZK TEST SERVER
   [junit4]   2> 1063187 INFO  (Thread-1258) [    ] o.a.s.c.ZkTestServer client port:0.0.0.0/0.0.0.0:0
   [junit4]   2> 1063187 INFO  (Thread-1258) [    ] o.a.s.c.ZkTestServer Starting server
   [junit4]   2> 1063214 ERROR (Thread-1258) [    ] o.a.z.s.ZooKeeperServer ZKShutdownHandler is not registered, so ZooKeeper server won't take any action on ERROR or SHUTDOWN server state changes
   [junit4]   2> 1063287 INFO  (TEST-TestDistribStateManager.testCreateMode-seed#[70E0E3CC850E755D]) [    ] o.a.s.c.ZkTestServer start zk server on port:46397
   [junit4]   2> 1063289 INFO  (zkConnectionManagerCallback-1161-thread-1) [    ] o.a.s.c.c.ConnectionManager zkClient has connected
   [junit4]   2> 1063290 INFO  (TEST-TestDistribStateManager.testCreateMode-seed#[70E0E3CC850E755D]) [    ] o.a.s.c.a.s.TestDistribStateManager Using org.apache.solr.client.solrj.impl.ZkDistribStateManager
   [junit4]   2> 1063344 INFO  (zkConnectionManagerCallback-1163-thread-1) [    ] o.a.s.c.c.ConnectionManager zkClient has connected
   [junit4]   2> 1063344 INFO  (TEST-TestDistribStateManager.testCreateMode-seed#[70E0E3CC850E755D]) [    ] o.a.s.c.a.s.TestDistribStateManager Using org.apache.solr.client.solrj.impl.ZkDistribStateManager
   [junit4]   2> 1063347 ERROR (TEST-TestDistribStateManager.testCreateMode-seed#[70E0E3CC850E755D]) [    ] o.a.z.s.ZooKeeperServer ZKShutdownHandler is not registered, so ZooKeeper server won't take any action on ERROR or SHUTDOWN server state changes
   [junit4]   2> 1063364 INFO  (TEST-TestDistribStateManager.testCreateMode-seed#[70E0E3CC850E755D]) [    ] o.a.s.c.ZkTestServer connecting to 127.0.0.1:46397 46397
   [junit4]   2> 1063678 INFO  (Thread-1258) [    ] o.a.s.c.ZkTestServer connecting to 127.0.0.1:46397 46397
   [junit4]   2> 1063680 INFO  (TEST-TestDistribStateManager.testCreateMode-seed#[70E0E3CC850E755D]) [    ] o.a.s.SolrTestCaseJ4 ###Ending testCreateMode
   [junit4]   2> 1063700 INFO  (TEST-TestDistribStateManager.testMulti-seed#[70E0E3CC850E755D]) [    ] o.a.s.SolrTestCaseJ4 ###Starting testMulti
   [junit4]   2> 1063703 INFO  (TEST-TestDistribStateManager.testMulti-seed#[70E0E3CC850E755D]) [    ] o.a.s.c.a.s.TestDistribStateManager Using org.apache.solr.cloud.autoscaling.sim.SimDistribStateManager
   [junit4]   2> 1063703 INFO  (TEST-TestDistribStateManager.testMulti-seed#[70E0E3CC850E755D]) [    ] o.a.s.SolrTestCaseJ4 ###Ending testMulti
   [junit4]   2> 1063719 INFO  (TEST-TestDistribStateManager.testListData-seed#[70E0E3CC850E755D]) [    ] o.a.s.SolrTestCaseJ4 ###Starting testListData
   [junit4]   2> 1063719 INFO  (TEST-TestDistribStateManager.testListData-seed#[70E0E3CC850E755D]) [    ] o.a.s.c.a.s.TestDistribStateManager Using org.apache.solr.cloud.autoscaling.sim.SimDistribStateManager
   [junit4]   2> 1063720 INFO  (TEST-TestDistribStateManager.testListData-seed#[70E0E3CC850E755D]) [    ] o.a.s.SolrTestCaseJ4 ###Ending testListData
   [junit4]   2> 1063733 INFO  (TEST-TestDistribStateManager.testHasData-seed#[70E0E3CC850E755D]) [    ] o.a.s.SolrTestCaseJ4 ###Starting testHasData
   [junit4]   2> 1063733 INFO  (TEST-TestDistribStateManager.testHasData-seed#[70E0E3CC850E755D]) [    ] o.a.s.c.ZkTestServer STARTING ZK TEST SERVER
   [junit4]   2> 1063734 INFO  (Thread-1259) [    ] o.a.s.c.ZkTestServer client port:0.0.0.0/0.0.0.0:0
   [junit4]   2> 1063734 INFO  (Thread-1259) [    ] o.a.s.c.ZkTestServer Starting server
   [junit4]   2> 1063749 ERROR (Thread-1259) [    ] o.a.z.s.ZooKeeperServer ZKShutdownHandler is not registered, so ZooKeeper server won't take any action on ERROR or SHUTDOWN server state changes
   [junit4]   2> 1063834 INFO  (TEST-TestDistribStateManager.testHasData-seed#[70E0E3CC850E755D]) [    ] o.a.s.c.ZkTestServer start zk server on port:45680
   [junit4]   2> 1063836 INFO  (zkConnectionManagerCallback-1165-thread-1) [    ] o.a.s.c.c.ConnectionManager zkClient has connected
   [junit4]   2> 1063836 INFO  (TEST-TestDistribStateManager.testHasData-seed#[70E0E3CC850E755D]) [    ] o.a.s.c.a.s.TestDistribStateManager Using org.apache.solr.client.solrj.impl.ZkDistribStateManager
   [junit4]   2> 1063840 ERROR (TEST-TestDistribStateManager.testHasData-seed#[70E0E3CC850E755D]) [    ] o.a.z.s.ZooKeeperServer ZKShutdownHandler is not registered, so ZooKeeper server won't take any action on ERROR or SHUTDOWN server state changes
   [junit4]   2> 1063854 INFO  (TEST-TestDistribStateManager.testHasData-seed#[70E0E3CC850E755D]) [    ] o.a.s.c.ZkTestServer connecting to 127.0.0.1:45680 45680
   [junit4]   2> 1063915 INFO  (Thread-1259) [    ] o.a.s.c.ZkTestServer connecting to 127.0.0.1:45680 45680
   [junit4]   2> 1063916 INFO  (TEST-TestDistribStateManager.testHasData-seed#[70E0E3CC850E755D]) [    ] o.a.s.SolrTestCaseJ4 ###Ending testHasData
   [junit4]   2> 1063918 INFO  (TEST-TestDistribStateManager.testGetSetRemoveData-seed#[70E0E3CC850E755D]) [    ] o.a.s.SolrTestCaseJ4 ###Starting testGetSetRemoveData
   [junit4]   2> 1063918 INFO  (TEST-TestDistribStateManager.testGetSetRemoveData-seed#[70E0E3CC850E755D]) [    ] o.a.s.c.ZkTestServer STARTING ZK TEST SERVER
   [junit4]   2> 1063918 INFO  (Thread-1260) [    ] o.a.s.c.ZkTestServer client port:0.0.0.0/0.0.0.0:0
   [junit4]   2> 1063918 INFO  (Thread-1260) [    ] o.a.s.c.ZkTestServer Starting server
   [junit4]   2> 1063919 ERROR (Thread-1260) [    ] o.a.z.s.ZooKeeperServer ZKShutdownHandler is not registered, so ZooKeeper server won't take any action on ERROR or SHUTDOWN server state changes
   [junit4]   2> 1064020 INFO  (TEST-TestDistribStateManager.testGetSetRemoveData-seed#[70E0E3CC850E755D]) [    ] o.a.s.c.ZkTestServer start zk server on port:38692
   [junit4]   2> 1064045 INFO  (zkConnectionManagerCallback-1167-thread-1) [    ] o.a.s.c.c.ConnectionManager zkClient has connected
   [junit4]   2> 1064046 INFO  (TEST-TestDistribStateManager.testGetSetRemoveData-seed#[70E0E3CC850E755D]) [    ] o.a.s.c.a.s.TestDistribStateManager Using org.apache.solr.client.solrj.impl.ZkDistribStateManager
   [junit4]   2> 1064050 INFO  (zkConnectionManagerCallback-1169-thread-1) [    ] o.a.s.c.c.ConnectionManager zkClient has connected
   [junit4]   2> 1064094 INFO  (TEST-TestDistribStateManager.testGetSetRemoveData-seed#[70E0E3CC850E755D]) [    ] o.a.s.c.a.s.TestDistribStateManager Using org.apache.solr.client.solrj.impl.ZkDistribStateManager
   [junit4]   2> 1069096 ERROR (TEST-TestDistribStateManager.testGetSetRemoveData-seed#[70E0E3CC850E755D]) [    ] o.a.z.s.ZooKeeperServer ZKShutdownHandler is not registered, so ZooKeeper server won't take any action on ERROR or SHUTDOWN server state changes
   [junit4]   2> 1069096 INFO  (TEST-TestDistribStateManager.testGetSetRemoveData-seed#[70E0E3CC850E755D]) [    ] o.a.s.c.ZkTestServer connecting to 127.0.0.1:38692 38692
   [junit4]   2> 1069326 INFO  (Thread-1260) [    ] o.a.s.c.ZkTestServer connecting to 127.0.0.1:38692 38692
   [junit4]   2> 1069326 INFO  (TEST-TestDistribStateManager.testGetSetRemoveData-seed#[70E0E3CC850E755D]) [    ] o.a.s.SolrTestCaseJ4 ###Ending testGetSetRemoveData
   [junit4]   2> NOTE: reproduce with: ant test  -Dtestcase=TestDistribStateManager -Dtests.method=testGetSetRemoveData -Dtests.seed=70E0E3CC850E755D -Dtests.multiplier=2 -Dtests.slow=true -Dtests.locale=hr -Dtests.timezone=America/Noronha -Dtests.asserts=true -Dtests.file.encoding=US-ASCII
   [junit4] FAILURE 5.41s J1 | TestDistribStateManager.testGetSetRemoveData <<<
   [junit4]    > Throwable #1: java.lang.AssertionError: Node watch should have fired!
   [junit4]    > 	at __randomizedtesting.SeedInfo.seed([70E0E3CC850E755D:56700C9ED180B357]:0)
   [junit4]    > 	at org.apache.solr.cloud.autoscaling.sim.TestDistribStateManager.testGetSetRemoveData(TestDistribStateManager.java:256)
   [junit4]    > 	at java.lang.Thread.run(Thread.java:748)
   [junit4]   2> NOTE: leaving temporary files on disk at: /home/jenkins/jenkins-slave/workspace/Lucene-Solr-Tests-7.x/solr/build/solr-core/test/J1/temp/solr.cloud.autoscaling.sim.TestDistribStateManager_70E0E3CC850E755D-001
   [junit4]   2> Feb 01, 2018 12:24:55 AM com.carrotsearch.randomizedtesting.ThreadLeakControl checkThreadLeaks
   [junit4]   2> WARNING: Will linger awaiting termination of 1 leaked thread(s).
   [junit4]   2> NOTE: test params are: codec=Asserting(Lucene70): {}, docValues:{}, maxPointsInLeafNode=1248, maxMBSortInHeap=7.3207745729132885, sim=RandomSimilarity(queryNorm=true): {}, locale=hr, timezone=America/Noronha
   [junit4]   2> NOTE: Linux 4.4.0-104-generic amd64/Oracle Corporation 1.8.0_152 (64-bit)/cpus=4,threads=1,free=182314232,total=517996544
   [junit4]   2> NOTE: All tests run in this JVM: [TestMacroExpander, DistributedDebugComponentTest, TestPullReplicaErrorHandling, SmileWriterTest, TestLegacyField, TestRebalanceLeaders, DeleteStatusTest, SolrCloudExampleTest, ReplaceNodeNoTargetTest, TestStandardQParsers, TestXmlQParser, TestSchemaVersionResource, LegacyCloudClusterPropTest, DistributedQueryComponentOptimizationTest, HttpPartitionTest, TestObjectReleaseTracker, HLLUtilTest, RestartWhileUpdatingTest, DistributedFacetPivotLargeTest, BasicFunctionalityTest, TestSolrCloudSnapshots, HdfsNNFailoverTest, TestSolr4Spatial, SuggesterFSTTest, TestSubQueryTransformerDistrib, TestInitQParser, BadComponentTest, ExplicitHLLTest, TestDFISimilarityFactory, ClassificationUpdateProcessorTest, TestPivotHelperCode, HighlighterTest, DistribJoinFromCollectionTest, AlternateDirectoryTest, RulesTest, TestFunctionQuery, UpdateRequestProcessorFactoryTest, GraphQueryTest, EnumFieldTest, TriLevelCompositeIdRoutingTest, TestCorePropertiesReload, SuggesterTest, PeerSyncTest, CachingDirectoryFactoryTest, TestLeaderInitiatedRecoveryThread, TestOverriddenPrefixQueryForCustomFieldType, DistributedIntervalFacetingTest, DistributedMLTComponentTest, ScriptEngineTest, TestAnalyzeInfixSuggestions, PrimitiveFieldTypeTest, ConfigSetsAPITest, FastVectorHighlighterTest, SearchHandlerTest, PolyFieldTest, TestSolrJ, TestNumericRangeQuery64, AddBlockUpdateTest, TestSolrCloudWithHadoopAuthPlugin, QueryElevationComponentTest, TestPerFieldSimilarity, OverseerRolesTest, TestDistribStateManager]
   [junit4] Completed [185/773 (1!)] on J1 in 7.07s, 5 tests, 1 failure <<< FAILURES!

[...truncated 1524 lines...]
   [junit4] Suite: org.apache.solr.cloud.autoscaling.TriggerIntegrationTest
   [junit4]   2> Creating dataDir: /home/jenkins/jenkins-slave/workspace/Lucene-Solr-Tests-7.x/solr/build/solr-core/test/J2/temp/solr.cloud.autoscaling.TriggerIntegrationTest_70E0E3CC850E755D-001/init-core-data-001
   [junit4]   2> 3611264 INFO  (SUITE-TriggerIntegrationTest-seed#[70E0E3CC850E755D]-worker) [    ] o.a.s.SolrTestCaseJ4 Using PointFields (NUMERIC_POINTS_SYSPROP=true) w/NUMERIC_DOCVALUES_SYSPROP=false
   [junit4]   2> 3611275 INFO  (SUITE-TriggerIntegrationTest-seed#[70E0E3CC850E755D]-worker) [    ] o.a.s.SolrTestCaseJ4 Randomized ssl (true) and clientAuth (true) via: @org.apache.solr.util.RandomizeSSL(reason=, value=NaN, ssl=NaN, clientAuth=NaN)
   [junit4]   2> 3611275 INFO  (SUITE-TriggerIntegrationTest-seed#[70E0E3CC850E755D]-worker) [    ] o.a.s.SolrTestCaseJ4 SecureRandom sanity checks: test.solr.allowed.securerandom=null & java.security.egd=file:/dev/./urandom
   [junit4]   2> 3611276 INFO  (SUITE-TriggerIntegrationTest-seed#[70E0E3CC850E755D]-worker) [    ] o.a.s.c.MiniSolrCloudCluster Starting cluster of 2 servers in /home/jenkins/jenkins-slave/workspace/Lucene-Solr-Tests-7.x/solr/build/solr-core/test/J2/temp/solr.cloud.autoscaling.TriggerIntegrationTest_70E0E3CC850E755D-001/tempDir-001
   [junit4]   2> 3611276 INFO  (SUITE-TriggerIntegrationTest-seed#[70E0E3CC850E755D]-worker) [    ] o.a.s.c.ZkTestServer STARTING ZK TEST SERVER
   [junit4]   2> 3611282 INFO  (Thread-8143) [    ] o.a.s.c.ZkTestServer client port:0.0.0.0/0.0.0.0:0
   [junit4]   2> 3611282 INFO  (Thread-8143) [    ] o.a.s.c.ZkTestServer Starting server
   [junit4]   2> 3611291 ERROR (Thread-8143) [    ] o.a.z.s.ZooKeeperServer ZKShutdownHandler is not registered, so ZooKeeper server won't take any action on ERROR or SHUTDOWN server state changes
   [junit4]   2> 3611382 INFO  (SUITE-TriggerIntegrationTest-seed#[70E0E3CC850E755D]-worker) [    ] o.a.s.c.ZkTestServer start zk server on port:46437
   [junit4]   2> 3611386 INFO  (zkConnectionManagerCallback-5162-thread-1) [    ] o.a.s.c.c.ConnectionManager zkClient has connected
   [junit4]   2> 3611392 INFO  (jetty-launcher-5159-thread-1) [    ] o.e.j.s.Server jetty-9.4.8.v20171121, build timestamp: 2017-11-22T11:27:37+14:00, git hash: 82b8fb23f757335bb3329d540ce37a2a2615f0a8
   [junit4]   2> 3611392 INFO  (jetty-launcher-5159-thread-2) [    ] o.e.j.s.Server jetty-9.4.8.v20171121, build timestamp: 2017-11-22T11:27:37+14:00, git hash: 82b8fb23f757335bb3329d540ce37a2a2615f0a8
   [junit4]   2> 3611393 INFO  (jetty-launcher-5159-thread-1) [    ] o.e.j.s.session DefaultSessionIdManager workerName=node0
   [junit4]   2> 3611393 INFO  (jetty-launcher-5159-thread-1) [    ] o.e.j.s.session No SessionScavenger set, using defaults
   [junit4]   2> 3611393 INFO  (jetty-launcher-5159-thread-2) [    ] o.e.j.s.session DefaultSessionIdManager workerName=node0
   [junit4]   2> 3611393 INFO  (jetty-launcher-5159-thread-1) [    ] o.e.j.s.session Scavenging every 600000ms
   [junit4]   2> 3611393 INFO  (jetty-launcher-5159-thread-2) [    ] o.e.j.s.session No SessionScavenger set, using defaults
   [junit4]   2> 3611393 INFO  (jetty-launcher-5159-thread-2) [    ] o.e.j.s.session Scavenging every 600000ms
   [junit4]   2> 3611393 INFO  (jetty-launcher-5159-thread-1) [    ] o.e.j.s.h.ContextHandler Started o.e.j.s.ServletContextHandler@7eb3a45d{/solr,null,AVAILABLE}
   [junit4]   2> 3611394 INFO  (jetty-launcher-5159-thread-2) [    ] o.e.j.s.h.ContextHandler Started o.e.j.s.ServletContextHandler@3e47f1fe{/solr,null,AVAILABLE}
   [junit4]   2> 3611395 INFO  (jetty-launcher-5159-thread-1) [    ] o.e.j.s.AbstractConnector Started ServerConnector@2f9ce966{SSL,[ssl, http/1.1]}{127.0.0.1:44315}
   [junit4]   2> 3611395 INFO  (jetty-launcher-5159-thread-2) [    ] o.e.j.s.AbstractConnector Started ServerConnector@72026bf0{SSL,[ssl, http/1.1]}{127.0.0.1:37754}
   [junit4]   2> 3611395 INFO  (jetty-launcher-5159-thread-1) [    ] o.e.j.s.Server Started @3621696ms
   [junit4]   2> 3611395 INFO  (jetty-launcher-5159-thread-2) [    ] o.e.j.s.Server Started @3621696ms
   [junit4]   2> 3611395 INFO  (jetty-launcher-5159-thread-1) [    ] o.a.s.c.s.e.JettySolrRunner Jetty properties: {hostContext=/solr, hostPort=44315}
   [junit4]   2> 3611395 INFO  (jetty-launcher-5159-thread-2) [    ] o.a.s.c.s.e.JettySolrRunner Jetty properties: {hostContext=/solr, hostPort=37754}
   [junit4]   2> 3611396 ERROR (jetty-launcher-5159-thread-1) [    ] o.a.s.u.StartupLoggingUtils Missing Java Option solr.log.dir. Logging may be missing or incomplete.
   [junit4]   2> 3611396 ERROR (jetty-launcher-5159-thread-2) [    ] o.a.s.u.StartupLoggingUtils Missing Java Option solr.log.dir. Logging may be missing or incomplete.
   [junit4]   2> 3611396 INFO  (jetty-launcher-5159-thread-1) [    ] o.a.s.s.SolrDispatchFilter  ___      _       Welcome to Apache Solr? version 7.3.0
   [junit4]   2> 3611396 INFO  (jetty-launcher-5159-thread-2) [    ] o.a.s.s.SolrDispatchFilter  ___      _       Welcome to Apache Solr? version 7.3.0
   [junit4]   2> 3611396 INFO  (jetty-launcher-5159-thread-1) [    ] o.a.s.s.SolrDispatchFilter / __| ___| |_ _   Starting in cloud mode on port null
   [junit4]   2> 3611396 INFO  (jetty-launcher-5159-thread-2) [    ] o.a.s.s.SolrDispatchFilter / __| ___| |_ _   Starting in cloud mode on port null
   [junit4]   2> 3611396 INFO  (jetty-launcher-5159-thread-1) [    ] o.a.s.s.SolrDispatchFilter \__ \/ _ \ | '_|  Install dir: null
   [junit4]   2> 3611396 INFO  (jetty-launcher-5159-thread-2) [    ] o.a.s.s.SolrDispatchFilter \__ \/ _ \ | '_|  Install dir: null
   [junit4]   2> 3611396 INFO  (jetty-launcher-5159-thread-1) [    ] o.a.s.s.SolrDispatchFilter |___/\___/_|_|    Start time: 2018-02-01T01:07:16.236Z
   [junit4]   2> 3611396 INFO  (jetty-launcher-5159-thread-2) [    ] o.a.s.s.SolrDispatchFilter |___/\___/_|_|    Start time: 2018-02-01T01:07:16.236Z
   [junit4]   2> 3611397 INFO  (zkConnectionManagerCallback-5165-thread-1) [    ] o.a.s.c.c.ConnectionManager zkClient has connected
   [junit4]   2> 3611397 INFO  (zkConnectionManagerCallback-5166-thread-1) [    ] o.a.s.c.c.ConnectionManager zkClient has connected
   [junit4]   2> 3611397 INFO  (jetty-launcher-5159-thread-1) [    ] o.a.s.s.SolrDispatchFilter solr.xml found in ZooKeeper. Loading...
   [junit4]   2> 3611397 INFO  (jetty-launcher-5159-thread-2) [    ] o.a.s.s.SolrDispatchFilter solr.xml found in ZooKeeper. Loading...
   [junit4]   2> 3611404 INFO  (jetty-launcher-5159-thread-2) [    ] o.a.s.c.ZkContainer Zookeeper client=127.0.0.1:46437/solr
   [junit4]   2> 3611404 INFO  (jetty-launcher-5159-thread-1) [    ] o.a.s.c.ZkContainer Zookeeper client=127.0.0.1:46437/solr
   [junit4]   2> 3611408 INFO  (zkConnectionManagerCallback-5174-thread-1) [    ] o.a.s.c.c.ConnectionManager zkClient has connected
   [junit4]   2> 3611408 INFO  (zkConnectionManagerCallback-5172-thread-1) [    ] o.a.s.c.c.ConnectionManager zkClient has connected
   [junit4]   2> 3611410 INFO  (zkConnectionManagerCallback-5176-thread-1-processing-n:127.0.0.1:44315_solr) [n:127.0.0.1:44315_solr    ] o.a.s.c.c.ConnectionManager zkClient has connected
   [junit4]   2> 3611411 INFO  (zkConnectionManagerCallback-5178-thread-1-processing-n:127.0.0.1:37754_solr) [n:127.0.0.1:37754_solr    ] o.a.s.c.c.ConnectionManager zkClient has connected
   [junit4]   2> 3611469 INFO  (jetty-launcher-5159-thread-2) [n:127.0.0.1:37754_solr    ] o.a.s.c.Overseer Overseer (id=null) closing
   [junit4]   2> 3611469 INFO  (jetty-launcher-5159-thread-1) [n:127.0.0.1:44315_solr    ] o.a.s.c.Overseer Overseer (id=null) closing
   [junit4]   2> 3611469 INFO  (jetty-launcher-5159-thread-2) [n:127.0.0.1:37754_solr    ] o.a.s.c.OverseerElectionContext I am going to be the leader 127.0.0.1:37754_solr
   [junit4]   2> 3611470 INFO  (jetty-launcher-5159-thread-1) [n:127.0.0.1:44315_solr    ] o.a.s.c.ZkController Register node as live in ZooKeeper:/live_nodes/127.0.0.1:44315_solr
   [junit4]   2> 3611470 INFO  (jetty-launcher-5159-thread-2) [n:127.0.0.1:37754_solr    ] o.a.s.c.Overseer Overseer (id=72182215205978118-127.0.0.1:37754_solr-n_0000000000) starting
   [junit4]   2> 3611472 INFO  (zkCallback-5175-thread-1-processing-n:127.0.0.1:44315_solr) [n:127.0.0.1:44315_solr    ] o.a.s.c.c.ZkStateReader Updated live nodes from ZooKeeper... (0) -> (1)
   [junit4]   2> 3611474 INFO  (zkCallback-5177-thread-1-processing-n:127.0.0.1:37754_solr) [n:127.0.0.1:37754_solr    ] o.a.s.c.c.ZkStateReader Updated live nodes from ZooKeeper... (0) -> (1)
   [junit4]   2> 3611479 DEBUG (OverseerAutoScalingTriggerThread-72182215205978118-127.0.0.1:37754_solr-n_0000000000) [n:127.0.0.1:37754_solr    ] o.a.s.c.a.OverseerTriggerThread Adding .autoAddReplicas trigger
   [junit4]   2> 3611480 DEBUG (OverseerAutoScalingTriggerThread-72182215205978118-127.0.0.1:37754_solr-n_0000000000) [n:127.0.0.1:37754_solr    ] o.a.s.c.a.OverseerTriggerThread Refreshing /autoscaling.json with znode version 1
   [junit4]   2> 3611480 DEBUG (OverseerAutoScalingTriggerThread-72182215205978118-127.0.0.1:37754_solr-n_0000000000) [n:127.0.0.1:37754_solr    ] o.a.s.c.a.NodeLostTrigger Initial livenodes: [127.0.0.1:44315_solr]
   [junit4]   2> 3611480 DEBUG (OverseerAutoScalingTriggerThread-72182215205978118-127.0.0.1:37754_solr-n_0000000000) [n:127.0.0.1:37754_solr    ] o.a.s.c.a.OverseerTriggerThread Current znodeVersion 1, lastZnodeVersion -1
   [junit4]   2> 3611480 DEBUG (OverseerAutoScalingTriggerThread-72182215205978118-127.0.0.1:37754_solr-n_0000000000) [n:127.0.0.1:37754_solr    ] o.a.s.c.a.OverseerTriggerThread Processed trigger updates upto znodeVersion 1
   [junit4]   2> 3611480 INFO  (jetty-launcher-5159-thread-2) [n:127.0.0.1:37754_solr    ] o.a.s.c.ZkController Register node as live in ZooKeeper:/live_nodes/127.0.0.1:37754_solr
   [junit4]   2> 3611491 INFO  (zkCallback-5175-thread-1-processing-n:127.0.0.1:44315_solr) [n:127.0.0.1:44315_solr    ] o.a.s.c.c.ZkStateReader Updated live nodes from ZooKeeper... (1) -> (2)
   [junit4]   2> 3611491 INFO  (zkCallback-5177-thread-1-processing-n:127.0.0.1:37754_solr) [n:127.0.0.1:37754_solr    ] o.a.s.c.c.ZkStateReader Updated live nodes from ZooKeeper... (1) -> (2)
   [junit4]   2> 3611495 DEBUG (OverseerAutoScalingTriggerThread-72182215205978118-127.0.0.1:37754_solr-n_0000000000) [n:127.0.0.1:37754_solr    ] o.a.s.c.a.OverseerTriggerThread -- clean old nodeAdded markers
   [junit4]   2> 3611496 DEBUG (OverseerAutoScalingTriggerThread-72182215205978118-127.0.0.1:37754_solr-n_0000000000) [n:127.0.0.1:37754_solr    ] o.a.s.c.a.OverseerTriggerThread Current znodeVersion 1, lastZnodeVersion 1
   [junit4]   2> 3611496 DEBUG (ScheduledTrigger-8679-thread-1) [n:127.0.0.1:37754_solr    ] o.a.s.c.a.NodeLostTrigger Running NodeLostTrigger: .auto_add_replicas with currently live nodes: 2
   [junit4]   2> 3611515 INFO  (jetty-launcher-5159-thread-1) [n:127.0.0.1:44315_solr    ] o.a.s.m.r.SolrJmxReporter JMX monitoring for 'solr_44315.solr.node' (registry 'solr.node') enabled at server: com.sun.jmx.mbeanserver.JmxMBeanServer@19aad4dd
   [junit4]   2> 3611521 INFO  (jetty-launcher-5159-thread-1) [n:127.0.0.1:44315_solr    ] o.a.s.m.r.SolrJmxReporter JMX monitoring for 'solr_44315.solr.jvm' (registry 'solr.jvm') enabled at server: com.sun.jmx.mbeanserver.JmxMBeanServer@19aad4dd
   [junit4]   2> 3611521 INFO  (jetty-launcher-5159-thread-1) [n:127.0.0.1:44315_solr    ] o.a.s.m.r.SolrJmxReporter JMX monitoring for 'solr_44315.solr.jetty' (registry 'solr.jetty') enabled at server: com.sun.jmx.mbeanserver.JmxMBeanServer@19aad4dd
   [junit4]   2> 3611522 INFO  (jetty-launcher-5159-thread-1) [n:127.0.0.1:44315_solr    ] o.a.s.c.CorePropertiesLocator Found 0 core definitions underneath /home/jenkins/jenkins-slave/workspace/Lucene-Solr-Tests-7.x/solr/build/solr-core/test/J2/temp/solr.cloud.autoscaling.TriggerIntegrationTest_70E0E3CC850E755D-001/tempDir-001/node1/.
   [junit4]   2> 3611535 INFO  (jetty-launcher-5159-thread-2) [n:127.0.0.1:37754_solr    ] o.a.s.m.r.SolrJmxReporter JMX monitoring for 'solr_37754.solr.node' (registry 'solr.node') enabled at server: com.sun.jmx.mbeanserver.JmxMBeanServer@19aad4dd
   [junit4]   2> 3611542 INFO  (jetty-launcher-5159-thread-2) [n:127.0.0.1:37754_solr    ] o.a.s.m.r.SolrJmxReporter JMX monitoring for 'solr_37754.solr.jvm' (registry 'solr.jvm') enabled at server: com.sun.jmx.mbeanserver.JmxMBeanServer@19aad4dd
   [junit4]   2> 3611542 INFO  (jetty-launcher-5159-thread-2) [n:127.0.0.1:37754_solr    ] o.a.s.m.r.SolrJmxReporter JMX monitoring for 'solr_37754.solr.jetty' (registry 'solr.jetty') enabled at server: com.sun.jmx.mbeanserver.JmxMBeanServer@19aad4dd
   [junit4]   2> 3611543 INFO  (jetty-launcher-5159-thread-2) [n:127.0.0.1:37754_solr    ] o.a.s.c.CorePropertiesLocator Found 0 core definitions underneath /home/jenkins/jenkins-slave/workspace/Lucene-Solr-Tests-7.x/solr/build/solr-core/test/J2/temp/solr.cloud.autoscaling.TriggerIntegrationTest_70E0E3CC850E755D-001/tempDir-001/node2/.
   [junit4]   2> 3611560 INFO  (zkConnectionManagerCallback-5184-thread-1) [    ] o.a.s.c.c.ConnectionManager zkClient has connected
   [junit4]   2> 3611562 INFO  (zkConnectionManagerCallback-5188-thread-1) [    ] o.a.s.c.c.ConnectionManager zkClient has connected
   [junit4]   2> 3611563 INFO  (SUITE-TriggerIntegrationTest-seed#[70E0E3CC850E755D]-worker) [    ] o.a.s.c.c.ZkStateReader Updated live nodes from ZooKeeper... (0) -> (2)
   [junit4]   2> 3611563 INFO  (SUITE-TriggerIntegrationTest-seed#[70E0E3CC850E755D]-worker) [    ] o.a.s.c.s.i.ZkClientClusterStateProvider Cluster at 127.0.0.1:46437/solr ready
   [junit4]   2> 3611624 INFO  (TEST-TriggerIntegrationTest.testEventQueue-seed#[70E0E3CC850E755D]) [    ] o.a.s.SolrTestCaseJ4 ###Starting testEventQueue
   [junit4]   2> 3611624 INFO  (TEST-TriggerIntegrationTest.testEventQueue-seed#[70E0E3CC850E755D]) [    ] o.a.s.c.a.TriggerIntegrationTest /autoscaling.json reset, new znode version 2
   [junit4]   2> 3611624 DEBUG (zkCallback-5177-thread-1-processing-n:127.0.0.1:37754_solr) [n:127.0.0.1:37754_solr    ] o.a.s.c.a.OverseerTriggerThread Refreshing /autoscaling.json with znode version 2
   [junit4]   2> 3611624 DEBUG (OverseerAutoScalingTriggerThread-72182215205978118-127.0.0.1:37754_solr-n_0000000000) [n:127.0.0.1:37754_solr    ] o.a.s.c.a.OverseerTriggerThread Processed trigger updates upto znodeVersion 2
   [junit4]   2> 3611626 DEBUG (OverseerAutoScalingTriggerThread-72182215205978118-127.0.0.1:37754_solr-n_0000000000) [n:127.0.0.1:37754_solr    ] o.a.s.c.a.OverseerTriggerThread -- clean old nodeLost markers
   [junit4]   2> 3611626 DEBUG (OverseerAutoScalingTriggerThread-72182215205978118-127.0.0.1:37754_solr-n_0000000000) [n:127.0.0.1:37754_solr    ] o.a.s.c.a.OverseerTriggerThread -- clean old nodeAdded markers
   [junit4]   2> 3611627 DEBUG (OverseerAutoScalingTriggerThread-72182215205978118-127.0.0.1:37754_solr-n_0000000000) [n:127.0.0.1:37754_solr    ] o.a.s.c.a.OverseerTriggerThread Current znodeVersion 2, lastZnodeVersion 2
   [junit4]   2> 3611644 INFO  (qtp1474490809-26991) [n:127.0.0.1:37754_solr    ] o.a.s.h.a.CollectionsHandler Invoked Collection Action :overseerstatus with params action=OVERSEERSTATUS&wt=javabin&version=2 and sendToOCPQueue=true
   [junit4]   2> 3611648 INFO  (qtp1474490809-26991) [n:127.0.0.1:37754_solr    ] o.a.s.s.HttpSolrCall [admin] webapp=null path=/admin/collections params={action=OVERSEERSTATUS&wt=javabin&version=2} status=0 QTime=4
   [junit4]   2> 3611674 INFO  (qtp1474490809-26997) [n:127.0.0.1:37754_solr    ] o.a.s.s.HttpSolrCall [admin] webapp=null path=/admin/metrics params={prefix=CONTAINER.fs.usableSpace,CORE.coreName&wt=javabin&version=2&group=solr.node,solr.core} status=0 QTime=0
   [junit4]   2> 3611676 INFO  (qtp798780450-26983) [n:127.0.0.1:44315_solr    ] o.a.s.s.HttpSolrCall [admin] webapp=null path=/admin/metrics params={prefix=CONTAINER.fs.usableSpace,CORE.coreName&wt=javabin&version=2&group=solr.node,solr.core} status=0 QTime=0
   [junit4]   2> 3611676 DEBUG (qtp798780450-26992) [n:127.0.0.1:44315_solr    ] o.a.s.c.a.AutoScalingHandler Verified autoscaling configuration
   [junit4]   2> 3611677 INFO  (qtp798780450-26992) [n:127.0.0.1:44315_solr    ] o.a.s.s.HttpSolrCall [admin] webapp=null path=/cluster/autoscaling params={wt=javabin&version=2} status=0 QTime=7
   [junit4]   2> 3611677 DEBUG (zkCallback-5177-thread-1-processing-n:127.0.0.1:37754_solr) [n:127.0.0.1:37754_solr    ] o.a.s.c.a.OverseerTriggerThread Refreshing /autoscaling.json with znode version 3
   [junit4]   2> 3611678 INFO  (zkCallback-5177-thread-1-processing-n:127.0.0.1:37754_solr) [n:127.0.0.1:37754_solr    ] o.a.s.c.a.TriggerIntegrationTest TestEventQueueAction instantiated
   [junit4]   2> 3611680 DEBUG (zkCallback-5177-thread-1-processing-n:127.0.0.1:37754_solr) [n:127.0.0.1:37754_solr    ] o.a.s.c.a.NodeAddedTrigger Initial livenodes: [127.0.0.1:44315_solr, 127.0.0.1:37754_solr]
   [junit4]   2> 3611680 DEBUG (zkCallback-5177-thread-1-processing-n:127.0.0.1:37754_solr) [n:127.0.0.1:37754_solr    ] o.a.s.c.a.NodeAddedTrigger NodeAddedTrigger node_added_triggerEQ instantiated with properties: {event=nodeAdded, waitFor=1, actions=[{name=test, class=org.apache.solr.cloud.autoscaling.TriggerIntegrationTest$TestEventQueueAction}], enabled=true}
   [junit4]   2> 3611680 DEBUG (OverseerAutoScalingTriggerThread-72182215205978118-127.0.0.1:37754_solr-n_0000000000) [n:127.0.0.1:37754_solr    ] o.a.s.c.a.OverseerTriggerThread Processed trigger updates upto znodeVersion 3
   [junit4]   2> 3611681 DEBUG (OverseerAutoScalingTriggerThread-72182215205978118-127.0.0.1:37754_solr-n_0000000000) [n:127.0.0.1:37754_solr    ] o.a.s.c.a.TriggerIntegrationTest TestTriggerAction init
   [junit4]   2> 3611681 DEBUG (OverseerAutoScalingTriggerThread-72182215205978118-127.0.0.1:37754_solr-n_0000000000) [n:127.0.0.1:37754_solr    ] o.a.s.c.a.OverseerTriggerThread -- clean old nodeLost markers
   [junit4]   2> 3611682 DEBUG (OverseerAutoScalingTriggerThread-72182215205978118-127.0.0.1:37754_solr-n_0000000000) [n:127.0.0.1:37754_solr    ] o.a.s.c.a.OverseerTriggerThread Current znodeVersion 3, lastZnodeVersion 3
   [junit4]   2> 3611682 DEBUG (ScheduledTrigger-8679-thread-1) [n:127.0.0.1:37754_solr    ] o.a.s.c.a.NodeAddedTrigger Running NodeAddedTrigger node_added_triggerEQ
   [junit4]   2> 3611682 DEBUG (ScheduledTrigger-8679-thread-1) [n:127.0.0.1:37754_solr    ] o.a.s.c.a.NodeAddedTrigger Found livenodes: 2
   [junit4]   2> 3611682 INFO  (TEST-TriggerIntegrationTest.testEventQueue-seed#[70E0E3CC850E755D]) [    ] o.e.j.s.Server jetty-9.4.8.v20171121, build timestamp: 2017-11-22T11:27:37+14:00, git hash: 82b8fb23f757335bb3329d540ce37a2a2615f0a8
   [junit4]   2> 3611683 INFO  (TEST-TriggerIntegrationTest.testEventQueue-seed#[70E0E3CC850E755D]) [    ] o.e.j.s.session DefaultSessionIdManager workerName=node0
   [junit4]   2> 3611683 INFO  (TEST-TriggerIntegrationTest.testEventQueue-seed#[70E0E3CC850E755D]) [    ] o.e.j.s.session No SessionScavenger set, using defaults
   [junit4]   2> 3611683 INFO  (TEST-TriggerIntegrationTest.testEventQueue-seed#[70E0E3CC850E755D]) [    ] o.e.j.s.session Scavenging every 600000ms
   [junit4]   2> 3611683 INFO  (TEST-TriggerIntegrationTest.testEventQueue-seed#[70E0E3CC850E755D]) [    ] o.e.j.s.h.ContextHandler Started o.e.j.s.ServletContextHandler@2707223f{/solr,null,AVAILABLE}
   [junit4]   2> 3611684 INFO  (TEST-TriggerIntegrationTest.testEventQueue-seed#[70E0E3CC850E755D]) [    ] o.e.j.s.AbstractConnector Started ServerConnector@6b45886f{SSL,[ssl, http/1.1]}{127.0.0.1:44545}
   [junit4]   2> 3611684 INFO  (TEST-TriggerIntegrationTest.testEventQueue-seed#[70E0E3CC850E755D]) [    ] o.e.j.s.Server Started @3621984ms
   [junit4]   2> 3611684 INFO  (TEST-TriggerIntegrationTest.testEventQueue-seed#[70E0E3CC850E755D]) [    ] o.a.s.c.s.e.JettySolrRunner Jetty properties: {hostContext=/solr, hostPort=44545}
   [junit4]   2> 3611684 ERROR (TEST-TriggerIntegrationTest.testEventQueue-seed#[70E0E3CC850E755D]) [    ] o.a.s.u.StartupLoggingUtils Missing Java Option solr.log.dir. Logging may be missing or incomplete.
   [junit4]   2> 3611684 INFO  (TEST-TriggerIntegrationTest.testEventQueue-seed#[70E0E3CC850E755D]) [    ] o.a.s.s.SolrDispatchFilter  ___      _       Welcome to Apache Solr? version 7.3.0
   [junit4]   2> 3611684 INFO  (TEST-TriggerIntegrationTest.testEventQueue-seed#[70E0E3CC850E755D]) [    ] o.a.s.s.SolrDispatchFilter / __| ___| |_ _   Starting in cloud mode on port null
   [junit4]   2> 3611684 INFO  (TEST-TriggerIntegrationTest.testEventQueue-seed#[70E0E3CC850E755D]) [    ] o.a.s.s.SolrDispatchFilter \__ \/ _ \ | '_|  Install dir: null
   [junit4]   2> 3611684 INFO  (TEST-TriggerIntegrationTest.testEventQueue-seed#[70E0E3CC850E755D]) [    ] o.a.s.s.SolrDispatchFilter |___/\___/_|_|    Start time: 2018-02-01T01:07:16.524Z
   [junit4]   2> 3611685 INFO  (zkConnectionManagerCallback-5190-thread-1) [    ] o.a.s.c.c.ConnectionManager zkClient has connected
   [junit4]   2> 3611686 INFO  (TEST-TriggerIntegrationTest.testEventQueue-seed#[70E0E3CC850E755D]) [    ] o.a.s.s.SolrDispatchFilter solr.xml found in ZooKeeper. Loading...
   [junit4]   2> 3611695 INFO  (TEST-TriggerIntegrationTest.testEventQueue-seed#[70E0E3CC850E755D]) [    ] o.a.s.c.ZkContainer Zookeeper client=127.0.0.1:46437/solr
   [junit4]   2> 3611695 INFO  (zkConnectionManagerCallback-5194-thread-1) [    ] o.a.s.c.c.ConnectionManager zkClient has connected
   [junit4]   2> 3611702 INFO  (zkConnectionManagerCallback-5196-thread-1-processing-n:127.0.0.1:44545_solr) [n:127.0.0.1:44545_solr    ] o.a.s.c.c.ConnectionManager zkClient has connected
   [junit4]   2> 3611706 INFO  (TEST-TriggerIntegrationTest.testEventQueue-seed#[70E0E3CC850E755D]) [n:127.0.0.1:44545_solr    ] o.a.s.c.c.ZkStateReader Updated live nodes from ZooKeeper... (0) -> (2)
   [junit4]   2> 3611707 INFO  (TEST-TriggerIntegrationTest.testEventQueue-seed#[70E0E3CC850E755D]) [n:127.0.0.1:44545_solr    ] o.a.s.c.Overseer Overseer (id=null) closing
   [junit4]   2> 3611708 INFO  (TEST-TriggerIntegrationTest.testEventQueue-seed#[70E0E3CC850E755D]) [n:127.0.0.1:44545_solr    ] o.a.s.c.ZkController Register node as live in ZooKeeper:/live_nodes/127.0.0.1:44545_solr
   [junit4]   2> 3611709 INFO  (zkCallback-5175-thread-1-processing-n:127.0.0.1:44315_solr) [n:127.0.0.1:44315_solr    ] o.a.s.c.c.ZkStateReader Updated live nodes from ZooKeeper... (2) -> (3)
   [junit4]   2> 3611711 INFO  (zkCallback-5195-thread-1-processing-n:127.0.0.1:44545_solr) [n:127.0.0.1:44545_solr    ] o.a.s.c.c.ZkStateReader Updated live nodes from ZooKeeper... (2) -> (3)
   [junit4]   2> 3611721 INFO  (zkCallback-5177-thread-1-processing-n:127.0.0.1:37754_solr) [n:127.0.0.1:37754_solr    ] o.a.s.c.c.ZkStateReader Updated live nodes from ZooKeeper... (2) -> (3)
   [junit4]   2> 3611722 INFO  (zkCallback-5187-thread-1) [    ] o.a.s.c.c.ZkStateReader Updated live nodes from ZooKeeper... (2) -> (3)
   [junit4]   2> 3611764 INFO  (TEST-TriggerIntegrationTest.testEventQueue-seed#[70E0E3CC850E755D]) [n:127.0.0.1:44545_solr    ] o.a.s.m.r.SolrJmxReporter JMX monitoring for 'solr_44545.solr.node' (registry 'solr.node') enabled at server: com.sun.jmx.mbeanserver.JmxMBeanServer@19aad4dd
   [junit4]   2> 3611781 INFO  (TEST-TriggerIntegrationTest.testEventQueue-seed#[70E0E3CC850E755D]) [n:127.0.0.1:44545_solr    ] o.a.s.m.r.SolrJmxReporter JMX monitoring for 'solr_44545.solr.jvm' (registry 'solr.jvm') enabled at server: com.sun.jmx.mbeanserver.JmxMBeanServer@19aad4dd
   [junit4]   2> 3611781 INFO  (TEST-TriggerIntegrationTest.testEventQueue-seed#[70E0E3CC850E755D]) [n:127.0.0.1:44545_solr    ] o.a.s.m.r.SolrJmxReporter JMX monitoring for 'solr_44545.solr.jetty' (registry 'solr.jetty') enabled at server: com.sun.jmx.mbeanserver.JmxMBeanServer@19aad4dd
   [junit4]   2> 3611783 INFO  (TEST-TriggerIntegrationTest.testEventQueue-seed#[70E0E3CC850E755D]) [n:127.0.0.1:44545_solr    ] o.a.s.c.CorePropertiesLocator Found 0 core definitions underneath /home/jenkins/jenkins-slave/workspace/Lucene-Solr-Tests-7.x/solr/build/solr-core/test/J2/temp/solr.cloud.autoscaling.TriggerIntegrationTest_70E0E3CC850E755D-001/tempDir-001/node3/.
   [junit4]   2> 3612686 DEBUG (ScheduledTrigger-8679-thread-2) [n:127.0.0.1:37754_solr    ] o.a.s.c.a.NodeAddedTrigger Running NodeAddedTrigger node_added_triggerEQ
   [junit4]   2> 3612686 DEBUG (ScheduledTrigger-8679-thread-2) [n:127.0.0.1:37754_solr    ] o.a.s.c.a.NodeAddedTrigger Found livenodes: 3
   [junit4]   2> 3612686 DEBUG (ScheduledTrigger-8679-thread-2) [n:127.0.0.1:37754_solr    ] o.a.s.c.a.NodeAddedTrigger Tracking new node: 127.0.0.1:44545_solr at time 1901569519320770
   [junit4]   2> 3613647 INFO  (OverseerCollectionConfigSetProcessor-72182215205978118-127.0.0.1:37754_solr-n_0000000000) [n:127.0.0.1:37754_solr    ] o.a.s.c.OverseerTaskQueue Response ZK path: /overseer/collection-queue-work/qnr-0000000000 doesn't exist.  Requestor may have disconnected from ZooKeeper
   [junit4]   2> 3613687 DEBUG (ScheduledTrigger-8679-thread-2) [n:127.0.0.1:37754_solr    ] o.a.s.c.a.NodeAddedTrigger Running NodeAddedTrigger node_added_triggerEQ
   [junit4]   2> 3613687 DEBUG (ScheduledTrigger-8679-thread-2) [n:127.0.0.1:37754_solr    ] o.a.s.c.a.NodeAddedTrigger Found livenodes: 3
   [junit4]   2> 3613687 DEBUG (ScheduledTrigger-8679-thread-2) [n:127.0.0.1:37754_solr    ] o.a.s.c.a.NodeAddedTrigger NodeAddedTrigger node_added_triggerEQ firing registered processor for nodes: [127.0.0.1:44545_solr] added at times [1901569519320770], now=1901570520107840
   [junit4]   2> 3613687 DEBUG (ScheduledTrigger-8679-thread-2) [n:127.0.0.1:37754_solr    ] o.a.s.c.a.ScheduledTriggers ++++++++ Cooldown inactive - processing event: {
   [junit4]   2>   "id":"6c177a7b6fec2T19eb92hubht45ylnjfpt46qfn",
   [junit4]   2>   "source":"node_added_triggerEQ",
   [junit4]   2>   "eventTime":1901569519320770,
   [junit4]   2>   "eventType":"NODEADDED",
   [junit4]   2>   "properties":{
   [junit4]   2>     "eventTimes":[1901569519320770],
   [junit4]   2>     "nodeNames":["127.0.0.1:44545_solr"]}}
   [junit4]   2> 3613689 DEBUG (ScheduledTrigger-8679-thread-2) [n:127.0.0.1:37754_solr    ] o.a.s.c.a.ScheduledTriggers Pausing all triggers: [node_added_triggerEQ]
   [junit4]   2> 3613689 INFO  (ScheduledTrigger-8679-thread-2) [n:127.0.0.1:37754_solr    ] o.a.s.c.a.SystemLogListener Collection .system does not exist, disabling logging.
   [junit4]   2> 3613690 DEBUG (AutoscalingActionExecutor-8680-thread-1-processing-n:127.0.0.1:37754_solr) [n:127.0.0.1:37754_solr    ] o.a.s.c.a.ScheduledTriggers -- processing actions for {
   [junit4]   2>   "id":"6c177a7b6fec2T19eb92hubht45ylnjfpt46qfn",
   [junit4]   2>   "source":"node_added_triggerEQ",
   [junit4]   2>   "eventTime":1901569519320770,
   [junit4]   2>   "eventType":"NODEADDED",
   [junit4]   2>   "properties":{
   [junit4]   2>     "eventTimes":[1901569519320770],
   [junit4]   2>     "_enqueue_time_":1901570522406197,
   [junit4]   2>     "nodeNames":["127.0.0.1:44545_solr"]}}
   [junit4]   2> 3613690 INFO  (AutoscalingActionExecutor-8680-thread-1-processing-n:127.0.0.1:37754_solr) [n:127.0.0.1:37754_solr    ] o.a.s.c.a.TriggerIntegrationTest -- event: {
   [junit4]   2>   "id":"6c177a7b6fec2T19eb92hubht45ylnjfpt46qfn",
   [junit4]   2>   "source":"node_added_triggerEQ",
   [junit4]   2>   "eventTime":1901569519320770,
   [junit4]   2>   "eventType":"NODEADDED",
   [junit4]   2>   "properties":{
   [junit4]   2>     "eventTimes":[1901569519320770],
   [junit4]   2>     "_enqueue_time_":1901570522406197,
   [junit4]   2>     "nodeNames":["127.0.0.1:44545_solr"]}}
   [junit4]   2> 3613691 INFO  (TEST-TriggerIntegrationTest.testEventQueue-seed#[70E0E3CC850E755D]) [    ] o.e.j.s.AbstractConnector Stopped ServerConnector@72026bf0{SSL,[ssl, http/1.1]}{127.0.0.1:0}
   [junit4]   2> 3613692 INFO  (TEST-TriggerIntegrationTest.testEventQueue-seed#[70E0E3CC850E755D]) [    ] o.a.s.c.CoreContainer Shutting down CoreContainer instance=1993029186
   [junit4]   2> 3613692 INFO  (TEST-TriggerIntegrationTest.testEventQueue-seed#[70E0E3CC850E755D]) [    ] o.a.s.m.SolrMetricManager Closing metric reporters for registry=solr.node, tag=null
   [junit4]   2> 3613692 INFO  (TEST-TriggerIntegrationTest.testEventQueue-seed#[70E0E3CC850E755D]) [    ] o.a.s.m.r.SolrJmxReporter Closing reporter [org.apache.solr.metrics.reporters.SolrJmxReporter@2eabfafc: rootName = solr_37754, domain = solr.node, service url = null, agent id = null] for registry solr.node / com.codahale.metrics.MetricRegistry@610edddc
   [junit4]   2> 3613698 INFO  (TEST-TriggerIntegrationTest.testEventQueue-seed#[70E0E3CC850E755D]) [    ] o.a.s.m.SolrMetricManager Closing metric reporters for registry=solr.jvm, tag=null
   [junit4]   2> 3613698 INFO  (TEST-TriggerIntegrationTest.testEventQueue-seed#[70E0E3CC850E755D]) [    ] o.a.s.m.r.SolrJmxReporter Closing reporter [org.apache.solr.metrics.reporters.SolrJmxReporter@72b4bae3: rootName = solr_37754, domain = solr.jvm, service url = null, agent id = null] for registry solr.jvm / com.codahale.metrics.MetricRegistry@96faf96
   [junit4]   2> 3613702 INFO  (TEST-TriggerIntegrationTest.testEventQueue-seed#[70E0E3CC850E755D]) [    ] o.a.s.m.SolrMetricManager Closing metric reporters for registry=solr.jetty, tag=null
   [junit4]   2> 3613702 INFO  (TEST-TriggerIntegrationTest.testEventQueue-seed#[70E0E3CC850E755D]) [    ] o.a.s.m.r.SolrJmxReporter Closing reporter [org.apache.solr.metrics.reporters.SolrJmxReporter@7cbdec38: rootName = solr_37754, domain = solr.jetty, service url = null, agent id = null] for registry solr.jetty / com.codahale.metrics.MetricRegistry@6b77d146
   [junit4]   2> 3613702 INFO  (TEST-TriggerIntegrationTest.testEventQueue-seed#[70E0E3CC850E755D]) [    ] o.a.s.c.ZkController Remove node as live in ZooKeeper:/live_nodes/127.0.0.1:37754_solr
   [junit4]   2> 3613703 INFO  (TEST-TriggerIntegrationTest.testEventQueue-seed#[70E0E3CC850E755D]) [    ] o.a.s.m.SolrMetricManager Closing metric reporters for registry=solr.cluster, tag=null
   [junit4]   2> 3613703 INFO  (zkCallback-5195-thread-1-processing-n:127.0.0.1:44545_solr) [n:127.0.0.1:44545_solr    ] o.a.s.c.c.ZkStateReader Updated live nodes from ZooKeeper... (3) -> (2)
   [junit4]   2> 3613703 INFO  (zkCallback-5187-thread-1) [    ] o.a.s.c.c.ZkStateReader Updated live nodes from ZooKeeper... (3) -> (2)
   [junit4]   2> 3613703 INFO  (TEST-TriggerIntegrationTest.testEventQueue-seed#[70E0E3CC850E755D]) [    ] o.a.s.c.TransientSolrCoreCacheDefault Allocating transient cache for 2147483647 transient cores
   [junit4]   2> 3613703 INFO  (zkCallback-5175-thread-1-processing-n:127.0.0.1:44315_solr) [n:127.0.0.1:44315_solr    ] o.a.s.c.c.ZkStateReader Updated live nodes from ZooKeeper... (3) -> (2)
   [junit4]   2> 3613703 INFO  (TEST-TriggerIntegrationTest.testEventQueue-seed#[70E0E3CC850E755D]) [    ] o.a.s.c.Overseer Overseer (id=72182215205978118-127.0.0.1:37754_solr-n_0000000000) closing
   [junit4]   2> 3613703 INFO  (OverseerStateUpdate-72182215205978118-127.0.0.1:37754_solr-n_0000000000) [n:127.0.0.1:37754_solr    ] o.a.s.c.Overseer Overseer Loop exiting : 127.0.0.1:37754_solr
   [junit4]   2> 3613703 INFO  (zkCallback-5177-thread-1-processing-n:127.0.0.1:37754_solr) [n:127.0.0.1:37754_solr    ] o.a.s.c.c.ZkStateReader Updated live nodes from ZooKeeper... (3) -> (2)
   [junit4]   2> 3613705 WARN  (OverseerAutoScalingTriggerThread-72182215205978118-127.0.0.1:37754_solr-n_0000000000) [n:127.0.0.1:37754_solr    ] o.a.s.c.a.OverseerTriggerThread OverseerTriggerThread woken up but we are closed, exiting.
   [junit4]   2> 3613706 WARN  (AutoscalingActionExecutor-8680-thread-1-processing-n:127.0.0.1:37754_solr) [n:127.0.0.1:37754_solr    ] o.a.s.c.a.ScheduledTriggers Exception executing actions
   [junit4]   2> org.apache.lucene.store.AlreadyClosedException: ScheduledTrigger node_added_triggerEQ has been closed.
   [junit4]   2> 	at org.apache.solr.cloud.autoscaling.ScheduledTriggers$ScheduledTrigger.dequeue(ScheduledTriggers.java:526)
   [junit4]   2> 	at org.apache.solr.cloud.autoscaling.ScheduledTriggers.lambda$null$3(ScheduledTriggers.java:310)
   [junit4]   2> 	at java.util.concurrent.Executors$RunnableAdapter.call(Executors.java:511)
   [junit4]   2> 	at java.util.concurrent.FutureTask.run(FutureTask.java:266)
   [junit4]   2> 	at org.apache.solr.common.util.ExecutorUtil$MDCAwareThreadPoolExecutor.lambda$execute$0(ExecutorUtil.java:188)
   [junit4]   2> 	at java.util.concurrent.ThreadPoolExecutor.runWorker(ThreadPoolExecutor.java:1149)
   [junit4]   2> 	at java.util.concurrent.ThreadPoolExecutor$Worker.run(ThreadPoolExecutor.java:624)
   [junit4]   2> 	at java.lang.Thread.run(Thread.java:748)
   [junit4]   2> 3613705 DEBUG (TEST-TriggerIntegrationTest.testEventQueue-seed#[70E0E3CC850E755D]) [    ] o.a.s.c.a.OverseerTriggerThread OverseerTriggerThread has been closed explicitly
   [junit4]   2> 3613710 DEBUG (AutoscalingActionExecutor-8680-thread-1-processing-n:127.0.0.1:37754_solr) [n:127.0.0.1:37754_solr    ] o.a.s.c.a.ScheduledTriggers -- processing took 20 ms for event id=6c177a7b6fec2T19eb92hubht45ylnjfpt46qfn
   [junit4]   2> 3613711 INFO  (TEST-TriggerIntegrationTest.testEventQueue-seed#[70E0E3CC850E755D]) [    ] o.e.j.s.h.ContextHandler Stopped o.e.j.s.ServletContextHandler@3e47f1fe{/solr,null,UNAVAILABLE}
   [junit4]   2> 3613711 INFO  (zkCallback-5175-thread-1-processing-n:127.0.0.1:44315_solr) [n:127.0.0.1:44315_solr    ] o.a.s.c.OverseerElectionContext I am going to be the leader 127.0.0.1:44315_solr
   [junit4]   2> 3613712 INFO  (TEST-TriggerIntegrationTest.testEventQueue-seed#[70E0E3CC850E755D]) [    ] o.e.j.s.session Stopped scavenging
   [junit4]   2> 3613713 INFO  (zkCallback-5175-thread-1-processing-n:127.0.0.1:44315_solr) [n:127.0.0.1:44315_solr    ] o.a.s.c.Overseer Overseer (id=72182215205978117-127.0.0.1:44315_solr-n_0000000001) starting
   [junit4]   2> 3613716 DEBUG (OverseerAutoScalingTriggerThread-72182215205978117-127.0.0.1:44315_solr-n_0000000001) [n:127.0.0.1:44315_solr    ] o.a.s.c.a.OverseerTriggerThread Adding .autoAddReplicas trigger
   [junit4]   2> 3613716 DEBUG (OverseerAutoScalingTriggerThread-72182215205978117-127.0.0.1:44315_solr-n_0000000001) [n:127.0.0.1:44315_solr    ] o.a.s.c.a.OverseerTriggerThread Refreshing /autoscaling.json with znode version 4
   [junit4]   2> 3613716 INFO  (OverseerAutoScalingTriggerThread-72182215205978117-127.0.0.1:44315_solr-n_0000000001) [n:127.0.0.1:44315_solr    ] o.a.s.c.a.TriggerIntegrationTest TestEventQueueAction instantiated
   [junit4]   2> 3613716 DEBUG (OverseerAutoScalingTriggerThread-72182215205978117-127.0.0.1:44315_solr-n_0000000001) [n:127.0.0.1:44315_solr    ] o.a.s.c.a.NodeAddedTrigger Initial livenodes: [127.0.0.1:44315_solr, 127.0.0.1:44545_solr]
   [junit4]   2> 3613716 DEBUG (OverseerAutoScalingTriggerThread-72182215205978117-127.0.0.1:44315_solr-n_0000000001) [n:127.0.0.1:44315_solr    ] o.a.s.c.a.NodeAddedTrigger NodeAddedTrigger node_added_triggerEQ instantiated with properties: {event=nodeAdded, waitFor=1, actions=[{name=test, class=org.apache.solr.cloud.autoscaling.TriggerIntegrationTest$TestEventQueueAction}], enabled=true}
   [junit4]   2> 3613717 DEBUG (OverseerAutoScalingTriggerThread-72182215205978117-127.0.0.1:44315_solr-n_0000000001) [n:127.0.0.1:44315_solr    ] o.a.s.c.a.NodeLostTrigger Initial livenodes: [127.0.0.1:44315_solr, 127.0.0.1:44545_solr]
   [junit4]   2> 3613717 DEBUG (OverseerAutoScalingTriggerThread-72182215205978117-127.0.0.1:44315_solr-n_0000000001) [n:127.0.0.1:44315_solr    ] o.a.s.c.a.OverseerTriggerThread Current znodeVersion 4, lastZnodeVersion -1
   [junit4]   2> 3613717 DEBUG (OverseerAutoScalingTriggerThread-72182215205978117-127.0.0.1:44315_solr-n_0000000001) [n:127.0.0.1:44315_solr    ] o.a.s.c.a.OverseerTriggerThread Processed trigger updates upto znodeVersion 4
   [junit4]   2> 3613718 DEBUG (OverseerAutoScalingTriggerThread-72182215205978117-127.0.0.1:44315_solr-n_0000000001) [n:127.0.0.1:44315_solr    ] o.a.s.c.a.TriggerIntegrationTest TestTriggerAction init
   [junit4]   2> 3613718 DEBUG (ScheduledTrigger-8694-thread-1) [n:127.0.0.1:44315_solr    ] o.a.s.c.a.NodeLostTrigger Running NodeLostTrigger: .auto_add_replicas with currently live nodes: 2
   [junit4]   2> 3613718 DEBUG (OverseerAutoScalingTriggerThread-72182215205978117-127.0.0.1:44315_solr-n_0000000001) [n:127.0.0.1:44315_solr    ] o.a.s.c.a.OverseerTriggerThread Current znodeVersion 4, lastZnodeVersion 4
   [junit4]   2> 3613719 DEBUG (ScheduledTrigger-8694-thread-2) [n:127.0.0.1:44315_solr    ] o.a.s.c.a.ScheduledTriggers ++++++++ Cooldown inactive - processing event: {
   [junit4]   2>   "id":"6c177a7b6fec2T19eb92hubht45ylnjfpt46qfn",
   [junit4]   2>   "source":"node_added_triggerEQ",
   [junit4]   2>   "eventTime":1901569519320770,
   [junit4]   2>   "eventType":"NODEADDED",
   [junit4]   2>   "properties":{
   [junit4]   2>     "eventTimes":[1901569519320770],
   [junit4]   2>     "_dequeue_time_":1901570552020534,
   [junit4]   2>     "_enqueue_time_":1901570522406197,
   [junit4]   2>     "nodeNames":["127.0.0.1:44545_solr"],
   [junit4]   2>     "replaying":true}}
   [junit4]   2> 3613720 DEBUG (ScheduledTrigger-8694-thread-2) [n:127.0.0.1:44315_solr    ] o.a.s.c.a.ScheduledTriggers Pausing all triggers: [.auto_add_replicas, node_added_triggerEQ]
   [junit4]   2> 3613720 INFO  (ScheduledTrigger-8694-thread-2) [n:127.0.0.1:44315_solr    ] o.a.s.c.a.SystemLogListener Collection .system does not exist, disabling logging.
   [junit4]   2> 3613720 DEBUG (AutoscalingActionExecutor-8695-thread-1-processing-n:127.0.0.1:44315_solr) [n:127.0.0.1:44315_solr    ] o.a.s.c.a.ScheduledTriggers -- processing actions for {
   [junit4]   2>   "id":"6c177a7b6fec2T19eb92hubht45ylnjfpt46qfn",
   [junit4]   2>   "source":"node_added_triggerEQ",
   [junit4]   2>   "eventTime":1901569519320770,
   [junit4]   2>   "eventType":"NODEADDED",
   [junit4]   2>   "properties":{
   [junit4]   2>     "eventTimes":[1901569519320770],
   [junit4]   2>     "_dequeue_time_":1901570552020534,
   [junit4]   2>     "_enqueue_time_":1901570522406197,
   [junit4]   2>     "nodeNames":["127.0.0.1:44545_solr"],
   [junit4]   2>     "replaying":true}}
   [junit4]   2> 3613720 INFO  (AutoscalingActionExecutor-8695-thread-1-processing-n:127.0.0.1:44315_solr) [n:127.0.0.1:44315_solr    ] o.a.s.c.a.TriggerIntegrationTest -- event: {
   [junit4]   2>   "id":"6c177a7b6fec2T19eb92hubht45ylnjfpt46qfn",
   [junit4]   2>   "source":"node_added_triggerEQ",
   [junit4]   2>   "eventTime":1901569519320770,
   [junit4]   2>   "eventType":"NODEADDED",
   [junit4]   2>   "properties":{
   [junit4]   2>     "eventTimes":[1901569519320770],
   [junit4]   2>     "_dequeue_time_":1901570552020534,
   [junit4]   2>     "_enqueue_time_":1901570522406197,
   [junit4]   2>     "nodeNames":["127.0.0.1:44545_solr"],
   [junit4]   2>     "replaying":true}}
   [junit4]   2> 3613721 DEBUG (ScheduledTrigger-8694-thread-2) [n:127.0.0.1:44315_solr    ] o.a.s.c.a.NodeAddedTrigger Running NodeAddedTrigger node_added_triggerEQ
   [junit4]   2> 3613721 DEBUG (ScheduledTrigger-8694-thread-2) [n:127.0.0.1:44315_solr    ] o.a.s.c.a.NodeAddedTrigger Found livenodes: 2
   [junit4]   2> 3613722 DEBUG (AutoscalingActionExecutor-8695-thread-1-processing-n:127.0.0.1:44315_solr) [n:127.0.0.1:44315_solr    ] o.a.s.c.a.ScheduledTriggers Resuming trigger: .auto_add_replicas after 5000ms
   [junit4]   2> 3613722 DEBUG (AutoscalingActionExecutor-8695-thread-1-processing-n:127.0.0.1:44315_solr) [n:127.0.0.1:44315_solr    ] o.a.s.c.a.ScheduledTriggers Resuming trigger: node_added_triggerEQ after 5000ms
   [junit4]   2> 3613722 DEBUG (AutoscalingActionExecutor-8695-thread-1-processing-n:127.0.0.1:44315_solr) [n:127.0.0.1:44315_solr    ] o.a.s.c.a.ScheduledTriggers -- processing took 1 ms for event id=6c177a7b6fec2T19eb92hubht45ylnjfpt46qfn
   [junit4]   2> 3618713 INFO  (TEST-TriggerIntegrationTest.testEventQueue-seed#[70E0E3CC850E755D]) [    ] o.a.s.SolrTestCaseJ4 ###Ending testEventQueue
   [junit4]   2> 3618722 DEBUG (ScheduledTrigger-8694-thread-1) [n:127.0.0.1:44315_solr    ] o.a.s.c.a.NodeLostTrigger Running NodeLostTrigger: .auto_add_replicas with currently live nodes: 2
   [junit4]   2> 3618724 DEBUG (ScheduledTrigger-8694-thread-3) [n:127.0.0.1:44315_solr    ] o.a.s.c.a.NodeAddedTrigger Running NodeAddedTrigger node_added_triggerEQ
   [junit4]   2> 3618725 DEBUG (ScheduledTrigger-8694-thread-3) [n:127.0.0.1:44315_solr    ] o.a.s.c.a.NodeAddedTrigger Found livenodes: 2
   [junit4]   2> 3618776 INFO  (TEST-TriggerIntegrationTest.testContinueTriggersOnOverseerRestart-seed#[70E0E3CC850E755D]) [    ] o.a.s.SolrTestCaseJ4 ###Starting testContinueTriggersOnOverseerRestart
   [junit4]   2> 3618776 INFO  (TEST-TriggerIntegrationTest.testContinueTriggersOnOverseerRestart-seed#[70E0E3CC850E755D]) [    ] o.a.s.c.a.TriggerIntegrationTest /autoscaling.json reset, new znode version 5
   [junit4]   2> 3618776 DEBUG (zkCallback-5175-thread-1-processing-n:127.0.0.1:44315_solr) [n:127.0.0.1:44315_solr    ] o.a.s.c.a.OverseerTriggerThread Refreshing /autoscaling.json with znode version 5
   [junit4]   2> 3618777 DEBUG (OverseerAutoScalingTriggerThread-72182215205978117-127.0.0.1:44315_solr-n_0000000001) [n:127.0.0.1:44315_solr    ] o.a.s.c.a.OverseerTriggerThread Processed trigger updates upto znodeVersion 5
   [junit4]   2> 3618779 DEBUG (OverseerAutoScalingTriggerThread-72182215205978117-127.0.0.1:44315_solr-n_0000000001) [n:127.0.0.1:44315_solr    ] o.a.s.c.a.OverseerTriggerThread -- clean old nodeLost markers
   [junit4]   2> 3618779 DEBUG (OverseerAutoScalingTriggerThread-72182215205978117-127.0.0.1:44315_solr-n_0000000001) [n:127.0.0.1:44315_solr    ] o.a.s.c.a.OverseerTriggerThread -- clean old nodeAdded markers
   [junit4]   2> 3618779 DEBUG (OverseerAutoScalingTriggerThread-72182215205978117-127.0.0.1:44315_solr-n_0000000001) [n:127.0.0.1:44315_solr    ] o.a.s.c.a.OverseerTriggerThread Current znodeVersion 5, lastZnodeVersion 5
   [junit4]   2> 3618781 INFO  (qtp798780450-26988) [n:127.0.0.1:44315_solr    ] o.a.s.h.a.CollectionsHandler Invoked Collection Action :overseerstatus with params action=OVERSEERSTATUS&wt=javabin&version=2 and sendToOCPQueue=true
   [junit4]   2> 3618788 INFO  (qtp798780450-26988) [n:127.0.0.1:44315_solr    ] o.a.s.s.HttpSolrCall [admin] webapp=null path=/admin/collections params={action=OVERSEERSTATUS&wt=javabin&version=2} status=0 QTime=7
   [junit4]   2> 3618797 INFO  (qtp798780450-26994) [n:127.0.0.1:44315_solr    ] o.a.s.s.HttpSolrCall [admin] webapp=null path=/admin/metrics params={prefix=CONTAINER.fs.usableSpace,CORE.coreName&wt=javabin&version=2&group=solr.node,solr.core} status=0 QTime=0
   [junit4]   2> 3618826 INFO  (qtp1425344267-27051) [n:127.0.0.1:44545_solr    ] o.a.s.s.HttpSolrCall [admin] webapp=null path=/admin/metrics params={prefix=CONTAINER.fs.usableSpace,CORE.coreName&wt=javabin&version=2&group=solr.node,solr.core} status=0 QTime=0
   [junit4]   2> 3618827 DEBUG (qtp798780450-26992) [n:127.0.0.1:44315_solr    ] o.a.s.c.a.AutoScalingHandler Verified autoscaling configuration
   [junit4]   2> 3618827 INFO  (qtp798780450-26992) [n:127.0.0.1:44315_solr    ] o.a.s.s.HttpSolrCall [admin] webapp=null path=/cluster/autoscaling params={wt=javabin&version=2} status=0 QTime=32
   [junit4]   2> 3618827 DEBUG (zkCallback-5175-thread-2-processing-n:127.0.0.1:44315_solr) [n:127.0.0.1:44315_solr    ] o.a.s.c.a.OverseerTriggerThread Refreshing /autoscaling.json with znode version 6
   [junit4]   2> 3618829 DEBUG (zkCallback-5175-thread-2-processing-n:127.0.0.1:44315_solr) [n:127.0.0.1:44315_solr    ] o.a.s.c.a.NodeAddedTrigger Initial livenodes: [127.0.0.1:44315_solr, 127.0.0.1:44545_solr]
   [junit4]   2> 3618829 DEBUG (zkCallback-5175-thread-2-processing-n:127.0.0.1:44315_solr) [n:127.0.0.1:44315_solr    ] o.a.s.c.a.NodeAddedTrigger NodeAddedTrigger node_added_triggerCTOOR instantiated with properties: {event=nodeAdded, waitFor=3, actions=[{name=test, class=org.apache.solr.cloud.autoscaling.TriggerIntegrationTest$TestTriggerAction}], enabled=true}
   [junit4]   2> 3618829 DEBUG (OverseerAutoScalingTriggerThread-72182215205978117-127.0.0.1:44315_solr-n_0000000001) [n:127.0.0.1:44315_solr    ] o.a.s.c.a.OverseerTriggerThread Processed trigger updates upto znodeVersion 6
   [junit4]   2> 3618830 INFO  (OverseerAutoScalingTriggerThread-72182215205978117-127.0.0.1:44315_solr-n_0000000001) [n:127.0.0.1:44315_solr    ] o.a.s.c.a.TriggerIntegrationTest TestTriggerAction init
   [junit4]   2> 3618831 DEBUG (OverseerAutoScalingTriggerThread-72182215205978117-127.0.0.1:44315_solr-n_0000000001) [n:127.0.0.1:44315_solr    ] o.a.s.c.a.OverseerTriggerThread -- clean old nodeLost markers
   [junit4]   2> 3618831 INFO  (TEST-TriggerIntegrationTest.testContinueTriggersOnOverseerRestart-seed#[70E0E3CC850E755D]) [    ] o.e.j.s.AbstractConnector Stopped ServerConnector@2f9ce966{SSL,[ssl, http/1.1]}{127.0.0.1:0}
   [junit4]   2> 3618832 INFO  (TEST-TriggerIntegrationTest.testContinueTriggersOnOverseerRestart-seed#[70E0E3CC850E755D]) [    ] o.a.s.c.CoreContainer Shutting down CoreContainer instance=1089204499
   [junit4]   2> 3618833 INFO  (TEST-TriggerIntegrationTest.testContinueTriggersOnOverseerRestart-seed#[70E0E3CC850E755D]) [    ] o.a.s.m.SolrMetricManager Closing metric reporters for registry=solr.node, tag=null
   [junit4]   2> 3618833 INFO  (TEST-TriggerIntegrationTest.testContinueTriggersOnOverseerRestart-seed#[70E0E3CC850E755D]) [    ] o.a.s.m.r.SolrJmxReporter Closing reporter [org.apache.solr.metrics.reporters.SolrJmxReporter@25e395d8: rootName = solr_44315, domain = solr.node, service url = null, agent id = null] for registry solr.node / com.codahale.metrics.MetricRegistry@540a1e8f
   [junit4]   2> 3618838 INFO  (TEST-TriggerIntegrationTest.testContinueTriggersOnOverseerRestart-seed#[70E0E3CC850E755D]) [    ] o.a.s.m.SolrMetricManager Closing metric reporters for registry=solr.jvm, tag=null
   [junit4]   2> 3618838 INFO  (TEST-TriggerIntegrationTest.testContinueTriggersOnOverseerRestart-seed#[70E0E3CC850E755D]) [    ] o.a.s.m.r.SolrJmxReporter Closing reporter [org.apache.solr.metrics.reporters.SolrJmxReporter@1efba6e6: rootName = solr_44315, domain = solr.jvm, service url = null, agent id = null] for registry solr.jvm / com.codahale.metrics.MetricRegistry@96faf96
   [junit4]   2> 3618842 INFO  (TEST-TriggerIntegrationTest.testContinueTriggersOnOverseerRestart-seed#[70E0E3CC850E755D]) [    ] o.a.s.m.SolrMetricManager Closing metric reporters for registry=solr.jetty, tag=null
   [junit4]   2> 3618842 INFO  (TEST-TriggerIntegrationTest.testContinueTriggersOnOverseerRestart-seed#[70E0E3CC850E755D]) [    ] o.a.s.m.r.SolrJmxReporter Closing reporter [org.apache.solr.metrics.reporters.SolrJmxReporter@1bc93131: rootName = solr_44315, domain = solr.jetty, service url = null, agent id = null] for registry solr.jetty / com.codahale.metrics.MetricRegistry@6b77d146
   [junit4]   2> 3618842 DEBUG (OverseerAutoScalingTriggerThread-72182215205978117-127.0.0.1:44315_solr-n_0000000001) [n:127.0.0.1:44315_solr    ] o.a.s.c.a.OverseerTriggerThread Current znodeVersion 6, lastZnodeVersion 6
   [junit4]   2> 3618842 DEBUG (ScheduledTrigger-8694-thread-4) [n:127.0.0.1:44315_solr    ] o.a.s.c.a.NodeAddedTrigger Running NodeAddedTrigger node_added_triggerCTOOR
   [junit4]   2> 3618843 DEBUG (ScheduledTrigger-8694-thread-4) [n:127.0.0.1:44315_solr    ] o.a.s.c.a.NodeAddedTrigger Found livenodes: 2
   [junit4]   2> 3618843 INFO  (TEST-TriggerIntegrationTest.testContinueTriggersOnOverseerRestart-seed#[70E0E3CC850E755D]) [    ] o.a.s.c.ZkController Remove node as live in ZooKeeper:/live_nodes/127.0.0.1:44315_solr
   [junit4]   2> 3618844 INFO  (zkCallback-5195-thread-1-processing-n:127.0.0.1:44545_solr) [n:127.0.0.1:44545_solr    ] o.a.s.c.c.ZkStateReader Updated live nodes from ZooKeeper... (2) -> (1)
   [junit4]   2> 3618844 INFO  (zkCallback-5187-thread-1) [    ] o.a.s.c.c.ZkStateReader Updated live nodes from ZooKeeper... (2) -> (1)
   [junit4]   2> 3618844 INFO  (zkCallback-5175-thread-2-processing-n:127.0.0.1:44315_solr) [n:127.0.0.1:44315_solr    ] o.a.s.c.c.ZkStateReader Updated live nodes from ZooKeeper... (2) -> (1)
   [junit4]   2> 3618844 INFO  (TEST-TriggerIntegrationTest.testContinueTriggersOnOverseerRestart-seed#[70E0E3CC850E755D]) [    ] o.a.s.m.SolrMetricManager Closing metric reporters for registry=solr.cluster, tag=null
   [junit4]   2> 3618844 INFO  (TEST-TriggerIntegrationTest.testContinueTriggersOnOverseerRestart-seed#[70E0E3CC850E755D]) [    ] o.a.s.c.TransientSolrCoreCacheDefault Allocating transient cache for 2147483647 transient cores
   [junit4]   2> 3618844 INFO  (TEST-TriggerIntegrationTest.testContinueTriggersOnOverseerRestart-seed#[70E0E3CC850E755D]) [    ] o.a.s.c.Overseer Overseer (id=72182215205978117-127.0.0.1:44315_solr-n_0000000001) closing
   [junit4]   2> 3618845 INFO  (OverseerStateUpdate-72182215205978117-127.0.0.1:44315_solr-n_0000000001) [n:127.0.0.1:44315_solr    ] o.a.s.c.Overseer Overseer Loop exiting : 127.0.0.1:44315_solr
   [junit4]   2> 3618845 WARN  (OverseerAutoScalingTriggerThread-72182215205978117-127.0.0.1:44315_solr-n_0000000001) [n:127.0.0.1:44315_solr    ] o.a.s.c.a.OverseerTriggerThread OverseerTriggerThread woken up but we are closed, exiting.
   [junit4]   2> 3618847 DEBUG (TEST-TriggerIntegrationTest.testContinueTriggersOnOverseerRestart-seed#[70E0E3CC850E755D]) [    ] o.a.s.c.a.OverseerTriggerThread OverseerTriggerThread has been closed explicitly
   [junit4]   2> 3618848 INFO  (zkCallback-5195-thread-1-processing-n:127.0.0.1:44545_solr) [n:127.0.0.1:44545_solr    ] o.a.s.c.OverseerElectionContext I am going to be the leader 127.0.0.1:44545_solr
   [junit4]   2> 3618848 INFO  (TEST-TriggerIntegrationTest.testContinueTriggersOnOverseerRestart-seed#[70E0E3CC850E755D]) [    ] o.e.j.s.h.ContextHandler Stopped o.e.j.s.ServletContextHandler@7eb3a45d{/solr,null,UNAVAILABLE}
   [junit4]   2> 3618850 INFO  (TEST-TriggerIntegrationTest.testContinueTriggersOnOverseerRestart-seed#[70E0E3CC850E755D]) [    ] o.e.j.s.session Stopped scavenging
   [junit4]   2> 3618851 INFO  (zkCallback-5195-thread-1-processing-n:127.0.0.1:44545_solr) [n:127.0.0.1:44545_solr    ] o.a.s.c.Overseer Overseer (id=72182215205978123-127.0.0.1:44545_solr-n_0000000002) starting
   [junit4]   2> 3618854 DEBUG (OverseerAutoScalingTriggerThread-72182215205978123-127.0.0.1:44545_solr-n_0000000002) [n:127.0.0.1:44545_solr    ] o.a.s.c.a.OverseerTriggerThread Adding .autoAddReplicas trigger
   [junit4]   2> 3618855 DEBUG (OverseerAutoScalingTriggerThread-72182215205978123-127.0.0.1:44545_solr-n_0000000002) [n:127.0.0.1:44545_solr    ] o.a.s.c.a.OverseerTriggerThread Refreshing /autoscaling.json with znode version 7
   [junit4]   2> 3618855 DEBUG (OverseerAutoScalingTriggerThread-72182215205978123-127.0.0.1:44545_solr-n_0000000002) [n:127.0.0.1:44545_solr    ] o.a.s.c.a.NodeAddedTrigger Initial livenodes: [127.0.0.1:44545_solr]
   [junit4]   2> 3618856 DEBUG (OverseerAutoScalingTriggerThread-72182215205978123-127.0.0.1:44545_solr-n_0000000002) [n:127.0.0.1:44545_solr    ] o.a.s.c.a.NodeAddedTrigger NodeAddedTrigger node_added_triggerCTOOR instantiated with properties: {event=nodeAdded, waitFor=3, actions=[{name=test, class=org.apache.solr.cloud.autoscaling.TriggerIntegrationTest$TestTriggerAction}], enabled=true}
   [junit4]   2> 3618856 DEBUG (OverseerAutoScalingTriggerThread-72182215205978123-127.0.0.1:44545_solr-n_0000000002) [n:127.0.0.1:44545_solr    ] o.a.s.c.a.NodeLostTrigger Initial livenodes: [127.0.0.1:44545_solr]
   [junit4]   2> 3618856 DEBUG (OverseerAutoScalingTriggerThread-72182215205978123-127.0.0.1:44545_solr-n_0000000002) [n:127.0.0.1:44545_solr    ] o.a.s.c.a.OverseerTriggerThread Current znodeVersion 7, lastZnodeVersion -1
   [junit4]   2> 3618856 DEBUG (OverseerAutoScalingTriggerThread-72182215205978123-127.0.0.1:44545_solr-n_0000000002) [n:127.0.0.1:44545_solr    ] o.a.s.c.a.OverseerTriggerThread Processed trigger updates upto znodeVersion 7
   [junit4]   2> 3618856 INFO  (OverseerAutoScalingTriggerThread-72182215205978123-127.0.0.1:44545_solr-n_0000000002) [n:127.0.0.1:44545_solr    ] o.a.s.c.a.TriggerIntegrationTest TestTriggerAction init
   [junit4]   2> 3618858 DEBUG (ScheduledTrigger-8699-thread-1) [n:127.0.0.1:44545_solr    ] o.a.s.c.a.NodeAddedTrigger Running NodeAddedTrigger node_added_triggerCTOOR
   [junit4]   2> 3618858 DEBUG (ScheduledTrigger-8699-thread-1) [n:127.0.0.1:44545_solr    ] o.a.s.c.a.NodeAddedTrigger Found livenodes: 1
   [junit4]   2> 3618858 DEBUG (OverseerAutoScalingTriggerThread-72182215205978123-127.0.0.1:44545_solr-n_0000000002) [n:127.0.0.1:44545_solr    ] o.a.s.c.a.OverseerTriggerThread Current znodeVersion 7, lastZnodeVersion 7
   [junit4]   2> 3618858 DEBUG (ScheduledTrigger-8699-thread-2) [n:127.0.0.1:44545_solr    ] o.a.s.c.a.NodeLostTrigger Running NodeLostTrigger: .auto_add_replicas with currently live nodes: 1
   [junit4]   2> 3619858 DEBUG (ScheduledTrigger-8699-thread-1) [n:127.0.0.1:44545_solr    ] o.a.s.c.a.NodeAddedTrigger Running NodeAddedTrigger node_added_triggerCTOOR
   [junit4]   2> 3619858 DEBUG (ScheduledTrigger-8699-thread-1) [n:127.0.0.1:44545_solr    ] o.a.s.c.a.NodeAddedTrigger Found livenodes: 1
   [junit4]   2> 3619862 DEBUG (ScheduledTrigger-8699-thread-3) [n:127.0.0.1:44545_solr    ] o.a.s.c.a.NodeLostTrigger Running NodeLostTrigger: .auto_add_replicas with currently live nodes: 1
   [junit4]   2> 3620862 DEBUG (ScheduledTrigger-8699-thread-2) [n:127.0.0.1:44545_solr    ] o.a.s.c.a.NodeAddedTrigger Running NodeAddedTrigger node_added_triggerCTOOR
   [junit4]   2> 3620862 DEBUG (ScheduledTrigger-8699-thread-2) [n:127.0.0.1:44545_solr    ] o.a.s.c.a.NodeAddedTrigger Found livenodes: 1
   [junit4]   2> 3620862 DEBUG (ScheduledTrigger-8699-thread-4) [n:127.0.0.1:44545_solr    ] o.a.s.c.a.NodeLostTrigger Running NodeLostTrigger: .auto_add_replicas with currently live nodes: 1
   [junit4]   2> 3621862 DEBUG (ScheduledTrigger-8699-thread-1) [n:127.0.0.1:44545_solr    ] o.a.s.c.a.NodeAddedTrigger Running NodeAddedTrigger node_added_triggerCTOOR
   [junit4]   2> 3621862 DEBUG (ScheduledTrigger-8699-thread-1) [n:127.0.0.1:44545_solr    ] o.a.s.c.a.NodeAddedTrigger Found livenodes: 1
   [junit4]   2> 3621863 DEBUG (ScheduledTrigger-8699-thread-3) [n:127.0.0.1:44545_solr    ] o.a.s.c.a.NodeLostTrigger Running NodeLostTrigger: .auto_add_replicas with currently live nodes: 1
   [junit4]   2> 3622862 DEBUG (ScheduledTrigger-8699-thread-2) [n:127.0.0.1:44545_solr    ] o.a.s.c.a.NodeAddedTrigger Running NodeAddedTrigger node_added_triggerCTOOR
   [junit4]   2> 3622863 DEBUG (ScheduledTrigger-8699-thread-2) [n:127.0.0.1:44545_solr    ] o.a.s.c.a.NodeAddedTrigger Found livenodes: 1
   [junit4]   2> 3622863 DEBUG (ScheduledTrigger-8699-thread-4) [n:127.0.0.1:44545_solr    ] o.a.s.c.a.NodeLostTrigger Running NodeLostTrigger: .auto_add_replicas with currently live nodes: 1
   [junit4]   2> 3623863 DEBUG (ScheduledTrigger-8699-thread-1) [n:127.0.0.1:44545_solr    ] o.a.s.c.a.NodeAddedTrigger Running NodeAddedTrigger node_added_triggerCTOOR
   [junit4]   2> 3623863 DEBUG (ScheduledTrigger-8699-thread-1) [n:127.0.0.1:44545_solr    ] o.a.s.c.a.NodeAddedTrigger Found livenodes: 1
   [junit4]   2> 3623863 DEBUG (ScheduledTrigger-8699-thread-1) [n:127.0.0.1:44545_solr    ] o.a.s.c.a.NodeLostTrigger Running NodeLostTrigger: .auto_add_replicas with currently live nodes: 1
   [junit4]   2> 3624863 DEBUG (ScheduledTrigger-8699-thread-3) [n:127.0.0.1:44545_solr    ] o.a.s.c.a.NodeAddedTrigger Running NodeAddedTrigger node_added_triggerCTOOR
   [junit4]   2> 3624863 DEBUG (ScheduledTrigger-8699-thread-3) [n:127.0.0.1:44545_solr    ] o.a.s.c.a.NodeAddedTrigger Found livenodes: 1
   [junit4]   2> 3624863 DEBUG (ScheduledTrigger-8699-thread-2) [n:127.0.0.1:44545_solr    ] o.a.s.c.a.NodeLostTrigger Running NodeLostTrigger: .auto_add_replicas with currently live nodes: 1
   [junit4]   2> 3625863 DEBUG (ScheduledTrigger-8699-thread-3) [n:127.0.0.1:44545_solr    ] o.a.s.c.a.NodeAddedTrigger Running NodeAddedTrigger node_added_triggerCTOOR
   [junit4]   2> 3625863 DEBUG (ScheduledTrigger-8699-thread-1) [n:127.0.0.1:44545_solr    ] o.a.s.c.a.NodeLostTrigger Running NodeLostTrigger: .auto_add_replicas with currently live nodes: 1
   [junit4]   2> 3625864 DEBUG (ScheduledTrigger-8699-thread-3) [n:127.0.0.1:44545_solr    ] o.a.s.c.a.NodeAddedTrigger Found livenodes: 1
   [junit4]   2> 3626864 DEBUG (ScheduledTrigger-8699-thread-1) [n:127.0.0.1:44545_solr    ] o.a.s.c.a.NodeLostTrigger Running NodeLostTrigger: .auto_add_replicas with currently live nodes: 1
   [junit4]   2> 3626864 DEBUG (ScheduledTrigger-8699-thread-2) [n:127.0.0.1:44545_solr    ] o.a.s.c.a.NodeAddedTrigger Running NodeAddedTrigger node_added_triggerCTOOR
   [junit4]   2> 3626864 DEBUG (ScheduledTrigger-8699-thread-2) [n:127.0.0.1:44545_solr    ] o.a.s.c.a.NodeAddedTrigger Found livenodes: 1
   [junit4]   2> 3627864 DEBUG (ScheduledTrigger-8699-thread-1) [n:127.0.0.1:44545_solr    ] o.a.s.c.a.NodeLostTrigger Running NodeLostTrigger: .auto_add_replicas with currently live nodes: 1
   [junit4]   2> 3627864 DEBUG (ScheduledTrigger-8699-thread-3) [n:127.0.0.1:44545_solr    ] o.a.s.c.a.NodeAddedTrigger Running NodeAddedTrigger node_added_triggerCTOOR
   [junit4]   2> 3627864 DEBUG (ScheduledTrigger-8699-thread-3) [n:127.0.0.1:44545_solr    ] o.a.s.c.a.NodeAddedTrigger Found livenodes: 1
   [junit4]   2> 3628852 INFO  (TEST-TriggerIntegrationTest.testContinueTriggersOnOverseerRestart-seed#[70E0E3CC850E755D]) [    ] o.e.j.s.Server jetty-9.4.8.v20171121, build timestamp: 2017-11-22T11:27:37+14:00, git hash: 82b8fb23f757335bb3329d540ce37a2a2615f0a8
   [junit4]   2> 3628852 INFO  (TEST-TriggerIntegrationTest.testContinueTriggersOnOverseerRestart-seed#[70E0E3CC850E755D]) [    ] o.e.j.s.session DefaultSessionIdManager workerName=node0
   [junit4]   2> 3628852 INFO  (TEST-TriggerIntegrationTest.testContinueTriggersOnOverseerRestart-seed#[70E0E3CC850E755D]) [    ] o.e.j.s.session No SessionScavenger set, using defaults
   [junit4]   2> 3628852 INFO  (TEST-TriggerIntegrationTest.testContinueTriggersOnOverseerRestart-seed#[70E0E3CC850E755D]) [    ] o.e.j.s.session Scavenging every 660000ms
   [junit4]   2> 3628853 INFO  (TEST-TriggerIntegrationTest.testContinueTriggersOnOverseerRestart-seed#[70E0E3CC850E755D]) [    ] o.e.j.s.h.ContextHandler Started o.e.j.s.ServletContextHandler@617ec6f7{/solr,null,AVAILABLE}
   [junit4]   2> 3628853 INFO  (TEST-TriggerIntegrationTest.testContinueTriggersOnOverseerRestart-seed#[70E0E3CC850E755D]) [    ] o.e.j.s.AbstractConnector Started ServerConnector@5afd2a89{SSL,[ssl, http/1.1]}{127.0.0.1:33557}
   [junit4]   2> 3628853 INFO  (TEST-TriggerIntegrationTest.testContinueTriggersOnOverseerRestart-seed#[70E0E3CC850E755D]) [    ] o.e.j.s.Server Started @3639153ms
   [junit4]   2> 3628853 INFO  (TEST-TriggerIntegrationTest.testContinueTriggersOnOverseerRestart-seed#[70E0E3CC850E755D]) [    ] o.a.s.c.s.e.JettySolrRunner Jetty properties: {hostContext=/solr, hostPort=33557}
   [junit4]   2> 3628853 ERROR (TEST-TriggerIntegrationTest.testContinueTriggersOnOverseerRestart-seed#[70E0E3CC850E755D]) [    ] o.a.s.u.StartupLoggingUtils Missing Java Option solr.log.dir. Logging may be missing or incomplete.
   [junit4]   2> 3628853 INFO  (TEST-TriggerIntegrationTest.testContinueTriggersOnOverseerRestart-seed#[70E0E3CC850E755D]) [    ] o.a.s.s.SolrDispatchFilter  ___      _       Welcome to Apache Solr? version 7.3.0
   [junit4]   2> 3628853 INFO  (TEST-TriggerIntegrationTest.testContinueTriggersOnOverseerRestart-seed#[70E0E3CC850E755D]) [    ] o.a.s.s.SolrDispatchFilter / __| ___| |_ _   Starting in cloud mode on port null
   [junit4]   2> 3628854 INFO  (TEST-TriggerIntegrationTest.testContinueTriggersOnOverseerRestart-seed#[70E0E3CC850E755D]) [    ] o.a.s.s.SolrDispatchFilter \__ \/ _ \ | '_|  Install dir: null
   [junit4]   2> 3628854 INFO  (TEST-TriggerIntegrationTest.testContinueTriggersOnOverseerRestart-seed#[70E0E3CC850E755D]) [    ] o.a.s.s.SolrDispatchFilter |___/\___/_|_|    Start time: 2018-02-01T01:07:33.694Z
   [junit4]   2> 3628855 INFO  (zkConnectionManagerCallback-5200-thread-1) [    ] o.a.s.c.c.ConnectionManager zkClient has connected
   [junit4]   2> 3628855 INFO  (TEST-TriggerIntegrationTest.testContinueTriggersOnOverseerRestart-seed#[70E0E3CC850E755D]) [    ] o.a.s.s.SolrDispatchFilter solr.xml found in ZooKeeper. Loading...
   [junit4]   2> 3628861 INFO  (TEST-TriggerIntegrationTest.testContinueTriggersOnOverseerRestart-seed#[70E0E3CC850E755D]) [    ] o.a.s.c.ZkContainer Zookeeper client=127.0.0.1:46437/solr
   [junit4]   2> 3628862 INFO  (zkConnectionManagerCallback-5204-thread-1) [    ] o.a.s.c.c.ConnectionManager zkClient has connected
   [junit4]   2> 3628864 DEBUG (ScheduledTrigger-8699-thread-1) [n:127.0.0.1:44545_solr    ] o.a.s.c.a.NodeLostTrigger Running NodeLostTrigger: .auto_add_replicas with currently live nodes: 1
   [junit4]   2> 3628864 DEBUG (ScheduledTrigger-8699-thread-2) [n:127.0.0.1:44545_solr    ] o.a.s.c.a.NodeAddedTrigger Running NodeAddedTrigger node_added_triggerCTOOR
   [junit4]   2> 3628864 DEBUG (ScheduledTrigger-8699-thread-2) [n:127.0.0.1:44545_solr    ] o.a.s.c.a.NodeAddedTrigger Found livenodes: 1
   [junit4]   2> 3628865 INFO  (zkConnectionManagerCallback-5206-thread-1-processing-n:127.0.0.1:33557_solr) [n:127.0.0.1:33557_solr    ] o.a.s.c.c.ConnectionManager zkClient has connected
   [junit4]   2> 3628869 INFO  (TEST-TriggerIntegrationTest.testContinueTriggersOnOverseerRestart-seed#[70E0E3CC850E755D]) [n:127.0.0.1:33557_solr    ] o.a.s.c.c.ZkStateReader Updated live nodes from ZooKeeper... (0) -> (1)
   [junit4]   2> 3628870 INFO  (TEST-TriggerIntegrationTest.testContinueTriggersOnOverseerRestart-seed#[70E0E3CC850E755D]) [n:127.0.0.1:33557_solr    ] o.a.s.c.Overseer Overseer (id=null) closing
   [junit4]   2> 3628871 INFO  (TEST-TriggerIntegrationTest.testContinueTriggersOnOverseerRestart-seed#[70E0E3CC850E755D]) [n:127.0.0.1:33557_solr    ] o.a.s.c.ZkController Register node as live in ZooKeeper:/live_nodes/127.0.0.1:33557_solr
   [junit4]   2> 3628872 INFO  (zkCallback-5195-thread-1-processing-n:127.0.0.1:44545_solr) [n:127.0.0.1:44545_solr    ] o.a.s.c.c.ZkStateReader Updated live nodes from ZooKeeper... (1) -> (2)
   [junit4]   2> 3628872 INFO  (zkCallback-5187-thread-1) [    ] o.a.s.c.c.ZkStateReader Updated live nodes from ZooKeeper... (1) -> (2)
   [junit4]   2> 3628874 INFO  (zkCallback-5205-thread-1-processing-n:127.0.0.1:33557_solr) [n:127.0.0.1:33557_solr    ] o.a.s.c.c.ZkStateReader Updated live nodes from ZooKeeper... (1) -> (2)
   [junit4]   2> 3628928 INFO  (TEST-TriggerIntegrationTest.testContinueTriggersOnOverseerRestart-seed#[70E0E3CC850E755D]) [n:127.0.0.1:33557_solr    ] o.a.s.m.r.SolrJmxReporter JMX monitoring for 'solr_33557.solr.node' (registry 'solr.node') enabled at server: com.sun.jmx.mbeanserver.JmxMBeanServer@19aad4dd
   [junit4]   2> 3628936 INFO  (TEST-TriggerIntegrationTest.testContinueTriggersOnOverseerRestart-seed#[70E0E3CC850E755D]) [n:127.0.0.1:33557_solr    ] o.a.s.m.r.SolrJmxReporter JMX monitoring for 'solr_33557.solr.jvm' (registry 'solr.jvm') enabled at server: com.sun.jmx.mbeanserver.JmxMBeanServer@19aad4dd
   [junit4]   2> 3628937 INFO  (TEST-TriggerIntegrationTest.testContinueTriggersOnOverseerRestart-seed#[70E0E3CC850E755D]) [n:127.0.0.1:33557_solr    ] o.a.s.m.r.SolrJmxReporter JMX monitoring for 'solr_33557.solr.jetty' (registry 'solr.jetty') enabled at server: com.sun.jmx.mbeanserver.JmxMBeanServer@19aad4dd
   [junit4]   2> 3628938 INFO  (TEST-TriggerIntegrationTest.testContinueTriggersOnOverseerRestart-seed#[70E0E3CC850E755D]) [n:127.0.0.1:33557_solr    ] o.a.s.c.CorePropertiesLocator Found 0 core definitions underneath /home/jenkins/jenkins-slave/workspace/Lucene-Solr-Tests-7.x/solr/build/solr-core/test/J2/temp/solr.cloud.autoscaling.TriggerIntegrationTest_70E0E3CC850E755D-001/tempDir-001/node4/.
   [junit4]   2> 3629864 DEBUG (ScheduledTrigger-8699-thread-1) [n:127.0.0.1:44545_solr    ] o.a.s.c.a.NodeLostTrigger Running NodeLostTrigger: .auto_add_replicas with currently live nodes: 2
   [junit4]   2> 3629865 DEBUG (ScheduledTrigger-8699-thread-3) [n:127.0.0.1:44545_solr    ] o.a.s.c.a.NodeAddedTrigger Running NodeAddedTrigger node_added_triggerCTOOR
   [junit4]   2> 3629865 DEBUG (ScheduledTrigger-8699-thread-3) [n:127.0.0.1:44545_solr    ] o.a.s.c.a.NodeAddedTrigger Found livenodes: 2
   [junit4]   2> 3629865 DEBUG (ScheduledTrigger-8699-thread-3) [n:127.0.0.1:44545_solr    ] o.a.s.c.a.NodeAddedTrigger Tracking new node: 127.0.0.1:33557_solr at time 1901586698141485
   [junit4]   2> 3630865 DEBUG (ScheduledTrigger-8699-thread-1) [n:127.0.0.1:44545_solr    ] o.a.s.c.a.NodeLostTrigger Running NodeLostTrigger: .auto_add_replicas with currently live nodes: 2
   [junit4]   2> 3630865 DEBUG (ScheduledTrigger-8699-thread-2) [n:127.0.0.1:44545_solr    ] o.a.s.c.a.NodeAddedTrigger Running NodeAddedTrigger node_added_triggerCTOOR
   [junit4]   2> 3630865 DEBUG (ScheduledTrigger-8699-thread-2) [n:127.0.0.1:44545_solr    ] o.a.s.c.a.NodeAddedTrigger Found livenodes: 2
   [junit4]   2> 3631865 DEBUG (ScheduledTrigger-8699-thread-1) [n:127.0.0.1:44545_solr    ] o.a.s.c.a.NodeLostTrigger Running NodeLostTrigger: .auto_add_replicas with currently live nodes: 2
   [junit4]   2> 3631866 DEBUG (ScheduledTrigger-8699-thread-3) [n:127.0.0.1:44545_solr    ] o.a.s.c.a.NodeAddedTrigger Running NodeAddedTrigger node_added_triggerCTOOR

[...truncated too long message...]

testMetricTrigger s:shard2 r:core_node4 x:testMetricTrigger_shard2_replica_n2] o.a.s.m.SolrMetricManager Closing metric reporters for registry=solr.collection.testMetricTrigger.shard2.leader, tag=468762600
   [junit4]   2> 3807984 INFO  (jetty-closer-5160-thread-5) [    ] o.e.j.s.h.ContextHandler Stopped o.e.j.s.ServletContextHandler@dd59e28{/solr,null,UNAVAILABLE}
   [junit4]   2> 3807986 INFO  (jetty-closer-5160-thread-5) [    ] o.e.j.s.session Stopped scavenging
   [junit4]   2> 3807991 INFO  (zkCallback-5288-thread-1-processing-n:127.0.0.1:39330_solr) [n:127.0.0.1:39330_solr    ] o.a.s.c.OverseerElectionContext I am going to be the leader 127.0.0.1:39330_solr
   [junit4]   2> 3807991 INFO  (jetty-closer-5160-thread-4) [    ] o.e.j.s.h.ContextHandler Stopped o.e.j.s.ServletContextHandler@8e4cd50{/solr,null,UNAVAILABLE}
   [junit4]   2> 3807993 INFO  (jetty-closer-5160-thread-4) [    ] o.e.j.s.session Stopped scavenging
   [junit4]   2> 3809496 INFO  (jetty-closer-5160-thread-7) [    ] o.e.j.s.h.ContextHandler Stopped o.e.j.s.ServletContextHandler@22837be3{/solr,null,UNAVAILABLE}
   [junit4]   2> 3809498 INFO  (jetty-closer-5160-thread-7) [    ] o.e.j.s.session Stopped scavenging
   [junit4]   2> 3809498 ERROR (SUITE-TriggerIntegrationTest-seed#[70E0E3CC850E755D]-worker) [    ] o.a.z.s.ZooKeeperServer ZKShutdownHandler is not registered, so ZooKeeper server won't take any action on ERROR or SHUTDOWN server state changes
   [junit4]   2> 3809500 INFO  (SUITE-TriggerIntegrationTest-seed#[70E0E3CC850E755D]-worker) [    ] o.a.s.c.ZkTestServer connecting to 127.0.0.1:46437 46437
   [junit4]   2> 3809664 INFO  (Thread-8143) [    ] o.a.s.c.ZkTestServer connecting to 127.0.0.1:46437 46437
   [junit4]   2> 3809668 WARN  (Thread-8143) [    ] o.a.s.c.ZkTestServer Watch limit violations: 
   [junit4]   2> Maximum concurrent create/delete watches above limit:
   [junit4]   2> 
   [junit4]   2> 	42	/solr/collections/collection1/terms/shard1
   [junit4]   2> 	19	/solr/aliases.json
   [junit4]   2> 	18	/solr/security.json
   [junit4]   2> 	10	/solr/collections/testMetricTrigger/terms/shard1
   [junit4]   2> 	9	/solr/configs/conf
   [junit4]   2> 	2	/solr/collections/testMetricTrigger/terms/shard2
   [junit4]   2> 
   [junit4]   2> Maximum concurrent data watches above limit:
   [junit4]   2> 
   [junit4]   2> 	119	/solr/collections/collection1/state.json
   [junit4]   2> 	32	/solr/collections/testMetricTrigger/state.json
   [junit4]   2> 	19	/solr/clusterprops.json
   [junit4]   2> 	19	/solr/clusterstate.json
   [junit4]   2> 	6	/solr/autoscaling.json
   [junit4]   2> 	3	/solr/overseer_elect/election/72182215205978160-127.0.0.1:45661_solr-n_0000000014
   [junit4]   2> 	2	/solr/overseer_elect/election/72182215205978132-127.0.0.1:34362_solr-n_0000000005
   [junit4]   2> 	2	/solr/collections/collection1/leader_elect/shard1/election/72182215205978138-core_node6-n_0000000002
   [junit4]   2> 	2	/solr/collections/collection1/leader_elect/shard1/election/72182215205978141-core_node4-n_0000000001
   [junit4]   2> 	2	/solr/overseer_elect/election/72182215205978141-127.0.0.1:41361_solr-n_0000000008
   [junit4]   2> 	2	/solr/overseer_elect/election/72182215205978144-127.0.0.1:36018_solr-n_0000000009
   [junit4]   2> 
   [junit4]   2> Maximum concurrent children watches above limit:
   [junit4]   2> 
   [junit4]   2> 	19	/solr/live_nodes
   [junit4]   2> 	19	/solr/collections
   [junit4]   2> 	6	/solr/overseer/queue-work
   [junit4]   2> 	6	/solr/autoscaling/events/.auto_add_replicas
   [junit4]   2> 	6	/solr/overseer/queue
   [junit4]   2> 	6	/solr/overseer/collection-queue-work
   [junit4]   2> 	2	/solr/autoscaling/events/node_lost_triggerMR
   [junit4]   2> 	2	/solr/autoscaling/events/node_added_triggerCTOOR
   [junit4]   2> 
   [junit4]   2> NOTE: leaving temporary files on disk at: /home/jenkins/jenkins-slave/workspace/Lucene-Solr-Tests-7.x/solr/build/solr-core/test/J2/temp/solr.cloud.autoscaling.TriggerIntegrationTest_70E0E3CC850E755D-001
   [junit4]   2> Feb 01, 2018 1:10:34 AM com.carrotsearch.randomizedtesting.ThreadLeakControl checkThreadLeaks
   [junit4]   2> WARNING: Will linger awaiting termination of 1 leaked thread(s).
   [junit4]   2> NOTE: test params are: codec=Asserting(Lucene70): {id=Lucene50(blocksize=128), x_s=BlockTreeOrds(blocksize=128)}, docValues:{}, maxPointsInLeafNode=1685, maxMBSortInHeap=5.211775090727315, sim=RandomSimilarity(queryNorm=false): {}, locale=ar-KW, timezone=Europe/Rome
   [junit4]   2> NOTE: Linux 4.4.0-104-generic amd64/Oracle Corporation 1.8.0_152 (64-bit)/cpus=4,threads=1,free=98589392,total=458227712
   [junit4]   2> NOTE: All tests run in this JVM: [SpatialFilterTest, HdfsAutoAddReplicasIntegrationTest, TestManagedResource, CopyFieldTest, TestDelegationWithHadoopAuth, DisMaxRequestHandlerTest, RecoveryAfterSoftCommitTest, SolrGraphiteReporterTest, TestCloudManagedSchema, TestRealTimeGet, TestAtomicUpdateErrorCases, TestStressReorder, TestFieldCacheSort, ClusterStateTest, TestSimDistributedQueue, TestBinaryResponseWriter, SimpleMLTQParserTest, TestCloudNestedDocsSort, MigrateRouteKeyTest, VMParamsZkACLAndCredentialsProvidersTest, ConnectionReuseTest, AutoScalingHandlerTest, DirectSolrSpellCheckerTest, CoreAdminCreateDiscoverTest, TestCustomSort, TestBlobHandler, TestTlogReplica, WordBreakSolrSpellCheckerTest, TestUtils, TestCustomStream, TestSolrDeletionPolicy2, TestClusterStateMutator, AssignTest, OverseerCollectionConfigSetProcessorTest, ConnectionManagerTest, TestManagedSynonymFilterFactory, TestDistribDocBasedVersion, PingRequestHandlerTest, BufferStoreTest, TestRequestStatusCollectionAPI, SharedFSAutoReplicaFailoverTest, AliasIntegrationTest, TestRestoreCore, TestLockTree, ParsingFieldUpdateProcessorsTest, TestBackupRepositoryFactory, SolrMetricReporterTest, ImplicitSnitchTest, TestStressCloudBlindAtomicUpdates, TestMacros, SolrTestCaseJ4Test, TestNodeAddedTrigger, TestLegacyNumericRangeQueryBuilder, TestCodecSupport, TestClusterStateProvider, TestDefaultStatsCache, LukeRequestHandlerTest, TestPrepRecovery, NumericFieldsTest, DistribCursorPagingTest, TestRecoveryHdfs, TolerantUpdateProcessorTest, TestFaceting, TestZkAclsWithHadoopAuth, TestScoreJoinQPScore, TestPayloadCheckQParserPlugin, CursorMarkTest, SecurityConfHandlerTest, TestValueSourceCache, SolrXmlInZkTest, TestClusterProperties, TestPushWriter, TestPKIAuthenticationPlugin, NumberUtilsTest, TestFastWriter, TestSolrConfigHandler, RegexBoostProcessorTest, TestHalfAndHalfDocValues, ReplaceNodeTest, DistributedFacetPivotWhiteBoxTest, TestBulkSchemaAPI, DistributedFacetPivotLongTailTest, HdfsChaosMonkeyNothingIsSafeTest, AddSchemaFieldsUpdateProcessorFactoryTest, TestFieldCacheWithThreads, CoreAdminHandlerTest, TestSolrConfigHandlerCloud, MinimalSchemaTest, TestNonDefinedSimilarityFactory, TestSolrCoreProperties, TestNumericTokenStream, TestLMJelinekMercerSimilarityFactory, RankQueryTest, SolrCmdDistributorTest, TestNumericTerms64, TestApiFramework, SystemLogListenerTest, SearchHandlerTest, TestGraphTermsQParserPlugin, TestExpandComponent, CacheHeaderTest, StatelessScriptUpdateProcessorFactoryTest, TestSuggestSpellingConverter, CollectionsAPIAsyncDistributedZkTest, TestMultiWordSynonyms, TestReloadAndDeleteDocs, UnloadDistributedZkTest, DistributedSuggestComponentTest, SparseHLLTest, ReplicaListTransformerTest, DateMathParserTest, LIRRollingUpdatesTest, RollingRestartTest, TestJmxIntegration, ForceLeaderTest, SuggesterTSTTest, TestSerializedLuceneMatchVersion, UniqFieldsUpdateProcessorFactoryTest, TestBlendedInfixSuggestions, TestXmlQParserPlugin, DeleteInactiveReplicaTest, TestDynamicFieldResource, RegexBytesRefFilterTest, AnalysisAfterCoreReloadTest, DocValuesMultiTest, RecoveryZkTest, TestExecutePlanAction, MoveReplicaHDFSTest, TestDistributedSearch, SpellCheckComponentTest, BadIndexSchemaTest, TestFiltering, TestIndexSearcher, ShowFileRequestHandlerTest, SimplePostToolTest, TestCoreDiscovery, SpellCheckCollatorTest, TestStressLucene, TestTrie, TestCSVLoader, NoCacheHeaderTest, TestPseudoReturnFields, TestUpdate, FieldMutatingUpdateProcessorTest, TestWordDelimiterFilterFactory, QueryEqualityTest, DefaultValueUpdateProcessorTest, SortByFunctionTest, DistanceFunctionTest, SolrInfoBeanTest, IndexBasedSpellCheckerTest, TestWriterPerf, FileBasedSpellCheckerTest, RequestHandlersTest, DocumentBuilderTest, PathHierarchyTokenizerFactoryTest, TermVectorComponentTest, MoreLikeThisHandlerTest, RequiredFieldsTest, IndexSchemaRuntimeFieldTest, ReturnFieldsTest, JsonLoaderTest, TestPartialUpdateDeduplication, SOLR749Test, TestQuerySenderListener, UpdateParamsTest, ResponseLogComponentTest, SolrIndexConfigTest, MultiTermTest, TestBinaryField, TestSearchPerf, TestElisionMultitermQuery, TestConfig, TestFuzzyAnalyzedSuggestions, DirectSolrConnectionTest, NotRequiredUniqueKeyTest, SpellPossibilityIteratorTest, SynonymTokenizerTest, TestXIncludeConfig, TestDFRSimilarityFactory, TestBM25SimilarityFactory, ResourceLoaderTest, URLClassifyProcessorTest, PluginInfoTest, DateFieldTest, DOMUtilTest, TestLRUCache, TestCrossCoreJoin, TestHighlightDedupGrouping, TestSimpleTrackingShardHandler, TestEmbeddedSolrServerAdminHandler, TestEmbeddedSolrServerConstructors, TestEmbeddedSolrServerSchemaAPI, TestJettySolrRunner, ActionThrottleTest, AddReplicaTest, ChaosMonkeyNothingIsSafeWithPullReplicasTest, DeleteReplicaTest, LeaderInitiatedRecoveryOnShardRestartTest, MoveReplicaHDFSFailoverTest, TestCloudInspectUtil, TestCloudJSONFacetJoinDomain, TestCloudSearcherWarming, TestMiniSolrCloudClusterSSL, TestSolrCloudWithDelegationTokens, TestSolrCloudWithKerberosAlt, TlogReplayBufferedWhileIndexingTest, ZkShardTermsTest, CustomCollectionTest, SimpleCollectionCreateDeleteTest, TestCollectionAPI, TestReplicaProperties, ComputePlanActionTest, ExecutePlanActionTest, HttpTriggerListenerTest, MetricTriggerTest, NodeLostTriggerTest, TriggerIntegrationTest]
   [junit4] Completed [620/773 (2!)] on J2 in 198.96s, 14 tests, 2 failures <<< FAILURES!

[...truncated 48645 lines...]

Mime
View raw message