lucene-dev mailing list archives

Site index · List index
Message view « Date » · « Thread »
Top « Date » · « Thread »
From Policeman Jenkins Server <jenk...@thetaphi.de>
Subject [JENKINS] Lucene-Solr-7.x-Linux (32bit/jdk1.8.0_144) - Build # 1271 - Still Unstable!
Date Thu, 01 Feb 2018 03:03:52 GMT
Build: https://jenkins.thetaphi.de/job/Lucene-Solr-7.x-Linux/1271/
Java: 32bit/jdk1.8.0_144 -client -XX:+UseG1GC

3 tests failed.
FAILED:  junit.framework.TestSuite.org.apache.solr.cloud.SyncSliceTest

Error Message:
1 thread leaked from SUITE scope at org.apache.solr.cloud.SyncSliceTest:     1) Thread[id=10387, name=qtp28730764-10387, state=TIMED_WAITING, group=TGRP-SyncSliceTest]         at sun.misc.Unsafe.park(Native Method)         at java.util.concurrent.locks.LockSupport.parkNanos(LockSupport.java:215)         at java.util.concurrent.locks.AbstractQueuedSynchronizer$ConditionObject.await(AbstractQueuedSynchronizer.java:2163)         at org.eclipse.jetty.util.thread.ReservedThreadExecutor$ReservedThread.reservedWait(ReservedThreadExecutor.java:308)         at org.eclipse.jetty.util.thread.ReservedThreadExecutor$ReservedThread.run(ReservedThreadExecutor.java:373)         at org.eclipse.jetty.util.thread.QueuedThreadPool.runJob(QueuedThreadPool.java:708)         at org.eclipse.jetty.util.thread.QueuedThreadPool$2.run(QueuedThreadPool.java:626)         at java.lang.Thread.run(Thread.java:748)

Stack Trace:
com.carrotsearch.randomizedtesting.ThreadLeakError: 1 thread leaked from SUITE scope at org.apache.solr.cloud.SyncSliceTest: 
   1) Thread[id=10387, name=qtp28730764-10387, state=TIMED_WAITING, group=TGRP-SyncSliceTest]
        at sun.misc.Unsafe.park(Native Method)
        at java.util.concurrent.locks.LockSupport.parkNanos(LockSupport.java:215)
        at java.util.concurrent.locks.AbstractQueuedSynchronizer$ConditionObject.await(AbstractQueuedSynchronizer.java:2163)
        at org.eclipse.jetty.util.thread.ReservedThreadExecutor$ReservedThread.reservedWait(ReservedThreadExecutor.java:308)
        at org.eclipse.jetty.util.thread.ReservedThreadExecutor$ReservedThread.run(ReservedThreadExecutor.java:373)
        at org.eclipse.jetty.util.thread.QueuedThreadPool.runJob(QueuedThreadPool.java:708)
        at org.eclipse.jetty.util.thread.QueuedThreadPool$2.run(QueuedThreadPool.java:626)
        at java.lang.Thread.run(Thread.java:748)
	at __randomizedtesting.SeedInfo.seed([C401B50A945DEFFE]:0)


FAILED:  junit.framework.TestSuite.org.apache.solr.cloud.SyncSliceTest

Error Message:
There are still zombie threads that couldn't be terminated:    1) Thread[id=10387, name=qtp28730764-10387, state=TIMED_WAITING, group=TGRP-SyncSliceTest]         at sun.misc.Unsafe.park(Native Method)         at java.util.concurrent.locks.LockSupport.parkNanos(LockSupport.java:215)         at java.util.concurrent.locks.AbstractQueuedSynchronizer$ConditionObject.await(AbstractQueuedSynchronizer.java:2163)         at org.eclipse.jetty.util.thread.ReservedThreadExecutor$ReservedThread.reservedWait(ReservedThreadExecutor.java:308)         at org.eclipse.jetty.util.thread.ReservedThreadExecutor$ReservedThread.run(ReservedThreadExecutor.java:373)         at org.eclipse.jetty.util.thread.QueuedThreadPool.runJob(QueuedThreadPool.java:708)         at org.eclipse.jetty.util.thread.QueuedThreadPool$2.run(QueuedThreadPool.java:626)         at java.lang.Thread.run(Thread.java:748)

Stack Trace:
com.carrotsearch.randomizedtesting.ThreadLeakError: There are still zombie threads that couldn't be terminated:
   1) Thread[id=10387, name=qtp28730764-10387, state=TIMED_WAITING, group=TGRP-SyncSliceTest]
        at sun.misc.Unsafe.park(Native Method)
        at java.util.concurrent.locks.LockSupport.parkNanos(LockSupport.java:215)
        at java.util.concurrent.locks.AbstractQueuedSynchronizer$ConditionObject.await(AbstractQueuedSynchronizer.java:2163)
        at org.eclipse.jetty.util.thread.ReservedThreadExecutor$ReservedThread.reservedWait(ReservedThreadExecutor.java:308)
        at org.eclipse.jetty.util.thread.ReservedThreadExecutor$ReservedThread.run(ReservedThreadExecutor.java:373)
        at org.eclipse.jetty.util.thread.QueuedThreadPool.runJob(QueuedThreadPool.java:708)
        at org.eclipse.jetty.util.thread.QueuedThreadPool$2.run(QueuedThreadPool.java:626)
        at java.lang.Thread.run(Thread.java:748)
	at __randomizedtesting.SeedInfo.seed([C401B50A945DEFFE]:0)


FAILED:  org.apache.solr.cloud.TestAuthenticationFramework.testBasics

Error Message:
Error from server at https://127.0.0.1:33013/solr/testcollection_shard1_replica_n2: Expected mime type application/octet-stream but got text/html. <html> <head> <meta http-equiv="Content-Type" content="text/html;charset=utf-8"/> <title>Error 404 Can not find: /solr/testcollection_shard1_replica_n2/update</title> </head> <body><h2>HTTP ERROR 404</h2> <p>Problem accessing /solr/testcollection_shard1_replica_n2/update. Reason: <pre>    Can not find: /solr/testcollection_shard1_replica_n2/update</pre></p><hr><a href="http://eclipse.org/jetty">Powered by Jetty:// 9.4.8.v20171121</a><hr/>  </body> </html> 

Stack Trace:
org.apache.solr.client.solrj.impl.CloudSolrClient$RouteException: Error from server at https://127.0.0.1:33013/solr/testcollection_shard1_replica_n2: Expected mime type application/octet-stream but got text/html. <html>
<head>
<meta http-equiv="Content-Type" content="text/html;charset=utf-8"/>
<title>Error 404 Can not find: /solr/testcollection_shard1_replica_n2/update</title>
</head>
<body><h2>HTTP ERROR 404</h2>
<p>Problem accessing /solr/testcollection_shard1_replica_n2/update. Reason:
<pre>    Can not find: /solr/testcollection_shard1_replica_n2/update</pre></p><hr><a href="http://eclipse.org/jetty">Powered by Jetty:// 9.4.8.v20171121</a><hr/>

</body>
</html>

	at __randomizedtesting.SeedInfo.seed([C401B50A945DEFFE:F9D91B26ACB3B18E]:0)
	at org.apache.solr.client.solrj.impl.CloudSolrClient.directUpdate(CloudSolrClient.java:550)
	at org.apache.solr.client.solrj.impl.CloudSolrClient.sendRequest(CloudSolrClient.java:1013)
	at org.apache.solr.client.solrj.impl.CloudSolrClient.requestWithRetryOnStaleState(CloudSolrClient.java:884)
	at org.apache.solr.client.solrj.impl.CloudSolrClient.requestWithRetryOnStaleState(CloudSolrClient.java:946)
	at org.apache.solr.client.solrj.impl.CloudSolrClient.requestWithRetryOnStaleState(CloudSolrClient.java:946)
	at org.apache.solr.client.solrj.impl.CloudSolrClient.requestWithRetryOnStaleState(CloudSolrClient.java:946)
	at org.apache.solr.client.solrj.impl.CloudSolrClient.requestWithRetryOnStaleState(CloudSolrClient.java:946)
	at org.apache.solr.client.solrj.impl.CloudSolrClient.requestWithRetryOnStaleState(CloudSolrClient.java:946)
	at org.apache.solr.client.solrj.impl.CloudSolrClient.request(CloudSolrClient.java:817)
	at org.apache.solr.client.solrj.SolrRequest.process(SolrRequest.java:194)
	at org.apache.solr.client.solrj.request.UpdateRequest.commit(UpdateRequest.java:233)
	at org.apache.solr.cloud.TestAuthenticationFramework.collectionCreateSearchDeleteTwice(TestAuthenticationFramework.java:126)
	at org.apache.solr.cloud.TestAuthenticationFramework.testBasics(TestAuthenticationFramework.java:74)
	at sun.reflect.NativeMethodAccessorImpl.invoke0(Native Method)
	at sun.reflect.NativeMethodAccessorImpl.invoke(NativeMethodAccessorImpl.java:62)
	at sun.reflect.DelegatingMethodAccessorImpl.invoke(DelegatingMethodAccessorImpl.java:43)
	at java.lang.reflect.Method.invoke(Method.java:498)
	at com.carrotsearch.randomizedtesting.RandomizedRunner.invoke(RandomizedRunner.java:1737)
	at com.carrotsearch.randomizedtesting.RandomizedRunner$8.evaluate(RandomizedRunner.java:934)
	at com.carrotsearch.randomizedtesting.RandomizedRunner$9.evaluate(RandomizedRunner.java:970)
	at com.carrotsearch.randomizedtesting.RandomizedRunner$10.evaluate(RandomizedRunner.java:984)
	at com.carrotsearch.randomizedtesting.rules.SystemPropertiesRestoreRule$1.evaluate(SystemPropertiesRestoreRule.java:57)
	at org.apache.lucene.util.TestRuleSetupTeardownChained$1.evaluate(TestRuleSetupTeardownChained.java:49)
	at org.apache.lucene.util.AbstractBeforeAfterRule$1.evaluate(AbstractBeforeAfterRule.java:45)
	at org.apache.lucene.util.TestRuleThreadAndTestName$1.evaluate(TestRuleThreadAndTestName.java:48)
	at org.apache.lucene.util.TestRuleIgnoreAfterMaxFailures$1.evaluate(TestRuleIgnoreAfterMaxFailures.java:64)
	at org.apache.lucene.util.TestRuleMarkFailure$1.evaluate(TestRuleMarkFailure.java:47)
	at com.carrotsearch.randomizedtesting.rules.StatementAdapter.evaluate(StatementAdapter.java:36)
	at com.carrotsearch.randomizedtesting.ThreadLeakControl$StatementRunner.run(ThreadLeakControl.java:368)
	at com.carrotsearch.randomizedtesting.ThreadLeakControl.forkTimeoutingTask(ThreadLeakControl.java:817)
	at com.carrotsearch.randomizedtesting.ThreadLeakControl$3.evaluate(ThreadLeakControl.java:468)
	at com.carrotsearch.randomizedtesting.RandomizedRunner.runSingleTest(RandomizedRunner.java:943)
	at com.carrotsearch.randomizedtesting.RandomizedRunner$5.evaluate(RandomizedRunner.java:829)
	at com.carrotsearch.randomizedtesting.RandomizedRunner$6.evaluate(RandomizedRunner.java:879)
	at com.carrotsearch.randomizedtesting.RandomizedRunner$7.evaluate(RandomizedRunner.java:890)
	at com.carrotsearch.randomizedtesting.rules.StatementAdapter.evaluate(StatementAdapter.java:36)
	at com.carrotsearch.randomizedtesting.rules.SystemPropertiesRestoreRule$1.evaluate(SystemPropertiesRestoreRule.java:57)
	at org.apache.lucene.util.AbstractBeforeAfterRule$1.evaluate(AbstractBeforeAfterRule.java:45)
	at com.carrotsearch.randomizedtesting.rules.StatementAdapter.evaluate(StatementAdapter.java:36)
	at org.apache.lucene.util.TestRuleStoreClassName$1.evaluate(TestRuleStoreClassName.java:41)
	at com.carrotsearch.randomizedtesting.rules.NoShadowingOrOverridesOnMethodsRule$1.evaluate(NoShadowingOrOverridesOnMethodsRule.java:40)
	at com.carrotsearch.randomizedtesting.rules.NoShadowingOrOverridesOnMethodsRule$1.evaluate(NoShadowingOrOverridesOnMethodsRule.java:40)
	at com.carrotsearch.randomizedtesting.rules.StatementAdapter.evaluate(StatementAdapter.java:36)
	at com.carrotsearch.randomizedtesting.rules.StatementAdapter.evaluate(StatementAdapter.java:36)
	at com.carrotsearch.randomizedtesting.rules.StatementAdapter.evaluate(StatementAdapter.java:36)
	at org.apache.lucene.util.TestRuleAssertionsRequired$1.evaluate(TestRuleAssertionsRequired.java:53)
	at org.apache.lucene.util.TestRuleMarkFailure$1.evaluate(TestRuleMarkFailure.java:47)
	at org.apache.lucene.util.TestRuleIgnoreAfterMaxFailures$1.evaluate(TestRuleIgnoreAfterMaxFailures.java:64)
	at org.apache.lucene.util.TestRuleIgnoreTestSuites$1.evaluate(TestRuleIgnoreTestSuites.java:54)
	at com.carrotsearch.randomizedtesting.rules.StatementAdapter.evaluate(StatementAdapter.java:36)
	at com.carrotsearch.randomizedtesting.ThreadLeakControl$StatementRunner.run(ThreadLeakControl.java:368)
	at java.lang.Thread.run(Thread.java:748)
Caused by: org.apache.solr.client.solrj.impl.HttpSolrClient$RemoteSolrException: Error from server at https://127.0.0.1:33013/solr/testcollection_shard1_replica_n2: Expected mime type application/octet-stream but got text/html. <html>
<head>
<meta http-equiv="Content-Type" content="text/html;charset=utf-8"/>
<title>Error 404 Can not find: /solr/testcollection_shard1_replica_n2/update</title>
</head>
<body><h2>HTTP ERROR 404</h2>
<p>Problem accessing /solr/testcollection_shard1_replica_n2/update. Reason:
<pre>    Can not find: /solr/testcollection_shard1_replica_n2/update</pre></p><hr><a href="http://eclipse.org/jetty">Powered by Jetty:// 9.4.8.v20171121</a><hr/>

</body>
</html>

	at org.apache.solr.client.solrj.impl.HttpSolrClient.executeMethod(HttpSolrClient.java:607)
	at org.apache.solr.client.solrj.impl.HttpSolrClient.request(HttpSolrClient.java:255)
	at org.apache.solr.client.solrj.impl.HttpSolrClient.request(HttpSolrClient.java:244)
	at org.apache.solr.client.solrj.impl.LBHttpSolrClient.doRequest(LBHttpSolrClient.java:483)
	at org.apache.solr.client.solrj.impl.LBHttpSolrClient.request(LBHttpSolrClient.java:413)
	at org.apache.solr.client.solrj.impl.CloudSolrClient.lambda$directUpdate$0(CloudSolrClient.java:527)
	at java.util.concurrent.FutureTask.run(FutureTask.java:266)
	at org.apache.solr.common.util.ExecutorUtil$MDCAwareThreadPoolExecutor.lambda$execute$0(ExecutorUtil.java:188)
	at java.util.concurrent.ThreadPoolExecutor.runWorker(ThreadPoolExecutor.java:1149)
	at java.util.concurrent.ThreadPoolExecutor$Worker.run(ThreadPoolExecutor.java:624)
	... 1 more




Build Log:
[...truncated 12532 lines...]
   [junit4] Suite: org.apache.solr.cloud.TestAuthenticationFramework
   [junit4]   2> 1177483 INFO  (SUITE-TestAuthenticationFramework-seed#[C401B50A945DEFFE]-worker) [    ] o.a.s.SolrTestCaseJ4 SecureRandom sanity checks: test.solr.allowed.securerandom=null & java.security.egd=file:/dev/./urandom
   [junit4]   2> Creating dataDir: /home/jenkins/workspace/Lucene-Solr-7.x-Linux/solr/build/solr-core/test/J0/temp/solr.cloud.TestAuthenticationFramework_C401B50A945DEFFE-001/init-core-data-001
   [junit4]   2> 1177483 WARN  (SUITE-TestAuthenticationFramework-seed#[C401B50A945DEFFE]-worker) [    ] o.a.s.SolrTestCaseJ4 startTrackingSearchers: numOpens=3 numCloses=3
   [junit4]   2> 1177484 INFO  (SUITE-TestAuthenticationFramework-seed#[C401B50A945DEFFE]-worker) [    ] o.a.s.SolrTestCaseJ4 Using PointFields (NUMERIC_POINTS_SYSPROP=true) w/NUMERIC_DOCVALUES_SYSPROP=true
   [junit4]   2> 1177485 INFO  (SUITE-TestAuthenticationFramework-seed#[C401B50A945DEFFE]-worker) [    ] o.a.s.SolrTestCaseJ4 Randomized ssl (true) and clientAuth (false) via: @org.apache.solr.util.RandomizeSSL(reason=, ssl=NaN, value=NaN, clientAuth=NaN)
   [junit4]   2> 1177489 INFO  (TEST-TestAuthenticationFramework.testBasics-seed#[C401B50A945DEFFE]) [    ] o.a.s.c.MiniSolrCloudCluster Starting cluster of 2 servers in /home/jenkins/workspace/Lucene-Solr-7.x-Linux/solr/build/solr-core/test/J0/temp/solr.cloud.TestAuthenticationFramework_C401B50A945DEFFE-001/tempDir-001
   [junit4]   2> 1177489 INFO  (TEST-TestAuthenticationFramework.testBasics-seed#[C401B50A945DEFFE]) [    ] o.a.s.c.ZkTestServer STARTING ZK TEST SERVER
   [junit4]   2> 1177489 INFO  (Thread-2951) [    ] o.a.s.c.ZkTestServer client port:0.0.0.0/0.0.0.0:0
   [junit4]   2> 1177489 INFO  (Thread-2951) [    ] o.a.s.c.ZkTestServer Starting server
   [junit4]   2> 1177492 ERROR (Thread-2951) [    ] o.a.z.s.ZooKeeperServer ZKShutdownHandler is not registered, so ZooKeeper server won't take any action on ERROR or SHUTDOWN server state changes
   [junit4]   2> 1177589 INFO  (TEST-TestAuthenticationFramework.testBasics-seed#[C401B50A945DEFFE]) [    ] o.a.s.c.ZkTestServer start zk server on port:39871
   [junit4]   2> 1177591 INFO  (zkConnectionManagerCallback-1859-thread-1) [    ] o.a.s.c.c.ConnectionManager zkClient has connected
   [junit4]   2> 1177594 WARN  (NIOServerCxn.Factory:0.0.0.0/0.0.0.0:0) [    ] o.a.z.s.NIOServerCnxn Unable to read additional data from client sessionid 0x1000ce180830000, likely client has closed socket
   [junit4]   2> 1177597 INFO  (jetty-launcher-1856-thread-2) [    ] o.e.j.s.Server jetty-9.4.8.v20171121, build timestamp: 2017-11-21T16:27:37-05:00, git hash: 82b8fb23f757335bb3329d540ce37a2a2615f0a8
   [junit4]   2> 1177597 INFO  (jetty-launcher-1856-thread-1) [    ] o.e.j.s.Server jetty-9.4.8.v20171121, build timestamp: 2017-11-21T16:27:37-05:00, git hash: 82b8fb23f757335bb3329d540ce37a2a2615f0a8
   [junit4]   2> 1177598 INFO  (jetty-launcher-1856-thread-1) [    ] o.e.j.s.session DefaultSessionIdManager workerName=node0
   [junit4]   2> 1177598 INFO  (jetty-launcher-1856-thread-2) [    ] o.e.j.s.session DefaultSessionIdManager workerName=node0
   [junit4]   2> 1177598 INFO  (jetty-launcher-1856-thread-1) [    ] o.e.j.s.session No SessionScavenger set, using defaults
   [junit4]   2> 1177598 INFO  (jetty-launcher-1856-thread-2) [    ] o.e.j.s.session No SessionScavenger set, using defaults
   [junit4]   2> 1177598 INFO  (jetty-launcher-1856-thread-1) [    ] o.e.j.s.session Scavenging every 600000ms
   [junit4]   2> 1177598 INFO  (jetty-launcher-1856-thread-2) [    ] o.e.j.s.session Scavenging every 600000ms
   [junit4]   2> 1177598 INFO  (jetty-launcher-1856-thread-1) [    ] o.e.j.s.h.ContextHandler Started o.e.j.s.ServletContextHandler@17ad796{/solr,null,AVAILABLE}
   [junit4]   2> 1177598 INFO  (jetty-launcher-1856-thread-2) [    ] o.e.j.s.h.ContextHandler Started o.e.j.s.ServletContextHandler@106aac5{/solr,null,AVAILABLE}
   [junit4]   2> 1177599 INFO  (jetty-launcher-1856-thread-2) [    ] o.e.j.s.AbstractConnector Started ServerConnector@1630880{SSL,[ssl, http/1.1]}{127.0.0.1:33013}
   [junit4]   2> 1177599 INFO  (jetty-launcher-1856-thread-1) [    ] o.e.j.s.AbstractConnector Started ServerConnector@1e633b7{SSL,[ssl, http/1.1]}{127.0.0.1:39071}
   [junit4]   2> 1177600 INFO  (jetty-launcher-1856-thread-2) [    ] o.e.j.s.Server Started @1178683ms
   [junit4]   2> 1177600 INFO  (jetty-launcher-1856-thread-1) [    ] o.e.j.s.Server Started @1178683ms
   [junit4]   2> 1177600 INFO  (jetty-launcher-1856-thread-2) [    ] o.a.s.c.s.e.JettySolrRunner Jetty properties: {hostContext=/solr, hostPort=33013}
   [junit4]   2> 1177600 INFO  (jetty-launcher-1856-thread-1) [    ] o.a.s.c.s.e.JettySolrRunner Jetty properties: {hostContext=/solr, hostPort=39071}
   [junit4]   2> 1177600 ERROR (jetty-launcher-1856-thread-2) [    ] o.a.s.u.StartupLoggingUtils Missing Java Option solr.log.dir. Logging may be missing or incomplete.
   [junit4]   2> 1177600 ERROR (jetty-launcher-1856-thread-1) [    ] o.a.s.u.StartupLoggingUtils Missing Java Option solr.log.dir. Logging may be missing or incomplete.
   [junit4]   2> 1177600 INFO  (jetty-launcher-1856-thread-2) [    ] o.a.s.s.SolrDispatchFilter  ___      _       Welcome to Apache Solr™ version 7.3.0
   [junit4]   2> 1177600 INFO  (jetty-launcher-1856-thread-1) [    ] o.a.s.s.SolrDispatchFilter  ___      _       Welcome to Apache Solr™ version 7.3.0
   [junit4]   2> 1177600 INFO  (jetty-launcher-1856-thread-2) [    ] o.a.s.s.SolrDispatchFilter / __| ___| |_ _   Starting in cloud mode on port null
   [junit4]   2> 1177600 INFO  (jetty-launcher-1856-thread-1) [    ] o.a.s.s.SolrDispatchFilter / __| ___| |_ _   Starting in cloud mode on port null
   [junit4]   2> 1177600 INFO  (jetty-launcher-1856-thread-2) [    ] o.a.s.s.SolrDispatchFilter \__ \/ _ \ | '_|  Install dir: null
   [junit4]   2> 1177600 INFO  (jetty-launcher-1856-thread-1) [    ] o.a.s.s.SolrDispatchFilter \__ \/ _ \ | '_|  Install dir: null
   [junit4]   2> 1177600 INFO  (jetty-launcher-1856-thread-2) [    ] o.a.s.s.SolrDispatchFilter |___/\___/_|_|    Start time: 2018-02-01T02:42:24.763Z
   [junit4]   2> 1177600 INFO  (jetty-launcher-1856-thread-1) [    ] o.a.s.s.SolrDispatchFilter |___/\___/_|_|    Start time: 2018-02-01T02:42:24.763Z
   [junit4]   2> 1177603 INFO  (zkConnectionManagerCallback-1863-thread-1) [    ] o.a.s.c.c.ConnectionManager zkClient has connected
   [junit4]   2> 1177603 INFO  (zkConnectionManagerCallback-1862-thread-1) [    ] o.a.s.c.c.ConnectionManager zkClient has connected
   [junit4]   2> 1177604 INFO  (jetty-launcher-1856-thread-2) [    ] o.a.s.s.SolrDispatchFilter solr.xml found in ZooKeeper. Loading...
   [junit4]   2> 1177604 INFO  (jetty-launcher-1856-thread-1) [    ] o.a.s.s.SolrDispatchFilter solr.xml found in ZooKeeper. Loading...
   [junit4]   2> 1177611 WARN  (NIOServerCxn.Factory:0.0.0.0/0.0.0.0:0) [    ] o.a.z.s.NIOServerCnxn Unable to read additional data from client sessionid 0x1000ce180830002, likely client has closed socket
   [junit4]   2> 1177614 INFO  (jetty-launcher-1856-thread-1) [    ] o.a.s.c.ZkContainer Zookeeper client=127.0.0.1:39871/solr
   [junit4]   2> 1177614 INFO  (jetty-launcher-1856-thread-2) [    ] o.a.s.c.ZkContainer Zookeeper client=127.0.0.1:39871/solr
   [junit4]   2> 1177616 INFO  (zkConnectionManagerCallback-1871-thread-1) [    ] o.a.s.c.c.ConnectionManager zkClient has connected
   [junit4]   2> 1177616 INFO  (zkConnectionManagerCallback-1869-thread-1) [    ] o.a.s.c.c.ConnectionManager zkClient has connected
   [junit4]   2> 1177617 WARN  (NIOServerCxn.Factory:0.0.0.0/0.0.0.0:0) [    ] o.a.z.s.NIOServerCnxn Unable to read additional data from client sessionid 0x1000ce180830004, likely client has closed socket
   [junit4]   2> 1177618 INFO  (zkConnectionManagerCallback-1873-thread-1-processing-n:127.0.0.1:33013_solr) [n:127.0.0.1:33013_solr    ] o.a.s.c.c.ConnectionManager zkClient has connected
   [junit4]   2> 1177618 INFO  (zkConnectionManagerCallback-1875-thread-1-processing-n:127.0.0.1:39071_solr) [n:127.0.0.1:39071_solr    ] o.a.s.c.c.ConnectionManager zkClient has connected
   [junit4]   2> 1177674 INFO  (jetty-launcher-1856-thread-2) [n:127.0.0.1:33013_solr    ] o.a.s.c.Overseer Overseer (id=null) closing
   [junit4]   2> 1177675 INFO  (jetty-launcher-1856-thread-1) [n:127.0.0.1:39071_solr    ] o.a.s.c.Overseer Overseer (id=null) closing
   [junit4]   2> 1177675 INFO  (jetty-launcher-1856-thread-2) [n:127.0.0.1:33013_solr    ] o.a.s.c.OverseerElectionContext I am going to be the leader 127.0.0.1:33013_solr
   [junit4]   2> 1177675 INFO  (jetty-launcher-1856-thread-1) [n:127.0.0.1:39071_solr    ] o.a.s.c.ZkController Register node as live in ZooKeeper:/live_nodes/127.0.0.1:39071_solr
   [junit4]   2> 1177675 INFO  (jetty-launcher-1856-thread-2) [n:127.0.0.1:33013_solr    ] o.a.s.c.Overseer Overseer (id=72071756701171717-127.0.0.1:33013_solr-n_0000000000) starting
   [junit4]   2> 1177676 INFO  (zkCallback-1874-thread-1-processing-n:127.0.0.1:39071_solr) [n:127.0.0.1:39071_solr    ] o.a.s.c.c.ZkStateReader Updated live nodes from ZooKeeper... (0) -> (1)
   [junit4]   2> 1177676 INFO  (zkCallback-1872-thread-1-processing-n:127.0.0.1:33013_solr) [n:127.0.0.1:33013_solr    ] o.a.s.c.c.ZkStateReader Updated live nodes from ZooKeeper... (0) -> (1)
   [junit4]   2> 1177682 INFO  (jetty-launcher-1856-thread-2) [n:127.0.0.1:33013_solr    ] o.a.s.c.ZkController Register node as live in ZooKeeper:/live_nodes/127.0.0.1:33013_solr
   [junit4]   2> 1177682 INFO  (zkCallback-1872-thread-1-processing-n:127.0.0.1:33013_solr) [n:127.0.0.1:33013_solr    ] o.a.s.c.c.ZkStateReader Updated live nodes from ZooKeeper... (1) -> (2)
   [junit4]   2> 1177683 INFO  (zkCallback-1874-thread-1-processing-n:127.0.0.1:39071_solr) [n:127.0.0.1:39071_solr    ] o.a.s.c.c.ZkStateReader Updated live nodes from ZooKeeper... (1) -> (2)
   [junit4]   2> 1177785 INFO  (jetty-launcher-1856-thread-1) [n:127.0.0.1:39071_solr    ] o.a.s.c.CoreContainer Initializing authentication plugin: org.apache.solr.cloud.TestAuthenticationFramework$MockAuthenticationPlugin
   [junit4]   2> 1177821 INFO  (jetty-launcher-1856-thread-1) [n:127.0.0.1:39071_solr    ] o.a.s.m.r.SolrJmxReporter JMX monitoring for 'solr_39071.solr.node' (registry 'solr.node') enabled at server: com.sun.jmx.mbeanserver.JmxMBeanServer@1bc2bcf
   [junit4]   2> 1177831 INFO  (jetty-launcher-1856-thread-1) [n:127.0.0.1:39071_solr    ] o.a.s.m.r.SolrJmxReporter JMX monitoring for 'solr_39071.solr.jvm' (registry 'solr.jvm') enabled at server: com.sun.jmx.mbeanserver.JmxMBeanServer@1bc2bcf
   [junit4]   2> 1177831 INFO  (jetty-launcher-1856-thread-1) [n:127.0.0.1:39071_solr    ] o.a.s.m.r.SolrJmxReporter JMX monitoring for 'solr_39071.solr.jetty' (registry 'solr.jetty') enabled at server: com.sun.jmx.mbeanserver.JmxMBeanServer@1bc2bcf
   [junit4]   2> 1177832 INFO  (jetty-launcher-1856-thread-1) [n:127.0.0.1:39071_solr    ] o.a.s.c.CorePropertiesLocator Found 0 core definitions underneath /home/jenkins/workspace/Lucene-Solr-7.x-Linux/solr/build/solr-core/test/J0/temp/solr.cloud.TestAuthenticationFramework_C401B50A945DEFFE-001/tempDir-001/node1/.
   [junit4]   2> 1177895 INFO  (jetty-launcher-1856-thread-2) [n:127.0.0.1:33013_solr    ] o.a.s.c.CoreContainer Initializing authentication plugin: org.apache.solr.cloud.TestAuthenticationFramework$MockAuthenticationPlugin
   [junit4]   2> 1177924 INFO  (jetty-launcher-1856-thread-2) [n:127.0.0.1:33013_solr    ] o.a.s.m.r.SolrJmxReporter JMX monitoring for 'solr_33013.solr.node' (registry 'solr.node') enabled at server: com.sun.jmx.mbeanserver.JmxMBeanServer@1bc2bcf
   [junit4]   2> 1177933 INFO  (jetty-launcher-1856-thread-2) [n:127.0.0.1:33013_solr    ] o.a.s.m.r.SolrJmxReporter JMX monitoring for 'solr_33013.solr.jvm' (registry 'solr.jvm') enabled at server: com.sun.jmx.mbeanserver.JmxMBeanServer@1bc2bcf
   [junit4]   2> 1177933 INFO  (jetty-launcher-1856-thread-2) [n:127.0.0.1:33013_solr    ] o.a.s.m.r.SolrJmxReporter JMX monitoring for 'solr_33013.solr.jetty' (registry 'solr.jetty') enabled at server: com.sun.jmx.mbeanserver.JmxMBeanServer@1bc2bcf
   [junit4]   2> 1177934 INFO  (jetty-launcher-1856-thread-2) [n:127.0.0.1:33013_solr    ] o.a.s.c.CorePropertiesLocator Found 0 core definitions underneath /home/jenkins/workspace/Lucene-Solr-7.x-Linux/solr/build/solr-core/test/J0/temp/solr.cloud.TestAuthenticationFramework_C401B50A945DEFFE-001/tempDir-001/node2/.
   [junit4]   2> 1177961 INFO  (zkConnectionManagerCallback-1881-thread-1) [    ] o.a.s.c.c.ConnectionManager zkClient has connected
   [junit4]   2> 1177962 WARN  (NIOServerCxn.Factory:0.0.0.0/0.0.0.0:0) [    ] o.a.z.s.NIOServerCnxn Unable to read additional data from client sessionid 0x1000ce180830007, likely client has closed socket
   [junit4]   2> 1177964 INFO  (zkConnectionManagerCallback-1885-thread-1) [    ] o.a.s.c.c.ConnectionManager zkClient has connected
   [junit4]   2> 1177966 INFO  (TEST-TestAuthenticationFramework.testBasics-seed#[C401B50A945DEFFE]) [    ] o.a.s.c.c.ZkStateReader Updated live nodes from ZooKeeper... (0) -> (2)
   [junit4]   2> 1177967 INFO  (TEST-TestAuthenticationFramework.testBasics-seed#[C401B50A945DEFFE]) [    ] o.a.s.c.s.i.ZkClientClusterStateProvider Cluster at 127.0.0.1:39871/solr ready
   [junit4]   2> 1177970 INFO  (TEST-TestAuthenticationFramework.testBasics-seed#[C401B50A945DEFFE]) [    ] o.a.s.SolrTestCaseJ4 ###Starting testBasics
   [junit4]   2> 1178029 INFO  (qtp6585170-9826) [n:127.0.0.1:33013_solr    ] o.a.s.h.a.CollectionsHandler Invoked Collection Action :create with params replicationFactor=2&collection.configName=solrCloudCollectionConfig&maxShardsPerNode=2&name=testcollection&nrtReplicas=2&action=CREATE&numShards=2&wt=javabin&version=2 and sendToOCPQueue=true
   [junit4]   2> 1178032 INFO  (OverseerThreadFactory-4159-thread-1-processing-n:127.0.0.1:33013_solr) [n:127.0.0.1:33013_solr    ] o.a.s.c.a.c.CreateCollectionCmd Create collection testcollection
   [junit4]   2> 1178139 INFO  (OverseerStateUpdate-72071756701171717-127.0.0.1:33013_solr-n_0000000000) [n:127.0.0.1:33013_solr    ] o.a.s.c.o.SliceMutator createReplica() {
   [junit4]   2>   "operation":"ADDREPLICA",
   [junit4]   2>   "collection":"testcollection",
   [junit4]   2>   "shard":"shard1",
   [junit4]   2>   "core":"testcollection_shard1_replica_n1",
   [junit4]   2>   "state":"down",
   [junit4]   2>   "base_url":"https://127.0.0.1:39071/solr",
   [junit4]   2>   "type":"NRT",
   [junit4]   2>   "waitForFinalState":"false"} 
   [junit4]   2> 1178140 INFO  (OverseerStateUpdate-72071756701171717-127.0.0.1:33013_solr-n_0000000000) [n:127.0.0.1:33013_solr    ] o.a.s.c.o.SliceMutator createReplica() {
   [junit4]   2>   "operation":"ADDREPLICA",
   [junit4]   2>   "collection":"testcollection",
   [junit4]   2>   "shard":"shard1",
   [junit4]   2>   "core":"testcollection_shard1_replica_n2",
   [junit4]   2>   "state":"down",
   [junit4]   2>   "base_url":"https://127.0.0.1:33013/solr",
   [junit4]   2>   "type":"NRT",
   [junit4]   2>   "waitForFinalState":"false"} 
   [junit4]   2> 1178141 INFO  (OverseerStateUpdate-72071756701171717-127.0.0.1:33013_solr-n_0000000000) [n:127.0.0.1:33013_solr    ] o.a.s.c.o.SliceMutator createReplica() {
   [junit4]   2>   "operation":"ADDREPLICA",
   [junit4]   2>   "collection":"testcollection",
   [junit4]   2>   "shard":"shard2",
   [junit4]   2>   "core":"testcollection_shard2_replica_n4",
   [junit4]   2>   "state":"down",
   [junit4]   2>   "base_url":"https://127.0.0.1:39071/solr",
   [junit4]   2>   "type":"NRT",
   [junit4]   2>   "waitForFinalState":"false"} 
   [junit4]   2> 1178143 INFO  (OverseerStateUpdate-72071756701171717-127.0.0.1:33013_solr-n_0000000000) [n:127.0.0.1:33013_solr    ] o.a.s.c.o.SliceMutator createReplica() {
   [junit4]   2>   "operation":"ADDREPLICA",
   [junit4]   2>   "collection":"testcollection",
   [junit4]   2>   "shard":"shard2",
   [junit4]   2>   "core":"testcollection_shard2_replica_n6",
   [junit4]   2>   "state":"down",
   [junit4]   2>   "base_url":"https://127.0.0.1:33013/solr",
   [junit4]   2>   "type":"NRT",
   [junit4]   2>   "waitForFinalState":"false"} 
   [junit4]   2> 1178351 INFO  (qtp6585170-9825) [n:127.0.0.1:33013_solr    ] o.a.s.h.a.CoreAdminOperation core create command qt=/admin/cores&coreNodeName=core_node8&collection.configName=solrCloudCollectionConfig&newCollection=true&name=testcollection_shard2_replica_n6&action=CREATE&numShards=2&collection=testcollection&shard=shard2&wt=javabin&version=2&replicaType=NRT
   [junit4]   2> 1178351 INFO  (qtp6585170-9813) [n:127.0.0.1:33013_solr    ] o.a.s.h.a.CoreAdminOperation core create command qt=/admin/cores&coreNodeName=core_node5&collection.configName=solrCloudCollectionConfig&newCollection=true&name=testcollection_shard1_replica_n2&action=CREATE&numShards=2&collection=testcollection&shard=shard1&wt=javabin&version=2&replicaType=NRT
   [junit4]   2> 1178352 INFO  (qtp6585170-9813) [n:127.0.0.1:33013_solr    ] o.a.s.c.TransientSolrCoreCacheDefault Allocating transient cache for 2147483647 transient cores
   [junit4]   2> 1178389 INFO  (qtp8303684-9882) [n:127.0.0.1:39071_solr    ] o.a.s.h.a.CoreAdminOperation core create command qt=/admin/cores&coreNodeName=core_node3&collection.configName=solrCloudCollectionConfig&newCollection=true&name=testcollection_shard1_replica_n1&action=CREATE&numShards=2&collection=testcollection&shard=shard1&wt=javabin&version=2&replicaType=NRT
   [junit4]   2> 1178390 INFO  (qtp8303684-9882) [n:127.0.0.1:39071_solr    ] o.a.s.c.TransientSolrCoreCacheDefault Allocating transient cache for 2147483647 transient cores
   [junit4]   2> 1178390 INFO  (qtp8303684-9880) [n:127.0.0.1:39071_solr    ] o.a.s.h.a.CoreAdminOperation core create command qt=/admin/cores&coreNodeName=core_node7&collection.configName=solrCloudCollectionConfig&newCollection=true&name=testcollection_shard2_replica_n4&action=CREATE&numShards=2&collection=testcollection&shard=shard2&wt=javabin&version=2&replicaType=NRT
   [junit4]   2> 1178493 INFO  (zkCallback-1872-thread-1-processing-n:127.0.0.1:33013_solr) [n:127.0.0.1:33013_solr    ] o.a.s.c.c.ZkStateReader A cluster state change: [WatchedEvent state:SyncConnected type:NodeDataChanged path:/collections/testcollection/state.json] for collection [testcollection] has occurred - updating... (live nodes size: [2])
   [junit4]   2> 1178493 INFO  (zkCallback-1874-thread-1-processing-n:127.0.0.1:39071_solr) [n:127.0.0.1:39071_solr    ] o.a.s.c.c.ZkStateReader A cluster state change: [WatchedEvent state:SyncConnected type:NodeDataChanged path:/collections/testcollection/state.json] for collection [testcollection] has occurred - updating... (live nodes size: [2])
   [junit4]   2> 1178493 INFO  (zkCallback-1874-thread-2-processing-n:127.0.0.1:39071_solr) [n:127.0.0.1:39071_solr    ] o.a.s.c.c.ZkStateReader A cluster state change: [WatchedEvent state:SyncConnected type:NodeDataChanged path:/collections/testcollection/state.json] for collection [testcollection] has occurred - updating... (live nodes size: [2])
   [junit4]   2> 1179365 INFO  (qtp6585170-9825) [n:127.0.0.1:33013_solr c:testcollection s:shard2 r:core_node8 x:testcollection_shard2_replica_n6] o.a.s.c.SolrConfig Using Lucene MatchVersion: 7.3.0
   [junit4]   2> 1179365 INFO  (qtp6585170-9813) [n:127.0.0.1:33013_solr c:testcollection s:shard1 r:core_node5 x:testcollection_shard1_replica_n2] o.a.s.c.SolrConfig Using Lucene MatchVersion: 7.3.0
   [junit4]   2> 1179374 INFO  (qtp6585170-9825) [n:127.0.0.1:33013_solr c:testcollection s:shard2 r:core_node8 x:testcollection_shard2_replica_n6] o.a.s.s.IndexSchema [testcollection_shard2_replica_n6] Schema name=minimal
   [junit4]   2> 1179374 INFO  (qtp6585170-9813) [n:127.0.0.1:33013_solr c:testcollection s:shard1 r:core_node5 x:testcollection_shard1_replica_n2] o.a.s.s.IndexSchema [testcollection_shard1_replica_n2] Schema name=minimal
   [junit4]   2> 1179377 INFO  (qtp6585170-9825) [n:127.0.0.1:33013_solr c:testcollection s:shard2 r:core_node8 x:testcollection_shard2_replica_n6] o.a.s.s.IndexSchema Loaded schema minimal/1.1 with uniqueid field id
   [junit4]   2> 1179377 INFO  (qtp6585170-9813) [n:127.0.0.1:33013_solr c:testcollection s:shard1 r:core_node5 x:testcollection_shard1_replica_n2] o.a.s.s.IndexSchema Loaded schema minimal/1.1 with uniqueid field id
   [junit4]   2> 1179377 INFO  (qtp6585170-9825) [n:127.0.0.1:33013_solr c:testcollection s:shard2 r:core_node8 x:testcollection_shard2_replica_n6] o.a.s.c.CoreContainer Creating SolrCore 'testcollection_shard2_replica_n6' using configuration from collection testcollection, trusted=true
   [junit4]   2> 1179377 INFO  (qtp6585170-9813) [n:127.0.0.1:33013_solr c:testcollection s:shard1 r:core_node5 x:testcollection_shard1_replica_n2] o.a.s.c.CoreContainer Creating SolrCore 'testcollection_shard1_replica_n2' using configuration from collection testcollection, trusted=true
   [junit4]   2> 1179378 INFO  (qtp6585170-9825) [n:127.0.0.1:33013_solr c:testcollection s:shard2 r:core_node8 x:testcollection_shard2_replica_n6] o.a.s.m.r.SolrJmxReporter JMX monitoring for 'solr_33013.solr.core.testcollection.shard2.replica_n6' (registry 'solr.core.testcollection.shard2.replica_n6') enabled at server: com.sun.jmx.mbeanserver.JmxMBeanServer@1bc2bcf
   [junit4]   2> 1179378 INFO  (qtp6585170-9813) [n:127.0.0.1:33013_solr c:testcollection s:shard1 r:core_node5 x:testcollection_shard1_replica_n2] o.a.s.m.r.SolrJmxReporter JMX monitoring for 'solr_33013.solr.core.testcollection.shard1.replica_n2' (registry 'solr.core.testcollection.shard1.replica_n2') enabled at server: com.sun.jmx.mbeanserver.JmxMBeanServer@1bc2bcf
   [junit4]   2> 1179378 INFO  (qtp6585170-9825) [n:127.0.0.1:33013_solr c:testcollection s:shard2 r:core_node8 x:testcollection_shard2_replica_n6] o.a.s.c.SolrCore solr.RecoveryStrategy.Builder
   [junit4]   2> 1179378 INFO  (qtp6585170-9813) [n:127.0.0.1:33013_solr c:testcollection s:shard1 r:core_node5 x:testcollection_shard1_replica_n2] o.a.s.c.SolrCore solr.RecoveryStrategy.Builder
   [junit4]   2> 1179378 INFO  (qtp6585170-9825) [n:127.0.0.1:33013_solr c:testcollection s:shard2 r:core_node8 x:testcollection_shard2_replica_n6] o.a.s.c.SolrCore [[testcollection_shard2_replica_n6] ] Opening new SolrCore at [/home/jenkins/workspace/Lucene-Solr-7.x-Linux/solr/build/solr-core/test/J0/temp/solr.cloud.TestAuthenticationFramework_C401B50A945DEFFE-001/tempDir-001/node2/testcollection_shard2_replica_n6], dataDir=[/home/jenkins/workspace/Lucene-Solr-7.x-Linux/solr/build/solr-core/test/J0/temp/solr.cloud.TestAuthenticationFramework_C401B50A945DEFFE-001/tempDir-001/node2/./testcollection_shard2_replica_n6/data/]
   [junit4]   2> 1179378 INFO  (qtp6585170-9813) [n:127.0.0.1:33013_solr c:testcollection s:shard1 r:core_node5 x:testcollection_shard1_replica_n2] o.a.s.c.SolrCore [[testcollection_shard1_replica_n2] ] Opening new SolrCore at [/home/jenkins/workspace/Lucene-Solr-7.x-Linux/solr/build/solr-core/test/J0/temp/solr.cloud.TestAuthenticationFramework_C401B50A945DEFFE-001/tempDir-001/node2/testcollection_shard1_replica_n2], dataDir=[/home/jenkins/workspace/Lucene-Solr-7.x-Linux/solr/build/solr-core/test/J0/temp/solr.cloud.TestAuthenticationFramework_C401B50A945DEFFE-001/tempDir-001/node2/./testcollection_shard1_replica_n2/data/]
   [junit4]   2> 1179400 INFO  (qtp8303684-9882) [n:127.0.0.1:39071_solr c:testcollection s:shard1 r:core_node3 x:testcollection_shard1_replica_n1] o.a.s.c.SolrConfig Using Lucene MatchVersion: 7.3.0
   [junit4]   2> 1179401 INFO  (qtp8303684-9880) [n:127.0.0.1:39071_solr c:testcollection s:shard2 r:core_node7 x:testcollection_shard2_replica_n4] o.a.s.c.SolrConfig Using Lucene MatchVersion: 7.3.0
   [junit4]   2> 1179408 INFO  (qtp8303684-9880) [n:127.0.0.1:39071_solr c:testcollection s:shard2 r:core_node7 x:testcollection_shard2_replica_n4] o.a.s.s.IndexSchema [testcollection_shard2_replica_n4] Schema name=minimal
   [junit4]   2> 1179408 INFO  (qtp8303684-9882) [n:127.0.0.1:39071_solr c:testcollection s:shard1 r:core_node3 x:testcollection_shard1_replica_n1] o.a.s.s.IndexSchema [testcollection_shard1_replica_n1] Schema name=minimal
   [junit4]   2> 1179410 INFO  (qtp8303684-9880) [n:127.0.0.1:39071_solr c:testcollection s:shard2 r:core_node7 x:testcollection_shard2_replica_n4] o.a.s.s.IndexSchema Loaded schema minimal/1.1 with uniqueid field id
   [junit4]   2> 1179410 INFO  (qtp8303684-9880) [n:127.0.0.1:39071_solr c:testcollection s:shard2 r:core_node7 x:testcollection_shard2_replica_n4] o.a.s.c.CoreContainer Creating SolrCore 'testcollection_shard2_replica_n4' using configuration from collection testcollection, trusted=true
   [junit4]   2> 1179410 INFO  (qtp8303684-9880) [n:127.0.0.1:39071_solr c:testcollection s:shard2 r:core_node7 x:testcollection_shard2_replica_n4] o.a.s.m.r.SolrJmxReporter JMX monitoring for 'solr_39071.solr.core.testcollection.shard2.replica_n4' (registry 'solr.core.testcollection.shard2.replica_n4') enabled at server: com.sun.jmx.mbeanserver.JmxMBeanServer@1bc2bcf
   [junit4]   2> 1179410 INFO  (qtp8303684-9880) [n:127.0.0.1:39071_solr c:testcollection s:shard2 r:core_node7 x:testcollection_shard2_replica_n4] o.a.s.c.SolrCore solr.RecoveryStrategy.Builder
   [junit4]   2> 1179410 INFO  (qtp8303684-9880) [n:127.0.0.1:39071_solr c:testcollection s:shard2 r:core_node7 x:testcollection_shard2_replica_n4] o.a.s.c.SolrCore [[testcollection_shard2_replica_n4] ] Opening new SolrCore at [/home/jenkins/workspace/Lucene-Solr-7.x-Linux/solr/build/solr-core/test/J0/temp/solr.cloud.TestAuthenticationFramework_C401B50A945DEFFE-001/tempDir-001/node1/testcollection_shard2_replica_n4], dataDir=[/home/jenkins/workspace/Lucene-Solr-7.x-Linux/solr/build/solr-core/test/J0/temp/solr.cloud.TestAuthenticationFramework_C401B50A945DEFFE-001/tempDir-001/node1/./testcollection_shard2_replica_n4/data/]
   [junit4]   2> 1179411 INFO  (qtp8303684-9882) [n:127.0.0.1:39071_solr c:testcollection s:shard1 r:core_node3 x:testcollection_shard1_replica_n1] o.a.s.s.IndexSchema Loaded schema minimal/1.1 with uniqueid field id
   [junit4]   2> 1179411 INFO  (qtp8303684-9882) [n:127.0.0.1:39071_solr c:testcollection s:shard1 r:core_node3 x:testcollection_shard1_replica_n1] o.a.s.c.CoreContainer Creating SolrCore 'testcollection_shard1_replica_n1' using configuration from collection testcollection, trusted=true
   [junit4]   2> 1179411 INFO  (qtp8303684-9882) [n:127.0.0.1:39071_solr c:testcollection s:shard1 r:core_node3 x:testcollection_shard1_replica_n1] o.a.s.m.r.SolrJmxReporter JMX monitoring for 'solr_39071.solr.core.testcollection.shard1.replica_n1' (registry 'solr.core.testcollection.shard1.replica_n1') enabled at server: com.sun.jmx.mbeanserver.JmxMBeanServer@1bc2bcf
   [junit4]   2> 1179411 INFO  (qtp8303684-9882) [n:127.0.0.1:39071_solr c:testcollection s:shard1 r:core_node3 x:testcollection_shard1_replica_n1] o.a.s.c.SolrCore solr.RecoveryStrategy.Builder
   [junit4]   2> 1179412 INFO  (qtp8303684-9882) [n:127.0.0.1:39071_solr c:testcollection s:shard1 r:core_node3 x:testcollection_shard1_replica_n1] o.a.s.c.SolrCore [[testcollection_shard1_replica_n1] ] Opening new SolrCore at [/home/jenkins/workspace/Lucene-Solr-7.x-Linux/solr/build/solr-core/test/J0/temp/solr.cloud.TestAuthenticationFramework_C401B50A945DEFFE-001/tempDir-001/node1/testcollection_shard1_replica_n1], dataDir=[/home/jenkins/workspace/Lucene-Solr-7.x-Linux/solr/build/solr-core/test/J0/temp/solr.cloud.TestAuthenticationFramework_C401B50A945DEFFE-001/tempDir-001/node1/./testcollection_shard1_replica_n1/data/]
   [junit4]   2> 1179463 INFO  (qtp6585170-9813) [n:127.0.0.1:33013_solr c:testcollection s:shard1 r:core_node5 x:testcollection_shard1_replica_n2] o.a.s.u.UpdateHandler Using UpdateLog implementation: org.apache.solr.update.UpdateLog
   [junit4]   2> 1179463 INFO  (qtp6585170-9825) [n:127.0.0.1:33013_solr c:testcollection s:shard2 r:core_node8 x:testcollection_shard2_replica_n6] o.a.s.u.UpdateHandler Using UpdateLog implementation: org.apache.solr.update.UpdateLog
   [junit4]   2> 1179463 INFO  (qtp6585170-9813) [n:127.0.0.1:33013_solr c:testcollection s:shard1 r:core_node5 x:testcollection_shard1_replica_n2] o.a.s.u.UpdateLog Initializing UpdateLog: dataDir=null defaultSyncLevel=FLUSH numRecordsToKeep=100 maxNumLogsToKeep=10 numVersionBuckets=65536
   [junit4]   2> 1179464 INFO  (qtp6585170-9825) [n:127.0.0.1:33013_solr c:testcollection s:shard2 r:core_node8 x:testcollection_shard2_replica_n6] o.a.s.u.UpdateLog Initializing UpdateLog: dataDir=null defaultSyncLevel=FLUSH numRecordsToKeep=100 maxNumLogsToKeep=10 numVersionBuckets=65536
   [junit4]   2> 1179465 INFO  (qtp6585170-9813) [n:127.0.0.1:33013_solr c:testcollection s:shard1 r:core_node5 x:testcollection_shard1_replica_n2] o.a.s.u.CommitTracker Hard AutoCommit: disabled
   [junit4]   2> 1179465 INFO  (qtp6585170-9813) [n:127.0.0.1:33013_solr c:testcollection s:shard1 r:core_node5 x:testcollection_shard1_replica_n2] o.a.s.u.CommitTracker Soft AutoCommit: disabled
   [junit4]   2> 1179465 INFO  (qtp6585170-9825) [n:127.0.0.1:33013_solr c:testcollection s:shard2 r:core_node8 x:testcollection_shard2_replica_n6] o.a.s.u.CommitTracker Hard AutoCommit: disabled
   [junit4]   2> 1179465 INFO  (qtp6585170-9825) [n:127.0.0.1:33013_solr c:testcollection s:shard2 r:core_node8 x:testcollection_shard2_replica_n6] o.a.s.u.CommitTracker Soft AutoCommit: disabled
   [junit4]   2> 1179467 INFO  (qtp6585170-9813) [n:127.0.0.1:33013_solr c:testcollection s:shard1 r:core_node5 x:testcollection_shard1_replica_n2] o.a.s.s.SolrIndexSearcher Opening [Searcher@3d5ae4[testcollection_shard1_replica_n2] main]
   [junit4]   2> 1179468 INFO  (qtp6585170-9825) [n:127.0.0.1:33013_solr c:testcollection s:shard2 r:core_node8 x:testcollection_shard2_replica_n6] o.a.s.s.SolrIndexSearcher Opening [Searcher@4d3f8e[testcollection_shard2_replica_n6] main]
   [junit4]   2> 1179468 INFO  (qtp6585170-9813) [n:127.0.0.1:33013_solr c:testcollection s:shard1 r:core_node5 x:testcollection_shard1_replica_n2] o.a.s.r.ManagedResourceStorage Configured ZooKeeperStorageIO with znodeBase: /configs/solrCloudCollectionConfig
   [junit4]   2> 1179469 INFO  (qtp6585170-9813) [n:127.0.0.1:33013_solr c:testcollection s:shard1 r:core_node5 x:testcollection_shard1_replica_n2] o.a.s.r.ManagedResourceStorage Loaded null at path _rest_managed.json using ZooKeeperStorageIO:path=/configs/solrCloudCollectionConfig
   [junit4]   2> 1179469 INFO  (qtp6585170-9825) [n:127.0.0.1:33013_solr c:testcollection s:shard2 r:core_node8 x:testcollection_shard2_replica_n6] o.a.s.r.ManagedResourceStorage Configured ZooKeeperStorageIO with znodeBase: /configs/solrCloudCollectionConfig
   [junit4]   2> 1179469 INFO  (qtp6585170-9825) [n:127.0.0.1:33013_solr c:testcollection s:shard2 r:core_node8 x:testcollection_shard2_replica_n6] o.a.s.r.ManagedResourceStorage Loaded null at path _rest_managed.json using ZooKeeperStorageIO:path=/configs/solrCloudCollectionConfig
   [junit4]   2> 1179470 INFO  (qtp6585170-9813) [n:127.0.0.1:33013_solr c:testcollection s:shard1 r:core_node5 x:testcollection_shard1_replica_n2] o.a.s.h.ReplicationHandler Commits will be reserved for 10000ms.
   [junit4]   2> 1179470 INFO  (qtp6585170-9825) [n:127.0.0.1:33013_solr c:testcollection s:shard2 r:core_node8 x:testcollection_shard2_replica_n6] o.a.s.h.ReplicationHandler Commits will be reserved for 10000ms.
   [junit4]   2> 1179471 INFO  (searcherExecutor-4165-thread-1-processing-n:127.0.0.1:33013_solr x:testcollection_shard1_replica_n2 s:shard1 c:testcollection r:core_node5) [n:127.0.0.1:33013_solr c:testcollection s:shard1 r:core_node5 x:testcollection_shard1_replica_n2] o.a.s.c.SolrCore [testcollection_shard1_replica_n2] Registered new searcher Searcher@3d5ae4[testcollection_shard1_replica_n2] main{ExitableDirectoryReader(UninvertingDirectoryReader())}
   [junit4]   2> 1179471 INFO  (searcherExecutor-4164-thread-1-processing-n:127.0.0.1:33013_solr x:testcollection_shard2_replica_n6 s:shard2 c:testcollection r:core_node8) [n:127.0.0.1:33013_solr c:testcollection s:shard2 r:core_node8 x:testcollection_shard2_replica_n6] o.a.s.c.SolrCore [testcollection_shard2_replica_n6] Registered new searcher Searcher@4d3f8e[testcollection_shard2_replica_n6] main{ExitableDirectoryReader(UninvertingDirectoryReader())}
   [junit4]   2> 1179472 INFO  (qtp6585170-9813) [n:127.0.0.1:33013_solr c:testcollection s:shard1 r:core_node5 x:testcollection_shard1_replica_n2] o.a.s.u.UpdateLog Could not find max version in index or recent updates, using new clock 1591164740970741760
   [junit4]   2> 1179472 INFO  (qtp6585170-9825) [n:127.0.0.1:33013_solr c:testcollection s:shard2 r:core_node8 x:testcollection_shard2_replica_n6] o.a.s.u.UpdateLog Could not find max version in index or recent updates, using new clock 1591164740970741760
   [junit4]   2> 1179478 INFO  (qtp8303684-9882) [n:127.0.0.1:39071_solr c:testcollection s:shard1 r:core_node3 x:testcollection_shard1_replica_n1] o.a.s.u.UpdateHandler Using UpdateLog implementation: org.apache.solr.update.UpdateLog
   [junit4]   2> 1179479 INFO  (qtp8303684-9882) [n:127.0.0.1:39071_solr c:testcollection s:shard1 r:core_node3 x:testcollection_shard1_replica_n1] o.a.s.u.UpdateLog Initializing UpdateLog: dataDir=null defaultSyncLevel=FLUSH numRecordsToKeep=100 maxNumLogsToKeep=10 numVersionBuckets=65536
   [junit4]   2> 1179480 INFO  (qtp8303684-9882) [n:127.0.0.1:39071_solr c:testcollection s:shard1 r:core_node3 x:testcollection_shard1_replica_n1] o.a.s.u.CommitTracker Hard AutoCommit: disabled
   [junit4]   2> 1179480 INFO  (qtp8303684-9882) [n:127.0.0.1:39071_solr c:testcollection s:shard1 r:core_node3 x:testcollection_shard1_replica_n1] o.a.s.u.CommitTracker Soft AutoCommit: disabled
   [junit4]   2> 1179481 INFO  (qtp6585170-9813) [n:127.0.0.1:33013_solr c:testcollection s:shard1 r:core_node5 x:testcollection_shard1_replica_n2] o.a.s.c.ShardLeaderElectionContext Waiting until we see more replicas up for shard shard1: total=2 found=1 timeoutin=9999ms
   [junit4]   2> 1179482 INFO  (qtp8303684-9880) [n:127.0.0.1:39071_solr c:testcollection s:shard2 r:core_node7 x:testcollection_shard2_replica_n4] o.a.s.u.UpdateHandler Using UpdateLog implementation: org.apache.solr.update.UpdateLog
   [junit4]   2> 1179482 INFO  (qtp8303684-9880) [n:127.0.0.1:39071_solr c:testcollection s:shard2 r:core_node7 x:testcollection_shard2_replica_n4] o.a.s.u.UpdateLog Initializing UpdateLog: dataDir=null defaultSyncLevel=FLUSH numRecordsToKeep=100 maxNumLogsToKeep=10 numVersionBuckets=65536
   [junit4]   2> 1179482 INFO  (qtp6585170-9825) [n:127.0.0.1:33013_solr c:testcollection s:shard2 r:core_node8 x:testcollection_shard2_replica_n6] o.a.s.c.ShardLeaderElectionContext Waiting until we see more replicas up for shard shard2: total=2 found=1 timeoutin=9999ms
   [junit4]   2> 1179483 INFO  (qtp8303684-9880) [n:127.0.0.1:39071_solr c:testcollection s:shard2 r:core_node7 x:testcollection_shard2_replica_n4] o.a.s.u.CommitTracker Hard AutoCommit: disabled
   [junit4]   2> 1179483 INFO  (qtp8303684-9882) [n:127.0.0.1:39071_solr c:testcollection s:shard1 r:core_node3 x:testcollection_shard1_replica_n1] o.a.s.s.SolrIndexSearcher Opening [Searcher@d6decd[testcollection_shard1_replica_n1] main]
   [junit4]   2> 1179483 INFO  (qtp8303684-9880) [n:127.0.0.1:39071_solr c:testcollection s:shard2 r:core_node7 x:testcollection_shard2_replica_n4] o.a.s.u.CommitTracker Soft AutoCommit: disabled
   [junit4]   2> 1179484 INFO  (qtp8303684-9882) [n:127.0.0.1:39071_solr c:testcollection s:shard1 r:core_node3 x:testcollection_shard1_replica_n1] o.a.s.r.ManagedResourceStorage Configured ZooKeeperStorageIO with znodeBase: /configs/solrCloudCollectionConfig
   [junit4]   2> 1179484 INFO  (qtp8303684-9882) [n:127.0.0.1:39071_solr c:testcollection s:shard1 r:core_node3 x:testcollection_shard1_replica_n1] o.a.s.r.ManagedResourceStorage Loaded null at path _rest_managed.json using ZooKeeperStorageIO:path=/configs/solrCloudCollectionConfig
   [junit4]   2> 1179485 INFO  (qtp8303684-9880) [n:127.0.0.1:39071_solr c:testcollection s:shard2 r:core_node7 x:testcollection_shard2_replica_n4] o.a.s.s.SolrIndexSearcher Opening [Searcher@1f84800[testcollection_shard2_replica_n4] main]
   [junit4]   2> 1179485 INFO  (qtp8303684-9882) [n:127.0.0.1:39071_solr c:testcollection s:shard1 r:core_node3 x:testcollection_shard1_replica_n1] o.a.s.h.ReplicationHandler Commits will be reserved for 10000ms.
   [junit4]   2> 1179486 INFO  (qtp8303684-9880) [n:127.0.0.1:39071_solr c:testcollection s:shard2 r:core_node7 x:testcollection_shard2_replica_n4] o.a.s.r.ManagedResourceStorage Configured ZooKeeperStorageIO with znodeBase: /configs/solrCloudCollectionConfig
   [junit4]   2> 1179486 INFO  (qtp8303684-9880) [n:127.0.0.1:39071_solr c:testcollection s:shard2 r:core_node7 x:testcollection_shard2_replica_n4] o.a.s.r.ManagedResourceStorage Loaded null at path _rest_managed.json using ZooKeeperStorageIO:path=/configs/solrCloudCollectionConfig
   [junit4]   2> 1179487 INFO  (searcherExecutor-4167-thread-1-processing-n:127.0.0.1:39071_solr x:testcollection_shard1_replica_n1 s:shard1 c:testcollection r:core_node3) [n:127.0.0.1:39071_solr c:testcollection s:shard1 r:core_node3 x:testcollection_shard1_replica_n1] o.a.s.c.SolrCore [testcollection_shard1_replica_n1] Registered new searcher Searcher@d6decd[testcollection_shard1_replica_n1] main{ExitableDirectoryReader(UninvertingDirectoryReader())}
   [junit4]   2> 1179487 INFO  (qtp8303684-9882) [n:127.0.0.1:39071_solr c:testcollection s:shard1 r:core_node3 x:testcollection_shard1_replica_n1] o.a.s.u.UpdateLog Could not find max version in index or recent updates, using new clock 1591164740986470400
   [junit4]   2> 1179487 INFO  (qtp8303684-9880) [n:127.0.0.1:39071_solr c:testcollection s:shard2 r:core_node7 x:testcollection_shard2_replica_n4] o.a.s.h.ReplicationHandler Commits will be reserved for 10000ms.
   [junit4]   2> 1179488 INFO  (searcherExecutor-4166-thread-1-processing-n:127.0.0.1:39071_solr x:testcollection_shard2_replica_n4 s:shard2 c:testcollection r:core_node7) [n:127.0.0.1:39071_solr c:testcollection s:shard2 r:core_node7 x:testcollection_shard2_replica_n4] o.a.s.c.SolrCore [testcollection_shard2_replica_n4] Registered new searcher Searcher@1f84800[testcollection_shard2_replica_n4] main{ExitableDirectoryReader(UninvertingDirectoryReader())}
   [junit4]   2> 1179488 INFO  (qtp8303684-9880) [n:127.0.0.1:39071_solr c:testcollection s:shard2 r:core_node7 x:testcollection_shard2_replica_n4] o.a.s.u.UpdateLog Could not find max version in index or recent updates, using new clock 1591164740987518976
   [junit4]   2> 1179583 INFO  (zkCallback-1872-thread-1-processing-n:127.0.0.1:33013_solr) [n:127.0.0.1:33013_solr    ] o.a.s.c.c.ZkStateReader A cluster state change: [WatchedEvent state:SyncConnected type:NodeDataChanged path:/collections/testcollection/state.json] for collection [testcollection] has occurred - updating... (live nodes size: [2])
   [junit4]   2> 1179584 INFO  (zkCallback-1874-thread-1-processing-n:127.0.0.1:39071_solr) [n:127.0.0.1:39071_solr    ] o.a.s.c.c.ZkStateReader A cluster state change: [WatchedEvent state:SyncConnected type:NodeDataChanged path:/collections/testcollection/state.json] for collection [testcollection] has occurred - updating... (live nodes size: [2])
   [junit4]   2> 1179584 INFO  (zkCallback-1874-thread-2-processing-n:127.0.0.1:39071_solr) [n:127.0.0.1:39071_solr    ] o.a.s.c.c.ZkStateReader A cluster state change: [WatchedEvent state:SyncConnected type:NodeDataChanged path:/collections/testcollection/state.json] for collection [testcollection] has occurred - updating... (live nodes size: [2])
   [junit4]   2> 1179981 INFO  (qtp6585170-9813) [n:127.0.0.1:33013_solr c:testcollection s:shard1 r:core_node5 x:testcollection_shard1_replica_n2] o.a.s.c.ShardLeaderElectionContext Enough replicas found to continue.
   [junit4]   2> 1179981 INFO  (qtp6585170-9813) [n:127.0.0.1:33013_solr c:testcollection s:shard1 r:core_node5 x:testcollection_shard1_replica_n2] o.a.s.c.ShardLeaderElectionContext I may be the new leader - try and sync
   [junit4]   2> 1179981 INFO  (qtp6585170-9813) [n:127.0.0.1:33013_solr c:testcollection s:shard1 r:core_node5 x:testcollection_shard1_replica_n2] o.a.s.c.SyncStrategy Sync replicas to https://127.0.0.1:33013/solr/testcollection_shard1_replica_n2/
   [junit4]   2> 1179982 INFO  (qtp6585170-9813) [n:127.0.0.1:33013_solr c:testcollection s:shard1 r:core_node5 x:testcollection_shard1_replica_n2] o.a.s.u.PeerSync PeerSync: core=testcollection_shard1_replica_n2 url=https://127.0.0.1:33013/solr START replicas=[https://127.0.0.1:39071/solr/testcollection_shard1_replica_n1/] nUpdates=100
   [junit4]   2> 1179983 INFO  (qtp6585170-9825) [n:127.0.0.1:33013_solr c:testcollection s:shard2 r:core_node8 x:testcollection_shard2_replica_n6] o.a.s.c.ShardLeaderElectionContext Enough replicas found to continue.
   [junit4]   2> 1179983 INFO  (qtp6585170-9825) [n:127.0.0.1:33013_solr c:testcollection s:shard2 r:core_node8 x:testcollection_shard2_replica_n6] o.a.s.c.ShardLeaderElectionContext I may be the new leader - try and sync
   [junit4]   2> 1179983 INFO  (qtp6585170-9825) [n:127.0.0.1:33013_solr c:testcollection s:shard2 r:core_node8 x:testcollection_shard2_replica_n6] o.a.s.c.SyncStrategy Sync replicas to https://127.0.0.1:33013/solr/testcollection_shard2_replica_n6/
   [junit4]   2> 1179983 INFO  (qtp6585170-9825) [n:127.0.0.1:33013_solr c:testcollection s:shard2 r:core_node8 x:testcollection_shard2_replica_n6] o.a.s.u.PeerSync PeerSync: core=testcollection_shard2_replica_n6 url=https://127.0.0.1:33013/solr START replicas=[https://127.0.0.1:39071/solr/testcollection_shard2_replica_n4/] nUpdates=100
   [junit4]   2> 1179988 INFO  (qtp8303684-9815) [n:127.0.0.1:39071_solr c:testcollection s:shard1 r:core_node3 x:testcollection_shard1_replica_n1] o.a.s.c.S.Request [testcollection_shard1_replica_n1]  webapp=/solr path=/get params={distrib=false&qt=/get&fingerprint=false&getVersions=100&wt=javabin&version=2} status=0 QTime=0
   [junit4]   2> 1179989 INFO  (qtp8303684-9817) [n:127.0.0.1:39071_solr c:testcollection s:shard2 r:core_node7 x:testcollection_shard2_replica_n4] o.a.s.c.S.Request [testcollection_shard2_replica_n4]  webapp=/solr path=/get params={distrib=false&qt=/get&fingerprint=false&getVersions=100&wt=javabin&version=2} status=0 QTime=0
   [junit4]   2> 1180284 INFO  (qtp6585170-9825) [n:127.0.0.1:33013_solr c:testcollection s:shard2 r:core_node8 x:testcollection_shard2_replica_n6] o.a.s.u.PeerSync PeerSync: core=testcollection_shard2_replica_n6 url=https://127.0.0.1:33013/solr DONE.  We have no versions.  sync failed.
   [junit4]   2> 1180284 INFO  (qtp6585170-9825) [n:127.0.0.1:33013_solr c:testcollection s:shard2 r:core_node8 x:testcollection_shard2_replica_n6] o.a.s.c.SyncStrategy Leader's attempt to sync with shard failed, moving to the next candidate
   [junit4]   2> 1180284 INFO  (qtp6585170-9825) [n:127.0.0.1:33013_solr c:testcollection s:shard2 r:core_node8 x:testcollection_shard2_replica_n6] o.a.s.c.ShardLeaderElectionContext We failed sync, but we have no versions - we can't sync in that case - we were active before, so become leader anyway
   [junit4]   2> 1180284 INFO  (qtp6585170-9825) [n:127.0.0.1:33013_solr c:testcollection s:shard2 r:core_node8 x:testcollection_shard2_replica_n6] o.a.s.c.ShardLeaderElectionContext Found all replicas participating in election, clear LIR
   [junit4]   2> 1180289 INFO  (qtp6585170-9825) [n:127.0.0.1:33013_solr c:testcollection s:shard2 r:core_node8 x:testcollection_shard2_replica_n6] o.a.s.c.ShardLeaderElectionContext I am the new leader: https://127.0.0.1:33013/solr/testcollection_shard2_replica_n6/ shard2
   [junit4]   2> 1180295 INFO  (qtp6585170-9813) [n:127.0.0.1:33013_solr c:testcollection s:shard1 r:core_node5 x:testcollection_shard1_replica_n2] o.a.s.u.PeerSync PeerSync: core=testcollection_shard1_replica_n2 url=https://127.0.0.1:33013/solr DONE.  We have no versions.  sync failed.
   [junit4]   2> 1180295 INFO  (qtp6585170-9813) [n:127.0.0.1:33013_solr c:testcollection s:shard1 r:core_node5 x:testcollection_shard1_replica_n2] o.a.s.c.SyncStrategy Leader's attempt to sync with shard failed, moving to the next candidate
   [junit4]   2> 1180295 INFO  (qtp6585170-9813) [n:127.0.0.1:33013_solr c:testcollection s:shard1 r:core_node5 x:testcollection_shard1_replica_n2] o.a.s.c.ShardLeaderElectionContext We failed sync, but we have no versions - we can't sync in that case - we were active before, so become leader anyway
   [junit4]   2> 1180295 INFO  (qtp6585170-9813) [n:127.0.0.1:33013_solr c:testcollection s:shard1 r:core_node5 x:testcollection_shard1_replica_n2] o.a.s.c.ShardLeaderElectionContext Found all replicas participating in election, clear LIR
   [junit4]   2> 1180298 INFO  (qtp6585170-9813) [n:127.0.0.1:33013_solr c:testcollection s:shard1 r:core_node5 x:testcollection_shard1_replica_n2] o.a.s.c.ShardLeaderElectionContext I am the new leader: https://127.0.0.1:33013/solr/testcollection_shard1_replica_n2/ shard1
   [junit4]   2> 1180399 INFO  (zkCallback-1874-thread-1-processing-n:127.0.0.1:39071_solr) [n:127.0.0.1:39071_solr    ] o.a.s.c.c.ZkStateReader A cluster state change: [WatchedEvent state:SyncConnected type:NodeDataChanged path:/collections/testcollection/state.json] for collection [testcollection] has occurred - updating... (live nodes size: [2])
   [junit4]   2> 1180399 INFO  (zkCallback-1872-thread-1-processing-n:127.0.0.1:33013_solr) [n:127.0.0.1:33013_solr    ] o.a.s.c.c.ZkStateReader A cluster state change: [WatchedEvent state:SyncConnected type:NodeDataChanged path:/collections/testcollection/state.json] for collection [testcollection] has occurred - updating... (live nodes size: [2])
   [junit4]   2> 1180399 INFO  (zkCallback-1874-thread-2-processing-n:127.0.0.1:39071_solr) [n:127.0.0.1:39071_solr    ] o.a.s.c.c.ZkStateReader A cluster state change: [WatchedEvent state:SyncConnected type:NodeDataChanged path:/collections/testcollection/state.json] for collection [testcollection] has occurred - updating... (live nodes size: [2])
   [junit4]   2> 1180440 INFO  (qtp6585170-9825) [n:127.0.0.1:33013_solr c:testcollection s:shard2 r:core_node8 x:testcollection_shard2_replica_n6] o.a.s.c.ZkController I am the leader, no recovery necessary
   [junit4]   2> 1180447 INFO  (qtp6585170-9825) [n:127.0.0.1:33013_solr c:testcollection s:shard2 r:core_node8 x:testcollection_shard2_replica_n6] o.a.s.s.HttpSolrCall [admin] webapp=null path=/admin/cores params={qt=/admin/cores&coreNodeName=core_node8&collection.configName=solrCloudCollectionConfig&newCollection=true&name=testcollection_shard2_replica_n6&action=CREATE&numShards=2&collection=testcollection&shard=shard2&wt=javabin&version=2&replicaType=NRT} status=0 QTime=2095
   [junit4]   2> 1180449 INFO  (qtp6585170-9813) [n:127.0.0.1:33013_solr c:testcollection s:shard1 r:core_node5 x:testcollection_shard1_replica_n2] o.a.s.c.ZkController I am the leader, no recovery necessary
   [junit4]   2> 1180450 INFO  (qtp6585170-9813) [n:127.0.0.1:33013_solr c:testcollection s:shard1 r:core_node5 x:testcollection_shard1_replica_n2] o.a.s.s.HttpSolrCall [admin] webapp=null path=/admin/cores params={qt=/admin/cores&coreNodeName=core_node5&collection.configName=solrCloudCollectionConfig&newCollection=true&name=testcollection_shard1_replica_n2&action=CREATE&numShards=2&collection=testcollection&shard=shard1&wt=javabin&version=2&replicaType=NRT} status=0 QTime=2099
   [junit4]   2> 1180495 INFO  (qtp8303684-9882) [n:127.0.0.1:39071_solr c:testcollection s:shard1 r:core_node3 x:testcollection_shard1_replica_n1] o.a.s.s.HttpSolrCall [admin] webapp=null path=/admin/cores params={qt=/admin/cores&coreNodeName=core_node3&collection.configName=solrCloudCollectionConfig&newCollection=true&name=testcollection_shard1_replica_n1&action=CREATE&numShards=2&collection=testcollection&shard=shard1&wt=javabin&version=2&replicaType=NRT} status=0 QTime=2106
   [junit4]   2> 1180496 INFO  (qtp8303684-9880) [n:127.0.0.1:39071_solr c:testcollection s:shard2 r:core_node7 x:testcollection_shard2_replica_n4] o.a.s.s.HttpSolrCall [admin] webapp=null path=/admin/cores params={qt=/admin/cores&coreNodeName=core_node7&collection.configName=solrCloudCollectionConfig&newCollection=true&name=testcollection_shard2_replica_n4&action=CREATE&numShards=2&collection=testcollection&shard=shard2&wt=javabin&version=2&replicaType=NRT} status=0 QTime=2106
   [junit4]   2> 1180501 INFO  (qtp6585170-9826) [n:127.0.0.1:33013_solr    ] o.a.s.h.a.CollectionsHandler Wait for new collection to be active for at most 30 seconds. Check all shard replicas
   [junit4]   2> 1180599 INFO  (zkCallback-1874-thread-2-processing-n:127.0.0.1:39071_solr) [n:127.0.0.1:39071_solr    ] o.a.s.c.c.ZkStateReader A cluster state change: [WatchedEvent state:SyncConnected type:NodeDataChanged path:/collections/testcollection/state.json] for collection [testcollection] has occurred - updating... (live nodes size: [2])
   [junit4]   2> 1180599 INFO  (zkCallback-1872-thread-1-processing-n:127.0.0.1:33013_solr) [n:127.0.0.1:33013_solr    ] o.a.s.c.c.ZkStateReader A cluster state change: [WatchedEvent state:SyncConnected type:NodeDataChanged path:/collections/testcollection/state.json] for collection [testcollection] has occurred - updating... (live nodes size: [2])
   [junit4]   2> 1180599 INFO  (zkCallback-1874-thread-1-processing-n:127.0.0.1:39071_solr) [n:127.0.0.1:39071_solr    ] o.a.s.c.c.ZkStateReader A cluster state change: [WatchedEvent state:SyncConnected type:NodeDataChanged path:/collections/testcollection/state.json] for collection [testcollection] has occurred - updating... (live nodes size: [2])
   [junit4]   2> 1181501 INFO  (qtp6585170-9826) [n:127.0.0.1:33013_solr    ] o.a.s.s.HttpSolrCall [admin] webapp=null path=/admin/collections params={replicationFactor=2&collection.configName=solrCloudCollectionConfig&maxShardsPerNode=2&name=testcollection&nrtReplicas=2&action=CREATE&numShards=2&wt=javabin&version=2} status=0 QTime=3472
   [junit4]   2> 1181502 INFO  (TEST-TestAuthenticationFramework.testBasics-seed#[C401B50A945DEFFE]) [    ] o.a.s.c.AbstractDistribZkTestBase Wait for recoveries to finish - collection: testcollection failOnTimeout:true timeout (sec):330
   [junit4]   1> -
   [junit4]   1> replica:core_node3 rstate:active live:true
   [junit4]   1> replica:core_node5 rstate:active live:true
   [junit4]   1> replica:core_node7 rstate:active live:true
   [junit4]   1> replica:core_node8 rstate:active live:true
   [junit4]   1> no one is recoverying
   [junit4]   2> 1181502 INFO  (TEST-TestAuthenticationFramework.testBasics-seed#[C401B50A945DEFFE]) [    ] o.a.s.c.AbstractDistribZkTestBase Recoveries finished - collection: testcollection
   [junit4]   2> 1181509 INFO  (qtp6585170-9883) [n:127.0.0.1:33013_solr c:testcollection s:shard2 r:core_node8 x:testcollection_shard2_replica_n6] o.a.s.c.S.Request [testcollection_shard2_replica_n6]  webapp=/solr path=/select params={df=text&distrib=false&_stateVer_=testcollection:5&fl=id&fl=score&shards.purpose=4&start=0&fsv=true&shard.url=https://127.0.0.1:33013/solr/testcollection_shard2_replica_n6/|https://127.0.0.1:39071/solr/testcollection_shard2_replica_n4/&rows=10&version=2&q=*:*&NOW=1517452948670&isShard=true&wt=javabin} hits=0 status=0 QTime=0
   [junit4]   2> 1181509 INFO  (qtp8303684-9820) [n:127.0.0.1:39071_solr c:testcollection s:shard1 r:core_node3 x:testcollection_shard1_replica_n1] o.a.s.c.S.Request [testcollection_shard1_replica_n1]  webapp=/solr path=/select params={df=text&distrib=false&_stateVer_=testcollection:5&fl=id&fl=score&shards.purpose=4&start=0&fsv=true&shard.url=https://127.0.0.1:39071/solr/testcollection_shard1_replica_n1/|https://127.0.0.1:33013/solr/testcollection_shard1_replica_n2/&rows=10&version=2&q=*:*&NOW=1517452948670&isShard=true&wt=javabin} hits=0 status=0 QTime=0
   [junit4]   2> 1181510 INFO  (qtp6585170-9823) [n:127.0.0.1:33013_solr c:testcollection s:shard1 r:core_node5 x:testcollection_shard1_replica_n2] o.a.s.c.S.Request [testcollection_shard1_replica_n2]  webapp=/solr path=/select params={q=*:*&_stateVer_=testcollection:5&wt=javabin&version=2} hits=0 status=0 QTime=3
   [junit4]   2> 1181519 INFO  (qtp8303684-9814) [n:127.0.0.1:39071_solr c:testcollection s:shard1 r:core_node3 x:testcollection_shard1_replica_n1] o.a.s.u.p.LogUpdateProcessorFactory [testcollection_shard1_replica_n1]  webapp=/solr path=/update params={update.distrib=FROMLEADER&distrib.from=https://127.0.0.1:33013/solr/testcollection_shard1_replica_n2/&wt=javabin&version=2}{add=[1 (1591164743110885376)]} 0 2
   [junit4]   2> 1181519 INFO  (qtp6585170-9826) [n:127.0.0.1:33013_solr c:testcollection s:shard1 r:core_node5 x:testcollection_shard1_replica_n2] o.a.s.u.p.LogUpdateProcessorFactory [testcollection_shard1_replica_n2]  webapp=/solr path=/update params={_stateVer_=testcollection:5&wt=javabin&version=2}{add=[1 (1591164743110885376)]} 0 7
   [junit4]   2> 1181524 INFO  (qtp8303684-9820) [n:127.0.0.1:39071_solr c:testcollection s:shard1 r:core_node3 x:testcollection_shard1_replica_n1] o.a.s.u.DirectUpdateHandler2 start commit{_version_=1591164743122419712,optimize=false,openSearcher=true,waitSearcher=true,expungeDeletes=false,softCommit=false,prepareCommit=false}
   [junit4]   2> 1181524 INFO  (qtp8303684-9812) [n:127.0.0.1:39071_solr c:testcollection s:shard2 r:core_node7 x:testcollection_shard2_replica_n4] o.a.s.u.DirectUpdateHandler2 start commit{_version_=1591164743122419712,optimize=false,openSearcher=true,waitSearcher=true,expungeDeletes=false,softCommit=false,prepareCommit=false}
   [junit4]   2> 1181524 INFO  (qtp8303684-9820) [n:127.0.0.1:39071_solr c:testcollection s:shard1 r:core_node3 x:testcollection_shard1_replica_n1] o.a.s.u.SolrIndexWriter Calling setCommitData with IW:org.apache.solr.update.SolrIndexWriter@11117b8 commitCommandVersion:1591164743122419712
   [junit4]   2> 1181524 INFO  (qtp8303684-9812) [n:127.0.0.1:39071_solr c:testcollection s:shard2 r:core_node7 x:testcollection_shard2_replica_n4] o.a.s.u.DirectUpdateHandler2 No uncommitted changes. Skipping IW.commit.
   [junit4]   2> 1181524 INFO  (qtp8303684-9812) [n:127.0.0.1:39071_solr c:testcollection s:shard2 r:core_node7 x:testcollection_shard2_replica_n4] o.a.s.u.DirectUpdateHandler2 end_commit_flush
   [junit4]   2> 1181525 INFO  (qtp8303684-9812) [n:127.0.0.1:39071_solr c:testcollection s:shard2 r:core_node7 x:testcollection_shard2_replica_n4] o.a.s.u.p.LogUpdateProcessorFactory [testcollection_shard2_replica_n4]  webapp=/solr path=/update params={update.distrib=FROMLEADER&waitSearcher=true&openSearcher=true&commit=true&softCommit=false&distrib.from=https://127.0.0.1:33013/solr/testcollection_shard1_replica_n2/&commit_end_point=true&wt=javabin&version=2&expungeDeletes=false}{commit=} 0 1
   [junit4]   2> 1181527 INFO  (qtp6585170-9816) [n:127.0.0.1:33013_solr c:testcollection s:shard1 r:core_node5 x:testcollection_shard1_replica_n2] o.a.s.u.DirectUpdateHandler2 start commit{_version_=1591164743125565440,optimize=false,openSearcher=true,waitSearcher=true,expungeDeletes=false,softCommit=false,prepareCommit=false}
   [junit4]   2> 1181527 INFO  (qtp6585170-9818) [n:127.0.0.1:33013_solr c:testcollection s:shard2 r:core_node8 x:testcollection_shard2_replica_n6] o.a.s.u.DirectUpdateHandler2 start commit{_version_=1591164743125565440,optimize=false,openSearcher=true,waitSearcher=true,expungeDeletes=false,softCommit=false,prepareCommit=false}
   [junit4]   2> 1181527 INFO  (qtp6585170-9816) [n:127.0.0.1:33013_solr c:testcollection s:shard1 r:core_node5 x:testcollection_shard1_replica_n2] o.a.s.u.SolrIndexWriter Calling setCommitData with IW:org.apache.solr.update.SolrIndexWriter@1fecdb7 commitCommandVersion:1591164743125565440
   [junit4]   2> 1181527 INFO  (qtp6585170-9818) [n:127.0.0.1:33013_solr c:testcollection s:shard2 r:core_node8 x:testcollection_shard2_replica_n6] o.a.s.u.DirectUpdateHandler2 No uncommitted changes. Skipping IW.commit.
   [junit4]   2> 1181528 INFO  (qtp6585170-9818) [n:127.0.0.1:33013_solr c:testcollection s:shard2 r:core_node8 x:testcollection_shard2_replica_n6] o.a.s.u.DirectUpdateHandler2 end_commit_flush
   [junit4]   2> 1181528 INFO  (qtp6585170-9818) [n:127.0.0.1:33013_solr c:testcollection s:shard2 r:core_node8 x:testcollection_shard2_replica_n6] o.a.s.u.p.LogUpdateProcessorFactory [testcollection_shard2_replica_n6]  webapp=/solr path=/update params={update.distrib=FROMLEADER&waitSearcher=true&openSearcher=true&commit=true&softCommit=false&distrib.from=https://127.0.0.1:33013/solr/testcollection_shard1_replica_n2/&commit_end_point=true&wt=javabin&version=2&expungeDeletes=false}{commit=} 0 0
   [junit4]   2> 1181528 INFO  (qtp8303684-9820) [n:127.0.0.1:39071_solr c:testcollection s:shard1 r:core_node3 x:testcollection_shard1_replica_n1] o.a.s.s.SolrIndexSearcher Opening [Searcher@b982bc[testcollection_shard1_replica_n1] main]
   [junit4]   2> 1181528 INFO  (qtp8303684-9820) [n:127.0.0.1:39071_solr c:testcollection s:shard1 r:core_node3 x:testcollection_shard1_replica_n1] o.a.s.u.DirectUpdateHandler2 end_commit_flush
   [junit4]   2> 1181531 INFO  (qtp6585170-9816) [n:127.0.0.1:33013_solr c:testcollection s:shard1 r:core_node5 x:testcollection_shard1_replica_n2] o.a.s.s.SolrIndexSearcher Opening [Searcher@18d1e34[testcollection_shard1_replica_n2] main]
   [junit4]   2> 1181531 INFO  (searcherExecutor-4167-thread-1-processing-n:127.0.0.1:39071_solr x:testcollection_shard1_replica_n1 s:shard1 c:testcollection r:core_node3) [n:127.0.0.1:39071_solr c:testcollection s:shard1 r:core_node3 x:testcollection_shard1_replica_n1] o.a.s.c.SolrCore [testcollection_shard1_replica_n1] Registered new searcher Searcher@b982bc[testcollection_shard1_replica_n1] main{ExitableDirectoryReader(UninvertingDirectoryReader(Uninverting(_0(7.3.0):C1)))}
   [junit4]   2> 1181531 INFO  (qtp6585170-9816) [n:127.0.0.1:33013_solr c:testcollection s:shard1 r:core_node5 x:testcollection_shard1_replica_n2] o.a.s.u.DirectUpdateHandler2 end_commit_flush
   [junit4]   2> 1181531 INFO  (qtp8303684-9820) [n:127.0.0.1:39071_solr c:testcollection s:shard1 r:core_node3 x:testcollection_shard1_replica_n1] o.a.s.u.p.LogUpdateProcessorFactory [testcollection_shard1_replica_n1]  webapp=/solr path=/update params={update.distrib=FROMLEADER&waitSearcher=true&openSearcher=true&commit=true&softCommit=false&distrib.from=https://127.0.0.1:33013/solr/testcollection_shard1_replica_n2/&commit_end_point=true&wt=javabin&version=2&expungeDeletes=false}{commit=} 0 8
   [junit4]   2> 1181534 INFO  (searcherExecutor-4165-thread-1-processing-n:127.0.0.1:33013_solr x:testcollection_shard1_replica_n2 s:shard1 c:testcollection r:core_node5) [n:127.0.0.1:33013_solr c:testcollection s:shard1 r:core_node5 x:testcollection_shard1_replica_n2] o.a.s.c.SolrCore [testcollection_shard1_replica_n2] Registered new searcher Searcher@18d1e34[testcollection_shard1_replica_n2] main{ExitableDirectoryReader(UninvertingDirectoryReader(Uninverting(_0(7.3.0):C1)))}
   [junit4]   2> 1181534 INFO  (qtp6585170-9816) [n:127.0.0.1:33013_solr c:testcollection s:shard1 r:core_node5 x:testcollection_shard1_replica_n2] o.a.s.u.p.LogUpdateProcessorFactory [testcollection_shard1_replica_n2]  webapp=/solr path=/update params={update.distrib=FROMLEADER&waitSearcher=true&openSearcher=true&commit=true&softCommit=false&distrib.from=https://127.0.0.1:33013/solr/testcollection_shard1_replica_n2/&commit_end_point=true&wt=javabin&version=2&expungeDeletes=false}{commit=} 0 7
   [junit4]   2> 1181535 INFO  (qtp6585170-9823) [n:127.0.0.1:33013_solr c:testcollection s:shard1 r:core_node5 x:testcollection_shard1_replica_n2] o.a.s.u.p.LogUpdateProcessorFactory [testcollection_shard1_replica_n2]  webapp=/solr path=/update params={_stateVer_=testcollection:5&commit=true&wt=javabin&version=2}{commit=} 0 13
   [junit4]   2> 1181538 INFO  (qtp6585170-9813) [n:127.0.0.1:33013_solr c:testcollection s:shard2 r:core_node8 x:testcollection_shard2_replica_n6] o.a.s.c.S.Request [testcollection_shard2_replica_n6]  webapp=/solr path=/select params={df=text&distrib=false&_stateVer_=testcollection:5&fl=id&fl=score&shards.purpose=4&start=0&fsv=true&shard.url=https://127.0.0.1:33013/solr/testcollection_shard2_replica_n6/|https://127.0.0.1:39071/solr/testcollection_shard2_replica_n4/&rows=10&version=2&q=*:*&NOW=1517452948700&isShard=true&wt=javabin} hits=0 status=0 QTime=0
   [junit4]   2> 1181539 INFO  (qtp6585170-9878) [n:127.0.0.1:33013_solr c:testcollection s:shard1 r:core_node5 x:testcollection_shard1_replica_n2] o.a.s.c.S.Request [testcollection_shard1_replica_n2]  webapp=/solr path=/select params={df=text&distrib=false&_stateVer_=testcollection:5&fl=id&fl=score&shards.purpose=4&start=0&fsv=true&shard.url=https://127.0.0.1:33013/solr/testcollection_shard1_replica_n2/|https://127.0.0.1:39071/solr/testcollection_shard1_replica_n1/&rows=10&version=2&q=*:*&NOW=1517452948700&isShard=true&wt=javabin} hits=1 status=0 QTime=0
   [junit4]   2> 1181541 INFO  (qtp6585170-9818) [n:127.0.0.1:33013_solr c:testcollection s:shard1 r:core_node5 x:testcollection_shard1_replica_n2] o.a.s.c.S.Request [testcollection_shard1_replica_n2]  webapp=/solr path=/select params={q=*:*&df=text&distrib=false&_stateVer_=testcollection:5&shards.purpose=64&NOW=1517452948700&ids=1&isShard=true&shard.url=https://127.0.0.1:33013/solr/testcollection_shard1_replica_n2/|https://127.0.0.1:39071/solr/testcollection_shard1_replica_n1/&wt=javabin&version=2} status=0 QTime=0
   [junit4]   2> 1181543 INFO  (qtp6585170-9883) [n:127.0.0.1:33013_solr c:testcollection s:shard1 r:core_node5 x:testcollection_shard1_replica_n2] o.a.s.c.S.Request [testcollection_shard1_replica_n2]  webapp=/solr path=/select params={q=*:*&_stateVer_=testcollection:5&wt=javabin&version=2} hits=1 status=0 QTime=6
   [junit4]   2> 1181545 INFO  (qtp6585170-9823) [n:127.0.0.1:33013_solr    ] o.a.s.h.a.CollectionsHandler Invoked Collection Action :delete with params name=testcollection&action=DELETE&wt=javabin&version=2 and sendToOCPQueue=true
   [junit4]   2> 1181548 INFO  (OverseerThreadFactory-4159-thread-2-processing-n:127.0.0.1:33013_solr) [n:127.0.0.1:33013_solr    ] o.a.s.c.a.c.OverseerCollectionMessageHandler Executing Collection Cmd : action=UNLOAD&deleteInstanceDir=true&deleteDataDir=true
   [junit4]   2> 1181548 INFO  (OverseerCollectionConfigSetProcessor-72071756701171717-127.0.0.1:33013_solr-n_0000000000) [n:127.0.0.1:33013_solr    ] o.a.s.c.OverseerTaskQueue Response ZK path: /overseer/collection-queue-work/qnr-0000000000 doesn't exist.  Requestor may have disconnected from ZooKeeper
   [junit4]   2> 1181549 INFO  (qtp8303684-9824) [n:127.0.0.1:39071_solr    ] o.a.s.m.SolrMetricManager Closing metric reporters for registry=solr.core.testcollection.shard2.replica_n4, tag=null
   [junit4]   2> 1181549 INFO  (qtp6585170-9878) [n:127.0.0.1:33013_solr    ] o.a.s.m.SolrMetricManager Closing metric reporters for registry=solr.core.testcollection.shard1.replica_n2, tag=null
   [junit4]   2> 1181549 INFO  (qtp8303684-9824) [n:127.0.0.1:39071_solr    ] o.a.s.m.r.SolrJmxReporter Closing reporter [org.apache.solr.metrics.reporters.SolrJmxReporter@ac6e0d: rootName = solr_39071, domain = solr.core.testcollection.shard2.replica_n4, service url = null, agent id = null] for registry solr.core.testcollection.shard2.replica_n4 / com.codahale.metrics.MetricRegistry@13fdf6
   [junit4]   2> 1181550 INFO  (qtp6585170-9878) [n:127.0.0.1:33013_solr    ] o.a.s.m.r.SolrJmxReporter Closing reporter [org.apache.solr.metrics.reporters.SolrJmxReporter@1b127e5: rootName = solr_33013, domain = solr.core.testcollection.shard1.replica_n2, service url = null, agent id = null] for registry solr.core.testcollection.shard1.replica_n2 / com.codahale.metrics.MetricRegistry@1436db7
   [junit4]   2> 1181572 INFO  (qtp8303684-9880) [n:127.0.0.1:39071_solr    ] o.a.s.m.SolrMetricManager Closing metric reporters for registry=solr.core.testcollection.shard1.replica_n1, tag=null
   [junit4]   2> 1181572 INFO  (qtp8303684-9824) [n:127.0.0.1:39071_solr    ] o.a.s.c.SolrCore [testcollection_shard2_replica_n4]  CLOSING SolrCore org.apache.solr.core.SolrCore@1ffb3b3
   [junit4]   2> 1181572 INFO  (qtp8303684-9880) [n:127.0.0.1:39071_solr    ] o.a.s.m.r.SolrJmxReporter Closing reporter [org.apache.solr.metrics.reporters.SolrJmxReporter@c3e0a8: rootName = solr_39071, domain = solr.core.testcollection.shard1.replica_n1, service url = null, agent id = null] for registry solr.core.testcollection.shard1.replica_n1 / com.codahale.metrics.MetricRegistry@1dbd27d
   [junit4]   2> 1181575 INFO  (qtp6585170-9816) [n:127.0.0.1:33013_solr    ] o.a.s.m.SolrMetricManager Closing metric reporters for registry=solr.core.testcollection.shard2.replica_n6, tag=null
   [junit4]   2> 1181576 INFO  (qtp6585170-9878) [n:127.0.0.1:33013_solr    ] o.a.s.c.SolrCore [testcollection_shard1_replica_n2]  CLOSING SolrCore org.apache.solr.core.SolrCore@77f609
   [junit4]   2> 1181576 INFO  (qtp6585170-9816) [n:127.0.0.1:33013_solr    ] o.a.s.m.r.SolrJmxReporter Closing reporter [org.apache.solr.metrics.reporters.SolrJmxReporter@99f816: rootName = solr_33013, domain = solr.core.testcollection.shard2.replica_n6, service url = null, agent id = null] for registry solr.core.testcollection.shard2.replica_n6 / com.codahale.metrics.MetricRegistry@14e1b7e
   [junit4]   2> 1181596 INFO  (qtp8303684-9824) [n:127.0.0.1:39071_solr    ] o.a.s.m.SolrMetricManager Closing metric reporters for registry=solr.core.testcollection.shard2.replica_n4, tag=33534899
   [junit4]   2> 1181596 INFO  (qtp8303684-9880) [n:127.0.0.1:39071_solr    ] o.a.s.c.SolrCore [testcollection_shard1_replica_n1]  CLOSING SolrCore org.apache.solr.core.SolrCore@2143eb
   [junit4]   2> 1181596 INFO  (qtp8303684-9824) [n:127.0.0.1:39071_solr    ] o.a.s.m.SolrMetricManager Closing metric reporters for registry=solr.collection.testcollection.shard2.leader, tag=33534899
   [junit4]   2> 1181597 INFO  (qtp8303684-9880) [n:127.0.0.1:39071_solr    ] o.a.s.m.SolrMetricManager Closing metric reporters for registry=solr.core.testcollection.shard1.replica_n1, tag=2180075
   [junit4]   2> 1181597 INFO  (qtp8303684-9880) [n:127.0.0.1:39071_solr    ] o.a.s.m.SolrMetricManager Closing metric reporters for registry=solr.collection.testcollection.shard1.leader, tag=2180075
   [junit4]   2> 1181598 INFO  (qtp6585170-9878) [n:127.0.0.1:33013_solr    ] o.a.s.m.SolrMetricManager Closing metric reporters for registry=solr.core.testcollection.shard1.replica_n2, tag=7861769
   [junit4]   2> 1181599 INFO  (qtp6585170-9816) [n:127.0.0.1:33013_solr    ] o.a.s.c.SolrCore [testcollection_shard2_replica_n6]  CLOSING SolrCore org.apache.solr.core.SolrCore@f3bb78
   [junit4]   2> 1181599 INFO  (qtp6585170-9878) [n:127.0.0.1:33013_solr    ] o.a.s.m.SolrMetricManager Closing metric reporters for registry=solr.collection.testcollection.shard1.leader, tag=7861769
   [junit4]   2> 1181599 INFO  (qtp6585170-9816) [n:127.0.0.1:33013_solr    ] o.a.s.m.SolrMetricManager Closing metric reporters for registry=solr.core.testcollection.shard2.replica_n6, tag=15973240
   [junit4]   2> 1181599 INFO  (qtp6585170-9816) [n:127.0.0.1:33013_solr    ] o.a.s.m.SolrMetricManager Closing metric reporters for registry=solr.collection.testcollection.shard2.leader, tag=15973240
   [junit4]   2> 1181600 INFO  (qtp8303684-9824) [n:127.0.0.1:39071_solr    ] o.a.s.c.ShardLeaderElectionContextBase No version found for ephemeral leader parent node, won't remove previous leader registration.
   [junit4]   2> 1181600 INFO  (qtp8303684-9824) [n:127.0.0.1:39071_solr    ] o.a.s.s.HttpSolrCall [admin] webapp=null path=/admin/cores params={deleteInstanceDir=true&core=testcollection_shard2_replica_n4&qt=/admin/cores&deleteDataDir=true&action=UNLOAD&wt=javabin&version=2} status=0 QTime=51
   [junit4]   2> 1181602 INFO  (qtp8303684-9880) [n:127.0.0.1:39071_solr    ] o.a.s.c.ShardLeaderElectionContextBase No version found for ephemeral leader parent node, won't remove previous leader registration.
   [junit4]   2> 1181602 INFO  (qtp6585170-9816) [n:127.0.0.1:33013_solr    ] o.a.s.s.HttpSolrCall [admin] webapp=null path=/admin/cores params={deleteInstanceDir=true&core=testcollection_shard2_replica_n6&qt=/admin/cores&deleteDataDir=true&action=UNLOAD&wt=javabin&version=2} status=0 QTime=52
   [junit4]   2> 1181603 INFO  (qtp8303684-9880) [n:127.0.0.1:39071_solr    ] o.a.s.s.HttpSolrCall [admin] webapp=null path=/admin/cores params={deleteInstanceDir=true&core=testcollection_shard1_replica_n1&qt=/admin/cores&deleteDataDir=true&action=UNLOAD&wt=javabin&version=2} status=0 QTime=54
   [junit4]   2> 1181603 WARN  (zkCallback-1874-thread-3-processing-n:127.0.0.1:39071_solr) [n:127.0.0.1:39071_solr    ] o.a.s.c.LeaderElector Our node is no longer in line to be leader
   [junit4]   2> 1181603 WARN  (zkCallback-1874-thread-1-processing-n:127.0.0.1:39071_solr) [n:127.0.0.1:39071_solr    ] o.a.s.c.LeaderElector Our node is no longer in line to be leader
   [junit4]   2> 1181604 INFO  (qtp6585170-9878) [n:127.0.0.1:33013_solr    ] o.a.s.s.HttpSolrCall [admin] webapp=null path=/admin/cores params={deleteInstanceDir=true&core=testcollection_shard1_replica_n2&qt=/admin/cores&deleteDataDir=true&action=UNLOAD&wt=javabin&version=2} status=0 QTime=55
   [junit4]   2> 1182316 INFO  (qtp6585170-9823) [n:127.0.0.1:33013_solr    ] o.a.s.s.HttpSolrCall [admin] webapp=null path=/admin/collections params={name=testcollection&action=DELETE&wt=javabin&version=2} status=0 QTime=771
   [junit4]   2> 1182318 INFO  (TEST-TestAuthenticationFramework.testBasics-seed#[C401B50A945DEFFE]) [    ] o.a.s.c.AbstractDistribZkTestBase Wait for collection to disappear - collection: testcollection failOnTimeout:true timeout (sec):330
   [junit4]   1> -
   [junit4]   2> 1182318 INFO  (TEST-TestAuthenticationFramework.testBasics-seed#[C401B50A945DEFFE]) [    ] o.a.s.c.AbstractDistribZkTestBase Collection has disappeared - collection: testcollection
   [junit4]   2> 1182320 INFO  (qtp6585170-9883) [n:127.0.0.1:33013_solr    ] o.a.s.h.a.CollectionsHandler Invoked Collection Action :create with params replicationFactor=2&collection.configName=solrCloudCollectionConfig&maxShardsPerNode=2&name=testcollection&nrtReplicas=2&action=CREATE&numShards=2&wt=javabin&version=2 and sendToOCPQueue=true
   [junit4]   2> 1182322 INFO  (OverseerThreadFactory-4159-thread-3-processing-n:127.0.0.1:33013_solr) [n:127.0.0.1:33013_solr    ] o.a.s.c.a.c.CreateCollectionCmd Create collection testcollection
   [junit4]   2> 1182322 INFO  (OverseerCollectionConfigSetProcessor-72071756701171717-127.0.0.1:33013_solr-n_0000000000) [n:127.0.0.1:33013_solr    ] o.a.s.c.OverseerTaskQueue Response ZK path: /overseer/collection-queue-work/qnr-0000000002 doesn't exist.  Requestor may have disconnected from ZooKeeper
   [junit4]   2> 1182539 INFO  (OverseerStateUpdate-72071756701171717-127.0.0.1:33013_solr-n_0000000000) [n:127.0.0.1:33013_solr    ] o.a.s.c.o.SliceMutator createReplica() {
   [junit4]   2>   "operation":"ADDREPLICA",
   [junit4]   2>   "collection":"testcollection",
   [junit4]   2>   "shard":"shard1",
   [junit4]   2>   "core":"testcollection_shard1_replica_n1",
   [junit4]   2>   "state":"down",
   [junit4]   2>   "base_url":"https://127.0.0.1:39071/solr",
   [junit4]   2>   "type":"NRT",
   [junit4]   2>   "waitForFinalState":"false"} 
   [junit4]   2> 1182544 INFO  (OverseerStateUpdate-72071756701171717-127.0.0.1:33013_solr-n_0000000000) [n:127.0.0.1:33013_solr    ] o.a.s.c.o.SliceMutator createReplica() {
   [junit4]   2>   "operation":"ADDREPLICA",
   [junit4]   2>   "collection":"testcollection",
   [junit4]   2>   "shard":"shard1",
   [junit4]   2>   "core":"testcollection_shard1_replica_n3",
   [junit4]   2>   "state":"down",
   [junit4]   2>   "base_url":"https://127.0.0.1:33013/solr",
   [junit4]   2>   "type":"NRT",
   [junit4]   2>   "waitForFinalState":"false"} 
   [junit4]   2> 1182550 INFO  (OverseerStateUpdate-72071756701171717-127.0.0.1:33013_solr-n_0000000000) [n:127.0.0.1:33013_solr    ] o.a.s.c.o.SliceMutator createReplica() {
   [junit4]   2>   "operation":"ADDREPLICA",
   [junit4]   2>   "collection":"testcollection",
   [junit4]   2>   "shard":"shard2",
   [junit4]   2>   "core":"testcollection_shard2_replica_n4",
   [junit4]   2>   "state":"down",
   [junit4]   2>   "base_url":"https://127.0.0.1:39071/solr",
   [junit4]   2>   "type":"NRT",
   [junit4]   2>   "waitForFinalState":"false"} 
   [junit4]   2> 1182563 INFO  (OverseerStateUpdate-72071756701171717-127.0.0.1:33013_solr-n_0000000000) [n:127.0.0.1:33013_solr    ] o.a.s.c.o.SliceMutator createReplica() {
   [junit4]   2>   "operation":"ADDREPLICA",
   [junit4]   2>   "collection":"testcollection",
   [junit4]   2>   "shard":"shard2",
   [junit4]   2>   "core":"testcollection_shard2_replica_n7",
   [junit4]   2>   "state":"down",
   [junit4]   2>   "base_url":"https://127.0.0.1:33013/solr",
   [junit4]   2>   "type":"NRT",
   [junit4]   2>   "waitForFinalState":"false"} 
   [junit4]   2> 1182767 INFO  (qtp8303684-9820) [n:127.0.0.1:39071_solr    ] o.a.s.h.a.CoreAdminOperation core create command qt=/admin/cores&coreNodeName=core_node2&collection.configName=solrCloudCollectionConfig&newCollection=true&name=testcollection_shard1_replica_n1&action=CREATE&numShards=2&collection=testcollection&shard=shard1&wt=javabin&version=2&replicaType=NRT
   [junit4]   2> 1182767 INFO  (qtp6585170-9813) [n:127.0.0.1:33013_solr    ] o.a.s.h.a.CoreAdminOperation core create command qt=/admin/cores&coreNodeName=core_node8&collection.configName=solrCloudCollectionConfig&newCollection=true&name=testcollection_shard2_replica_n7&action=CREATE&numShards=2&collection=testcollection&shard=shard2&wt=javabin&version=2&replicaType=NRT
   [junit4]   2> 1182767 INFO  (qtp8303684-9812) [n:127.0.0.1:39071_solr    ] o.a.s.h.a.CoreAdminOperation core create command qt=/admin/cores&coreNodeName=core_node6&collection.configName=solrCloudCollectionConfig&newCollection=true&name=testcollection_shard2_replica_n4&action=CREATE&numShards=2&collection=testcollection&shard=shard2&wt=javabin&version=2&replicaType=NRT
   [junit4]   2> 1182767 INFO  (qtp6585170-9818) [n:127.0.0.1:33013_solr    ] o.a.s.h.a.CoreAdminOperation core create command qt=/admin/cores&coreNodeName=core_node5&collection.configName=solrCloudCollectionConfig&newCollection=true&name=testcollection_shard1_replica_n3&action=CREATE&numShards=2&collection=testcollection&shard=shard1&wt=javabin&version=2&replicaType=NRT
   [junit4]   2> 1182874 INFO  (zkCallback-1874-thread-3-processing-n:127.0.0.1:39071_solr) [n:127.0.0.1:39071_solr    ] o.a.s.c.c.ZkStateReader A cluster state change: [WatchedEvent state:SyncConnected type:NodeDataChanged path:/collections/testcollection/state.json] for collection [testcollection] has occurred - updating... (live nodes size: [2])
   [junit4]   2> 1182875 INFO  (zkCallback-1874-thread-1-processing-n:127.0.0.1:39071_solr) [n:127.0.0.1:39071_solr    ] o.a.s.c.c.ZkStateReader A cluster state change: [WatchedEvent state:SyncConnected type:NodeDataChanged path:/collections/testcollection/state.json] for collection [testcollection] has occurred - updating... (live nodes size: [2])
   [junit4]   2> 1182876 INFO  (zkCallback-1872-thread-1-processing-n:127.0.0.1:33013_solr) [n:127.0.0.1:33013_solr    ] o.a.s.c.c.ZkStateReader A cluster state change: [WatchedEvent state:SyncConnected type:NodeDataChanged path:/collections/testcollection/state.json] for collection [testcollection] has occurred - updating... (live nodes size: [2])
   [junit4]   2> 1182876 INFO  (zkCallback-1872-thread-2-processing-n:127.0.0.1:33013_solr) [n:127.0.0.1:33013_solr    ] o.a.s.c.c.ZkStateReader A cluster state change: [WatchedEvent state:SyncConnected type:NodeDataChanged path:/collections/testcollection/state.json] for collection [testcollection] has occurred - updating... (live nodes size: [2])
   [junit4]   2> 1182876 INFO  (zkCallback-1872-thread-3-processing-n:127.0.0.1:33013_solr) [n:127.0.0.1:33013_solr    ] o.a.s.c.c.ZkStateReader A cluster state change: [WatchedEvent state:SyncConnected type:NodeDataChanged path:/collections/testcollection/state.json] for collection [testcollection] has occurred - updating... (live nodes size: [2])
   [junit4]   2> 1183796 INFO  (qtp8303684-9820) [n:127.0.0.1:39071_solr c:testcollection s:shard1 r:core_node2 x:testcollection_shard1_replica_n1] o.a.s.c.SolrConfig Using Lucene MatchVersion: 7.3.0
   [junit4]   2> 1183796 INFO  (qtp8303684-9812) [n:127.0.0.1:39071_solr c:testcollection s:shard2 r:core_node6 x:testcollection_shard2_replica_n4] o.a.s.c.SolrConfig Using Lucene MatchVersion: 7.3.0
   [junit4]   2> 1183796 INFO  (qtp6585170-9813) [n:127.0.0.1:33013_solr c:testcollection s:shard2 r:core_node8 x:testcollection_shard2_replica_n7] o.a.s.c.SolrConfig Using Lucene MatchVersion: 7.3.0
   [junit4]   2> 1183929 INFO  (qtp6585170-9818) [n:127.0.0.1:33013_solr c:testcollection s:shard1 r:core_node5 x:testcollection_shard1_replica_n3] o.a.s.c.SolrConfig Using Lucene MatchVersion: 7.3.0
   [junit4]   2> 1183938 INFO  (qtp8303684-9812) [n:127.0.0.1:39071_solr c:testcollection s:shard2 r:core_node6 x:testcollection_shard2_replica_n4] o.a.s.s.IndexSchema [testcollection_shard2_replica_n4] Schema name=minimal
   [junit4]   2> 1183942 INFO  (qtp8303684-9812) [n:127.0.0.1:39071_solr c:testcollection s:shard2 r:core_node6 x:testcollection_shard2_replica_n4] o.a.s.s.IndexSchema Loaded schema minimal/1.1 with uniqueid field id
   [junit4]   2> 1183943 INFO  (qtp8303684-9812) [n:127.0.0.1:39071_solr c:testcollection s:shard2 r:core_node6 x:testcollection_shard2_replica_n4] o.a.s.c.CoreContainer Creating Sol

[...truncated too long message...]

nit4]   2> 1369587 ERROR (TEST-SyncSliceTest.test-seed#[C401B50A945DEFFE]) [    ] o.a.z.s.ZooKeeperServer ZKShutdownHandler is not registered, so ZooKeeper server won't take any action on ERROR or SHUTDOWN server state changes
   [junit4]   2> 1369588 INFO  (TEST-SyncSliceTest.test-seed#[C401B50A945DEFFE]) [    ] o.a.s.c.ZkTestServer connecting to 127.0.0.1:36627 36627
   [junit4]   2> 1379777 INFO  (Thread-2100) [    ] o.a.s.c.ZkTestServer connecting to 127.0.0.1:36627 36627
   [junit4]   2> 1379778 WARN  (Thread-2100) [    ] o.a.s.c.ZkTestServer Watch limit violations: 
   [junit4]   2> Maximum concurrent create/delete watches above limit:
   [junit4]   2> 
   [junit4]   2> 	15	/solr/collections/collection1/terms/shard1
   [junit4]   2> 	8	/solr/aliases.json
   [junit4]   2> 	6	/solr/security.json
   [junit4]   2> 	6	/solr/configs/conf1
   [junit4]   2> 	2	/solr/collections/control_collection/terms/shard1
   [junit4]   2> 
   [junit4]   2> Maximum concurrent data watches above limit:
   [junit4]   2> 
   [junit4]   2> 	8	/solr/clusterprops.json
   [junit4]   2> 	8	/solr/clusterstate.json
   [junit4]   2> 	5	/solr/collections/collection1/state.json
   [junit4]   2> 	3	/solr/overseer_elect/election/72071764630634500-127.0.0.1:45671_-n_0000000000
   [junit4]   2> 	3	/solr/autoscaling.json
   [junit4]   2> 
   [junit4]   2> Maximum concurrent children watches above limit:
   [junit4]   2> 
   [junit4]   2> 	8	/solr/live_nodes
   [junit4]   2> 	8	/solr/collections
   [junit4]   2> 	3	/solr/overseer/queue
   [junit4]   2> 	3	/solr/overseer/collection-queue-work
   [junit4]   2> 	3	/solr/overseer/queue-work
   [junit4]   2> 	2	/solr/autoscaling/events/.auto_add_replicas
   [junit4]   2> 
   [junit4]   2> 1379779 INFO  (SUITE-SyncSliceTest-seed#[C401B50A945DEFFE]-worker) [    ] o.a.s.SolrTestCaseJ4 ------------------------------------------------------- Done waiting for tracked resources to be released
   [junit4]   2> Feb 01, 2018 2:45:47 AM com.carrotsearch.randomizedtesting.ThreadLeakControl checkThreadLeaks
   [junit4]   2> WARNING: Will linger awaiting termination of 1 leaked thread(s).
   [junit4]   2> Feb 01, 2018 2:46:07 AM com.carrotsearch.randomizedtesting.ThreadLeakControl checkThreadLeaks
   [junit4]   2> SEVERE: 1 thread leaked from SUITE scope at org.apache.solr.cloud.SyncSliceTest: 
   [junit4]   2>    1) Thread[id=10387, name=qtp28730764-10387, state=TIMED_WAITING, group=TGRP-SyncSliceTest]
   [junit4]   2>         at sun.misc.Unsafe.park(Native Method)
   [junit4]   2>         at java.util.concurrent.locks.LockSupport.parkNanos(LockSupport.java:215)
   [junit4]   2>         at java.util.concurrent.locks.AbstractQueuedSynchronizer$ConditionObject.await(AbstractQueuedSynchronizer.java:2163)
   [junit4]   2>         at org.eclipse.jetty.util.thread.ReservedThreadExecutor$ReservedThread.reservedWait(ReservedThreadExecutor.java:308)
   [junit4]   2>         at org.eclipse.jetty.util.thread.ReservedThreadExecutor$ReservedThread.run(ReservedThreadExecutor.java:373)
   [junit4]   2>         at org.eclipse.jetty.util.thread.QueuedThreadPool.runJob(QueuedThreadPool.java:708)
   [junit4]   2>         at org.eclipse.jetty.util.thread.QueuedThreadPool$2.run(QueuedThreadPool.java:626)
   [junit4]   2>         at java.lang.Thread.run(Thread.java:748)
   [junit4]   2> Feb 01, 2018 2:46:07 AM com.carrotsearch.randomizedtesting.ThreadLeakControl tryToInterruptAll
   [junit4]   2> INFO: Starting to interrupt leaked threads:
   [junit4]   2>    1) Thread[id=10387, name=qtp28730764-10387, state=TIMED_WAITING, group=TGRP-SyncSliceTest]
   [junit4]   2> Feb 01, 2018 2:46:10 AM com.carrotsearch.randomizedtesting.ThreadLeakControl tryToInterruptAll
   [junit4]   2> SEVERE: There are still zombie threads that couldn't be terminated:
   [junit4]   2>    1) Thread[id=10387, name=qtp28730764-10387, state=TIMED_WAITING, group=TGRP-SyncSliceTest]
   [junit4]   2>         at sun.misc.Unsafe.park(Native Method)
   [junit4]   2>         at java.util.concurrent.locks.LockSupport.parkNanos(LockSupport.java:215)
   [junit4]   2>         at java.util.concurrent.locks.AbstractQueuedSynchronizer$ConditionObject.await(AbstractQueuedSynchronizer.java:2163)
   [junit4]   2>         at org.eclipse.jetty.util.thread.ReservedThreadExecutor$ReservedThread.reservedWait(ReservedThreadExecutor.java:308)
   [junit4]   2>         at org.eclipse.jetty.util.thread.ReservedThreadExecutor$ReservedThread.run(ReservedThreadExecutor.java:373)
   [junit4]   2>         at org.eclipse.jetty.util.thread.QueuedThreadPool.runJob(QueuedThreadPool.java:708)
   [junit4]   2>         at org.eclipse.jetty.util.thread.QueuedThreadPool$2.run(QueuedThreadPool.java:626)
   [junit4]   2>         at java.lang.Thread.run(Thread.java:748)
   [junit4]   2> NOTE: test params are: codec=CheapBastard, sim=RandomSimilarity(queryNorm=false): {}, locale=sr-Latn-RS, timezone=America/Lower_Princes
   [junit4]   2> NOTE: Linux 4.13.0-32-generic i386/Oracle Corporation 1.8.0_144 (32-bit)/cpus=8,threads=2,free=297818752,total=536870912
   [junit4]   2> NOTE: All tests run in this JVM: [BadCopyFieldTest, CdcrVersionReplicationTest, TestPivotHelperCode, ResourceLoaderTest, TestPullReplicaErrorHandling, TestRestManager, TestDocBasedVersionConstraints, TestLargeCluster, TestMissingGroups, IgnoreCommitOptimizeUpdateProcessorFactoryTest, TestXIncludeConfig, TestFieldResource, TestQueryWrapperFilter, DirectoryFactoryTest, TestFoldingMultitermQuery, ZkControllerTest, BasicFunctionalityTest, RestartWhileUpdatingTest, TestComplexPhraseQParserPlugin, SliceStateTest, TestFastLRUCache, SpatialHeatmapFacetsTest, MergeStrategyTest, ShardSplitTest, SystemInfoHandlerTest, SchemaVersionSpecificBehaviorTest, TestZkChroot, DocumentBuilderTest, TestSolrIndexConfig, SolrJmxReporterTest, TestObjectReleaseTracker, TestSQLHandlerNonCloud, PeerSyncReplicationTest, BasicZkTest, TestSchemaVersionResource, TestSchemaNameResource, TestJettySolrRunner, TestSimpleTextCodec, SOLR749Test, TestSimpleTrackingShardHandler, HdfsRestartWhileUpdatingTest, TestCoreBackup, ExecutePlanActionTest, TestCollationFieldDocValues, TestBulkSchemaConcurrent, HdfsTlogReplayBufferedWhileIndexingTest, TestTrie, TestSha256AuthenticationProvider, ZkShardTermsTest, TestConfigSetsAPIExclusivity, TestJavabinTupleStreamParser, TestSegmentSorting, TestRecovery, DistribJoinFromCollectionTest, BasicAuthIntegrationTest, HighlighterTest, SmileWriterTest, PrimitiveFieldTypeTest, StressHdfsTest, RequiredFieldsTest, PolyFieldTest, PropertiesRequestHandlerTest, TestSolrJ, FastVectorHighlighterTest, BlockDirectoryTest, SuggesterTest, QueryEqualityTest, TestOrdValues, TriLevelCompositeIdRoutingTest, SolrMetricManagerTest, TestXmlQParser, TestLRUCache, SignatureUpdateProcessorFactoryTest, TestReload, TestLegacyTerms, TestFuzzyAnalyzedSuggestions, TestFilteredDocIdSet, TestSystemCollAutoCreate, InfixSuggestersTest, SolrShardReporterTest, TestScoreJoinQPNoScore, ExplicitHLLTest, SolrCoreTest, OverriddenZkACLAndCredentialsProvidersTest, ClassificationUpdateProcessorTest, DataDrivenBlockJoinTest, ResponseHeaderTest, TestExportWriter, OverseerTest, TestSolr4Spatial, TestStandardQParsers, SyncSliceTest]
   [junit4]   2> NOTE: reproduce with: ant test  -Dtestcase=SyncSliceTest -Dtests.seed=C401B50A945DEFFE -Dtests.multiplier=3 -Dtests.slow=true -Dtests.locale=sr-Latn-RS -Dtests.timezone=America/Lower_Princes -Dtests.asserts=true -Dtests.file.encoding=UTF-8
   [junit4] ERROR   0.00s J1 | SyncSliceTest (suite) <<<
   [junit4]    > Throwable #1: com.carrotsearch.randomizedtesting.ThreadLeakError: 1 thread leaked from SUITE scope at org.apache.solr.cloud.SyncSliceTest: 
   [junit4]    >    1) Thread[id=10387, name=qtp28730764-10387, state=TIMED_WAITING, group=TGRP-SyncSliceTest]
   [junit4]    >         at sun.misc.Unsafe.park(Native Method)
   [junit4]    >         at java.util.concurrent.locks.LockSupport.parkNanos(LockSupport.java:215)
   [junit4]    >         at java.util.concurrent.locks.AbstractQueuedSynchronizer$ConditionObject.await(AbstractQueuedSynchronizer.java:2163)
   [junit4]    >         at org.eclipse.jetty.util.thread.ReservedThreadExecutor$ReservedThread.reservedWait(ReservedThreadExecutor.java:308)
   [junit4]    >         at org.eclipse.jetty.util.thread.ReservedThreadExecutor$ReservedThread.run(ReservedThreadExecutor.java:373)
   [junit4]    >         at org.eclipse.jetty.util.thread.QueuedThreadPool.runJob(QueuedThreadPool.java:708)
   [junit4]    >         at org.eclipse.jetty.util.thread.QueuedThreadPool$2.run(QueuedThreadPool.java:626)
   [junit4]    >         at java.lang.Thread.run(Thread.java:748)
   [junit4]    > 	at __randomizedtesting.SeedInfo.seed([C401B50A945DEFFE]:0)Throwable #2: com.carrotsearch.randomizedtesting.ThreadLeakError: There are still zombie threads that couldn't be terminated:
   [junit4]    >    1) Thread[id=10387, name=qtp28730764-10387, state=TIMED_WAITING, group=TGRP-SyncSliceTest]
   [junit4]    >         at sun.misc.Unsafe.park(Native Method)
   [junit4]    >         at java.util.concurrent.locks.LockSupport.parkNanos(LockSupport.java:215)
   [junit4]    >         at java.util.concurrent.locks.AbstractQueuedSynchronizer$ConditionObject.await(AbstractQueuedSynchronizer.java:2163)
   [junit4]    >         at org.eclipse.jetty.util.thread.ReservedThreadExecutor$ReservedThread.reservedWait(ReservedThreadExecutor.java:308)
   [junit4]    >         at org.eclipse.jetty.util.thread.ReservedThreadExecutor$ReservedThread.run(ReservedThreadExecutor.java:373)
   [junit4]    >         at org.eclipse.jetty.util.thread.QueuedThreadPool.runJob(QueuedThreadPool.java:708)
   [junit4]    >         at org.eclipse.jetty.util.thread.QueuedThreadPool$2.run(QueuedThreadPool.java:626)
   [junit4]    >         at java.lang.Thread.run(Thread.java:748)
   [junit4]    > 	at __randomizedtesting.SeedInfo.seed([C401B50A945DEFFE]:0)
   [junit4] Completed [318/773 (2!)] on J1 in 104.56s, 1 test, 2 errors <<< FAILURES!

[...truncated 45397 lines...]

Mime
View raw message