lucene-dev mailing list archives

Site index · List index
Message view « Date » · « Thread »
Top « Date » · « Thread »
From Apache Jenkins Server <jenk...@builds.apache.org>
Subject [JENKINS] Lucene-Solr-NightlyTests-master - Build # 1466 - Still unstable
Date Thu, 01 Feb 2018 22:48:48 GMT
Build: https://builds.apache.org/job/Lucene-Solr-NightlyTests-master/1466/

14 tests failed.
FAILED:  org.apache.lucene.codecs.simpletext.TestSimpleTextPostingsFormat.testDocsAndFreqsAndPositionsAndOffsetsAndPayloads

Error Message:
Captured an uncaught exception in thread: Thread[id=36, name=Thread-24, state=RUNNABLE, group=TGRP-TestSimpleTextPostingsFormat]

Stack Trace:
com.carrotsearch.randomizedtesting.UncaughtExceptionError: Captured an uncaught exception in thread: Thread[id=36, name=Thread-24, state=RUNNABLE, group=TGRP-TestSimpleTextPostingsFormat]
Caused by: java.lang.RuntimeException: java.lang.AssertionError: position is wrong expected:<0> but was:<-1>
	at __randomizedtesting.SeedInfo.seed([305C644F49CC26AA]:0)
	at org.apache.lucene.index.RandomPostingsTester$TestThread.run(RandomPostingsTester.java:1208)
Caused by: java.lang.AssertionError: position is wrong expected:<0> but was:<-1>
	at org.junit.Assert.fail(Assert.java:93)
	at org.junit.Assert.failNotEquals(Assert.java:647)
	at org.junit.Assert.assertEquals(Assert.java:128)
	at org.junit.Assert.assertEquals(Assert.java:472)
	at org.apache.lucene.index.RandomPostingsTester.verifyEnum(RandomPostingsTester.java:1099)
	at org.apache.lucene.index.RandomPostingsTester.testTermsOneThread(RandomPostingsTester.java:1330)
	at org.apache.lucene.index.RandomPostingsTester.access$100(RandomPostingsTester.java:65)
	at org.apache.lucene.index.RandomPostingsTester$TestThread.run(RandomPostingsTester.java:1206)


FAILED:  org.apache.lucene.codecs.simpletext.TestSimpleTextPostingsFormat.testDocsAndFreqsAndPositionsAndOffsets

Error Message:
Captured an uncaught exception in thread: Thread[id=57, name=Thread-45, state=RUNNABLE, group=TGRP-TestSimpleTextPostingsFormat]

Stack Trace:
com.carrotsearch.randomizedtesting.UncaughtExceptionError: Captured an uncaught exception in thread: Thread[id=57, name=Thread-45, state=RUNNABLE, group=TGRP-TestSimpleTextPostingsFormat]
Caused by: java.lang.RuntimeException: java.lang.AssertionError: position is wrong expected:<2> but was:<-1>
	at __randomizedtesting.SeedInfo.seed([305C644F49CC26AA]:0)
	at org.apache.lucene.index.RandomPostingsTester$TestThread.run(RandomPostingsTester.java:1208)
Caused by: java.lang.AssertionError: position is wrong expected:<2> but was:<-1>
	at org.junit.Assert.fail(Assert.java:93)
	at org.junit.Assert.failNotEquals(Assert.java:647)
	at org.junit.Assert.assertEquals(Assert.java:128)
	at org.junit.Assert.assertEquals(Assert.java:472)
	at org.apache.lucene.index.RandomPostingsTester.verifyEnum(RandomPostingsTester.java:1099)
	at org.apache.lucene.index.RandomPostingsTester.testTermsOneThread(RandomPostingsTester.java:1330)
	at org.apache.lucene.index.RandomPostingsTester.access$100(RandomPostingsTester.java:65)
	at org.apache.lucene.index.RandomPostingsTester$TestThread.run(RandomPostingsTester.java:1206)


FAILED:  org.apache.lucene.codecs.simpletext.TestSimpleTextPostingsFormat.testDocsAndFreqsAndPositions

Error Message:
Captured an uncaught exception in thread: Thread[id=75, name=Thread-63, state=RUNNABLE, group=TGRP-TestSimpleTextPostingsFormat]

Stack Trace:
com.carrotsearch.randomizedtesting.UncaughtExceptionError: Captured an uncaught exception in thread: Thread[id=75, name=Thread-63, state=RUNNABLE, group=TGRP-TestSimpleTextPostingsFormat]
Caused by: java.lang.RuntimeException: java.lang.AssertionError: position is wrong expected:<0> but was:<-1>
	at __randomizedtesting.SeedInfo.seed([305C644F49CC26AA]:0)
	at org.apache.lucene.index.RandomPostingsTester$TestThread.run(RandomPostingsTester.java:1208)
Caused by: java.lang.AssertionError: position is wrong expected:<0> but was:<-1>
	at org.junit.Assert.fail(Assert.java:93)
	at org.junit.Assert.failNotEquals(Assert.java:647)
	at org.junit.Assert.assertEquals(Assert.java:128)
	at org.junit.Assert.assertEquals(Assert.java:472)
	at org.apache.lucene.index.RandomPostingsTester.verifyEnum(RandomPostingsTester.java:1099)
	at org.apache.lucene.index.RandomPostingsTester.testTermsOneThread(RandomPostingsTester.java:1330)
	at org.apache.lucene.index.RandomPostingsTester.access$100(RandomPostingsTester.java:65)
	at org.apache.lucene.index.RandomPostingsTester$TestThread.run(RandomPostingsTester.java:1206)


FAILED:  org.apache.lucene.codecs.simpletext.TestSimpleTextPostingsFormat.testRandom

Error Message:
Captured an uncaught exception in thread: Thread[id=82, name=Thread-70, state=RUNNABLE, group=TGRP-TestSimpleTextPostingsFormat]

Stack Trace:
com.carrotsearch.randomizedtesting.UncaughtExceptionError: Captured an uncaught exception in thread: Thread[id=82, name=Thread-70, state=RUNNABLE, group=TGRP-TestSimpleTextPostingsFormat]
Caused by: java.lang.RuntimeException: java.lang.AssertionError: position is wrong expected:<0> but was:<-1>
	at __randomizedtesting.SeedInfo.seed([305C644F49CC26AA]:0)
	at org.apache.lucene.index.RandomPostingsTester$TestThread.run(RandomPostingsTester.java:1208)
Caused by: java.lang.AssertionError: position is wrong expected:<0> but was:<-1>
	at org.junit.Assert.fail(Assert.java:93)
	at org.junit.Assert.failNotEquals(Assert.java:647)
	at org.junit.Assert.assertEquals(Assert.java:128)
	at org.junit.Assert.assertEquals(Assert.java:472)
	at org.apache.lucene.index.RandomPostingsTester.verifyEnum(RandomPostingsTester.java:1099)
	at org.apache.lucene.index.RandomPostingsTester.testTermsOneThread(RandomPostingsTester.java:1330)
	at org.apache.lucene.index.RandomPostingsTester.access$100(RandomPostingsTester.java:65)
	at org.apache.lucene.index.RandomPostingsTester$TestThread.run(RandomPostingsTester.java:1206)


FAILED:  org.apache.lucene.codecs.simpletext.TestSimpleTextPostingsFormat.testDocsAndFreqsAndPositionsAndPayloads

Error Message:
Captured an uncaught exception in thread: Thread[id=141, name=Thread-129, state=RUNNABLE, group=TGRP-TestSimpleTextPostingsFormat]

Stack Trace:
com.carrotsearch.randomizedtesting.UncaughtExceptionError: Captured an uncaught exception in thread: Thread[id=141, name=Thread-129, state=RUNNABLE, group=TGRP-TestSimpleTextPostingsFormat]
Caused by: java.lang.RuntimeException: java.lang.AssertionError: position is wrong expected:<0> but was:<-1>
	at __randomizedtesting.SeedInfo.seed([305C644F49CC26AA]:0)
	at org.apache.lucene.index.RandomPostingsTester$TestThread.run(RandomPostingsTester.java:1208)
Caused by: java.lang.AssertionError: position is wrong expected:<0> but was:<-1>
	at org.junit.Assert.fail(Assert.java:93)
	at org.junit.Assert.failNotEquals(Assert.java:647)
	at org.junit.Assert.assertEquals(Assert.java:128)
	at org.junit.Assert.assertEquals(Assert.java:472)
	at org.apache.lucene.index.RandomPostingsTester.verifyEnum(RandomPostingsTester.java:1099)
	at org.apache.lucene.index.RandomPostingsTester.testTermsOneThread(RandomPostingsTester.java:1330)
	at org.apache.lucene.index.RandomPostingsTester.access$100(RandomPostingsTester.java:65)
	at org.apache.lucene.index.RandomPostingsTester$TestThread.run(RandomPostingsTester.java:1206)


FAILED:  junit.framework.TestSuite.org.apache.lucene.codecs.simpletext.TestSimpleTextPostingsFormat

Error Message:
The test or suite printed 102728 bytes to stdout and stderr, even though the limit was set to 8192 bytes. Increase the limit with @Limit, ignore it completely with @SuppressSysoutChecks or run with -Dtests.verbose=true

Stack Trace:
java.lang.AssertionError: The test or suite printed 102728 bytes to stdout and stderr, even though the limit was set to 8192 bytes. Increase the limit with @Limit, ignore it completely with @SuppressSysoutChecks or run with -Dtests.verbose=true
	at __randomizedtesting.SeedInfo.seed([305C644F49CC26AA]:0)
	at org.apache.lucene.util.TestRuleLimitSysouts.afterIfSuccessful(TestRuleLimitSysouts.java:211)
	at com.carrotsearch.randomizedtesting.rules.TestRuleAdapter$1.afterIfSuccessful(TestRuleAdapter.java:36)
	at com.carrotsearch.randomizedtesting.rules.StatementAdapter.evaluate(StatementAdapter.java:37)
	at org.apache.lucene.util.TestRuleAssertionsRequired$1.evaluate(TestRuleAssertionsRequired.java:53)
	at org.apache.lucene.util.TestRuleMarkFailure$1.evaluate(TestRuleMarkFailure.java:47)
	at org.apache.lucene.util.TestRuleIgnoreAfterMaxFailures$1.evaluate(TestRuleIgnoreAfterMaxFailures.java:64)
	at org.apache.lucene.util.TestRuleIgnoreTestSuites$1.evaluate(TestRuleIgnoreTestSuites.java:54)
	at com.carrotsearch.randomizedtesting.rules.StatementAdapter.evaluate(StatementAdapter.java:36)
	at com.carrotsearch.randomizedtesting.ThreadLeakControl$StatementRunner.run(ThreadLeakControl.java:368)
	at java.lang.Thread.run(Thread.java:748)


FAILED:  org.apache.solr.cloud.AliasIntegrationTest.testModifyMetadataCAR

Error Message:


Stack Trace:
java.lang.AssertionError
	at __randomizedtesting.SeedInfo.seed([4A7B1ECF67D5A9F6:56295F84DA0E09AE]:0)
	at org.junit.Assert.fail(Assert.java:92)
	at org.junit.Assert.assertTrue(Assert.java:43)
	at org.junit.Assert.assertTrue(Assert.java:54)
	at org.apache.solr.cloud.AliasIntegrationTest.checkFooAndBarMeta(AliasIntegrationTest.java:283)
	at org.apache.solr.cloud.AliasIntegrationTest.testModifyMetadataCAR(AliasIntegrationTest.java:262)
	at sun.reflect.NativeMethodAccessorImpl.invoke0(Native Method)
	at sun.reflect.NativeMethodAccessorImpl.invoke(NativeMethodAccessorImpl.java:62)
	at sun.reflect.DelegatingMethodAccessorImpl.invoke(DelegatingMethodAccessorImpl.java:43)
	at java.lang.reflect.Method.invoke(Method.java:498)
	at com.carrotsearch.randomizedtesting.RandomizedRunner.invoke(RandomizedRunner.java:1737)
	at com.carrotsearch.randomizedtesting.RandomizedRunner$8.evaluate(RandomizedRunner.java:934)
	at com.carrotsearch.randomizedtesting.RandomizedRunner$9.evaluate(RandomizedRunner.java:970)
	at com.carrotsearch.randomizedtesting.RandomizedRunner$10.evaluate(RandomizedRunner.java:984)
	at com.carrotsearch.randomizedtesting.rules.SystemPropertiesRestoreRule$1.evaluate(SystemPropertiesRestoreRule.java:57)
	at org.apache.lucene.util.TestRuleSetupTeardownChained$1.evaluate(TestRuleSetupTeardownChained.java:49)
	at org.apache.lucene.util.AbstractBeforeAfterRule$1.evaluate(AbstractBeforeAfterRule.java:45)
	at org.apache.lucene.util.TestRuleThreadAndTestName$1.evaluate(TestRuleThreadAndTestName.java:48)
	at org.apache.lucene.util.TestRuleIgnoreAfterMaxFailures$1.evaluate(TestRuleIgnoreAfterMaxFailures.java:64)
	at org.apache.lucene.util.TestRuleMarkFailure$1.evaluate(TestRuleMarkFailure.java:47)
	at com.carrotsearch.randomizedtesting.rules.StatementAdapter.evaluate(StatementAdapter.java:36)
	at com.carrotsearch.randomizedtesting.ThreadLeakControl$StatementRunner.run(ThreadLeakControl.java:368)
	at com.carrotsearch.randomizedtesting.ThreadLeakControl.forkTimeoutingTask(ThreadLeakControl.java:817)
	at com.carrotsearch.randomizedtesting.ThreadLeakControl$3.evaluate(ThreadLeakControl.java:468)
	at com.carrotsearch.randomizedtesting.RandomizedRunner.runSingleTest(RandomizedRunner.java:943)
	at com.carrotsearch.randomizedtesting.RandomizedRunner$5.evaluate(RandomizedRunner.java:829)
	at com.carrotsearch.randomizedtesting.RandomizedRunner$6.evaluate(RandomizedRunner.java:879)
	at com.carrotsearch.randomizedtesting.RandomizedRunner$7.evaluate(RandomizedRunner.java:890)
	at com.carrotsearch.randomizedtesting.rules.StatementAdapter.evaluate(StatementAdapter.java:36)
	at com.carrotsearch.randomizedtesting.rules.SystemPropertiesRestoreRule$1.evaluate(SystemPropertiesRestoreRule.java:57)
	at org.apache.lucene.util.AbstractBeforeAfterRule$1.evaluate(AbstractBeforeAfterRule.java:45)
	at com.carrotsearch.randomizedtesting.rules.StatementAdapter.evaluate(StatementAdapter.java:36)
	at org.apache.lucene.util.TestRuleStoreClassName$1.evaluate(TestRuleStoreClassName.java:41)
	at com.carrotsearch.randomizedtesting.rules.NoShadowingOrOverridesOnMethodsRule$1.evaluate(NoShadowingOrOverridesOnMethodsRule.java:40)
	at com.carrotsearch.randomizedtesting.rules.NoShadowingOrOverridesOnMethodsRule$1.evaluate(NoShadowingOrOverridesOnMethodsRule.java:40)
	at com.carrotsearch.randomizedtesting.rules.StatementAdapter.evaluate(StatementAdapter.java:36)
	at com.carrotsearch.randomizedtesting.rules.StatementAdapter.evaluate(StatementAdapter.java:36)
	at com.carrotsearch.randomizedtesting.rules.StatementAdapter.evaluate(StatementAdapter.java:36)
	at org.apache.lucene.util.TestRuleAssertionsRequired$1.evaluate(TestRuleAssertionsRequired.java:53)
	at org.apache.lucene.util.TestRuleMarkFailure$1.evaluate(TestRuleMarkFailure.java:47)
	at org.apache.lucene.util.TestRuleIgnoreAfterMaxFailures$1.evaluate(TestRuleIgnoreAfterMaxFailures.java:64)
	at org.apache.lucene.util.TestRuleIgnoreTestSuites$1.evaluate(TestRuleIgnoreTestSuites.java:54)
	at com.carrotsearch.randomizedtesting.rules.StatementAdapter.evaluate(StatementAdapter.java:36)
	at com.carrotsearch.randomizedtesting.ThreadLeakControl$StatementRunner.run(ThreadLeakControl.java:368)
	at java.lang.Thread.run(Thread.java:748)


FAILED:  org.apache.solr.cloud.TestTlogReplica.testRecovery

Error Message:
Can not find doc 8 in https://127.0.0.1:37852/solr

Stack Trace:
java.lang.AssertionError: Can not find doc 8 in https://127.0.0.1:37852/solr
	at __randomizedtesting.SeedInfo.seed([4A7B1ECF67D5A9F6:8B8B67634A856351]:0)
	at org.junit.Assert.fail(Assert.java:93)
	at org.junit.Assert.assertTrue(Assert.java:43)
	at org.junit.Assert.assertNotNull(Assert.java:526)
	at org.apache.solr.cloud.TestTlogReplica.checkRTG(TestTlogReplica.java:885)
	at org.apache.solr.cloud.TestTlogReplica.testRecovery(TestTlogReplica.java:599)
	at sun.reflect.NativeMethodAccessorImpl.invoke0(Native Method)
	at sun.reflect.NativeMethodAccessorImpl.invoke(NativeMethodAccessorImpl.java:62)
	at sun.reflect.DelegatingMethodAccessorImpl.invoke(DelegatingMethodAccessorImpl.java:43)
	at java.lang.reflect.Method.invoke(Method.java:498)
	at com.carrotsearch.randomizedtesting.RandomizedRunner.invoke(RandomizedRunner.java:1737)
	at com.carrotsearch.randomizedtesting.RandomizedRunner$8.evaluate(RandomizedRunner.java:934)
	at com.carrotsearch.randomizedtesting.RandomizedRunner$9.evaluate(RandomizedRunner.java:970)
	at com.carrotsearch.randomizedtesting.RandomizedRunner$10.evaluate(RandomizedRunner.java:984)
	at com.carrotsearch.randomizedtesting.rules.SystemPropertiesRestoreRule$1.evaluate(SystemPropertiesRestoreRule.java:57)
	at org.apache.lucene.util.TestRuleSetupTeardownChained$1.evaluate(TestRuleSetupTeardownChained.java:49)
	at org.apache.lucene.util.AbstractBeforeAfterRule$1.evaluate(AbstractBeforeAfterRule.java:45)
	at org.apache.lucene.util.TestRuleThreadAndTestName$1.evaluate(TestRuleThreadAndTestName.java:48)
	at org.apache.lucene.util.TestRuleIgnoreAfterMaxFailures$1.evaluate(TestRuleIgnoreAfterMaxFailures.java:64)
	at org.apache.lucene.util.TestRuleMarkFailure$1.evaluate(TestRuleMarkFailure.java:47)
	at com.carrotsearch.randomizedtesting.rules.StatementAdapter.evaluate(StatementAdapter.java:36)
	at com.carrotsearch.randomizedtesting.ThreadLeakControl$StatementRunner.run(ThreadLeakControl.java:368)
	at com.carrotsearch.randomizedtesting.ThreadLeakControl.forkTimeoutingTask(ThreadLeakControl.java:817)
	at com.carrotsearch.randomizedtesting.ThreadLeakControl$3.evaluate(ThreadLeakControl.java:468)
	at com.carrotsearch.randomizedtesting.RandomizedRunner.runSingleTest(RandomizedRunner.java:943)
	at com.carrotsearch.randomizedtesting.RandomizedRunner$5.evaluate(RandomizedRunner.java:829)
	at com.carrotsearch.randomizedtesting.RandomizedRunner$6.evaluate(RandomizedRunner.java:879)
	at com.carrotsearch.randomizedtesting.RandomizedRunner$7.evaluate(RandomizedRunner.java:890)
	at com.carrotsearch.randomizedtesting.rules.StatementAdapter.evaluate(StatementAdapter.java:36)
	at com.carrotsearch.randomizedtesting.rules.SystemPropertiesRestoreRule$1.evaluate(SystemPropertiesRestoreRule.java:57)
	at org.apache.lucene.util.AbstractBeforeAfterRule$1.evaluate(AbstractBeforeAfterRule.java:45)
	at com.carrotsearch.randomizedtesting.rules.StatementAdapter.evaluate(StatementAdapter.java:36)
	at org.apache.lucene.util.TestRuleStoreClassName$1.evaluate(TestRuleStoreClassName.java:41)
	at com.carrotsearch.randomizedtesting.rules.NoShadowingOrOverridesOnMethodsRule$1.evaluate(NoShadowingOrOverridesOnMethodsRule.java:40)
	at com.carrotsearch.randomizedtesting.rules.NoShadowingOrOverridesOnMethodsRule$1.evaluate(NoShadowingOrOverridesOnMethodsRule.java:40)
	at com.carrotsearch.randomizedtesting.rules.StatementAdapter.evaluate(StatementAdapter.java:36)
	at com.carrotsearch.randomizedtesting.rules.StatementAdapter.evaluate(StatementAdapter.java:36)
	at com.carrotsearch.randomizedtesting.rules.StatementAdapter.evaluate(StatementAdapter.java:36)
	at org.apache.lucene.util.TestRuleAssertionsRequired$1.evaluate(TestRuleAssertionsRequired.java:53)
	at org.apache.lucene.util.TestRuleMarkFailure$1.evaluate(TestRuleMarkFailure.java:47)
	at org.apache.lucene.util.TestRuleIgnoreAfterMaxFailures$1.evaluate(TestRuleIgnoreAfterMaxFailures.java:64)
	at org.apache.lucene.util.TestRuleIgnoreTestSuites$1.evaluate(TestRuleIgnoreTestSuites.java:54)
	at com.carrotsearch.randomizedtesting.rules.StatementAdapter.evaluate(StatementAdapter.java:36)
	at com.carrotsearch.randomizedtesting.ThreadLeakControl$StatementRunner.run(ThreadLeakControl.java:368)
	at java.lang.Thread.run(Thread.java:748)


FAILED:  org.apache.solr.cloud.autoscaling.AutoAddReplicasIntegrationTest.testSimple

Error Message:
Waiting for collection testSimple1 null Live Nodes: [127.0.0.1:37004_solr, 127.0.0.1:44547_solr] Last available state: DocCollection(testSimple1//collections/testSimple1/state.json/19)={   "pullReplicas":"0",   "replicationFactor":"2",   "shards":{     "shard1":{       "range":"80000000-ffffffff",       "state":"active",       "replicas":{         "core_node6":{           "core":"testSimple1_shard1_replica_n2",           "base_url":"https://127.0.0.1:44547/solr",           "node_name":"127.0.0.1:44547_solr",           "state":"active",           "type":"NRT",           "leader":"true"},         "core_node12":{           "core":"testSimple1_shard1_replica_n11",           "base_url":"https://127.0.0.1:44547/solr",           "node_name":"127.0.0.1:44547_solr",           "state":"active",           "type":"NRT"}}},     "shard2":{       "range":"0-7fffffff",       "state":"active",       "replicas":{         "core_node8":{           "core":"testSimple1_shard2_replica_n5",           "base_url":"https://127.0.0.1:44547/solr",           "node_name":"127.0.0.1:44547_solr",           "state":"active",           "type":"NRT",           "leader":"true"},         "core_node10":{           "core":"testSimple1_shard2_replica_n9",           "base_url":"https://127.0.0.1:41794/solr",           "node_name":"127.0.0.1:41794_solr",           "state":"down",           "type":"NRT"}}}},   "router":{"name":"compositeId"},   "maxShardsPerNode":"2",   "autoAddReplicas":"true",   "nrtReplicas":"2",   "tlogReplicas":"0"}

Stack Trace:
java.lang.AssertionError: Waiting for collection testSimple1
null
Live Nodes: [127.0.0.1:37004_solr, 127.0.0.1:44547_solr]
Last available state: DocCollection(testSimple1//collections/testSimple1/state.json/19)={
  "pullReplicas":"0",
  "replicationFactor":"2",
  "shards":{
    "shard1":{
      "range":"80000000-ffffffff",
      "state":"active",
      "replicas":{
        "core_node6":{
          "core":"testSimple1_shard1_replica_n2",
          "base_url":"https://127.0.0.1:44547/solr",
          "node_name":"127.0.0.1:44547_solr",
          "state":"active",
          "type":"NRT",
          "leader":"true"},
        "core_node12":{
          "core":"testSimple1_shard1_replica_n11",
          "base_url":"https://127.0.0.1:44547/solr",
          "node_name":"127.0.0.1:44547_solr",
          "state":"active",
          "type":"NRT"}}},
    "shard2":{
      "range":"0-7fffffff",
      "state":"active",
      "replicas":{
        "core_node8":{
          "core":"testSimple1_shard2_replica_n5",
          "base_url":"https://127.0.0.1:44547/solr",
          "node_name":"127.0.0.1:44547_solr",
          "state":"active",
          "type":"NRT",
          "leader":"true"},
        "core_node10":{
          "core":"testSimple1_shard2_replica_n9",
          "base_url":"https://127.0.0.1:41794/solr",
          "node_name":"127.0.0.1:41794_solr",
          "state":"down",
          "type":"NRT"}}}},
  "router":{"name":"compositeId"},
  "maxShardsPerNode":"2",
  "autoAddReplicas":"true",
  "nrtReplicas":"2",
  "tlogReplicas":"0"}
	at __randomizedtesting.SeedInfo.seed([4A7B1ECF67D5A9F6:72C83A3140267D27]:0)
	at org.junit.Assert.fail(Assert.java:93)
	at org.apache.solr.cloud.SolrCloudTestCase.waitForState(SolrCloudTestCase.java:269)
	at org.apache.solr.cloud.autoscaling.AutoAddReplicasIntegrationTest.testSimple(AutoAddReplicasIntegrationTest.java:103)
	at sun.reflect.NativeMethodAccessorImpl.invoke0(Native Method)
	at sun.reflect.NativeMethodAccessorImpl.invoke(NativeMethodAccessorImpl.java:62)
	at sun.reflect.DelegatingMethodAccessorImpl.invoke(DelegatingMethodAccessorImpl.java:43)
	at java.lang.reflect.Method.invoke(Method.java:498)
	at com.carrotsearch.randomizedtesting.RandomizedRunner.invoke(RandomizedRunner.java:1737)
	at com.carrotsearch.randomizedtesting.RandomizedRunner$8.evaluate(RandomizedRunner.java:934)
	at com.carrotsearch.randomizedtesting.RandomizedRunner$9.evaluate(RandomizedRunner.java:970)
	at com.carrotsearch.randomizedtesting.RandomizedRunner$10.evaluate(RandomizedRunner.java:984)
	at com.carrotsearch.randomizedtesting.rules.SystemPropertiesRestoreRule$1.evaluate(SystemPropertiesRestoreRule.java:57)
	at org.apache.lucene.util.TestRuleSetupTeardownChained$1.evaluate(TestRuleSetupTeardownChained.java:49)
	at org.apache.lucene.util.AbstractBeforeAfterRule$1.evaluate(AbstractBeforeAfterRule.java:45)
	at org.apache.lucene.util.TestRuleThreadAndTestName$1.evaluate(TestRuleThreadAndTestName.java:48)
	at org.apache.lucene.util.TestRuleIgnoreAfterMaxFailures$1.evaluate(TestRuleIgnoreAfterMaxFailures.java:64)
	at org.apache.lucene.util.TestRuleMarkFailure$1.evaluate(TestRuleMarkFailure.java:47)
	at com.carrotsearch.randomizedtesting.rules.StatementAdapter.evaluate(StatementAdapter.java:36)
	at com.carrotsearch.randomizedtesting.ThreadLeakControl$StatementRunner.run(ThreadLeakControl.java:368)
	at com.carrotsearch.randomizedtesting.ThreadLeakControl.forkTimeoutingTask(ThreadLeakControl.java:817)
	at com.carrotsearch.randomizedtesting.ThreadLeakControl$3.evaluate(ThreadLeakControl.java:468)
	at com.carrotsearch.randomizedtesting.RandomizedRunner.runSingleTest(RandomizedRunner.java:943)
	at com.carrotsearch.randomizedtesting.RandomizedRunner$5.evaluate(RandomizedRunner.java:829)
	at com.carrotsearch.randomizedtesting.RandomizedRunner$6.evaluate(RandomizedRunner.java:879)
	at com.carrotsearch.randomizedtesting.RandomizedRunner$7.evaluate(RandomizedRunner.java:890)
	at com.carrotsearch.randomizedtesting.rules.StatementAdapter.evaluate(StatementAdapter.java:36)
	at com.carrotsearch.randomizedtesting.rules.SystemPropertiesRestoreRule$1.evaluate(SystemPropertiesRestoreRule.java:57)
	at org.apache.lucene.util.AbstractBeforeAfterRule$1.evaluate(AbstractBeforeAfterRule.java:45)
	at com.carrotsearch.randomizedtesting.rules.StatementAdapter.evaluate(StatementAdapter.java:36)
	at org.apache.lucene.util.TestRuleStoreClassName$1.evaluate(TestRuleStoreClassName.java:41)
	at com.carrotsearch.randomizedtesting.rules.NoShadowingOrOverridesOnMethodsRule$1.evaluate(NoShadowingOrOverridesOnMethodsRule.java:40)
	at com.carrotsearch.randomizedtesting.rules.NoShadowingOrOverridesOnMethodsRule$1.evaluate(NoShadowingOrOverridesOnMethodsRule.java:40)
	at com.carrotsearch.randomizedtesting.rules.StatementAdapter.evaluate(StatementAdapter.java:36)
	at com.carrotsearch.randomizedtesting.rules.StatementAdapter.evaluate(StatementAdapter.java:36)
	at com.carrotsearch.randomizedtesting.rules.StatementAdapter.evaluate(StatementAdapter.java:36)
	at org.apache.lucene.util.TestRuleAssertionsRequired$1.evaluate(TestRuleAssertionsRequired.java:53)
	at org.apache.lucene.util.TestRuleMarkFailure$1.evaluate(TestRuleMarkFailure.java:47)
	at org.apache.lucene.util.TestRuleIgnoreAfterMaxFailures$1.evaluate(TestRuleIgnoreAfterMaxFailures.java:64)
	at org.apache.lucene.util.TestRuleIgnoreTestSuites$1.evaluate(TestRuleIgnoreTestSuites.java:54)
	at com.carrotsearch.randomizedtesting.rules.StatementAdapter.evaluate(StatementAdapter.java:36)
	at com.carrotsearch.randomizedtesting.ThreadLeakControl$StatementRunner.run(ThreadLeakControl.java:368)
	at java.lang.Thread.run(Thread.java:748)


FAILED:  org.apache.solr.cloud.autoscaling.ComputePlanActionTest.testNodeWithMultipleReplicasLost

Error Message:
The operations computed by ComputePlanAction should not be null SolrClientNodeStateProvider.DEBUG{AFTER_ACTION=[compute_plan, null], BEFORE_ACTION=[compute_plan, null]}

Stack Trace:
java.lang.AssertionError: The operations computed by ComputePlanAction should not be null SolrClientNodeStateProvider.DEBUG{AFTER_ACTION=[compute_plan, null], BEFORE_ACTION=[compute_plan, null]}
	at __randomizedtesting.SeedInfo.seed([4A7B1ECF67D5A9F6:7ABBFF4DEFA748AA]:0)
	at org.junit.Assert.fail(Assert.java:93)
	at org.junit.Assert.assertTrue(Assert.java:43)
	at org.junit.Assert.assertNotNull(Assert.java:526)
	at org.apache.solr.cloud.autoscaling.ComputePlanActionTest.testNodeWithMultipleReplicasLost(ComputePlanActionTest.java:291)
	at sun.reflect.NativeMethodAccessorImpl.invoke0(Native Method)
	at sun.reflect.NativeMethodAccessorImpl.invoke(NativeMethodAccessorImpl.java:62)
	at sun.reflect.DelegatingMethodAccessorImpl.invoke(DelegatingMethodAccessorImpl.java:43)
	at java.lang.reflect.Method.invoke(Method.java:498)
	at com.carrotsearch.randomizedtesting.RandomizedRunner.invoke(RandomizedRunner.java:1737)
	at com.carrotsearch.randomizedtesting.RandomizedRunner$8.evaluate(RandomizedRunner.java:934)
	at com.carrotsearch.randomizedtesting.RandomizedRunner$9.evaluate(RandomizedRunner.java:970)
	at com.carrotsearch.randomizedtesting.RandomizedRunner$10.evaluate(RandomizedRunner.java:984)
	at com.carrotsearch.randomizedtesting.rules.SystemPropertiesRestoreRule$1.evaluate(SystemPropertiesRestoreRule.java:57)
	at org.apache.lucene.util.TestRuleSetupTeardownChained$1.evaluate(TestRuleSetupTeardownChained.java:49)
	at org.apache.lucene.util.AbstractBeforeAfterRule$1.evaluate(AbstractBeforeAfterRule.java:45)
	at org.apache.lucene.util.TestRuleThreadAndTestName$1.evaluate(TestRuleThreadAndTestName.java:48)
	at org.apache.lucene.util.TestRuleIgnoreAfterMaxFailures$1.evaluate(TestRuleIgnoreAfterMaxFailures.java:64)
	at org.apache.lucene.util.TestRuleMarkFailure$1.evaluate(TestRuleMarkFailure.java:47)
	at com.carrotsearch.randomizedtesting.rules.StatementAdapter.evaluate(StatementAdapter.java:36)
	at com.carrotsearch.randomizedtesting.ThreadLeakControl$StatementRunner.run(ThreadLeakControl.java:368)
	at com.carrotsearch.randomizedtesting.ThreadLeakControl.forkTimeoutingTask(ThreadLeakControl.java:817)
	at com.carrotsearch.randomizedtesting.ThreadLeakControl$3.evaluate(ThreadLeakControl.java:468)
	at com.carrotsearch.randomizedtesting.RandomizedRunner.runSingleTest(RandomizedRunner.java:943)
	at com.carrotsearch.randomizedtesting.RandomizedRunner$5.evaluate(RandomizedRunner.java:829)
	at com.carrotsearch.randomizedtesting.RandomizedRunner$6.evaluate(RandomizedRunner.java:879)
	at com.carrotsearch.randomizedtesting.RandomizedRunner$7.evaluate(RandomizedRunner.java:890)
	at com.carrotsearch.randomizedtesting.rules.StatementAdapter.evaluate(StatementAdapter.java:36)
	at com.carrotsearch.randomizedtesting.rules.SystemPropertiesRestoreRule$1.evaluate(SystemPropertiesRestoreRule.java:57)
	at org.apache.lucene.util.AbstractBeforeAfterRule$1.evaluate(AbstractBeforeAfterRule.java:45)
	at com.carrotsearch.randomizedtesting.rules.StatementAdapter.evaluate(StatementAdapter.java:36)
	at org.apache.lucene.util.TestRuleStoreClassName$1.evaluate(TestRuleStoreClassName.java:41)
	at com.carrotsearch.randomizedtesting.rules.NoShadowingOrOverridesOnMethodsRule$1.evaluate(NoShadowingOrOverridesOnMethodsRule.java:40)
	at com.carrotsearch.randomizedtesting.rules.NoShadowingOrOverridesOnMethodsRule$1.evaluate(NoShadowingOrOverridesOnMethodsRule.java:40)
	at com.carrotsearch.randomizedtesting.rules.StatementAdapter.evaluate(StatementAdapter.java:36)
	at com.carrotsearch.randomizedtesting.rules.StatementAdapter.evaluate(StatementAdapter.java:36)
	at com.carrotsearch.randomizedtesting.rules.StatementAdapter.evaluate(StatementAdapter.java:36)
	at org.apache.lucene.util.TestRuleAssertionsRequired$1.evaluate(TestRuleAssertionsRequired.java:53)
	at org.apache.lucene.util.TestRuleMarkFailure$1.evaluate(TestRuleMarkFailure.java:47)
	at org.apache.lucene.util.TestRuleIgnoreAfterMaxFailures$1.evaluate(TestRuleIgnoreAfterMaxFailures.java:64)
	at org.apache.lucene.util.TestRuleIgnoreTestSuites$1.evaluate(TestRuleIgnoreTestSuites.java:54)
	at com.carrotsearch.randomizedtesting.rules.StatementAdapter.evaluate(StatementAdapter.java:36)
	at com.carrotsearch.randomizedtesting.ThreadLeakControl$StatementRunner.run(ThreadLeakControl.java:368)
	at java.lang.Thread.run(Thread.java:748)


FAILED:  org.apache.solr.cloud.autoscaling.HdfsAutoAddReplicasIntegrationTest.testSimple

Error Message:
Waiting for collection testSimple1 null Live Nodes: [127.0.0.1:41946_solr, 127.0.0.1:46199_solr] Last available state: DocCollection(testSimple1//collections/testSimple1/state.json/16)={   "pullReplicas":"0",   "replicationFactor":"2",   "shards":{     "shard1":{       "range":"80000000-ffffffff",       "state":"active",       "replicas":{         "core_node3":{           "dataDir":"hdfs://lucene2-us-west.apache.org:32788/data/testSimple1/core_node3/data/",           "base_url":"https://127.0.0.1:46199/solr",           "node_name":"127.0.0.1:46199_solr",           "type":"NRT",           "ulogDir":"hdfs://lucene2-us-west.apache.org:32788/data/testSimple1/core_node3/data/tlog",           "core":"testSimple1_shard1_replica_n1",           "shared_storage":"true",           "state":"active"},         "core_node5":{           "dataDir":"hdfs://lucene2-us-west.apache.org:32788/data/testSimple1/core_node5/data/",           "base_url":"https://127.0.0.1:46199/solr",           "node_name":"127.0.0.1:46199_solr",           "type":"NRT",           "ulogDir":"hdfs://lucene2-us-west.apache.org:32788/data/testSimple1/core_node5/data/tlog",           "core":"testSimple1_shard1_replica_n2",           "shared_storage":"true",           "state":"active",           "leader":"true"}}},     "shard2":{       "range":"0-7fffffff",       "state":"active",       "replicas":{         "core_node7":{           "dataDir":"hdfs://lucene2-us-west.apache.org:32788/data/testSimple1/core_node7/data/",           "base_url":"https://127.0.0.1:41997/solr",           "node_name":"127.0.0.1:41997_solr",           "type":"NRT",           "ulogDir":"hdfs://lucene2-us-west.apache.org:32788/data/testSimple1/core_node7/data/tlog",           "core":"testSimple1_shard2_replica_n4",           "shared_storage":"true",           "state":"down"},         "core_node8":{           "dataDir":"hdfs://lucene2-us-west.apache.org:32788/data/testSimple1/core_node8/data/",           "base_url":"https://127.0.0.1:46199/solr",           "node_name":"127.0.0.1:46199_solr",           "type":"NRT",           "ulogDir":"hdfs://lucene2-us-west.apache.org:32788/data/testSimple1/core_node8/data/tlog",           "core":"testSimple1_shard2_replica_n6",           "shared_storage":"true",           "state":"active",           "leader":"true"}}}},   "router":{"name":"compositeId"},   "maxShardsPerNode":"2",   "autoAddReplicas":"true",   "nrtReplicas":"2",   "tlogReplicas":"0"}

Stack Trace:
java.lang.AssertionError: Waiting for collection testSimple1
null
Live Nodes: [127.0.0.1:41946_solr, 127.0.0.1:46199_solr]
Last available state: DocCollection(testSimple1//collections/testSimple1/state.json/16)={
  "pullReplicas":"0",
  "replicationFactor":"2",
  "shards":{
    "shard1":{
      "range":"80000000-ffffffff",
      "state":"active",
      "replicas":{
        "core_node3":{
          "dataDir":"hdfs://lucene2-us-west.apache.org:32788/data/testSimple1/core_node3/data/",
          "base_url":"https://127.0.0.1:46199/solr",
          "node_name":"127.0.0.1:46199_solr",
          "type":"NRT",
          "ulogDir":"hdfs://lucene2-us-west.apache.org:32788/data/testSimple1/core_node3/data/tlog",
          "core":"testSimple1_shard1_replica_n1",
          "shared_storage":"true",
          "state":"active"},
        "core_node5":{
          "dataDir":"hdfs://lucene2-us-west.apache.org:32788/data/testSimple1/core_node5/data/",
          "base_url":"https://127.0.0.1:46199/solr",
          "node_name":"127.0.0.1:46199_solr",
          "type":"NRT",
          "ulogDir":"hdfs://lucene2-us-west.apache.org:32788/data/testSimple1/core_node5/data/tlog",
          "core":"testSimple1_shard1_replica_n2",
          "shared_storage":"true",
          "state":"active",
          "leader":"true"}}},
    "shard2":{
      "range":"0-7fffffff",
      "state":"active",
      "replicas":{
        "core_node7":{
          "dataDir":"hdfs://lucene2-us-west.apache.org:32788/data/testSimple1/core_node7/data/",
          "base_url":"https://127.0.0.1:41997/solr",
          "node_name":"127.0.0.1:41997_solr",
          "type":"NRT",
          "ulogDir":"hdfs://lucene2-us-west.apache.org:32788/data/testSimple1/core_node7/data/tlog",
          "core":"testSimple1_shard2_replica_n4",
          "shared_storage":"true",
          "state":"down"},
        "core_node8":{
          "dataDir":"hdfs://lucene2-us-west.apache.org:32788/data/testSimple1/core_node8/data/",
          "base_url":"https://127.0.0.1:46199/solr",
          "node_name":"127.0.0.1:46199_solr",
          "type":"NRT",
          "ulogDir":"hdfs://lucene2-us-west.apache.org:32788/data/testSimple1/core_node8/data/tlog",
          "core":"testSimple1_shard2_replica_n6",
          "shared_storage":"true",
          "state":"active",
          "leader":"true"}}}},
  "router":{"name":"compositeId"},
  "maxShardsPerNode":"2",
  "autoAddReplicas":"true",
  "nrtReplicas":"2",
  "tlogReplicas":"0"}
	at __randomizedtesting.SeedInfo.seed([4A7B1ECF67D5A9F6:72C83A3140267D27]:0)
	at org.junit.Assert.fail(Assert.java:93)
	at org.apache.solr.cloud.SolrCloudTestCase.waitForState(SolrCloudTestCase.java:269)
	at org.apache.solr.cloud.autoscaling.AutoAddReplicasIntegrationTest.testSimple(AutoAddReplicasIntegrationTest.java:103)
	at sun.reflect.NativeMethodAccessorImpl.invoke0(Native Method)
	at sun.reflect.NativeMethodAccessorImpl.invoke(NativeMethodAccessorImpl.java:62)
	at sun.reflect.DelegatingMethodAccessorImpl.invoke(DelegatingMethodAccessorImpl.java:43)
	at java.lang.reflect.Method.invoke(Method.java:498)
	at com.carrotsearch.randomizedtesting.RandomizedRunner.invoke(RandomizedRunner.java:1737)
	at com.carrotsearch.randomizedtesting.RandomizedRunner$8.evaluate(RandomizedRunner.java:934)
	at com.carrotsearch.randomizedtesting.RandomizedRunner$9.evaluate(RandomizedRunner.java:970)
	at com.carrotsearch.randomizedtesting.RandomizedRunner$10.evaluate(RandomizedRunner.java:984)
	at com.carrotsearch.randomizedtesting.rules.SystemPropertiesRestoreRule$1.evaluate(SystemPropertiesRestoreRule.java:57)
	at org.apache.lucene.util.TestRuleSetupTeardownChained$1.evaluate(TestRuleSetupTeardownChained.java:49)
	at org.apache.lucene.util.AbstractBeforeAfterRule$1.evaluate(AbstractBeforeAfterRule.java:45)
	at org.apache.lucene.util.TestRuleThreadAndTestName$1.evaluate(TestRuleThreadAndTestName.java:48)
	at org.apache.lucene.util.TestRuleIgnoreAfterMaxFailures$1.evaluate(TestRuleIgnoreAfterMaxFailures.java:64)
	at org.apache.lucene.util.TestRuleMarkFailure$1.evaluate(TestRuleMarkFailure.java:47)
	at com.carrotsearch.randomizedtesting.rules.StatementAdapter.evaluate(StatementAdapter.java:36)
	at com.carrotsearch.randomizedtesting.ThreadLeakControl$StatementRunner.run(ThreadLeakControl.java:368)
	at com.carrotsearch.randomizedtesting.ThreadLeakControl.forkTimeoutingTask(ThreadLeakControl.java:817)
	at com.carrotsearch.randomizedtesting.ThreadLeakControl$3.evaluate(ThreadLeakControl.java:468)
	at com.carrotsearch.randomizedtesting.RandomizedRunner.runSingleTest(RandomizedRunner.java:943)
	at com.carrotsearch.randomizedtesting.RandomizedRunner$5.evaluate(RandomizedRunner.java:829)
	at com.carrotsearch.randomizedtesting.RandomizedRunner$6.evaluate(RandomizedRunner.java:879)
	at com.carrotsearch.randomizedtesting.RandomizedRunner$7.evaluate(RandomizedRunner.java:890)
	at com.carrotsearch.randomizedtesting.rules.StatementAdapter.evaluate(StatementAdapter.java:36)
	at com.carrotsearch.randomizedtesting.rules.SystemPropertiesRestoreRule$1.evaluate(SystemPropertiesRestoreRule.java:57)
	at org.apache.lucene.util.AbstractBeforeAfterRule$1.evaluate(AbstractBeforeAfterRule.java:45)
	at com.carrotsearch.randomizedtesting.rules.StatementAdapter.evaluate(StatementAdapter.java:36)
	at org.apache.lucene.util.TestRuleStoreClassName$1.evaluate(TestRuleStoreClassName.java:41)
	at com.carrotsearch.randomizedtesting.rules.NoShadowingOrOverridesOnMethodsRule$1.evaluate(NoShadowingOrOverridesOnMethodsRule.java:40)
	at com.carrotsearch.randomizedtesting.rules.NoShadowingOrOverridesOnMethodsRule$1.evaluate(NoShadowingOrOverridesOnMethodsRule.java:40)
	at com.carrotsearch.randomizedtesting.rules.StatementAdapter.evaluate(StatementAdapter.java:36)
	at com.carrotsearch.randomizedtesting.rules.StatementAdapter.evaluate(StatementAdapter.java:36)
	at com.carrotsearch.randomizedtesting.rules.StatementAdapter.evaluate(StatementAdapter.java:36)
	at org.apache.lucene.util.TestRuleAssertionsRequired$1.evaluate(TestRuleAssertionsRequired.java:53)
	at org.apache.lucene.util.TestRuleMarkFailure$1.evaluate(TestRuleMarkFailure.java:47)
	at org.apache.lucene.util.TestRuleIgnoreAfterMaxFailures$1.evaluate(TestRuleIgnoreAfterMaxFailures.java:64)
	at org.apache.lucene.util.TestRuleIgnoreTestSuites$1.evaluate(TestRuleIgnoreTestSuites.java:54)
	at com.carrotsearch.randomizedtesting.rules.StatementAdapter.evaluate(StatementAdapter.java:36)
	at com.carrotsearch.randomizedtesting.ThreadLeakControl$StatementRunner.run(ThreadLeakControl.java:368)
	at java.lang.Thread.run(Thread.java:748)


FAILED:  junit.framework.TestSuite.org.apache.solr.cloud.hdfs.HdfsBasicDistributedZkTest

Error Message:
ObjectTracker found 1 object(s) that were not released!!! [NRTCachingDirectory] org.apache.solr.common.util.ObjectReleaseTracker$ObjectTrackerException: org.apache.lucene.store.NRTCachingDirectory  at org.apache.solr.common.util.ObjectReleaseTracker.track(ObjectReleaseTracker.java:42)  at org.apache.solr.core.CachingDirectoryFactory.get(CachingDirectoryFactory.java:348)  at org.apache.solr.core.SolrCore.getNewIndexDir(SolrCore.java:351)  at org.apache.solr.core.SolrCore.cleanupOldIndexDirectories(SolrCore.java:3031)  at org.apache.solr.core.SolrCore.close(SolrCore.java:1604)  at org.apache.solr.core.SolrCore.<init>(SolrCore.java:1000)  at org.apache.solr.core.SolrCore.<init>(SolrCore.java:863)  at org.apache.solr.core.CoreContainer.createFromDescriptor(CoreContainer.java:1043)  at org.apache.solr.core.CoreContainer.lambda$load$13(CoreContainer.java:644)  at com.codahale.metrics.InstrumentedExecutorService$InstrumentedCallable.call(InstrumentedExecutorService.java:197)  at java.util.concurrent.FutureTask.run(FutureTask.java:266)  at org.apache.solr.common.util.ExecutorUtil$MDCAwareThreadPoolExecutor.lambda$execute$0(ExecutorUtil.java:188)  at java.util.concurrent.ThreadPoolExecutor.runWorker(ThreadPoolExecutor.java:1149)  at java.util.concurrent.ThreadPoolExecutor$Worker.run(ThreadPoolExecutor.java:624)  at java.lang.Thread.run(Thread.java:748)  

Stack Trace:
java.lang.AssertionError: ObjectTracker found 1 object(s) that were not released!!! [NRTCachingDirectory]
org.apache.solr.common.util.ObjectReleaseTracker$ObjectTrackerException: org.apache.lucene.store.NRTCachingDirectory
	at org.apache.solr.common.util.ObjectReleaseTracker.track(ObjectReleaseTracker.java:42)
	at org.apache.solr.core.CachingDirectoryFactory.get(CachingDirectoryFactory.java:348)
	at org.apache.solr.core.SolrCore.getNewIndexDir(SolrCore.java:351)
	at org.apache.solr.core.SolrCore.cleanupOldIndexDirectories(SolrCore.java:3031)
	at org.apache.solr.core.SolrCore.close(SolrCore.java:1604)
	at org.apache.solr.core.SolrCore.<init>(SolrCore.java:1000)
	at org.apache.solr.core.SolrCore.<init>(SolrCore.java:863)
	at org.apache.solr.core.CoreContainer.createFromDescriptor(CoreContainer.java:1043)
	at org.apache.solr.core.CoreContainer.lambda$load$13(CoreContainer.java:644)
	at com.codahale.metrics.InstrumentedExecutorService$InstrumentedCallable.call(InstrumentedExecutorService.java:197)
	at java.util.concurrent.FutureTask.run(FutureTask.java:266)
	at org.apache.solr.common.util.ExecutorUtil$MDCAwareThreadPoolExecutor.lambda$execute$0(ExecutorUtil.java:188)
	at java.util.concurrent.ThreadPoolExecutor.runWorker(ThreadPoolExecutor.java:1149)
	at java.util.concurrent.ThreadPoolExecutor$Worker.run(ThreadPoolExecutor.java:624)
	at java.lang.Thread.run(Thread.java:748)


	at __randomizedtesting.SeedInfo.seed([4A7B1ECF67D5A9F6]:0)
	at org.junit.Assert.fail(Assert.java:93)
	at org.junit.Assert.assertTrue(Assert.java:43)
	at org.junit.Assert.assertNull(Assert.java:551)
	at org.apache.solr.SolrTestCaseJ4.teardownTestCases(SolrTestCaseJ4.java:295)
	at sun.reflect.NativeMethodAccessorImpl.invoke0(Native Method)
	at sun.reflect.NativeMethodAccessorImpl.invoke(NativeMethodAccessorImpl.java:62)
	at sun.reflect.DelegatingMethodAccessorImpl.invoke(DelegatingMethodAccessorImpl.java:43)
	at java.lang.reflect.Method.invoke(Method.java:498)
	at com.carrotsearch.randomizedtesting.RandomizedRunner.invoke(RandomizedRunner.java:1737)
	at com.carrotsearch.randomizedtesting.RandomizedRunner$7.evaluate(RandomizedRunner.java:897)
	at com.carrotsearch.randomizedtesting.rules.StatementAdapter.evaluate(StatementAdapter.java:36)
	at com.carrotsearch.randomizedtesting.rules.SystemPropertiesRestoreRule$1.evaluate(SystemPropertiesRestoreRule.java:57)
	at org.apache.lucene.util.AbstractBeforeAfterRule$1.evaluate(AbstractBeforeAfterRule.java:45)
	at com.carrotsearch.randomizedtesting.rules.StatementAdapter.evaluate(StatementAdapter.java:36)
	at org.apache.lucene.util.TestRuleStoreClassName$1.evaluate(TestRuleStoreClassName.java:41)
	at com.carrotsearch.randomizedtesting.rules.NoShadowingOrOverridesOnMethodsRule$1.evaluate(NoShadowingOrOverridesOnMethodsRule.java:40)
	at com.carrotsearch.randomizedtesting.rules.NoShadowingOrOverridesOnMethodsRule$1.evaluate(NoShadowingOrOverridesOnMethodsRule.java:40)
	at com.carrotsearch.randomizedtesting.rules.StatementAdapter.evaluate(StatementAdapter.java:36)
	at com.carrotsearch.randomizedtesting.rules.StatementAdapter.evaluate(StatementAdapter.java:36)
	at com.carrotsearch.randomizedtesting.rules.StatementAdapter.evaluate(StatementAdapter.java:36)
	at org.apache.lucene.util.TestRuleAssertionsRequired$1.evaluate(TestRuleAssertionsRequired.java:53)
	at org.apache.lucene.util.TestRuleMarkFailure$1.evaluate(TestRuleMarkFailure.java:47)
	at org.apache.lucene.util.TestRuleIgnoreAfterMaxFailures$1.evaluate(TestRuleIgnoreAfterMaxFailures.java:64)
	at org.apache.lucene.util.TestRuleIgnoreTestSuites$1.evaluate(TestRuleIgnoreTestSuites.java:54)
	at com.carrotsearch.randomizedtesting.rules.StatementAdapter.evaluate(StatementAdapter.java:36)
	at com.carrotsearch.randomizedtesting.ThreadLeakControl$StatementRunner.run(ThreadLeakControl.java:368)
	at java.lang.Thread.run(Thread.java:748)


FAILED:  org.apache.solr.handler.TestReplicationHandler.doTestReplicateAfterCoreReload

Error Message:
expected:<[{indexVersion=1517520203641,generation=2,filelist=[_aui.cfe, _aui.cfs, _aui.si, _avj.cfe, _avj.cfs, _avj.si, _avk.cfe, _avk.cfs, _avk.si, _avl.cfe, _avl.cfs, _avl.si, _avm.cfe, _avm.cfs, _avm.si, _avn.cfe, _avn.cfs, _avn.si, _avo.cfe, _avo.cfs, _avo.si, _avp.cfe, _avp.cfs, _avp.si, _avq.cfe, _avq.cfs, _avq.si, _avr.cfe, _avr.cfs, _avr.si, _avs.cfe, _avs.cfs, _avs.si, _avt.cfe, _avt.cfs, _avt.si, _avu.cfe, _avu.cfs, _avu.si, _avv.cfe, _avv.cfs, _avv.si, _avw.cfe, _avw.cfs, _avw.si, _avx.cfe, _avx.cfs, _avx.si, _avy.cfe, _avy.cfs, _avy.si, _avz.cfe, _avz.cfs, _avz.si, _aw1.cfe, _aw1.cfs, _aw1.si, _aw2.cfe, _aw2.cfs, _aw2.si, _aw3.cfe, _aw3.cfs, _aw3.si, _aw4.cfe, _aw4.cfs, _aw4.si, _aw5.cfe, _aw5.cfs, _aw5.si, segments_2]}]> but was:<[{indexVersion=1517520203641,generation=2,filelist=[_aui.cfe, _aui.cfs, _aui.si, _avj.cfe, _avj.cfs, _avj.si, _avk.cfe, _avk.cfs, _avk.si, _avl.cfe, _avl.cfs, _avl.si, _avm.cfe, _avm.cfs, _avm.si, _avn.cfe, _avn.cfs, _avn.si, _avo.cfe, _avo.cfs, _avo.si, _avp.cfe, _avp.cfs, _avp.si, _avq.cfe, _avq.cfs, _avq.si, _avr.cfe, _avr.cfs, _avr.si, _avs.cfe, _avs.cfs, _avs.si, _avt.cfe, _avt.cfs, _avt.si, _avu.cfe, _avu.cfs, _avu.si, _avv.cfe, _avv.cfs, _avv.si, _avw.cfe, _avw.cfs, _avw.si, _avx.cfe, _avx.cfs, _avx.si, _avy.cfe, _avy.cfs, _avy.si, _avz.cfe, _avz.cfs, _avz.si, _aw1.cfe, _aw1.cfs, _aw1.si, _aw2.cfe, _aw2.cfs, _aw2.si, _aw3.cfe, _aw3.cfs, _aw3.si, _aw4.cfe, _aw4.cfs, _aw4.si, _aw5.cfe, _aw5.cfs, _aw5.si, segments_2]}, {indexVersion=1517520203641,generation=3,filelist=[_aw0.cfe, _aw0.cfs, _aw0.si, _aw1.cfe, _aw1.cfs, _aw1.si, _aw2.cfe, _aw2.cfs, _aw2.si, _aw3.cfe, _aw3.cfs, _aw3.si, _aw4.cfe, _aw4.cfs, _aw4.si, _aw5.cfe, _aw5.cfs, _aw5.si, segments_3]}]>

Stack Trace:
java.lang.AssertionError: expected:<[{indexVersion=1517520203641,generation=2,filelist=[_aui.cfe, _aui.cfs, _aui.si, _avj.cfe, _avj.cfs, _avj.si, _avk.cfe, _avk.cfs, _avk.si, _avl.cfe, _avl.cfs, _avl.si, _avm.cfe, _avm.cfs, _avm.si, _avn.cfe, _avn.cfs, _avn.si, _avo.cfe, _avo.cfs, _avo.si, _avp.cfe, _avp.cfs, _avp.si, _avq.cfe, _avq.cfs, _avq.si, _avr.cfe, _avr.cfs, _avr.si, _avs.cfe, _avs.cfs, _avs.si, _avt.cfe, _avt.cfs, _avt.si, _avu.cfe, _avu.cfs, _avu.si, _avv.cfe, _avv.cfs, _avv.si, _avw.cfe, _avw.cfs, _avw.si, _avx.cfe, _avx.cfs, _avx.si, _avy.cfe, _avy.cfs, _avy.si, _avz.cfe, _avz.cfs, _avz.si, _aw1.cfe, _aw1.cfs, _aw1.si, _aw2.cfe, _aw2.cfs, _aw2.si, _aw3.cfe, _aw3.cfs, _aw3.si, _aw4.cfe, _aw4.cfs, _aw4.si, _aw5.cfe, _aw5.cfs, _aw5.si, segments_2]}]> but was:<[{indexVersion=1517520203641,generation=2,filelist=[_aui.cfe, _aui.cfs, _aui.si, _avj.cfe, _avj.cfs, _avj.si, _avk.cfe, _avk.cfs, _avk.si, _avl.cfe, _avl.cfs, _avl.si, _avm.cfe, _avm.cfs, _avm.si, _avn.cfe, _avn.cfs, _avn.si, _avo.cfe, _avo.cfs, _avo.si, _avp.cfe, _avp.cfs, _avp.si, _avq.cfe, _avq.cfs, _avq.si, _avr.cfe, _avr.cfs, _avr.si, _avs.cfe, _avs.cfs, _avs.si, _avt.cfe, _avt.cfs, _avt.si, _avu.cfe, _avu.cfs, _avu.si, _avv.cfe, _avv.cfs, _avv.si, _avw.cfe, _avw.cfs, _avw.si, _avx.cfe, _avx.cfs, _avx.si, _avy.cfe, _avy.cfs, _avy.si, _avz.cfe, _avz.cfs, _avz.si, _aw1.cfe, _aw1.cfs, _aw1.si, _aw2.cfe, _aw2.cfs, _aw2.si, _aw3.cfe, _aw3.cfs, _aw3.si, _aw4.cfe, _aw4.cfs, _aw4.si, _aw5.cfe, _aw5.cfs, _aw5.si, segments_2]}, {indexVersion=1517520203641,generation=3,filelist=[_aw0.cfe, _aw0.cfs, _aw0.si, _aw1.cfe, _aw1.cfs, _aw1.si, _aw2.cfe, _aw2.cfs, _aw2.si, _aw3.cfe, _aw3.cfs, _aw3.si, _aw4.cfe, _aw4.cfs, _aw4.si, _aw5.cfe, _aw5.cfs, _aw5.si, segments_3]}]>
	at __randomizedtesting.SeedInfo.seed([4A7B1ECF67D5A9F6:6FAC05FF179DA7F5]:0)
	at org.junit.Assert.fail(Assert.java:93)
	at org.junit.Assert.failNotEquals(Assert.java:647)
	at org.junit.Assert.assertEquals(Assert.java:128)
	at org.junit.Assert.assertEquals(Assert.java:147)
	at org.apache.solr.handler.TestReplicationHandler.doTestReplicateAfterCoreReload(TestReplicationHandler.java:1277)
	at sun.reflect.NativeMethodAccessorImpl.invoke0(Native Method)
	at sun.reflect.NativeMethodAccessorImpl.invoke(NativeMethodAccessorImpl.java:62)
	at sun.reflect.DelegatingMethodAccessorImpl.invoke(DelegatingMethodAccessorImpl.java:43)
	at java.lang.reflect.Method.invoke(Method.java:498)
	at com.carrotsearch.randomizedtesting.RandomizedRunner.invoke(RandomizedRunner.java:1737)
	at com.carrotsearch.randomizedtesting.RandomizedRunner$8.evaluate(RandomizedRunner.java:934)
	at com.carrotsearch.randomizedtesting.RandomizedRunner$9.evaluate(RandomizedRunner.java:970)
	at com.carrotsearch.randomizedtesting.RandomizedRunner$10.evaluate(RandomizedRunner.java:984)
	at com.carrotsearch.randomizedtesting.rules.SystemPropertiesRestoreRule$1.evaluate(SystemPropertiesRestoreRule.java:57)
	at org.apache.lucene.util.TestRuleSetupTeardownChained$1.evaluate(TestRuleSetupTeardownChained.java:49)
	at org.apache.lucene.util.AbstractBeforeAfterRule$1.evaluate(AbstractBeforeAfterRule.java:45)
	at org.apache.lucene.util.TestRuleThreadAndTestName$1.evaluate(TestRuleThreadAndTestName.java:48)
	at org.apache.lucene.util.TestRuleIgnoreAfterMaxFailures$1.evaluate(TestRuleIgnoreAfterMaxFailures.java:64)
	at org.apache.lucene.util.TestRuleMarkFailure$1.evaluate(TestRuleMarkFailure.java:47)
	at com.carrotsearch.randomizedtesting.rules.StatementAdapter.evaluate(StatementAdapter.java:36)
	at com.carrotsearch.randomizedtesting.ThreadLeakControl$StatementRunner.run(ThreadLeakControl.java:368)
	at com.carrotsearch.randomizedtesting.ThreadLeakControl.forkTimeoutingTask(ThreadLeakControl.java:817)
	at com.carrotsearch.randomizedtesting.ThreadLeakControl$3.evaluate(ThreadLeakControl.java:468)
	at com.carrotsearch.randomizedtesting.RandomizedRunner.runSingleTest(RandomizedRunner.java:943)
	at com.carrotsearch.randomizedtesting.RandomizedRunner$5.evaluate(RandomizedRunner.java:829)
	at com.carrotsearch.randomizedtesting.RandomizedRunner$6.evaluate(RandomizedRunner.java:879)
	at com.carrotsearch.randomizedtesting.RandomizedRunner$7.evaluate(RandomizedRunner.java:890)
	at com.carrotsearch.randomizedtesting.rules.StatementAdapter.evaluate(StatementAdapter.java:36)
	at com.carrotsearch.randomizedtesting.rules.SystemPropertiesRestoreRule$1.evaluate(SystemPropertiesRestoreRule.java:57)
	at org.apache.lucene.util.AbstractBeforeAfterRule$1.evaluate(AbstractBeforeAfterRule.java:45)
	at com.carrotsearch.randomizedtesting.rules.StatementAdapter.evaluate(StatementAdapter.java:36)
	at org.apache.lucene.util.TestRuleStoreClassName$1.evaluate(TestRuleStoreClassName.java:41)
	at com.carrotsearch.randomizedtesting.rules.NoShadowingOrOverridesOnMethodsRule$1.evaluate(NoShadowingOrOverridesOnMethodsRule.java:40)
	at com.carrotsearch.randomizedtesting.rules.NoShadowingOrOverridesOnMethodsRule$1.evaluate(NoShadowingOrOverridesOnMethodsRule.java:40)
	at com.carrotsearch.randomizedtesting.rules.StatementAdapter.evaluate(StatementAdapter.java:36)
	at com.carrotsearch.randomizedtesting.rules.StatementAdapter.evaluate(StatementAdapter.java:36)
	at com.carrotsearch.randomizedtesting.rules.StatementAdapter.evaluate(StatementAdapter.java:36)
	at org.apache.lucene.util.TestRuleAssertionsRequired$1.evaluate(TestRuleAssertionsRequired.java:53)
	at org.apache.lucene.util.TestRuleMarkFailure$1.evaluate(TestRuleMarkFailure.java:47)
	at org.apache.lucene.util.TestRuleIgnoreAfterMaxFailures$1.evaluate(TestRuleIgnoreAfterMaxFailures.java:64)
	at org.apache.lucene.util.TestRuleIgnoreTestSuites$1.evaluate(TestRuleIgnoreTestSuites.java:54)
	at com.carrotsearch.randomizedtesting.rules.StatementAdapter.evaluate(StatementAdapter.java:36)
	at com.carrotsearch.randomizedtesting.ThreadLeakControl$StatementRunner.run(ThreadLeakControl.java:368)
	at java.lang.Thread.run(Thread.java:748)


FAILED:  org.apache.solr.cloud.AliasIntegrationTest.testModifyMetadataV1

Error Message:


Stack Trace:
java.lang.AssertionError
	at __randomizedtesting.SeedInfo.seed([4A7B1ECF67D5A9F6:9B1BA0064779BAAF]:0)
	at org.junit.Assert.fail(Assert.java:92)
	at org.junit.Assert.assertTrue(Assert.java:43)
	at org.junit.Assert.assertTrue(Assert.java:54)
	at org.apache.solr.cloud.AliasIntegrationTest.checkFooAndBarMeta(AliasIntegrationTest.java:283)
	at org.apache.solr.cloud.AliasIntegrationTest.testModifyMetadataV1(AliasIntegrationTest.java:251)
	at sun.reflect.NativeMethodAccessorImpl.invoke0(Native Method)
	at sun.reflect.NativeMethodAccessorImpl.invoke(NativeMethodAccessorImpl.java:62)
	at sun.reflect.DelegatingMethodAccessorImpl.invoke(DelegatingMethodAccessorImpl.java:43)
	at java.lang.reflect.Method.invoke(Method.java:498)
	at com.carrotsearch.randomizedtesting.RandomizedRunner.invoke(RandomizedRunner.java:1737)
	at com.carrotsearch.randomizedtesting.RandomizedRunner$8.evaluate(RandomizedRunner.java:934)
	at com.carrotsearch.randomizedtesting.RandomizedRunner$9.evaluate(RandomizedRunner.java:970)
	at com.carrotsearch.randomizedtesting.RandomizedRunner$10.evaluate(RandomizedRunner.java:984)
	at com.carrotsearch.randomizedtesting.rules.SystemPropertiesRestoreRule$1.evaluate(SystemPropertiesRestoreRule.java:57)
	at org.apache.lucene.util.TestRuleSetupTeardownChained$1.evaluate(TestRuleSetupTeardownChained.java:49)
	at org.apache.lucene.util.AbstractBeforeAfterRule$1.evaluate(AbstractBeforeAfterRule.java:45)
	at org.apache.lucene.util.TestRuleThreadAndTestName$1.evaluate(TestRuleThreadAndTestName.java:48)
	at org.apache.lucene.util.TestRuleIgnoreAfterMaxFailures$1.evaluate(TestRuleIgnoreAfterMaxFailures.java:64)
	at org.apache.lucene.util.TestRuleMarkFailure$1.evaluate(TestRuleMarkFailure.java:47)
	at com.carrotsearch.randomizedtesting.rules.StatementAdapter.evaluate(StatementAdapter.java:36)
	at com.carrotsearch.randomizedtesting.ThreadLeakControl$StatementRunner.run(ThreadLeakControl.java:368)
	at com.carrotsearch.randomizedtesting.ThreadLeakControl.forkTimeoutingTask(ThreadLeakControl.java:817)
	at com.carrotsearch.randomizedtesting.ThreadLeakControl$3.evaluate(ThreadLeakControl.java:468)
	at com.carrotsearch.randomizedtesting.RandomizedRunner.runSingleTest(RandomizedRunner.java:943)
	at com.carrotsearch.randomizedtesting.RandomizedRunner$5.evaluate(RandomizedRunner.java:829)
	at com.carrotsearch.randomizedtesting.RandomizedRunner$6.evaluate(RandomizedRunner.java:879)
	at com.carrotsearch.randomizedtesting.RandomizedRunner$7.evaluate(RandomizedRunner.java:890)
	at com.carrotsearch.randomizedtesting.rules.StatementAdapter.evaluate(StatementAdapter.java:36)
	at com.carrotsearch.randomizedtesting.rules.SystemPropertiesRestoreRule$1.evaluate(SystemPropertiesRestoreRule.java:57)
	at org.apache.lucene.util.AbstractBeforeAfterRule$1.evaluate(AbstractBeforeAfterRule.java:45)
	at com.carrotsearch.randomizedtesting.rules.StatementAdapter.evaluate(StatementAdapter.java:36)
	at org.apache.lucene.util.TestRuleStoreClassName$1.evaluate(TestRuleStoreClassName.java:41)
	at com.carrotsearch.randomizedtesting.rules.NoShadowingOrOverridesOnMethodsRule$1.evaluate(NoShadowingOrOverridesOnMethodsRule.java:40)
	at com.carrotsearch.randomizedtesting.rules.NoShadowingOrOverridesOnMethodsRule$1.evaluate(NoShadowingOrOverridesOnMethodsRule.java:40)
	at com.carrotsearch.randomizedtesting.rules.StatementAdapter.evaluate(StatementAdapter.java:36)
	at com.carrotsearch.randomizedtesting.rules.StatementAdapter.evaluate(StatementAdapter.java:36)
	at com.carrotsearch.randomizedtesting.rules.StatementAdapter.evaluate(StatementAdapter.java:36)
	at org.apache.lucene.util.TestRuleAssertionsRequired$1.evaluate(TestRuleAssertionsRequired.java:53)
	at org.apache.lucene.util.TestRuleMarkFailure$1.evaluate(TestRuleMarkFailure.java:47)
	at org.apache.lucene.util.TestRuleIgnoreAfterMaxFailures$1.evaluate(TestRuleIgnoreAfterMaxFailures.java:64)
	at org.apache.lucene.util.TestRuleIgnoreTestSuites$1.evaluate(TestRuleIgnoreTestSuites.java:54)
	at com.carrotsearch.randomizedtesting.rules.StatementAdapter.evaluate(StatementAdapter.java:36)
	at com.carrotsearch.randomizedtesting.ThreadLeakControl$StatementRunner.run(ThreadLeakControl.java:368)
	at java.lang.Thread.run(Thread.java:748)




Build Log:
[...truncated 7376 lines...]
   [junit4] Suite: org.apache.lucene.codecs.simpletext.TestSimpleTextPostingsFormat
   [junit4]   2> лют 02, 2018 2:43:31 AM com.carrotsearch.randomizedtesting.RandomizedRunner$QueueUncaughtExceptionsHandler uncaughtException
   [junit4]   2> WARNING: Uncaught exception in thread: Thread[Thread-24,5,TGRP-TestSimpleTextPostingsFormat]
   [junit4]   2> java.lang.RuntimeException: java.lang.AssertionError: position is wrong expected:<0> but was:<-1>
   [junit4]   2> 	at __randomizedtesting.SeedInfo.seed([305C644F49CC26AA]:0)
   [junit4]   2> 	at org.apache.lucene.index.RandomPostingsTester$TestThread.run(RandomPostingsTester.java:1208)
   [junit4]   2> Caused by: java.lang.AssertionError: position is wrong expected:<0> but was:<-1>
   [junit4]   2> 	at org.junit.Assert.fail(Assert.java:93)
   [junit4]   2> 	at org.junit.Assert.failNotEquals(Assert.java:647)
   [junit4]   2> 	at org.junit.Assert.assertEquals(Assert.java:128)
   [junit4]   2> 	at org.junit.Assert.assertEquals(Assert.java:472)
   [junit4]   2> 	at org.apache.lucene.index.RandomPostingsTester.verifyEnum(RandomPostingsTester.java:1099)
   [junit4]   2> 	at org.apache.lucene.index.RandomPostingsTester.testTermsOneThread(RandomPostingsTester.java:1330)
   [junit4]   2> 	at org.apache.lucene.index.RandomPostingsTester.access$100(RandomPostingsTester.java:65)
   [junit4]   2> 	at org.apache.lucene.index.RandomPostingsTester$TestThread.run(RandomPostingsTester.java:1206)
   [junit4]   2> 
   [junit4]   2> лют 02, 2018 2:43:31 AM com.carrotsearch.randomizedtesting.RandomizedRunner$QueueUncaughtExceptionsHandler uncaughtException
   [junit4]   2> WARNING: Uncaught exception in thread: Thread[Thread-25,5,TGRP-TestSimpleTextPostingsFormat]
   [junit4]   2> java.lang.RuntimeException: java.lang.AssertionError: position is wrong expected:<0> but was:<-1>
   [junit4]   2> 	at __randomizedtesting.SeedInfo.seed([305C644F49CC26AA]:0)
   [junit4]   2> 	at org.apache.lucene.index.RandomPostingsTester$TestThread.run(RandomPostingsTester.java:1208)
   [junit4]   2> Caused by: java.lang.AssertionError: position is wrong expected:<0> but was:<-1>
   [junit4]   2> 	at org.junit.Assert.fail(Assert.java:93)
   [junit4]   2> 	at org.junit.Assert.failNotEquals(Assert.java:647)
   [junit4]   2> 	at org.junit.Assert.assertEquals(Assert.java:128)
   [junit4]   2> 	at org.junit.Assert.assertEquals(Assert.java:472)
   [junit4]   2> 	at org.apache.lucene.index.RandomPostingsTester.verifyEnum(RandomPostingsTester.java:1099)
   [junit4]   2> 	at org.apache.lucene.index.RandomPostingsTester.testTermsOneThread(RandomPostingsTester.java:1330)
   [junit4]   2> 	at org.apache.lucene.index.RandomPostingsTester.access$100(RandomPostingsTester.java:65)
   [junit4]   2> 	at org.apache.lucene.index.RandomPostingsTester$TestThread.run(RandomPostingsTester.java:1206)
   [junit4]   2> 
   [junit4]   2> лют 02, 2018 2:43:33 AM com.carrotsearch.randomizedtesting.RandomizedRunner$QueueUncaughtExceptionsHandler uncaughtException
   [junit4]   2> WARNING: Uncaught exception in thread: Thread[Thread-23,5,TGRP-TestSimpleTextPostingsFormat]
   [junit4]   2> java.lang.RuntimeException: java.lang.AssertionError: position is wrong expected:<4> but was:<-1>
   [junit4]   2> 	at __randomizedtesting.SeedInfo.seed([305C644F49CC26AA]:0)
   [junit4]   2> 	at org.apache.lucene.index.RandomPostingsTester$TestThread.run(RandomPostingsTester.java:1208)
   [junit4]   2> Caused by: java.lang.AssertionError: position is wrong expected:<4> but was:<-1>
   [junit4]   2> 	at org.junit.Assert.fail(Assert.java:93)
   [junit4]   2> 	at org.junit.Assert.failNotEquals(Assert.java:647)
   [junit4]   2> 	at org.junit.Assert.assertEquals(Assert.java:128)
   [junit4]   2> 	at org.junit.Assert.assertEquals(Assert.java:472)
   [junit4]   2> 	at org.apache.lucene.index.RandomPostingsTester.verifyEnum(RandomPostingsTester.java:1099)
   [junit4]   2> 	at org.apache.lucene.index.RandomPostingsTester.testTermsOneThread(RandomPostingsTester.java:1330)
   [junit4]   2> 	at org.apache.lucene.index.RandomPostingsTester.access$100(RandomPostingsTester.java:65)
   [junit4]   2> 	at org.apache.lucene.index.RandomPostingsTester$TestThread.run(RandomPostingsTester.java:1206)
   [junit4]   2> 
   [junit4]   2> лют 02, 2018 2:43:33 AM com.carrotsearch.randomizedtesting.RandomizedRunner$QueueUncaughtExceptionsHandler uncaughtException
   [junit4]   2> WARNING: Uncaught exception in thread: Thread[Thread-27,5,TGRP-TestSimpleTextPostingsFormat]
   [junit4]   2> java.lang.RuntimeException: java.lang.AssertionError: position is wrong expected:<0> but was:<-1>
   [junit4]   2> 	at __randomizedtesting.SeedInfo.seed([305C644F49CC26AA]:0)
   [junit4]   2> 	at org.apache.lucene.index.RandomPostingsTester$TestThread.run(RandomPostingsTester.java:1208)
   [junit4]   2> Caused by: java.lang.AssertionError: position is wrong expected:<0> but was:<-1>
   [junit4]   2> 	at org.junit.Assert.fail(Assert.java:93)
   [junit4]   2> 	at org.junit.Assert.failNotEquals(Assert.java:647)
   [junit4]   2> 	at org.junit.Assert.assertEquals(Assert.java:128)
   [junit4]   2> 	at org.junit.Assert.assertEquals(Assert.java:472)
   [junit4]   2> 	at org.apache.lucene.index.RandomPostingsTester.verifyEnum(RandomPostingsTester.java:1099)
   [junit4]   2> 	at org.apache.lucene.index.RandomPostingsTester.testTermsOneThread(RandomPostingsTester.java:1330)
   [junit4]   2> 	at org.apache.lucene.index.RandomPostingsTester.access$100(RandomPostingsTester.java:65)
   [junit4]   2> 	at org.apache.lucene.index.RandomPostingsTester$TestThread.run(RandomPostingsTester.java:1206)
   [junit4]   2> 
   [junit4]   2> лют 02, 2018 2:43:33 AM com.carrotsearch.randomizedtesting.RandomizedRunner$QueueUncaughtExceptionsHandler uncaughtException
   [junit4]   2> WARNING: Uncaught exception in thread: Thread[Thread-28,5,TGRP-TestSimpleTextPostingsFormat]
   [junit4]   2> java.lang.RuntimeException: java.lang.AssertionError: position is wrong expected:<60> but was:<-1>
   [junit4]   2> 	at __randomizedtesting.SeedInfo.seed([305C644F49CC26AA]:0)
   [junit4]   2> 	at org.apache.lucene.index.RandomPostingsTester$TestThread.run(RandomPostingsTester.java:1208)
   [junit4]   2> Caused by: java.lang.AssertionError: position is wrong expected:<60> but was:<-1>
   [junit4]   2> 	at org.junit.Assert.fail(Assert.java:93)
   [junit4]   2> 	at org.junit.Assert.failNotEquals(Assert.java:647)
   [junit4]   2> 	at org.junit.Assert.assertEquals(Assert.java:128)
   [junit4]   2> 	at org.junit.Assert.assertEquals(Assert.java:472)
   [junit4]   2> 	at org.apache.lucene.index.RandomPostingsTester.verifyEnum(RandomPostingsTester.java:1099)
   [junit4]   2> 	at org.apache.lucene.index.RandomPostingsTester.testTermsOneThread(RandomPostingsTester.java:1330)
   [junit4]   2> 	at org.apache.lucene.index.RandomPostingsTester.access$100(RandomPostingsTester.java:65)
   [junit4]   2> 	at org.apache.lucene.index.RandomPostingsTester$TestThread.run(RandomPostingsTester.java:1206)
   [junit4]   2> 
   [junit4]   2> лют 02, 2018 2:43:33 AM com.carrotsearch.randomizedtesting.RandomizedRunner$QueueUncaughtExceptionsHandler uncaughtException
   [junit4]   2> WARNING: Uncaught exception in thread: Thread[Thread-26,5,TGRP-TestSimpleTextPostingsFormat]
   [junit4]   2> java.lang.RuntimeException: java.lang.AssertionError: position is wrong expected:<2> but was:<-1>
   [junit4]   2> 	at __randomizedtesting.SeedInfo.seed([305C644F49CC26AA]:0)
   [junit4]   2> 	at org.apache.lucene.index.RandomPostingsTester$TestThread.run(RandomPostingsTester.java:1208)
   [junit4]   2> Caused by: java.lang.AssertionError: position is wrong expected:<2> but was:<-1>
   [junit4]   2> 	at org.junit.Assert.fail(Assert.java:93)
   [junit4]   2> 	at org.junit.Assert.failNotEquals(Assert.java:647)
   [junit4]   2> 	at org.junit.Assert.assertEquals(Assert.java:128)
   [junit4]   2> 	at org.junit.Assert.assertEquals(Assert.java:472)
   [junit4]   2> 	at org.apache.lucene.index.RandomPostingsTester.verifyEnum(RandomPostingsTester.java:1099)
   [junit4]   2> 	at org.apache.lucene.index.RandomPostingsTester.testTermsOneThread(RandomPostingsTester.java:1330)
   [junit4]   2> 	at org.apache.lucene.index.RandomPostingsTester.access$100(RandomPostingsTester.java:65)
   [junit4]   2> 	at org.apache.lucene.index.RandomPostingsTester$TestThread.run(RandomPostingsTester.java:1206)
   [junit4]   2> 
   [junit4]   2> лют 02, 2018 2:43:33 AM com.carrotsearch.randomizedtesting.RandomizedRunner$QueueUncaughtExceptionsHandler uncaughtException
   [junit4]   2> WARNING: Uncaught exception in thread: Thread[Thread-29,5,TGRP-TestSimpleTextPostingsFormat]
   [junit4]   2> java.lang.RuntimeException: java.lang.AssertionError: position is wrong expected:<0> but was:<-1>
   [junit4]   2> 	at __randomizedtesting.SeedInfo.seed([305C644F49CC26AA]:0)
   [junit4]   2> 	at org.apache.lucene.index.RandomPostingsTester$TestThread.run(RandomPostingsTester.java:1208)
   [junit4]   2> Caused by: java.lang.AssertionError: position is wrong expected:<0> but was:<-1>
   [junit4]   2> 	at org.junit.Assert.fail(Assert.java:93)
   [junit4]   2> 	at org.junit.Assert.failNotEquals(Assert.java:647)
   [junit4]   2> 	at org.junit.Assert.assertEquals(Assert.java:128)
   [junit4]   2> 	at org.junit.Assert.assertEquals(Assert.java:472)
   [junit4]   2> 	at org.apache.lucene.index.RandomPostingsTester.verifyEnum(RandomPostingsTester.java:1099)
   [junit4]   2> 	at org.apache.lucene.index.RandomPostingsTester.testTermsOneThread(RandomPostingsTester.java:1330)
   [junit4]   2> 	at org.apache.lucene.index.RandomPostingsTester.access$100(RandomPostingsTester.java:65)
   [junit4]   2> 	at org.apache.lucene.index.RandomPostingsTester$TestThread.run(RandomPostingsTester.java:1206)
   [junit4]   2> 
   [junit4]   2> лют 02, 2018 2:43:33 AM com.carrotsearch.randomizedtesting.RandomizedRunner$QueueUncaughtExceptionsHandler uncaughtException
   [junit4]   2> WARNING: Uncaught exception in thread: Thread[Thread-30,5,TGRP-TestSimpleTextPostingsFormat]
   [junit4]   2> java.lang.RuntimeException: java.lang.AssertionError: position is wrong expected:<0> but was:<-1>
   [junit4]   2> 	at __randomizedtesting.SeedInfo.seed([305C644F49CC26AA]:0)
   [junit4]   2> 	at org.apache.lucene.index.RandomPostingsTester$TestThread.run(RandomPostingsTester.java:1208)
   [junit4]   2> Caused by: java.lang.AssertionError: position is wrong expected:<0> but was:<-1>
   [junit4]   2> 	at org.junit.Assert.fail(Assert.java:93)
   [junit4]   2> 	at org.junit.Assert.failNotEquals(Assert.java:647)
   [junit4]   2> 	at org.junit.Assert.assertEquals(Assert.java:128)
   [junit4]   2> 	at org.junit.Assert.assertEquals(Assert.java:472)
   [junit4]   2> 	at org.apache.lucene.index.RandomPostingsTester.verifyEnum(RandomPostingsTester.java:1099)
   [junit4]   2> 	at org.apache.lucene.index.RandomPostingsTester.testTermsOneThread(RandomPostingsTester.java:1330)
   [junit4]   2> 	at org.apache.lucene.index.RandomPostingsTester.access$100(RandomPostingsTester.java:65)
   [junit4]   2> 	at org.apache.lucene.index.RandomPostingsTester$TestThread.run(RandomPostingsTester.java:1206)
   [junit4]   2> 
   [junit4]   2> лют 02, 2018 2:43:33 AM com.carrotsearch.randomizedtesting.RandomizedRunner$QueueUncaughtExceptionsHandler uncaughtException
   [junit4]   2> WARNING: Uncaught exception in thread: Thread[Thread-31,5,TGRP-TestSimpleTextPostingsFormat]
   [junit4]   2> java.lang.RuntimeException: java.lang.AssertionError: position is wrong expected:<0> but was:<-1>
   [junit4]   2> 	at __randomizedtesting.SeedInfo.seed([305C644F49CC26AA]:0)
   [junit4]   2> 	at org.apache.lucene.index.RandomPostingsTester$TestThread.run(RandomPostingsTester.java:1208)
   [junit4]   2> Caused by: java.lang.AssertionError: position is wrong expected:<0> but was:<-1>
   [junit4]   2> 	at org.junit.Assert.fail(Assert.java:93)
   [junit4]   2> 	at org.junit.Assert.failNotEquals(Assert.java:647)
   [junit4]   2> 	at org.junit.Assert.assertEquals(Assert.java:128)
   [junit4]   2> 	at org.junit.Assert.assertEquals(Assert.java:472)
   [junit4]   2> 	at org.apache.lucene.index.RandomPostingsTester.verifyEnum(RandomPostingsTester.java:1099)
   [junit4]   2> 	at org.apache.lucene.index.RandomPostingsTester.testTermsOneThread(RandomPostingsTester.java:1330)
   [junit4]   2> 	at org.apache.lucene.index.RandomPostingsTester.access$100(RandomPostingsTester.java:65)
   [junit4]   2> 	at org.apache.lucene.index.RandomPostingsTester$TestThread.run(RandomPostingsTester.java:1206)
   [junit4]   2> 
   [junit4]   2> лют 02, 2018 2:43:33 AM com.carrotsearch.randomizedtesting.RandomizedRunner$QueueUncaughtExceptionsHandler uncaughtException
   [junit4]   2> WARNING: Uncaught exception in thread: Thread[Thread-33,5,TGRP-TestSimpleTextPostingsFormat]
   [junit4]   2> java.lang.RuntimeException: java.lang.AssertionError: position is wrong expected:<0> but was:<-1>
   [junit4]   2> 	at __randomizedtesting.SeedInfo.seed([305C644F49CC26AA]:0)
   [junit4]   2> 	at org.apache.lucene.index.RandomPostingsTester$TestThread.run(RandomPostingsTester.java:1208)
   [junit4]   2> Caused by: java.lang.AssertionError: position is wrong expected:<0> but was:<-1>
   [junit4]   2> 	at org.junit.Assert.fail(Assert.java:93)
   [junit4]   2> 	at org.junit.Assert.failNotEquals(Assert.java:647)
   [junit4]   2> 	at org.junit.Assert.assertEquals(Assert.java:128)
   [junit4]   2> 	at org.junit.Assert.assertEquals(Assert.java:472)
   [junit4]   2> 	at org.apache.lucene.index.RandomPostingsTester.verifyEnum(RandomPostingsTester.java:1099)
   [junit4]   2> 	at org.apache.lucene.index.RandomPostingsTester.testTermsOneThread(RandomPostingsTester.java:1330)
   [junit4]   2> 	at org.apache.lucene.index.RandomPostingsTester.access$100(RandomPostingsTester.java:65)
   [junit4]   2> 	at org.apache.lucene.index.RandomPostingsTester$TestThread.run(RandomPostingsTester.java:1206)
   [junit4]   2> 
   [junit4]   2> лют 02, 2018 2:43:33 AM com.carrotsearch.randomizedtesting.RandomizedRunner$QueueUncaughtExceptionsHandler uncaughtException
   [junit4]   2> WARNING: Uncaught exception in thread: Thread[Thread-32,5,TGRP-TestSimpleTextPostingsFormat]
   [junit4]   2> java.lang.RuntimeException: java.lang.AssertionError: position is wrong expected:<0> but was:<-1>
   [junit4]   2> 	at __randomizedtesting.SeedInfo.seed([305C644F49CC26AA]:0)
   [junit4]   2> 	at org.apache.lucene.index.RandomPostingsTester$TestThread.run(RandomPostingsTester.java:1208)
   [junit4]   2> Caused by: java.lang.AssertionError: position is wrong expected:<0> but was:<-1>
   [junit4]   2> 	at org.junit.Assert.fail(Assert.java:93)
   [junit4]   2> 	at org.junit.Assert.failNotEquals(Assert.java:647)
   [junit4]   2> 	at org.junit.Assert.assertEquals(Assert.java:128)
   [junit4]   2> 	at org.junit.Assert.assertEquals(Assert.java:472)
   [junit4]   2> 	at org.apache.lucene.index.RandomPostingsTester.verifyEnum(RandomPostingsTester.java:1099)
   [junit4]   2> 	at org.apache.lucene.index.RandomPostingsTester.testTermsOneThread(RandomPostingsTester.java:1330)
   [junit4]   2> 	at org.apache.lucene.index.RandomPostingsTester.access$100(RandomPostingsTester.java:65)
   [junit4]   2> 	at org.apache.lucene.index.RandomPostingsTester$TestThread.run(RandomPostingsTester.java:1206)
   [junit4]   2> 
   [junit4]   2> NOTE: download the large Jenkins line-docs file by running 'ant get-jenkins-line-docs' in the lucene directory.
   [junit4]   2> NOTE: reproduce with: ant test  -Dtestcase=TestSimpleTextPostingsFormat -Dtests.method=testDocsAndFreqsAndPositionsAndOffsetsAndPayloads -Dtests.seed=305C644F49CC26AA -Dtests.multiplier=2 -Dtests.nightly=true -Dtests.slow=true -Dtests.linedocsfile=/home/jenkins/jenkins-slave/workspace/Lucene-Solr-NightlyTests-master/test-data/enwiki.random.lines.txt -Dtests.locale=be -Dtests.timezone=Asia/Tokyo -Dtests.asserts=true -Dtests.file.encoding=UTF-8
   [junit4] ERROR   1337s J2 | TestSimpleTextPostingsFormat.testDocsAndFreqsAndPositionsAndOffsetsAndPayloads <<<
   [junit4]    > Throwable #1: com.carrotsearch.randomizedtesting.UncaughtExceptionError: Captured an uncaught exception in thread: Thread[id=36, name=Thread-24, state=RUNNABLE, group=TGRP-TestSimpleTextPostingsFormat]
   [junit4]    > Caused by: java.lang.RuntimeException: java.lang.AssertionError: position is wrong expected:<0> but was:<-1>
   [junit4]    > 	at __randomizedtesting.SeedInfo.seed([305C644F49CC26AA]:0)
   [junit4]    > 	at org.apache.lucene.index.RandomPostingsTester$TestThread.run(RandomPostingsTester.java:1208)
   [junit4]    > Caused by: java.lang.AssertionError: position is wrong expected:<0> but was:<-1>
   [junit4]    > 	at org.apache.lucene.index.RandomPostingsTester.verifyEnum(RandomPostingsTester.java:1099)
   [junit4]    > 	at org.apache.lucene.index.RandomPostingsTester.testTermsOneThread(RandomPostingsTester.java:1330)
   [junit4]    > 	at org.apache.lucene.index.RandomPostingsTester.access$100(RandomPostingsTester.java:65)
   [junit4]    > 	at org.apache.lucene.index.RandomPostingsTester$TestThread.run(RandomPostingsTester.java:1206)Throwable #2: com.carrotsearch.randomizedtesting.UncaughtExceptionError: Captured an uncaught exception in thread: Thread[id=37, name=Thread-25, state=RUNNABLE, group=TGRP-TestSimpleTextPostingsFormat]
   [junit4]    > Caused by: java.lang.RuntimeException: java.lang.AssertionError: position is wrong expected:<0> but was:<-1>
   [junit4]    > 	at __randomizedtesting.SeedInfo.seed([305C644F49CC26AA]:0)
   [junit4]    > 	at org.apache.lucene.index.RandomPostingsTester$TestThread.run(RandomPostingsTester.java:1208)
   [junit4]    > Caused by: java.lang.AssertionError: position is wrong expected:<0> but was:<-1>
   [junit4]    > 	at org.apache.lucene.index.RandomPostingsTester.verifyEnum(RandomPostingsTester.java:1099)
   [junit4]    > 	at org.apache.lucene.index.RandomPostingsTester.testTermsOneThread(RandomPostingsTester.java:1330)
   [junit4]    > 	at org.apache.lucene.index.RandomPostingsTester.access$100(RandomPostingsTester.java:65)
   [junit4]    > 	at org.apache.lucene.index.RandomPostingsTester$TestThread.run(RandomPostingsTester.java:1206)Throwable #3: com.carrotsearch.randomizedtesting.UncaughtExceptionError: Captured an uncaught exception in thread: Thread[id=35, name=Thread-23, state=RUNNABLE, group=TGRP-TestSimpleTextPostingsFormat]
   [junit4]    > Caused by: java.lang.RuntimeException: java.lang.AssertionError: position is wrong expected:<4> but was:<-1>
   [junit4]    > 	at __randomizedtesting.SeedInfo.seed([305C644F49CC26AA]:0)
   [junit4]    > 	at org.apache.lucene.index.RandomPostingsTester$TestThread.run(RandomPostingsTester.java:1208)
   [junit4]    > Caused by: java.lang.AssertionError: position is wrong expected:<4> but was:<-1>
   [junit4]    > 	at org.apache.lucene.index.RandomPostingsTester.verifyEnum(RandomPostingsTester.java:1099)
   [junit4]    > 	at org.apache.lucene.index.RandomPostingsTester.testTermsOneThread(RandomPostingsTester.java:1330)
   [junit4]    > 	at org.apache.lucene.index.RandomPostingsTester.access$100(RandomPostingsTester.java:65)
   [junit4]    > 	at org.apache.lucene.index.RandomPostingsTester$TestThread.run(RandomPostingsTester.java:1206)Throwable #4: com.carrotsearch.randomizedtesting.UncaughtExceptionError: Captured an uncaught exception in thread: Thread[id=39, name=Thread-27, state=RUNNABLE, group=TGRP-TestSimpleTextPostingsFormat]
   [junit4]    > Caused by: java.lang.RuntimeException: java.lang.AssertionError: position is wrong expected:<0> but was:<-1>
   [junit4]    > 	at __randomizedtesting.SeedInfo.seed([305C644F49CC26AA]:0)
   [junit4]    > 	at org.apache.lucene.index.RandomPostingsTester$TestThread.run(RandomPostingsTester.java:1208)
   [junit4]    > Caused by: java.lang.AssertionError: position is wrong expected:<0> but was:<-1>
   [junit4]    > 	at org.apache.lucene.index.RandomPostingsTester.verifyEnum(RandomPostingsTester.java:1099)
   [junit4]    > 	at org.apache.lucene.index.RandomPostingsTester.testTermsOneThread(RandomPostingsTester.java:1330)
   [junit4]    > 	at org.apache.lucene.index.RandomPostingsTester.access$100(RandomPostingsTester.java:65)
   [junit4]    > 	at org.apache.lucene.index.RandomPostingsTester$TestThread.run(RandomPostingsTester.java:1206)Throwable #5: com.carrotsearch.randomizedtesting.UncaughtExceptionError: Captured an uncaught exception in thread: Thread[id=40, name=Thread-28, state=RUNNABLE, group=TGRP-TestSimpleTextPostingsFormat]
   [junit4]    > Caused by: java.lang.RuntimeException: java.lang.AssertionError: position is wrong expected:<60> but was:<-1>
   [junit4]    > 	at __randomizedtesting.SeedInfo.seed([305C644F49CC26AA]:0)
   [junit4]    > 	at org.apache.lucene.index.RandomPostingsTester$TestThread.run(RandomPostingsTester.java:1208)
   [junit4]    > Caused by: java.lang.AssertionError: position is wrong expected:<60> but was:<-1>
   [junit4]    > 	at org.apache.lucene.index.RandomPostingsTester.verifyEnum(RandomPostingsTester.java:1099)
   [junit4]    > 	at org.apache.lucene.index.RandomPostingsTester.testTermsOneThread(RandomPostingsTester.java:1330)
   [junit4]    > 	at org.apache.lucene.index.RandomPostingsTester.access$100(RandomPostingsTester.java:65)
   [junit4]    > 	at org.apache.lucene.index.RandomPostingsTester$TestThread.run(RandomPostingsTester.java:1206)Throwable #6: com.carrotsearch.randomizedtesting.UncaughtExceptionError: Captured an uncaught exception in thread: Thread[id=38, name=Thread-26, state=RUNNABLE, group=TGRP-TestSimpleTextPostingsFormat]
   [junit4]    > Caused by: java.lang.RuntimeException: java.lang.AssertionError: position is wrong expected:<2> but was:<-1>
   [junit4]    > 	at __randomizedtesting.SeedInfo.seed([305C644F49CC26AA]:0)
   [junit4]    > 	at org.apache.lucene.index.RandomPostingsTester$TestThread.run(RandomPostingsTester.java:1208)
   [junit4]    > Caused by: java.lang.AssertionError: position is wrong expected:<2> but was:<-1>
   [junit4]    > 	at org.apache.lucene.index.RandomPostingsTester.verifyEnum(RandomPostingsTester.java:1099)
   [junit4]    > 	at org.apache.lucene.index.RandomPostingsTester.testTermsOneThread(RandomPostingsTester.java:1330)
   [junit4]    > 	at org.apache.lucene.index.RandomPostingsTester.access$100(RandomPostingsTester.java:65)
   [junit4]    > 	at org.apache.lucene.index.RandomPostingsTester$TestThread.run(RandomPostingsTester.java:1206)Throwable #7: com.carrotsearch.randomizedtesting.UncaughtExceptionError: Captured an uncaught exception in thread: Thread[id=41, name=Thread-29, state=RUNNABLE, group=TGRP-TestSimpleTextPostingsFormat]
   [junit4]    > Caused by: java.lang.RuntimeException: java.lang.AssertionError: position is wrong expected:<0> but was:<-1>
   [junit4]    > 	at __randomizedtesting.SeedInfo.seed([305C644F49CC26AA]:0)
   [junit4]    > 	at org.apache.lucene.index.RandomPostingsTester$TestThread.run(RandomPostingsTester.java:1208)
   [junit4]    > Caused by: java.lang.AssertionError: position is wrong expected:<0> but was:<-1>
   [junit4]    > 	at org.apache.lucene.index.RandomPostingsTester.verifyEnum(RandomPostingsTester.java:1099)
   [junit4]    > 	at org.apache.lucene.index.RandomPostingsTester.testTermsOneThread(RandomPostingsTester.java:1330)
   [junit4]    > 	at org.apache.lucene.index.RandomPostingsTester.access$100(RandomPostingsTester.java:65)
   [junit4]    > 	at org.apache.lucene.index.RandomPostingsTester$TestThread.run(RandomPostingsTester.java:1206)Throwable #8: com.carrotsearch.randomizedtesting.UncaughtExceptionError: Captured an uncaught exception in thread: Thread[id=42, name=Thread-30, state=RUNNABLE, group=TGRP-TestSimpleTextPostingsFormat]
   [junit4]    > Caused by: java.lang.RuntimeException: java.lang.AssertionError: position is wrong expected:<0> but was:<-1>
   [junit4]    > 	at __randomizedtesting.SeedInfo.seed([305C644F49CC26AA]:0)
   [junit4]    > 	at org.apache.lucene.index.RandomPostingsTester$TestThread.run(RandomPostingsTester.java:1208)
   [junit4]    > Caused by: java.lang.AssertionError: position is wrong expected:<0> but was:<-1>
   [junit4]    > 	at org.apache.lucene.index.RandomPostingsTester.verifyEnum(RandomPostingsTester.java:1099)
   [junit4]    > 	at org.apache.lucene.index.RandomPostingsTester.testTermsOneThread(RandomPostingsTester.java:1330)
   [junit4]    > 	at org.apache.lucene.index.RandomPostingsTester.access$100(RandomPostingsTester.java:65)
   [junit4]    > 	at org.apache.lucene.index.RandomPostingsTester$TestThread.run(RandomPostingsTester.java:1206)Throwable #9: com.carrotsearch.randomizedtesting.UncaughtExceptionError: Captured an uncaught exception in thread: Thread[id=43, name=Thread-31, state=RUNNABLE, group=TGRP-TestSimpleTextPostingsFormat]
   [junit4]    > Caused by: java.lang.RuntimeException: java.lang.AssertionError: position is wrong expected:<0> but was:<-1>
   [junit4]    > 	at __randomizedtesting.SeedInfo.seed([305C644F49CC26AA]:0)
   [junit4]    > 	at org.apache.lucene.index.RandomPostingsTester$TestThread.run(RandomPostingsTester.java:1208)
   [junit4]    > Caused by: java.lang.AssertionError: position is wrong expected:<0> but was:<-1>
   [junit4]    > 	at org.apache.lucene.index.RandomPostingsTester.verifyEnum(RandomPostingsTester.java:1099)
   [junit4]    > 	at org.apache.lucene.index.RandomPostingsTester.testTermsOneThread(RandomPostingsTester.java:1330)
   [junit4]    > 	at org.apache.lucene.index.RandomPostingsTester.access$100(RandomPostingsTester.java:65)
   [junit4]    > 	at org.apache.lucene.index.RandomPostingsTester$TestThread.run(RandomPostingsTester.java:1206)Throwable #10: com.carrotsearch.randomizedtesting.UncaughtExceptionError: Captured an uncaught exception in thread: Thread[id=45, name=Thread-33, state=RUNNABLE, group=TGRP-TestSimpleTextPostingsFormat]
   [junit4]    > Caused by: java.lang.RuntimeException: java.lang.AssertionError: position is wrong expected:<0> but was:<-1>
   [junit4]    > 	at __randomizedtesting.SeedInfo.seed([305C644F49CC26AA]:0)
   [junit4]    > 	at org.apache.lucene.index.RandomPostingsTester$TestThread.run(RandomPostingsTester.java:1208)
   [junit4]    > Caused by: java.lang.AssertionError: position is wrong expected:<0> but was:<-1>
   [junit4]    > 	at org.apache.lucene.index.RandomPostingsTester.verifyEnum(RandomPostingsTester.java:1099)
   [junit4]    > 	at org.apache.lucene.index.RandomPostingsTester.testTermsOneThread(RandomPostingsTester.java:1330)
   [junit4]    > 	at org.apache.lucene.index.RandomPostingsTester.access$100(RandomPostingsTester.java:65)
   [junit4]    > 	at org.apache.lucene.index.RandomPostingsTester$TestThread.run(RandomPostingsTester.java:1206)Throwable #11: com.carrotsearch.randomizedtesting.UncaughtExceptionError: Captured an uncaught exception in thread: Thread[id=44, name=Thread-32, state=RUNNABLE, group=TGRP-TestSimpleTextPostingsFormat]
   [junit4]    > Caused by: java.lang.RuntimeException: java.lang.AssertionError: position is wrong expected:<0> but was:<-1>
   [junit4]    > 	at __randomizedtesting.SeedInfo.seed([305C644F49CC26AA]:0)
   [junit4]    > 	at org.apache.lucene.index.RandomPostingsTester$TestThread.run(RandomPostingsTester.java:1208)
   [junit4]    > Caused by: java.lang.AssertionError: position is wrong expected:<0> but was:<-1>
   [junit4]    > 	at org.apache.lucene.index.RandomPostingsTester.verifyEnum(RandomPostingsTester.java:1099)
   [junit4]    > 	at org.apache.lucene.index.RandomPostingsTester.testTermsOneThread(RandomPostingsTester.java:1330)
   [junit4]    > 	at org.apache.lucene.index.RandomPostingsTester.access$100(RandomPostingsTester.java:65)
   [junit4]    > 	at org.apache.lucene.index.RandomPostingsTester$TestThread.run(RandomPostingsTester.java:1206)
   [junit4]   2> лют 02, 2018 2:52:13 AM com.carrotsearch.randomizedtesting.RandomizedRunner$QueueUncaughtExceptionsHandler uncaughtException
   [junit4]   2> WARNING: Uncaught exception in thread: Thread[Thread-45,5,TGRP-TestSimpleTextPostingsFormat]
   [junit4]   2> java.lang.RuntimeException: java.lang.AssertionError: position is wrong expected:<2> but was:<-1>
   [junit4]   2> 	at __randomizedtesting.SeedInfo.seed([305C644F49CC26AA]:0)
   [junit4]   2> 	at org.apache.lucene.index.RandomPostingsTester$TestThread.run(RandomPostingsTester.java:1208)
   [junit4]   2> Caused by: java.lang.AssertionError: position is wrong expected:<2> but was:<-1>
   [junit4]   2> 	at org.junit.Assert.fail(Assert.java:93)
   [junit4]   2> 	at org.junit.Assert.failNotEquals(Assert.java:647)
   [junit4]   2> 	at org.junit.Assert.assertEquals(Assert.java:128)
   [junit4]   2> 	at org.junit.Assert.assertEquals(Assert.java:472)
   [junit4]   2> 	at org.apache.lucene.index.RandomPostingsTester.verifyEnum(RandomPostingsTester.java:1099)
   [junit4]   2> 	at org.apache.lucene.index.RandomPostingsTester.testTermsOneThread(RandomPostingsTester.java:1330)
   [junit4]   2> 	at org.apache.lucene.index.RandomPostingsTester.access$100(RandomPostingsTester.java:65)
   [junit4]   2> 	at org.apache.lucene.index.RandomPostingsTester$TestThread.run(RandomPostingsTester.java:1206)
   [junit4]   2> 
   [junit4]   2> лют 02, 2018 2:52:13 AM com.carrotsearch.randomizedtesting.RandomizedRunner$QueueUncaughtExceptionsHandler uncaughtException
   [junit4]   2> WARNING: Uncaught exception in thread: Thread[Thread-46,5,TGRP-TestSimpleTextPostingsFormat]
   [junit4]   2> java.lang.RuntimeException: java.lang.AssertionError: position is wrong expected:<0> but was:<-1>
   [junit4]   2> 	at __randomizedtesting.SeedInfo.seed([305C644F49CC26AA]:0)
   [junit4]   2> 	at org.apache.lucene.index.RandomPostingsTester$TestThread.run(RandomPostingsTester.java:1208)
   [junit4]   2> Caused by: java.lang.AssertionError: position is wrong expected:<0> but was:<-1>
   [junit4]   2> 	at org.junit.Assert.fail(Assert.java:93)
   [junit4]   2> 	at org.junit.Assert.failNotEquals(Assert.java:647)
   [junit4]   2> 	at org.junit.Assert.assertEquals(Assert.java:128)
   [junit4]   2> 	at org.junit.Assert.assertEquals(Assert.java:472)
   [junit4]   2> 	at org.apache.lucene.index.RandomPostingsTester.verifyEnum(RandomPostingsTester.java:1099)
   [junit4]   2> 	at org.apache.lucene.index.RandomPostingsTester.testTermsOneThread(RandomPostingsTester.java:1330)
   [junit4]   2> 	at org.apache.lucene.index.RandomPostingsTester.access$100(RandomPostingsTester.java:65)
   [junit4]   2> 	at org.apache.lucene.index.RandomPostingsTester$TestThread.run(RandomPostingsTester.java:1206)
   [junit4]   2> 
   [junit4]   2> лют 02, 2018 2:52:13 AM com.carrotsearch.randomizedtesting.RandomizedRunner$QueueUncaughtExceptionsHandler uncaughtException
   [junit4]   2> WARNING: Uncaught exception in thread: Thread[Thread-47,5,TGRP-TestSimpleTextPostingsFormat]
   [junit4]   2> java.lang.RuntimeException: java.lang.AssertionError: position is wrong expected:<0> but was:<-1>
   [junit4]   2> 	at __randomizedtesting.SeedInfo.seed([305C644F49CC26AA]:0)
   [junit4]   2> 	at org.apache.lucene.index.RandomPostingsTester$TestThread.run(RandomPostingsTester.java:1208)
   [junit4]   2> Caused by: java.lang.AssertionError: position is wrong expected:<0> but was:<-1>
   [junit4]   2> 	at org.junit.Assert.fail(Assert.java:93)
   [junit4]   2> 	at org.junit.Assert.failNotEquals(Assert.java:647)
   [junit4]   2> 	at org.junit.Assert.assertEquals(Assert.java:128)
   [junit4]   2> 	at org.junit.Assert.assertEquals(Assert.java:472)
   [junit4]   2> 	at org.apache.lucene.index.RandomPostingsTester.verifyEnum(RandomPostingsTester.java:1099)
   [junit4]   2> 	at org.apache.lucene.index.RandomPostingsTester.testTermsOneThread(RandomPostingsTester.java:1330)
   [junit4]   2> 	at org.apache.lucene.index.RandomPostingsTester.access$100(RandomPostingsTester.java:65)
   [junit4]   2> 	at org.apache.lucene.index.RandomPostingsTester$TestThread.run(RandomPostingsTester.java:1206)
   [junit4]   2> 
   [junit4]   2> лют 02, 2018 2:52:13 AM com.carrotsearch.randomizedtesting.RandomizedRunner$QueueUncaughtExceptionsHandler uncaughtException
   [junit4]   2> WARNING: Uncaught exception in thread: Thread[Thread-48,5,TGRP-TestSimpleTextPostingsFormat]
   [junit4]   2> java.lang.RuntimeException: java.lang.AssertionError: position is wrong expected:<0> but was:<-1>
   [junit4]   2> 	at __randomizedtesting.SeedInfo.seed([305C644F49CC26AA]:0)
   [junit4]   2> 	at org.apache.lucene.index.RandomPostingsTester$TestThread.run(RandomPostingsTester.java:1208)
   [junit4]   2> Caused by: java.lang.AssertionError: position is wrong expected:<0> but was:<-1>
   [junit4]   2> 	at org.junit.Assert.fail(Assert.java:93)
   [junit4]   2> 	at org.junit.Assert.failNotEquals(Assert.java:647)
   [junit4]   2> 	at org.junit.Assert.assertEquals(Assert.java:128)
   [junit4]   2> 	at org.junit.Assert.assertEquals(Assert.java:472)
   [junit4]   2> 	at org.apache.lucene.index.RandomPostingsTester.verifyEnum(RandomPostingsTester.java:1099)
   [junit4]   2> 	at org.apache.lucene.index.RandomPostingsTester.testTermsOneThread(RandomPostingsTester.java:1330)
   [junit4]   2> 	at org.apache.lucene.index.RandomPostingsTester.access$100(RandomPostingsTester.java:65)
   [junit4]   2> 	at org.apache.lucene.index.RandomPostingsTester$TestThread.run(RandomPostingsTester.java:1206)
   [junit4]   2> 
   [junit4]   2> лют 02, 2018 2:52:13 AM com.carrotsearch.randomizedtesting.RandomizedRunner$QueueUncaughtExceptionsHandler uncaughtException
   [junit4]   2> WARNING: Uncaught exception in thread: Thread[Thread-49,5,TGRP-TestSimpleTextPostingsFormat]
   [junit4]   2> java.lang.RuntimeException: java.lang.AssertionError: position is wrong expected:<0> but was:<-1>
   [junit4]   2> 	at __randomizedtesting.SeedInfo.seed([305C644F49CC26AA]:0)
   [junit4]   2> 	at org.apache.lucene.index.RandomPostingsTester$TestThread.run(RandomPostingsTester.java:1208)
   [junit4]   2> Caused by: java.lang.AssertionError: position is wrong expected:<0> but was:<-1>
   [junit4]   2> 	at org.junit.Assert.fail(Assert.java:93)
   [junit4]   2> 	at org.junit.Assert.failNotEquals(Assert.java:647)
   [junit4]   2> 	at org.junit.Assert.assertEquals(Assert.java:128)
   [junit4]   2> 	at org.junit.Assert.assertEquals(Assert.java:472)
   [junit4]   2> 	at org.apache.lucene.index.RandomPostingsTester.verifyEnum(RandomPostingsTester.java:1099)
   [junit4]   2> 	at org.apache.lucen

[...truncated too long message...]

g), text=PostingsFormat(name=MockRandom)}, docValues:{regex_dup_A_s=DocValuesFormat(name=Memory), other_tl1=DocValuesFormat(name=Lucene70), regex_dup_B_s=DocValuesFormat(name=Direct), range_facet_l_dv=DocValuesFormat(name=Asserting), SubjectTerms_mfacet=DocValuesFormat(name=Lucene70), n_l1=DocValuesFormat(name=Direct), multiDefault=DocValuesFormat(name=Direct), intDefault=DocValuesFormat(name=Lucene70), genre_s=DocValuesFormat(name=Asserting), n_td1=DocValuesFormat(name=Lucene70), n_d1=DocValuesFormat(name=Direct), range_facet_l=DocValuesFormat(name=Direct), n_f1=DocValuesFormat(name=Lucene70), series_t=DocValuesFormat(name=Lucene70), n_tl1=DocValuesFormat(name=Lucene70), oddField_s=DocValuesFormat(name=Asserting), n_tf1=DocValuesFormat(name=Direct), price=DocValuesFormat(name=Memory), a_t=DocValuesFormat(name=Direct), cat=DocValuesFormat(name=Direct), sequence_i=DocValuesFormat(name=Asserting), inStock=DocValuesFormat(name=Memory), id=DocValuesFormat(name=Asserting), text=DocValuesFormat(name=Memory), intDvoDefault=DocValuesFormat(name=Asserting), timestamp=DocValuesFormat(name=Direct), foo_i=DocValuesFormat(name=Lucene70), val_i=DocValuesFormat(name=Asserting), n_dt1=DocValuesFormat(name=Lucene70), author_t=DocValuesFormat(name=Lucene70), a_i1=DocValuesFormat(name=Direct), n_ti1=DocValuesFormat(name=Asserting), rnd_b=DocValuesFormat(name=Asserting), _version_=DocValuesFormat(name=Lucene70), n_tdt1=DocValuesFormat(name=Lucene70), foo_b=DocValuesFormat(name=Memory), name=DocValuesFormat(name=Asserting), id_i1=DocValuesFormat(name=Lucene70), foo_d=DocValuesFormat(name=Asserting), range_facet_i_dv=DocValuesFormat(name=Direct), foo_f=DocValuesFormat(name=Memory)}, maxPointsInLeafNode=1033, maxMBSortInHeap=7.564643886990881, sim=Asserting(org.apache.lucene.search.similarities.AssertingSimilarity@2a3acb23), locale=zh-SG, timezone=Atlantic/Azores
   [junit4]   2> NOTE: Linux 4.4.0-104-generic amd64/Oracle Corporation 1.8.0_152 (64-bit)/cpus=4,threads=2,free=262975248,total=526385152
   [junit4]   2> NOTE: All tests run in this JVM: [TestDeleteCollectionOnDownNodes, TestAnalyzeInfixSuggestions, AnalysisAfterCoreReloadTest, StressHdfsTest, MoveReplicaHDFSFailoverTest, TestCoreContainer, TimeRoutedAliasUpdateProcessorTest, TestJsonFacetRefinement, OverriddenZkACLAndCredentialsProvidersTest, SuggesterTSTTest, TestExclusionRuleCollectionAccess, TestDistribStateManager, ConvertedLegacyTest, TestDistributedStatsComponentCardinality, TimeZoneUtilsTest, TestConfigsApi, SaslZkACLProviderTest, TestDynamicFieldCollectionResource, DistributedSpellCheckComponentTest, WordBreakSolrSpellCheckerTest, DistributedQueryComponentOptimizationTest, TestReplicaProperties, TestOnReconnectListenerSupport, ResponseLogComponentTest, SpatialHeatmapFacetsTest, ZkStateWriterTest, ZkShardTermsTest, RegexBoostProcessorTest, MultiTermTest, HighlighterMaxOffsetTest, TestExactSharedStatsCache, TestSegmentSorting, CdcrVersionReplicationTest, PeerSyncReplicationTest, QueryResultKeyTest, GraphQueryTest, DataDrivenBlockJoinTest, TriLevelCompositeIdRoutingTest, CollectionsAPISolrJTest, CacheHeaderTest, TestRawTransformer, TestObjectReleaseTracker, TestSha256AuthenticationProvider, DocValuesMultiTest, LeaderElectionIntegrationTest, ClassificationUpdateProcessorTest, MinimalSchemaTest, TestUtils, TestDistributedMissingSort, DeleteInactiveReplicaTest, TestRealTimeGet, TestLMJelinekMercerSimilarityFactory, AutoscalingHistoryHandlerTest, ConcurrentDeleteAndCreateCollectionTest, DisMaxRequestHandlerTest, TestQueryWrapperFilter, UninvertDocValuesMergePolicyTest, StatelessScriptUpdateProcessorFactoryTest, TestRebalanceLeaders, CoreMergeIndexesAdminHandlerTest, TestXmlQParser, TestSchemaVersionResource, NoCacheHeaderTest, TestCollationFieldDocValues, IndexSchemaRuntimeFieldTest, TestUseDocValuesAsStored2, HdfsNNFailoverTest, VersionInfoTest, TestRangeQuery, CollectionTooManyReplicasTest, SearchHandlerTest, PingRequestHandlerTest, ConnectionReuseTest, TestFieldCacheVsDocValues, TestFieldCacheReopen, NumericFieldsTest, TestLargeCluster, AutoAddReplicasPlanActionTest, TestSearcherReuse, TestSolrCloudSnapshots, TestFilteredDocIdSet, ConnectionManagerTest, SpellCheckComponentTest, RulesTest, TestDocBasedVersionConstraints, TestDFRSimilarityFactory, BaseCdcrDistributedZkTest, TestFieldResource, TestLeaderInitiatedRecoveryThread, TestStandardQParsers, DistributedFacetPivotSmallTest, MultiThreadedOCPTest, TestInPlaceUpdatesDistrib, TestAtomicUpdateErrorCases, BasicDistributedZk2Test, TestAuthorizationFramework, DistributedQueueTest, TestValueSourceCache, TestJavabinTupleStreamParser, TestTolerantUpdateProcessorRandomCloud, TestQueryTypes, TestAnalyzedSuggestions, MetricTriggerTest, URLClassifyProcessorTest, ShowFileRequestHandlerTest, TestPolicyCloud, UnloadDistributedZkTest, TestUpdate, ExplicitHLLTest, CurrencyFieldTypeTest, TestEmbeddedSolrServerConstructors, NotRequiredUniqueKeyTest, IgnoreCommitOptimizeUpdateProcessorFactoryTest, SolrTestCaseJ4Test, HttpPartitionTest, CleanupOldIndexTest, TestOverriddenPrefixQueryForCustomFieldType, SmileWriterTest, ResponseHeaderTest, TestLegacyTerms, CopyFieldTest, RecoveryZkTest, ExecutePlanActionTest, AtomicUpdatesTest, ClusterStateUpdateTest, TestRandomFaceting, LeaderElectionTest, TestRandomDVFaceting, ShardRoutingCustomTest, TestDistributedGrouping, TestFaceting, TestRecovery, TestHashPartitioner, ZkControllerTest, TestStressReorder, TestReload, SimpleFacetsTest, TestSolr4Spatial, SolrCoreTest, SolrCmdDistributorTest, QueryElevationComponentTest, BadIndexSchemaTest, TestFiltering, TestFunctionQuery, BasicFunctionalityTest, TestLazyCores, TestBadConfig, TestIndexSearcher, HighlighterTest, SoftAutoCommitTest, CoreAdminHandlerTest, SpatialFilterTest, SuggesterWFSTTest, TestCSVLoader, FieldMutatingUpdateProcessorTest, DirectUpdateHandlerOptimizeTest, DefaultValueUpdateProcessorTest, TestRemoteStreaming, DistanceFunctionTest, TestSolrDeletionPolicy1, XsltUpdateRequestHandlerTest, TestSurroundQueryParser, LukeRequestHandlerTest, TestQueryUtils, DirectSolrSpellCheckerTest, PrimitiveFieldTypeTest, FileBasedSpellCheckerTest, PathHierarchyTokenizerFactoryTest, TestIndexingPerformance, FieldAnalysisRequestHandlerTest, TestJmxIntegration, UpdateRequestProcessorFactoryTest, UniqFieldsUpdateProcessorFactoryTest, TestPartialUpdateDeduplication, TestLFUCache, TestIBSimilarityFactory, TestFastLRUCache, ChaosMonkeyNothingIsSafeTest, CloudExitableDirectoryReaderTest, CollectionStateFormat2Test, ConcurrentCreateRoutedAliasTest, DeleteReplicaTest, LeaderFailoverAfterPartitionTest, LeaderInitiatedRecoveryOnShardRestartTest, LegacyCloudClusterPropTest, MigrateRouteKeyTest, NodeMutatorTest, OutOfBoxZkACLAndCredentialsProvidersTest, OverseerCollectionConfigSetProcessorTest, OverseerModifyCollectionTest, OverseerRolesTest, OverseerTaskQueueTest, RemoteQueryErrorTest, ReplaceNodeNoTargetTest, ReplaceNodeTest, RollingRestartTest, TestStressLiveNodes, CollectionReloadTest, CollectionsAPIDistributedZkTest, TestCollectionAPI, TestCollectionsAPIViaSolrCloudCluster, TestLocalFSCloudBackupRestore, TestRequestStatusCollectionAPI, HdfsAutoAddReplicasIntegrationTest, TestClusterStateProvider, TestComputePlanAction, TestExecutePlanAction, TestTriggerIntegration, CdcrBootstrapTest, CdcrReplicationDistributedZkTest, HDFSCollectionsAPITest, HdfsBasicDistributedZkTest]
   [junit4]   2> NOTE: download the large Jenkins line-docs file by running 'ant get-jenkins-line-docs' in the lucene directory.
   [junit4]   2> NOTE: reproduce with: ant test  -Dtestcase=HdfsBasicDistributedZkTest -Dtests.seed=4A7B1ECF67D5A9F6 -Dtests.multiplier=2 -Dtests.nightly=true -Dtests.slow=true -Dtests.linedocsfile=/home/jenkins/jenkins-slave/workspace/Lucene-Solr-NightlyTests-master/test-data/enwiki.random.lines.txt -Dtests.locale=zh-SG -Dtests.timezone=Atlantic/Azores -Dtests.asserts=true -Dtests.file.encoding=US-ASCII
   [junit4] ERROR   0.00s J2 | HdfsBasicDistributedZkTest (suite) <<<
   [junit4]    > Throwable #1: java.lang.AssertionError: ObjectTracker found 1 object(s) that were not released!!! [NRTCachingDirectory]
   [junit4]    > org.apache.solr.common.util.ObjectReleaseTracker$ObjectTrackerException: org.apache.lucene.store.NRTCachingDirectory
   [junit4]    > 	at org.apache.solr.common.util.ObjectReleaseTracker.track(ObjectReleaseTracker.java:42)
   [junit4]    > 	at org.apache.solr.core.CachingDirectoryFactory.get(CachingDirectoryFactory.java:348)
   [junit4]    > 	at org.apache.solr.core.SolrCore.getNewIndexDir(SolrCore.java:351)
   [junit4]    > 	at org.apache.solr.core.SolrCore.cleanupOldIndexDirectories(SolrCore.java:3031)
   [junit4]    > 	at org.apache.solr.core.SolrCore.close(SolrCore.java:1604)
   [junit4]    > 	at org.apache.solr.core.SolrCore.<init>(SolrCore.java:1000)
   [junit4]    > 	at org.apache.solr.core.SolrCore.<init>(SolrCore.java:863)
   [junit4]    > 	at org.apache.solr.core.CoreContainer.createFromDescriptor(CoreContainer.java:1043)
   [junit4]    > 	at org.apache.solr.core.CoreContainer.lambda$load$13(CoreContainer.java:644)
   [junit4]    > 	at com.codahale.metrics.InstrumentedExecutorService$InstrumentedCallable.call(InstrumentedExecutorService.java:197)
   [junit4]    > 	at java.util.concurrent.FutureTask.run(FutureTask.java:266)
   [junit4]    > 	at org.apache.solr.common.util.ExecutorUtil$MDCAwareThreadPoolExecutor.lambda$execute$0(ExecutorUtil.java:188)
   [junit4]    > 	at java.util.concurrent.ThreadPoolExecutor.runWorker(ThreadPoolExecutor.java:1149)
   [junit4]    > 	at java.util.concurrent.ThreadPoolExecutor$Worker.run(ThreadPoolExecutor.java:624)
   [junit4]    > 	at java.lang.Thread.run(Thread.java:748)
   [junit4]    > 	at __randomizedtesting.SeedInfo.seed([4A7B1ECF67D5A9F6]:0)
   [junit4]    > 	at org.apache.solr.SolrTestCaseJ4.teardownTestCases(SolrTestCaseJ4.java:295)
   [junit4]    > 	at java.lang.Thread.run(Thread.java:748)
   [junit4] Completed [773/774 (7!)] on J2 in 979.97s, 1 test, 1 failure <<< FAILURES!

[...truncated 48080 lines...]

Mime
View raw message