lucene-dev mailing list archives

Site index · List index
Message view « Date » · « Thread »
Top « Date » · « Thread »
From Policeman Jenkins Server <jenk...@thetaphi.de>
Subject [JENKINS] Lucene-Solr-master-Windows (64bit/jdk1.8.0_144) - Build # 7186 - Failure!
Date Thu, 22 Feb 2018 10:31:31 GMT
Build: https://jenkins.thetaphi.de/job/Lucene-Solr-master-Windows/7186/
Java: 64bit/jdk1.8.0_144 -XX:-UseCompressedOops -XX:+UseG1GC

10 tests failed.
FAILED:  junit.framework.TestSuite.org.apache.lucene.index.TestFieldsReader

Error Message:
Could not remove the following files (in the order of attempts):    C:\Users\jenkins\workspace\Lucene-Solr-master-Windows\lucene\build\core\test\J0\temp\lucene.index.TestFieldsReader_BDE0DF54ECF15421-001\testfieldswriterexceptions-001: java.nio.file.DirectoryNotEmptyException: C:\Users\jenkins\workspace\Lucene-Solr-master-Windows\lucene\build\core\test\J0\temp\lucene.index.TestFieldsReader_BDE0DF54ECF15421-001\testfieldswriterexceptions-001    C:\Users\jenkins\workspace\Lucene-Solr-master-Windows\lucene\build\core\test\J0\temp\lucene.index.TestFieldsReader_BDE0DF54ECF15421-001\testfieldswriterexceptions-001\_0_LuceneFixedGap_0.doc: java.nio.file.AccessDeniedException: C:\Users\jenkins\workspace\Lucene-Solr-master-Windows\lucene\build\core\test\J0\temp\lucene.index.TestFieldsReader_BDE0DF54ECF15421-001\testfieldswriterexceptions-001\_0_LuceneFixedGap_0.doc    C:\Users\jenkins\workspace\Lucene-Solr-master-Windows\lucene\build\core\test\J0\temp\lucene.index.TestFieldsReader_BDE0DF54ECF15421-001: java.nio.file.DirectoryNotEmptyException: C:\Users\jenkins\workspace\Lucene-Solr-master-Windows\lucene\build\core\test\J0\temp\lucene.index.TestFieldsReader_BDE0DF54ECF15421-001 

Stack Trace:
java.io.IOException: Could not remove the following files (in the order of attempts):
   C:\Users\jenkins\workspace\Lucene-Solr-master-Windows\lucene\build\core\test\J0\temp\lucene.index.TestFieldsReader_BDE0DF54ECF15421-001\testfieldswriterexceptions-001: java.nio.file.DirectoryNotEmptyException: C:\Users\jenkins\workspace\Lucene-Solr-master-Windows\lucene\build\core\test\J0\temp\lucene.index.TestFieldsReader_BDE0DF54ECF15421-001\testfieldswriterexceptions-001
   C:\Users\jenkins\workspace\Lucene-Solr-master-Windows\lucene\build\core\test\J0\temp\lucene.index.TestFieldsReader_BDE0DF54ECF15421-001\testfieldswriterexceptions-001\_0_LuceneFixedGap_0.doc: java.nio.file.AccessDeniedException: C:\Users\jenkins\workspace\Lucene-Solr-master-Windows\lucene\build\core\test\J0\temp\lucene.index.TestFieldsReader_BDE0DF54ECF15421-001\testfieldswriterexceptions-001\_0_LuceneFixedGap_0.doc
   C:\Users\jenkins\workspace\Lucene-Solr-master-Windows\lucene\build\core\test\J0\temp\lucene.index.TestFieldsReader_BDE0DF54ECF15421-001: java.nio.file.DirectoryNotEmptyException: C:\Users\jenkins\workspace\Lucene-Solr-master-Windows\lucene\build\core\test\J0\temp\lucene.index.TestFieldsReader_BDE0DF54ECF15421-001

	at __randomizedtesting.SeedInfo.seed([BDE0DF54ECF15421]:0)
	at org.apache.lucene.util.IOUtils.rm(IOUtils.java:329)
	at org.apache.lucene.util.TestRuleTemporaryFilesCleanup.afterAlways(TestRuleTemporaryFilesCleanup.java:216)
	at com.carrotsearch.randomizedtesting.rules.TestRuleAdapter$1.afterAlways(TestRuleAdapter.java:31)
	at com.carrotsearch.randomizedtesting.rules.StatementAdapter.evaluate(StatementAdapter.java:43)
	at com.carrotsearch.randomizedtesting.rules.StatementAdapter.evaluate(StatementAdapter.java:36)
	at org.apache.lucene.util.TestRuleAssertionsRequired$1.evaluate(TestRuleAssertionsRequired.java:53)
	at org.apache.lucene.util.TestRuleMarkFailure$1.evaluate(TestRuleMarkFailure.java:47)
	at org.apache.lucene.util.TestRuleIgnoreAfterMaxFailures$1.evaluate(TestRuleIgnoreAfterMaxFailures.java:64)
	at org.apache.lucene.util.TestRuleIgnoreTestSuites$1.evaluate(TestRuleIgnoreTestSuites.java:54)
	at com.carrotsearch.randomizedtesting.rules.StatementAdapter.evaluate(StatementAdapter.java:36)
	at com.carrotsearch.randomizedtesting.ThreadLeakControl$StatementRunner.run(ThreadLeakControl.java:368)
	at java.lang.Thread.run(Thread.java:748)


FAILED:  org.apache.lucene.replicator.IndexAndTaxonomyReplicationClientTest.testRestart

Error Message:
Could not remove the following files (in the order of attempts):    C:\Users\jenkins\workspace\Lucene-Solr-master-Windows\lucene\build\replicator\test\J0\temp\lucene.replicator.IndexAndTaxonomyReplicationClientTest_D65CF6A3038EEDFB-001\replicationClientTest-005\2\index: java.nio.file.DirectoryNotEmptyException: C:\Users\jenkins\workspace\Lucene-Solr-master-Windows\lucene\build\replicator\test\J0\temp\lucene.replicator.IndexAndTaxonomyReplicationClientTest_D65CF6A3038EEDFB-001\replicationClientTest-005\2\index    C:\Users\jenkins\workspace\Lucene-Solr-master-Windows\lucene\build\replicator\test\J0\temp\lucene.replicator.IndexAndTaxonomyReplicationClientTest_D65CF6A3038EEDFB-001\replicationClientTest-005\2: java.nio.file.DirectoryNotEmptyException: C:\Users\jenkins\workspace\Lucene-Solr-master-Windows\lucene\build\replicator\test\J0\temp\lucene.replicator.IndexAndTaxonomyReplicationClientTest_D65CF6A3038EEDFB-001\replicationClientTest-005\2 

Stack Trace:
java.io.IOException: Could not remove the following files (in the order of attempts):
   C:\Users\jenkins\workspace\Lucene-Solr-master-Windows\lucene\build\replicator\test\J0\temp\lucene.replicator.IndexAndTaxonomyReplicationClientTest_D65CF6A3038EEDFB-001\replicationClientTest-005\2\index: java.nio.file.DirectoryNotEmptyException: C:\Users\jenkins\workspace\Lucene-Solr-master-Windows\lucene\build\replicator\test\J0\temp\lucene.replicator.IndexAndTaxonomyReplicationClientTest_D65CF6A3038EEDFB-001\replicationClientTest-005\2\index
   C:\Users\jenkins\workspace\Lucene-Solr-master-Windows\lucene\build\replicator\test\J0\temp\lucene.replicator.IndexAndTaxonomyReplicationClientTest_D65CF6A3038EEDFB-001\replicationClientTest-005\2: java.nio.file.DirectoryNotEmptyException: C:\Users\jenkins\workspace\Lucene-Solr-master-Windows\lucene\build\replicator\test\J0\temp\lucene.replicator.IndexAndTaxonomyReplicationClientTest_D65CF6A3038EEDFB-001\replicationClientTest-005\2

	at __randomizedtesting.SeedInfo.seed([D65CF6A3038EEDFB:43D11AC2866659EE]:0)
	at org.apache.lucene.util.IOUtils.rm(IOUtils.java:329)
	at org.apache.lucene.replicator.PerSessionDirectoryFactory.cleanupSession(PerSessionDirectoryFactory.java:58)
	at org.apache.lucene.replicator.ReplicationClient.doUpdate(ReplicationClient.java:259)
	at org.apache.lucene.replicator.ReplicationClient.updateNow(ReplicationClient.java:401)
	at org.apache.lucene.replicator.IndexAndTaxonomyReplicationClientTest.testRestart(IndexAndTaxonomyReplicationClientTest.java:247)
	at sun.reflect.NativeMethodAccessorImpl.invoke0(Native Method)
	at sun.reflect.NativeMethodAccessorImpl.invoke(NativeMethodAccessorImpl.java:62)
	at sun.reflect.DelegatingMethodAccessorImpl.invoke(DelegatingMethodAccessorImpl.java:43)
	at java.lang.reflect.Method.invoke(Method.java:498)
	at com.carrotsearch.randomizedtesting.RandomizedRunner.invoke(RandomizedRunner.java:1737)
	at com.carrotsearch.randomizedtesting.RandomizedRunner$8.evaluate(RandomizedRunner.java:934)
	at com.carrotsearch.randomizedtesting.RandomizedRunner$9.evaluate(RandomizedRunner.java:970)
	at com.carrotsearch.randomizedtesting.RandomizedRunner$10.evaluate(RandomizedRunner.java:984)
	at org.apache.lucene.util.TestRuleSetupTeardownChained$1.evaluate(TestRuleSetupTeardownChained.java:49)
	at org.apache.lucene.util.AbstractBeforeAfterRule$1.evaluate(AbstractBeforeAfterRule.java:45)
	at org.apache.lucene.util.TestRuleThreadAndTestName$1.evaluate(TestRuleThreadAndTestName.java:48)
	at org.apache.lucene.util.TestRuleIgnoreAfterMaxFailures$1.evaluate(TestRuleIgnoreAfterMaxFailures.java:64)
	at org.apache.lucene.util.TestRuleMarkFailure$1.evaluate(TestRuleMarkFailure.java:47)
	at com.carrotsearch.randomizedtesting.rules.StatementAdapter.evaluate(StatementAdapter.java:36)
	at com.carrotsearch.randomizedtesting.ThreadLeakControl$StatementRunner.run(ThreadLeakControl.java:368)
	at com.carrotsearch.randomizedtesting.ThreadLeakControl.forkTimeoutingTask(ThreadLeakControl.java:817)
	at com.carrotsearch.randomizedtesting.ThreadLeakControl$3.evaluate(ThreadLeakControl.java:468)
	at com.carrotsearch.randomizedtesting.RandomizedRunner.runSingleTest(RandomizedRunner.java:943)
	at com.carrotsearch.randomizedtesting.RandomizedRunner$5.evaluate(RandomizedRunner.java:829)
	at com.carrotsearch.randomizedtesting.RandomizedRunner$6.evaluate(RandomizedRunner.java:879)
	at com.carrotsearch.randomizedtesting.RandomizedRunner$7.evaluate(RandomizedRunner.java:890)
	at org.apache.lucene.util.AbstractBeforeAfterRule$1.evaluate(AbstractBeforeAfterRule.java:45)
	at com.carrotsearch.randomizedtesting.rules.StatementAdapter.evaluate(StatementAdapter.java:36)
	at org.apache.lucene.util.TestRuleStoreClassName$1.evaluate(TestRuleStoreClassName.java:41)
	at com.carrotsearch.randomizedtesting.rules.NoShadowingOrOverridesOnMethodsRule$1.evaluate(NoShadowingOrOverridesOnMethodsRule.java:40)
	at com.carrotsearch.randomizedtesting.rules.NoShadowingOrOverridesOnMethodsRule$1.evaluate(NoShadowingOrOverridesOnMethodsRule.java:40)
	at com.carrotsearch.randomizedtesting.rules.StatementAdapter.evaluate(StatementAdapter.java:36)
	at com.carrotsearch.randomizedtesting.rules.StatementAdapter.evaluate(StatementAdapter.java:36)
	at com.carrotsearch.randomizedtesting.rules.StatementAdapter.evaluate(StatementAdapter.java:36)
	at org.apache.lucene.util.TestRuleAssertionsRequired$1.evaluate(TestRuleAssertionsRequired.java:53)
	at org.apache.lucene.util.TestRuleMarkFailure$1.evaluate(TestRuleMarkFailure.java:47)
	at org.apache.lucene.util.TestRuleIgnoreAfterMaxFailures$1.evaluate(TestRuleIgnoreAfterMaxFailures.java:64)
	at org.apache.lucene.util.TestRuleIgnoreTestSuites$1.evaluate(TestRuleIgnoreTestSuites.java:54)
	at com.carrotsearch.randomizedtesting.rules.StatementAdapter.evaluate(StatementAdapter.java:36)
	at com.carrotsearch.randomizedtesting.ThreadLeakControl$StatementRunner.run(ThreadLeakControl.java:368)
	at java.lang.Thread.run(Thread.java:748)


FAILED:  junit.framework.TestSuite.org.apache.solr.cloud.ChaosMonkeySafeLeaderWithPullReplicasTest

Error Message:
1 thread leaked from SUITE scope at org.apache.solr.cloud.ChaosMonkeySafeLeaderWithPullReplicasTest:     1) Thread[id=16277, name=qtp1489251436-16277, state=TIMED_WAITING, group=TGRP-ChaosMonkeySafeLeaderWithPullReplicasTest]         at sun.misc.Unsafe.park(Native Method)         at java.util.concurrent.locks.LockSupport.parkNanos(LockSupport.java:215)         at java.util.concurrent.locks.AbstractQueuedSynchronizer$ConditionObject.await(AbstractQueuedSynchronizer.java:2163)         at org.eclipse.jetty.util.thread.ReservedThreadExecutor$ReservedThread.reservedWait(ReservedThreadExecutor.java:308)         at org.eclipse.jetty.util.thread.ReservedThreadExecutor$ReservedThread.run(ReservedThreadExecutor.java:373)         at org.eclipse.jetty.util.thread.QueuedThreadPool.runJob(QueuedThreadPool.java:708)         at org.eclipse.jetty.util.thread.QueuedThreadPool$2.run(QueuedThreadPool.java:626)         at java.lang.Thread.run(Thread.java:748)

Stack Trace:
com.carrotsearch.randomizedtesting.ThreadLeakError: 1 thread leaked from SUITE scope at org.apache.solr.cloud.ChaosMonkeySafeLeaderWithPullReplicasTest: 
   1) Thread[id=16277, name=qtp1489251436-16277, state=TIMED_WAITING, group=TGRP-ChaosMonkeySafeLeaderWithPullReplicasTest]
        at sun.misc.Unsafe.park(Native Method)
        at java.util.concurrent.locks.LockSupport.parkNanos(LockSupport.java:215)
        at java.util.concurrent.locks.AbstractQueuedSynchronizer$ConditionObject.await(AbstractQueuedSynchronizer.java:2163)
        at org.eclipse.jetty.util.thread.ReservedThreadExecutor$ReservedThread.reservedWait(ReservedThreadExecutor.java:308)
        at org.eclipse.jetty.util.thread.ReservedThreadExecutor$ReservedThread.run(ReservedThreadExecutor.java:373)
        at org.eclipse.jetty.util.thread.QueuedThreadPool.runJob(QueuedThreadPool.java:708)
        at org.eclipse.jetty.util.thread.QueuedThreadPool$2.run(QueuedThreadPool.java:626)
        at java.lang.Thread.run(Thread.java:748)
	at __randomizedtesting.SeedInfo.seed([BEA09F488600D5DF]:0)


FAILED:  junit.framework.TestSuite.org.apache.solr.cloud.ChaosMonkeySafeLeaderWithPullReplicasTest

Error Message:
There are still zombie threads that couldn't be terminated:    1) Thread[id=16277, name=qtp1489251436-16277, state=TIMED_WAITING, group=TGRP-ChaosMonkeySafeLeaderWithPullReplicasTest]         at sun.misc.Unsafe.park(Native Method)         at java.util.concurrent.locks.LockSupport.parkNanos(LockSupport.java:215)         at java.util.concurrent.locks.AbstractQueuedSynchronizer$ConditionObject.await(AbstractQueuedSynchronizer.java:2163)         at org.eclipse.jetty.util.thread.ReservedThreadExecutor$ReservedThread.reservedWait(ReservedThreadExecutor.java:308)         at org.eclipse.jetty.util.thread.ReservedThreadExecutor$ReservedThread.run(ReservedThreadExecutor.java:373)         at org.eclipse.jetty.util.thread.QueuedThreadPool.runJob(QueuedThreadPool.java:708)         at org.eclipse.jetty.util.thread.QueuedThreadPool$2.run(QueuedThreadPool.java:626)         at java.lang.Thread.run(Thread.java:748)

Stack Trace:
com.carrotsearch.randomizedtesting.ThreadLeakError: There are still zombie threads that couldn't be terminated:
   1) Thread[id=16277, name=qtp1489251436-16277, state=TIMED_WAITING, group=TGRP-ChaosMonkeySafeLeaderWithPullReplicasTest]
        at sun.misc.Unsafe.park(Native Method)
        at java.util.concurrent.locks.LockSupport.parkNanos(LockSupport.java:215)
        at java.util.concurrent.locks.AbstractQueuedSynchronizer$ConditionObject.await(AbstractQueuedSynchronizer.java:2163)
        at org.eclipse.jetty.util.thread.ReservedThreadExecutor$ReservedThread.reservedWait(ReservedThreadExecutor.java:308)
        at org.eclipse.jetty.util.thread.ReservedThreadExecutor$ReservedThread.run(ReservedThreadExecutor.java:373)
        at org.eclipse.jetty.util.thread.QueuedThreadPool.runJob(QueuedThreadPool.java:708)
        at org.eclipse.jetty.util.thread.QueuedThreadPool$2.run(QueuedThreadPool.java:626)
        at java.lang.Thread.run(Thread.java:748)
	at __randomizedtesting.SeedInfo.seed([BEA09F488600D5DF]:0)


FAILED:  org.apache.solr.cloud.autoscaling.TriggerIntegrationTest.testEventQueue

Error Message:
action wasn't interrupted

Stack Trace:
java.lang.AssertionError: action wasn't interrupted
	at __randomizedtesting.SeedInfo.seed([BEA09F488600D5DF:7715DDE68F67132A]:0)
	at org.junit.Assert.fail(Assert.java:93)
	at org.junit.Assert.assertTrue(Assert.java:43)
	at org.apache.solr.cloud.autoscaling.TriggerIntegrationTest.testEventQueue(TriggerIntegrationTest.java:728)
	at sun.reflect.NativeMethodAccessorImpl.invoke0(Native Method)
	at sun.reflect.NativeMethodAccessorImpl.invoke(NativeMethodAccessorImpl.java:62)
	at sun.reflect.DelegatingMethodAccessorImpl.invoke(DelegatingMethodAccessorImpl.java:43)
	at java.lang.reflect.Method.invoke(Method.java:498)
	at com.carrotsearch.randomizedtesting.RandomizedRunner.invoke(RandomizedRunner.java:1737)
	at com.carrotsearch.randomizedtesting.RandomizedRunner$8.evaluate(RandomizedRunner.java:934)
	at com.carrotsearch.randomizedtesting.RandomizedRunner$9.evaluate(RandomizedRunner.java:970)
	at com.carrotsearch.randomizedtesting.RandomizedRunner$10.evaluate(RandomizedRunner.java:984)
	at com.carrotsearch.randomizedtesting.rules.SystemPropertiesRestoreRule$1.evaluate(SystemPropertiesRestoreRule.java:57)
	at org.apache.lucene.util.TestRuleSetupTeardownChained$1.evaluate(TestRuleSetupTeardownChained.java:49)
	at org.apache.lucene.util.AbstractBeforeAfterRule$1.evaluate(AbstractBeforeAfterRule.java:45)
	at org.apache.lucene.util.TestRuleThreadAndTestName$1.evaluate(TestRuleThreadAndTestName.java:48)
	at org.apache.lucene.util.TestRuleIgnoreAfterMaxFailures$1.evaluate(TestRuleIgnoreAfterMaxFailures.java:64)
	at org.apache.lucene.util.TestRuleMarkFailure$1.evaluate(TestRuleMarkFailure.java:47)
	at com.carrotsearch.randomizedtesting.rules.StatementAdapter.evaluate(StatementAdapter.java:36)
	at com.carrotsearch.randomizedtesting.ThreadLeakControl$StatementRunner.run(ThreadLeakControl.java:368)
	at com.carrotsearch.randomizedtesting.ThreadLeakControl.forkTimeoutingTask(ThreadLeakControl.java:817)
	at com.carrotsearch.randomizedtesting.ThreadLeakControl$3.evaluate(ThreadLeakControl.java:468)
	at com.carrotsearch.randomizedtesting.RandomizedRunner.runSingleTest(RandomizedRunner.java:943)
	at com.carrotsearch.randomizedtesting.RandomizedRunner$5.evaluate(RandomizedRunner.java:829)
	at com.carrotsearch.randomizedtesting.RandomizedRunner$6.evaluate(RandomizedRunner.java:879)
	at com.carrotsearch.randomizedtesting.RandomizedRunner$7.evaluate(RandomizedRunner.java:890)
	at com.carrotsearch.randomizedtesting.rules.StatementAdapter.evaluate(StatementAdapter.java:36)
	at com.carrotsearch.randomizedtesting.rules.SystemPropertiesRestoreRule$1.evaluate(SystemPropertiesRestoreRule.java:57)
	at org.apache.lucene.util.AbstractBeforeAfterRule$1.evaluate(AbstractBeforeAfterRule.java:45)
	at com.carrotsearch.randomizedtesting.rules.StatementAdapter.evaluate(StatementAdapter.java:36)
	at org.apache.lucene.util.TestRuleStoreClassName$1.evaluate(TestRuleStoreClassName.java:41)
	at com.carrotsearch.randomizedtesting.rules.NoShadowingOrOverridesOnMethodsRule$1.evaluate(NoShadowingOrOverridesOnMethodsRule.java:40)
	at com.carrotsearch.randomizedtesting.rules.NoShadowingOrOverridesOnMethodsRule$1.evaluate(NoShadowingOrOverridesOnMethodsRule.java:40)
	at com.carrotsearch.randomizedtesting.rules.StatementAdapter.evaluate(StatementAdapter.java:36)
	at com.carrotsearch.randomizedtesting.rules.StatementAdapter.evaluate(StatementAdapter.java:36)
	at com.carrotsearch.randomizedtesting.rules.StatementAdapter.evaluate(StatementAdapter.java:36)
	at org.apache.lucene.util.TestRuleAssertionsRequired$1.evaluate(TestRuleAssertionsRequired.java:53)
	at org.apache.lucene.util.TestRuleMarkFailure$1.evaluate(TestRuleMarkFailure.java:47)
	at org.apache.lucene.util.TestRuleIgnoreAfterMaxFailures$1.evaluate(TestRuleIgnoreAfterMaxFailures.java:64)
	at org.apache.lucene.util.TestRuleIgnoreTestSuites$1.evaluate(TestRuleIgnoreTestSuites.java:54)
	at com.carrotsearch.randomizedtesting.rules.StatementAdapter.evaluate(StatementAdapter.java:36)
	at com.carrotsearch.randomizedtesting.ThreadLeakControl$StatementRunner.run(ThreadLeakControl.java:368)
	at java.lang.Thread.run(Thread.java:748)


FAILED:  org.apache.solr.cloud.autoscaling.TriggerIntegrationTest.testScheduledTrigger

Error Message:
expected:<2> but was:<1>

Stack Trace:
java.lang.AssertionError: expected:<2> but was:<1>
	at __randomizedtesting.SeedInfo.seed([BEA09F488600D5DF:2DBBD73AD8FD8EEB]:0)
	at org.junit.Assert.fail(Assert.java:93)
	at org.junit.Assert.failNotEquals(Assert.java:647)
	at org.junit.Assert.assertEquals(Assert.java:128)
	at org.junit.Assert.assertEquals(Assert.java:472)
	at org.junit.Assert.assertEquals(Assert.java:456)
	at org.apache.solr.cloud.autoscaling.TriggerIntegrationTest.testScheduledTrigger(TriggerIntegrationTest.java:1679)
	at sun.reflect.NativeMethodAccessorImpl.invoke0(Native Method)
	at sun.reflect.NativeMethodAccessorImpl.invoke(NativeMethodAccessorImpl.java:62)
	at sun.reflect.DelegatingMethodAccessorImpl.invoke(DelegatingMethodAccessorImpl.java:43)
	at java.lang.reflect.Method.invoke(Method.java:498)
	at com.carrotsearch.randomizedtesting.RandomizedRunner.invoke(RandomizedRunner.java:1737)
	at com.carrotsearch.randomizedtesting.RandomizedRunner$8.evaluate(RandomizedRunner.java:934)
	at com.carrotsearch.randomizedtesting.RandomizedRunner$9.evaluate(RandomizedRunner.java:970)
	at com.carrotsearch.randomizedtesting.RandomizedRunner$10.evaluate(RandomizedRunner.java:984)
	at com.carrotsearch.randomizedtesting.rules.SystemPropertiesRestoreRule$1.evaluate(SystemPropertiesRestoreRule.java:57)
	at org.apache.lucene.util.TestRuleSetupTeardownChained$1.evaluate(TestRuleSetupTeardownChained.java:49)
	at org.apache.lucene.util.AbstractBeforeAfterRule$1.evaluate(AbstractBeforeAfterRule.java:45)
	at org.apache.lucene.util.TestRuleThreadAndTestName$1.evaluate(TestRuleThreadAndTestName.java:48)
	at org.apache.lucene.util.TestRuleIgnoreAfterMaxFailures$1.evaluate(TestRuleIgnoreAfterMaxFailures.java:64)
	at org.apache.lucene.util.TestRuleMarkFailure$1.evaluate(TestRuleMarkFailure.java:47)
	at com.carrotsearch.randomizedtesting.rules.StatementAdapter.evaluate(StatementAdapter.java:36)
	at com.carrotsearch.randomizedtesting.ThreadLeakControl$StatementRunner.run(ThreadLeakControl.java:368)
	at com.carrotsearch.randomizedtesting.ThreadLeakControl.forkTimeoutingTask(ThreadLeakControl.java:817)
	at com.carrotsearch.randomizedtesting.ThreadLeakControl$3.evaluate(ThreadLeakControl.java:468)
	at com.carrotsearch.randomizedtesting.RandomizedRunner.runSingleTest(RandomizedRunner.java:943)
	at com.carrotsearch.randomizedtesting.RandomizedRunner$5.evaluate(RandomizedRunner.java:829)
	at com.carrotsearch.randomizedtesting.RandomizedRunner$6.evaluate(RandomizedRunner.java:879)
	at com.carrotsearch.randomizedtesting.RandomizedRunner$7.evaluate(RandomizedRunner.java:890)
	at com.carrotsearch.randomizedtesting.rules.StatementAdapter.evaluate(StatementAdapter.java:36)
	at com.carrotsearch.randomizedtesting.rules.SystemPropertiesRestoreRule$1.evaluate(SystemPropertiesRestoreRule.java:57)
	at org.apache.lucene.util.AbstractBeforeAfterRule$1.evaluate(AbstractBeforeAfterRule.java:45)
	at com.carrotsearch.randomizedtesting.rules.StatementAdapter.evaluate(StatementAdapter.java:36)
	at org.apache.lucene.util.TestRuleStoreClassName$1.evaluate(TestRuleStoreClassName.java:41)
	at com.carrotsearch.randomizedtesting.rules.NoShadowingOrOverridesOnMethodsRule$1.evaluate(NoShadowingOrOverridesOnMethodsRule.java:40)
	at com.carrotsearch.randomizedtesting.rules.NoShadowingOrOverridesOnMethodsRule$1.evaluate(NoShadowingOrOverridesOnMethodsRule.java:40)
	at com.carrotsearch.randomizedtesting.rules.StatementAdapter.evaluate(StatementAdapter.java:36)
	at com.carrotsearch.randomizedtesting.rules.StatementAdapter.evaluate(StatementAdapter.java:36)
	at com.carrotsearch.randomizedtesting.rules.StatementAdapter.evaluate(StatementAdapter.java:36)
	at org.apache.lucene.util.TestRuleAssertionsRequired$1.evaluate(TestRuleAssertionsRequired.java:53)
	at org.apache.lucene.util.TestRuleMarkFailure$1.evaluate(TestRuleMarkFailure.java:47)
	at org.apache.lucene.util.TestRuleIgnoreAfterMaxFailures$1.evaluate(TestRuleIgnoreAfterMaxFailures.java:64)
	at org.apache.lucene.util.TestRuleIgnoreTestSuites$1.evaluate(TestRuleIgnoreTestSuites.java:54)
	at com.carrotsearch.randomizedtesting.rules.StatementAdapter.evaluate(StatementAdapter.java:36)
	at com.carrotsearch.randomizedtesting.ThreadLeakControl$StatementRunner.run(ThreadLeakControl.java:368)
	at java.lang.Thread.run(Thread.java:748)


FAILED:  junit.framework.TestSuite.org.apache.lucene.index.TestBackwardsCompatibility

Error Message:
Could not remove the following files (in the order of attempts):    C:\Users\jenkins\workspace\Lucene-Solr-master-Windows\lucene\build\backward-codecs\test\J0\temp\lucene.index.TestBackwardsCompatibility_9665C5767183B0E-001\3.6.0-cfs-001: java.nio.file.DirectoryNotEmptyException: C:\Users\jenkins\workspace\Lucene-Solr-master-Windows\lucene\build\backward-codecs\test\J0\temp\lucene.index.TestBackwardsCompatibility_9665C5767183B0E-001\3.6.0-cfs-001 

Stack Trace:
java.io.IOException: Could not remove the following files (in the order of attempts):
   C:\Users\jenkins\workspace\Lucene-Solr-master-Windows\lucene\build\backward-codecs\test\J0\temp\lucene.index.TestBackwardsCompatibility_9665C5767183B0E-001\3.6.0-cfs-001: java.nio.file.DirectoryNotEmptyException: C:\Users\jenkins\workspace\Lucene-Solr-master-Windows\lucene\build\backward-codecs\test\J0\temp\lucene.index.TestBackwardsCompatibility_9665C5767183B0E-001\3.6.0-cfs-001

	at __randomizedtesting.SeedInfo.seed([9665C5767183B0E]:0)
	at org.apache.lucene.util.IOUtils.rm(IOUtils.java:329)
	at org.apache.lucene.util.TestRuleTemporaryFilesCleanup.afterAlways(TestRuleTemporaryFilesCleanup.java:216)
	at com.carrotsearch.randomizedtesting.rules.TestRuleAdapter$1.afterAlways(TestRuleAdapter.java:31)
	at com.carrotsearch.randomizedtesting.rules.StatementAdapter.evaluate(StatementAdapter.java:43)
	at com.carrotsearch.randomizedtesting.rules.StatementAdapter.evaluate(StatementAdapter.java:36)
	at org.apache.lucene.util.TestRuleAssertionsRequired$1.evaluate(TestRuleAssertionsRequired.java:53)
	at org.apache.lucene.util.TestRuleMarkFailure$1.evaluate(TestRuleMarkFailure.java:47)
	at org.apache.lucene.util.TestRuleIgnoreAfterMaxFailures$1.evaluate(TestRuleIgnoreAfterMaxFailures.java:64)
	at org.apache.lucene.util.TestRuleIgnoreTestSuites$1.evaluate(TestRuleIgnoreTestSuites.java:54)
	at com.carrotsearch.randomizedtesting.rules.StatementAdapter.evaluate(StatementAdapter.java:36)
	at com.carrotsearch.randomizedtesting.ThreadLeakControl$StatementRunner.run(ThreadLeakControl.java:368)
	at java.lang.Thread.run(Thread.java:748)


FAILED:  junit.framework.TestSuite.org.apache.solr.client.solrj.request.SchemaTest

Error Message:
1 thread leaked from SUITE scope at org.apache.solr.client.solrj.request.SchemaTest:     1) Thread[id=471, name=qtp2023465093-471, state=TIMED_WAITING, group=TGRP-SchemaTest]         at sun.misc.Unsafe.park(Native Method)         at java.util.concurrent.locks.LockSupport.parkNanos(LockSupport.java:215)         at java.util.concurrent.locks.AbstractQueuedSynchronizer$ConditionObject.await(AbstractQueuedSynchronizer.java:2163)         at org.eclipse.jetty.util.thread.ReservedThreadExecutor$ReservedThread.reservedWait(ReservedThreadExecutor.java:308)         at org.eclipse.jetty.util.thread.ReservedThreadExecutor$ReservedThread.run(ReservedThreadExecutor.java:373)         at org.eclipse.jetty.util.thread.QueuedThreadPool.runJob(QueuedThreadPool.java:708)         at org.eclipse.jetty.util.thread.QueuedThreadPool$2.run(QueuedThreadPool.java:626)         at java.lang.Thread.run(Thread.java:748)

Stack Trace:
com.carrotsearch.randomizedtesting.ThreadLeakError: 1 thread leaked from SUITE scope at org.apache.solr.client.solrj.request.SchemaTest: 
   1) Thread[id=471, name=qtp2023465093-471, state=TIMED_WAITING, group=TGRP-SchemaTest]
        at sun.misc.Unsafe.park(Native Method)
        at java.util.concurrent.locks.LockSupport.parkNanos(LockSupport.java:215)
        at java.util.concurrent.locks.AbstractQueuedSynchronizer$ConditionObject.await(AbstractQueuedSynchronizer.java:2163)
        at org.eclipse.jetty.util.thread.ReservedThreadExecutor$ReservedThread.reservedWait(ReservedThreadExecutor.java:308)
        at org.eclipse.jetty.util.thread.ReservedThreadExecutor$ReservedThread.run(ReservedThreadExecutor.java:373)
        at org.eclipse.jetty.util.thread.QueuedThreadPool.runJob(QueuedThreadPool.java:708)
        at org.eclipse.jetty.util.thread.QueuedThreadPool$2.run(QueuedThreadPool.java:626)
        at java.lang.Thread.run(Thread.java:748)
	at __randomizedtesting.SeedInfo.seed([A6B750101EDAA2F2]:0)


FAILED:  junit.framework.TestSuite.org.apache.solr.client.solrj.request.SchemaTest

Error Message:
There are still zombie threads that couldn't be terminated:    1) Thread[id=471, name=qtp2023465093-471, state=TIMED_WAITING, group=TGRP-SchemaTest]         at sun.misc.Unsafe.park(Native Method)         at java.util.concurrent.locks.LockSupport.parkNanos(LockSupport.java:215)         at java.util.concurrent.locks.AbstractQueuedSynchronizer$ConditionObject.await(AbstractQueuedSynchronizer.java:2163)         at org.eclipse.jetty.util.thread.ReservedThreadExecutor$ReservedThread.reservedWait(ReservedThreadExecutor.java:308)         at org.eclipse.jetty.util.thread.ReservedThreadExecutor$ReservedThread.run(ReservedThreadExecutor.java:373)         at org.eclipse.jetty.util.thread.QueuedThreadPool.runJob(QueuedThreadPool.java:708)         at org.eclipse.jetty.util.thread.QueuedThreadPool$2.run(QueuedThreadPool.java:626)         at java.lang.Thread.run(Thread.java:748)

Stack Trace:
com.carrotsearch.randomizedtesting.ThreadLeakError: There are still zombie threads that couldn't be terminated:
   1) Thread[id=471, name=qtp2023465093-471, state=TIMED_WAITING, group=TGRP-SchemaTest]
        at sun.misc.Unsafe.park(Native Method)
        at java.util.concurrent.locks.LockSupport.parkNanos(LockSupport.java:215)
        at java.util.concurrent.locks.AbstractQueuedSynchronizer$ConditionObject.await(AbstractQueuedSynchronizer.java:2163)
        at org.eclipse.jetty.util.thread.ReservedThreadExecutor$ReservedThread.reservedWait(ReservedThreadExecutor.java:308)
        at org.eclipse.jetty.util.thread.ReservedThreadExecutor$ReservedThread.run(ReservedThreadExecutor.java:373)
        at org.eclipse.jetty.util.thread.QueuedThreadPool.runJob(QueuedThreadPool.java:708)
        at org.eclipse.jetty.util.thread.QueuedThreadPool$2.run(QueuedThreadPool.java:626)
        at java.lang.Thread.run(Thread.java:748)
	at __randomizedtesting.SeedInfo.seed([A6B750101EDAA2F2]:0)


FAILED:  junit.framework.TestSuite.org.apache.solr.update.processor.TestOpenNLPExtractNamedEntitiesUpdateProcessorFactory

Error Message:
Could not remove the following files (in the order of attempts):    C:\Users\jenkins\workspace\Lucene-Solr-master-Windows\solr\build\contrib\solr-analysis-extras\test\J1\temp\solr.update.processor.TestOpenNLPExtractNamedEntitiesUpdateProcessorFactory_809812095EF79D89-001\tempDir-001\collection1\conf: java.nio.file.DirectoryNotEmptyException: C:\Users\jenkins\workspace\Lucene-Solr-master-Windows\solr\build\contrib\solr-analysis-extras\test\J1\temp\solr.update.processor.TestOpenNLPExtractNamedEntitiesUpdateProcessorFactory_809812095EF79D89-001\tempDir-001\collection1\conf    C:\Users\jenkins\workspace\Lucene-Solr-master-Windows\solr\build\contrib\solr-analysis-extras\test\J1\temp\solr.update.processor.TestOpenNLPExtractNamedEntitiesUpdateProcessorFactory_809812095EF79D89-001\tempDir-001\collection1: java.nio.file.DirectoryNotEmptyException: C:\Users\jenkins\workspace\Lucene-Solr-master-Windows\solr\build\contrib\solr-analysis-extras\test\J1\temp\solr.update.processor.TestOpenNLPExtractNamedEntitiesUpdateProcessorFactory_809812095EF79D89-001\tempDir-001\collection1    C:\Users\jenkins\workspace\Lucene-Solr-master-Windows\solr\build\contrib\solr-analysis-extras\test\J1\temp\solr.update.processor.TestOpenNLPExtractNamedEntitiesUpdateProcessorFactory_809812095EF79D89-001\tempDir-001: java.nio.file.DirectoryNotEmptyException: C:\Users\jenkins\workspace\Lucene-Solr-master-Windows\solr\build\contrib\solr-analysis-extras\test\J1\temp\solr.update.processor.TestOpenNLPExtractNamedEntitiesUpdateProcessorFactory_809812095EF79D89-001\tempDir-001    C:\Users\jenkins\workspace\Lucene-Solr-master-Windows\solr\build\contrib\solr-analysis-extras\test\J1\temp\solr.update.processor.TestOpenNLPExtractNamedEntitiesUpdateProcessorFactory_809812095EF79D89-001\tempDir-001\collection1\conf\en-test-ner-person.bin: java.nio.file.AccessDeniedException: C:\Users\jenkins\workspace\Lucene-Solr-master-Windows\solr\build\contrib\solr-analysis-extras\test\J1\temp\solr.update.processor.TestOpenNLPExtractNamedEntitiesUpdateProcessorFactory_809812095EF79D89-001\tempDir-001\collection1\conf\en-test-ner-person.bin    C:\Users\jenkins\workspace\Lucene-Solr-master-Windows\solr\build\contrib\solr-analysis-extras\test\J1\temp\solr.update.processor.TestOpenNLPExtractNamedEntitiesUpdateProcessorFactory_809812095EF79D89-001\tempDir-001\collection1\conf\en-test-tokenizer.bin: java.nio.file.AccessDeniedException: C:\Users\jenkins\workspace\Lucene-Solr-master-Windows\solr\build\contrib\solr-analysis-extras\test\J1\temp\solr.update.processor.TestOpenNLPExtractNamedEntitiesUpdateProcessorFactory_809812095EF79D89-001\tempDir-001\collection1\conf\en-test-tokenizer.bin    C:\Users\jenkins\workspace\Lucene-Solr-master-Windows\solr\build\contrib\solr-analysis-extras\test\J1\temp\solr.update.processor.TestOpenNLPExtractNamedEntitiesUpdateProcessorFactory_809812095EF79D89-001\tempDir-001\collection1\conf\en-test-sent.bin: java.nio.file.AccessDeniedException: C:\Users\jenkins\workspace\Lucene-Solr-master-Windows\solr\build\contrib\solr-analysis-extras\test\J1\temp\solr.update.processor.TestOpenNLPExtractNamedEntitiesUpdateProcessorFactory_809812095EF79D89-001\tempDir-001\collection1\conf\en-test-sent.bin    C:\Users\jenkins\workspace\Lucene-Solr-master-Windows\solr\build\contrib\solr-analysis-extras\test\J1\temp\solr.update.processor.TestOpenNLPExtractNamedEntitiesUpdateProcessorFactory_809812095EF79D89-001: java.nio.file.DirectoryNotEmptyException: C:\Users\jenkins\workspace\Lucene-Solr-master-Windows\solr\build\contrib\solr-analysis-extras\test\J1\temp\solr.update.processor.TestOpenNLPExtractNamedEntitiesUpdateProcessorFactory_809812095EF79D89-001 

Stack Trace:
java.io.IOException: Could not remove the following files (in the order of attempts):
   C:\Users\jenkins\workspace\Lucene-Solr-master-Windows\solr\build\contrib\solr-analysis-extras\test\J1\temp\solr.update.processor.TestOpenNLPExtractNamedEntitiesUpdateProcessorFactory_809812095EF79D89-001\tempDir-001\collection1\conf: java.nio.file.DirectoryNotEmptyException: C:\Users\jenkins\workspace\Lucene-Solr-master-Windows\solr\build\contrib\solr-analysis-extras\test\J1\temp\solr.update.processor.TestOpenNLPExtractNamedEntitiesUpdateProcessorFactory_809812095EF79D89-001\tempDir-001\collection1\conf
   C:\Users\jenkins\workspace\Lucene-Solr-master-Windows\solr\build\contrib\solr-analysis-extras\test\J1\temp\solr.update.processor.TestOpenNLPExtractNamedEntitiesUpdateProcessorFactory_809812095EF79D89-001\tempDir-001\collection1: java.nio.file.DirectoryNotEmptyException: C:\Users\jenkins\workspace\Lucene-Solr-master-Windows\solr\build\contrib\solr-analysis-extras\test\J1\temp\solr.update.processor.TestOpenNLPExtractNamedEntitiesUpdateProcessorFactory_809812095EF79D89-001\tempDir-001\collection1
   C:\Users\jenkins\workspace\Lucene-Solr-master-Windows\solr\build\contrib\solr-analysis-extras\test\J1\temp\solr.update.processor.TestOpenNLPExtractNamedEntitiesUpdateProcessorFactory_809812095EF79D89-001\tempDir-001: java.nio.file.DirectoryNotEmptyException: C:\Users\jenkins\workspace\Lucene-Solr-master-Windows\solr\build\contrib\solr-analysis-extras\test\J1\temp\solr.update.processor.TestOpenNLPExtractNamedEntitiesUpdateProcessorFactory_809812095EF79D89-001\tempDir-001
   C:\Users\jenkins\workspace\Lucene-Solr-master-Windows\solr\build\contrib\solr-analysis-extras\test\J1\temp\solr.update.processor.TestOpenNLPExtractNamedEntitiesUpdateProcessorFactory_809812095EF79D89-001\tempDir-001\collection1\conf\en-test-ner-person.bin: java.nio.file.AccessDeniedException: C:\Users\jenkins\workspace\Lucene-Solr-master-Windows\solr\build\contrib\solr-analysis-extras\test\J1\temp\solr.update.processor.TestOpenNLPExtractNamedEntitiesUpdateProcessorFactory_809812095EF79D89-001\tempDir-001\collection1\conf\en-test-ner-person.bin
   C:\Users\jenkins\workspace\Lucene-Solr-master-Windows\solr\build\contrib\solr-analysis-extras\test\J1\temp\solr.update.processor.TestOpenNLPExtractNamedEntitiesUpdateProcessorFactory_809812095EF79D89-001\tempDir-001\collection1\conf\en-test-tokenizer.bin: java.nio.file.AccessDeniedException: C:\Users\jenkins\workspace\Lucene-Solr-master-Windows\solr\build\contrib\solr-analysis-extras\test\J1\temp\solr.update.processor.TestOpenNLPExtractNamedEntitiesUpdateProcessorFactory_809812095EF79D89-001\tempDir-001\collection1\conf\en-test-tokenizer.bin
   C:\Users\jenkins\workspace\Lucene-Solr-master-Windows\solr\build\contrib\solr-analysis-extras\test\J1\temp\solr.update.processor.TestOpenNLPExtractNamedEntitiesUpdateProcessorFactory_809812095EF79D89-001\tempDir-001\collection1\conf\en-test-sent.bin: java.nio.file.AccessDeniedException: C:\Users\jenkins\workspace\Lucene-Solr-master-Windows\solr\build\contrib\solr-analysis-extras\test\J1\temp\solr.update.processor.TestOpenNLPExtractNamedEntitiesUpdateProcessorFactory_809812095EF79D89-001\tempDir-001\collection1\conf\en-test-sent.bin
   C:\Users\jenkins\workspace\Lucene-Solr-master-Windows\solr\build\contrib\solr-analysis-extras\test\J1\temp\solr.update.processor.TestOpenNLPExtractNamedEntitiesUpdateProcessorFactory_809812095EF79D89-001: java.nio.file.DirectoryNotEmptyException: C:\Users\jenkins\workspace\Lucene-Solr-master-Windows\solr\build\contrib\solr-analysis-extras\test\J1\temp\solr.update.processor.TestOpenNLPExtractNamedEntitiesUpdateProcessorFactory_809812095EF79D89-001

	at __randomizedtesting.SeedInfo.seed([809812095EF79D89]:0)
	at org.apache.lucene.util.IOUtils.rm(IOUtils.java:329)
	at org.apache.lucene.util.TestRuleTemporaryFilesCleanup.afterAlways(TestRuleTemporaryFilesCleanup.java:216)
	at com.carrotsearch.randomizedtesting.rules.TestRuleAdapter$1.afterAlways(TestRuleAdapter.java:31)
	at com.carrotsearch.randomizedtesting.rules.StatementAdapter.evaluate(StatementAdapter.java:43)
	at com.carrotsearch.randomizedtesting.rules.StatementAdapter.evaluate(StatementAdapter.java:36)
	at org.apache.lucene.util.TestRuleAssertionsRequired$1.evaluate(TestRuleAssertionsRequired.java:53)
	at org.apache.lucene.util.TestRuleMarkFailure$1.evaluate(TestRuleMarkFailure.java:47)
	at org.apache.lucene.util.TestRuleIgnoreAfterMaxFailures$1.evaluate(TestRuleIgnoreAfterMaxFailures.java:64)
	at org.apache.lucene.util.TestRuleIgnoreTestSuites$1.evaluate(TestRuleIgnoreTestSuites.java:54)
	at com.carrotsearch.randomizedtesting.rules.StatementAdapter.evaluate(StatementAdapter.java:36)
	at com.carrotsearch.randomizedtesting.ThreadLeakControl$StatementRunner.run(ThreadLeakControl.java:368)
	at java.lang.Thread.run(Thread.java:748)




Build Log:
[...truncated 838 lines...]
   [junit4] Suite: org.apache.lucene.index.TestFieldsReader
   [junit4]   2> NOTE: test params are: codec=Asserting(Lucene70): {textField1Utf8=Lucene50(blocksize=128), unStoredField2=PostingsFormat(name=LuceneFixedGap), keyField=PostingsFormat(name=Direct), omitNorms=PostingsFormat(name=LuceneFixedGap), omitTermFreqAndPositions=PostingsFormat(name=LuceneVarGapDocFreqInterval), textField2=Lucene50(blocksize=128), textField1=PostingsFormat(name=LuceneVarGapDocFreqInterval), textField2Utf8=PostingsFormat(name=LuceneFixedGap), unStoredField1=PostingsFormat(name=Direct), textField3=PostingsFormat(name=LuceneFixedGap), lazyField=PostingsFormat(name=LuceneVarGapDocFreqInterval), largeLazyField=PostingsFormat(name=Direct)}, docValues:{}, maxPointsInLeafNode=319, maxMBSortInHeap=5.660664338069786, sim=Asserting(org.apache.lucene.search.similarities.AssertingSimilarity@2319974a), locale=fr-BE, timezone=America/Phoenix
   [junit4]   2> NOTE: Windows 10 10.0 amd64/Oracle Corporation 1.8.0_144 (64-bit)/cpus=3,threads=1,free=160296184,total=395313152
   [junit4]   2> NOTE: All tests run in this JVM: [TestIndexWriterDeleteByQuery, TestBlockPostingsFormat, TestManyFields, TestFloatRange, TestParallelCompositeReader, TestPointQueries, TestDuelingCodecs, TestBagOfPositions, TestNGramPhraseQuery, TestAxiomaticF1LOG, TestRadixSelector, TestBoostQuery, TestIndexWriterOnVMError, TestFrequencyTrackingRingBuffer, TestBlendedTermQuery, TestOneMergeWrappingMergePolicy, TestPriorityQueue, TestIndexWriterFromReader, TestBooleanScorer, TestAllFilesCheckIndexHeader, TestFilterLeafReader, TestVersion, TestDuelingCodecsAtNight, TestDirectory, TestBKD, TestHighCompressionMode, TestTrackingDirectoryWrapper, TestParallelLeafReader, Test2BSortedDocValuesFixedSorted, TestStandardAnalyzer, TestOmitPositions, TestCharsRef, TestAllFilesHaveCodecHeader, TestLongRange, TestBlockPostingsFormat3, TestSpansEnum, TestDirectPacked, TestSimpleExplanationsOfNonMatches, TestLockFactory, TestReaderClosed, TestIndexSearcher, TestRegexpQuery, TestElevationComparator, TestDocIDMerger, TestAutomaton, TestBufferedIndexInput, TestToken, TestNot, TestBooleanMinShouldMatch, TestIndexWriterLockRelease, TestLevenshteinAutomata, TestTieredMergePolicy, TestSpanOrQuery, TestIndexFileDeleter, TestPrefixRandom, TestSortedSetSelector, TestExternalCodecs, TestTopDocsMerge, TestAllFilesHaveChecksumFooter, TestWANDScorer, TestIndexWriterMerging, TestTimSorter, TestCompiledAutomaton, TestSingleInstanceLockFactory, TestIntsRef, TestAtomicUpdate, TestFutureObjects, TestLongBitSet, TestIndexWriterWithThreads, TestDocCount, TestNoMergeScheduler, TestOmitTf, TestField, TestReusableStringReader, TestBagOfPostings, TestSpanSearchEquivalence, TestIndexOptions, TestAxiomaticF2LOG, Test2BNumericDocValues, TestLucene50StoredFieldsFormatHighCompression, TestPositiveScoresOnlyCollector, TestDoubleRange, TestDateSort, TestMergePolicyWrapper, TestLMDirichletSimilarity, TestFSTs, FiniteStringsIteratorTest, TestInfoStream, TestLucene50CompoundFormat, TestIndexableField, TestTermScorer, TestCachingTokenFilter, TestLazyProxSkipping, TestIndexInput, TestMutableValues, TestTimeLimitingCollector, TestBM25Similarity, TestIndexWriterThreadsToSegments, TestTermVectors, TestBooleanQuery, TestUpgradeIndexMergePolicy, TestFieldsReader]
   [junit4]   2> NOTE: reproduce with: ant test  -Dtestcase=TestFieldsReader -Dtests.seed=BDE0DF54ECF15421 -Dtests.slow=true -Dtests.locale=fr-BE -Dtests.timezone=America/Phoenix -Dtests.asserts=true -Dtests.file.encoding=ISO-8859-1
   [junit4] ERROR   0.00s J0 | TestFieldsReader (suite) <<<
   [junit4]    > Throwable #1: java.io.IOException: Could not remove the following files (in the order of attempts):
   [junit4]    >    C:\Users\jenkins\workspace\Lucene-Solr-master-Windows\lucene\build\core\test\J0\temp\lucene.index.TestFieldsReader_BDE0DF54ECF15421-001\testfieldswriterexceptions-001: java.nio.file.DirectoryNotEmptyException: C:\Users\jenkins\workspace\Lucene-Solr-master-Windows\lucene\build\core\test\J0\temp\lucene.index.TestFieldsReader_BDE0DF54ECF15421-001\testfieldswriterexceptions-001
   [junit4]    >    C:\Users\jenkins\workspace\Lucene-Solr-master-Windows\lucene\build\core\test\J0\temp\lucene.index.TestFieldsReader_BDE0DF54ECF15421-001\testfieldswriterexceptions-001\_0_LuceneFixedGap_0.doc: java.nio.file.AccessDeniedException: C:\Users\jenkins\workspace\Lucene-Solr-master-Windows\lucene\build\core\test\J0\temp\lucene.index.TestFieldsReader_BDE0DF54ECF15421-001\testfieldswriterexceptions-001\_0_LuceneFixedGap_0.doc
   [junit4]    >    C:\Users\jenkins\workspace\Lucene-Solr-master-Windows\lucene\build\core\test\J0\temp\lucene.index.TestFieldsReader_BDE0DF54ECF15421-001: java.nio.file.DirectoryNotEmptyException: C:\Users\jenkins\workspace\Lucene-Solr-master-Windows\lucene\build\core\test\J0\temp\lucene.index.TestFieldsReader_BDE0DF54ECF15421-001
   [junit4]    > 	at __randomizedtesting.SeedInfo.seed([BDE0DF54ECF15421]:0)
   [junit4]    > 	at org.apache.lucene.util.IOUtils.rm(IOUtils.java:329)
   [junit4]    > 	at java.lang.Thread.run(Thread.java:748)
   [junit4] Completed [183/486 (1!)] on J0 in 0.33s, 2 tests, 1 error <<< FAILURES!

[...truncated 4071 lines...]
   [junit4] Suite: org.apache.lucene.index.TestBackwardsCompatibility
   [junit4] IGNOR/A 0.01s J0 | TestBackwardsCompatibility.testCreateNoCFS
   [junit4]    > Assumption #1: backcompat creation tests must be run with -Dtests.bwcdir=/path/to/write/indexes
   [junit4] IGNOR/A 0.00s J0 | TestBackwardsCompatibility.testCreateCFS
   [junit4]    > Assumption #1: backcompat creation tests must be run with -Dtests.bwcdir=/path/to/write/indexes
   [junit4] IGNOR/A 0.00s J0 | TestBackwardsCompatibility.testCreateMoreTermsIndex
   [junit4]    > Assumption #1: backcompat creation tests must be run with -Dtests.bwcdir=/path/to/write/indexes
   [junit4] IGNOR/A 0.00s J0 | TestBackwardsCompatibility.testCreateSingleSegmentNoCFS
   [junit4]    > Assumption #1: backcompat creation tests must be run with -Dtests.bwcdir=/path/to/write/indexes
   [junit4] IGNOR/A 0.00s J0 | TestBackwardsCompatibility.testCreateSortedIndex
   [junit4]    > Assumption #1: backcompat creation tests must be run with -Dtests.bwcdir=/path/to/write/indexes
   [junit4] IGNOR/A 0.00s J0 | TestBackwardsCompatibility.testCreateEmptyIndex
   [junit4]    > Assumption #1: backcompat creation tests must be run with -Dtests.bwcdir=/path/to/write/indexes
   [junit4] IGNOR/A 0.00s J0 | TestBackwardsCompatibility.testCreateIndexWithDocValuesUpdates
   [junit4]    > Assumption #1: backcompat creation tests must be run with -Dtests.bwcdir=/path/to/write/indexes
   [junit4] IGNOR/A 0.00s J0 | TestBackwardsCompatibility.testCreateSingleSegmentCFS
   [junit4]    > Assumption #1: backcompat creation tests must be run with -Dtests.bwcdir=/path/to/write/indexes
   [junit4]   2> NOTE: test params are: codec=Asserting(Lucene70): {content6=PostingsFormat(name=Memory), content5=PostingsFormat(name=LuceneVarGapFixedInterval), content4=PostingsFormat(name=Direct), content3=FST50, content2=PostingsFormat(name=Memory), fie?ld=PostingsFormat(name=Memory), utf8=PostingsFormat(name=Memory), id=PostingsFormat(name=Direct), content=PostingsFormat(name=Memory), autf8=PostingsFormat(name=LuceneVarGapFixedInterval)}, docValues:{ndv2=DocValuesFormat(name=Lucene70), ndv1=DocValuesFormat(name=Memory), utf8=DocValuesFormat(name=Memory), fie?ld=DocValuesFormat(name=Memory), dvShort=DocValuesFormat(name=Lucene70), dvInt=DocValuesFormat(name=Memory), longPoint2d=DocValuesFormat(name=Asserting), dvBytesSortedVar=DocValuesFormat(name=Memory), dvSortedSet=DocValuesFormat(name=Direct), content=DocValuesFormat(name=Memory), floatPoint1d=DocValuesFormat(name=Direct), bdv2=DocValuesFormat(name=Lucene70), bdv2_c=DocValuesFormat(name=Asserting), intPoint1d=DocValuesFormat(name=Asserting), bdv1=DocValuesFormat(name=Memory), bdv1_c=DocValuesFormat(name=Memory), doublePoint2d=DocValuesFormat(name=Memory), dvBytesDerefVar=DocValuesFormat(name=Lucene70), id=DocValuesFormat(name=Direct), binaryPoint2d=DocValuesFormat(name=Memory), dvSortedNumeric=DocValuesFormat(name=Asserting), dvBytesDerefFixed=DocValuesFormat(name=Direct), autf8=DocValuesFormat(name=Lucene70), dvBytesSortedFixed=DocValuesFormat(name=Lucene70), dvBytesStraightVar=DocValuesFormat(name=Asserting), dvBytesStraightFixed=DocValuesFormat(name=Memory), dvLong=DocValuesFormat(name=Asserting), longPoint1d=DocValuesFormat(name=Direct), floatPoint2d=DocValuesFormat(name=Lucene70), dvDouble=DocValuesFormat(name=Direct), dvFloat=DocValuesFormat(name=Lucene70), content6=DocValuesFormat(name=Memory), content5=DocValuesFormat(name=Lucene70), dvPacked=DocValuesFormat(name=Asserting), intPoint2d=DocValuesFormat(name=Direct), content4=DocValuesFormat(name=Direct), content3=DocValuesFormat(name=Asserting), content2=DocValuesFormat(name=Memory), doublePoint1d=DocValuesFormat(name=Asserting), dvByte=DocValuesFormat(name=Asserting), ndv1_c=DocValuesFormat(name=Memory), ndv2_c=DocValuesFormat(name=Asserting), binaryPoint1d=DocValuesFormat(name=Lucene70)}, maxPointsInLeafNode=1680, maxMBSortInHeap=7.115313418756466, sim=Asserting(org.apache.lucene.search.similarities.AssertingSimilarity@554a1b65), locale=sr-CS, timezone=Asia/Amman
   [junit4]   2> NOTE: Windows 10 10.0 amd64/Oracle Corporation 1.8.0_144 (64-bit)/cpus=3,threads=1,free=39316216,total=100663296
   [junit4]   2> NOTE: All tests run in this JVM: [TestBackwardsCompatibility]
   [junit4]   2> NOTE: reproduce with: ant test  -Dtestcase=TestBackwardsCompatibility -Dtests.seed=9665C5767183B0E -Dtests.slow=true -Dtests.locale=sr-CS -Dtests.timezone=Asia/Amman -Dtests.asserts=true -Dtests.file.encoding=Cp1252
   [junit4] ERROR   0.00s J0 | TestBackwardsCompatibility (suite) <<<
   [junit4]    > Throwable #1: java.io.IOException: Could not remove the following files (in the order of attempts):
   [junit4]    >    C:\Users\jenkins\workspace\Lucene-Solr-master-Windows\lucene\build\backward-codecs\test\J0\temp\lucene.index.TestBackwardsCompatibility_9665C5767183B0E-001\3.6.0-cfs-001: java.nio.file.DirectoryNotEmptyException: C:\Users\jenkins\workspace\Lucene-Solr-master-Windows\lucene\build\backward-codecs\test\J0\temp\lucene.index.TestBackwardsCompatibility_9665C5767183B0E-001\3.6.0-cfs-001
   [junit4]    > 	at __randomizedtesting.SeedInfo.seed([9665C5767183B0E]:0)
   [junit4]    > 	at org.apache.lucene.util.IOUtils.rm(IOUtils.java:329)
   [junit4]    > 	at java.lang.Thread.run(Thread.java:748)
   [junit4] Completed [3/3 (1!)] on J0 in 29.97s, 30 tests, 1 error, 8 skipped <<< FAILURES!

[...truncated 4280 lines...]
   [junit4] Suite: org.apache.lucene.replicator.IndexAndTaxonomyReplicationClientTest
   [junit4]   2> NOTE: reproduce with: ant test  -Dtestcase=IndexAndTaxonomyReplicationClientTest -Dtests.method=testRestart -Dtests.seed=D65CF6A3038EEDFB -Dtests.slow=true -Dtests.locale=sq -Dtests.timezone=Mexico/BajaNorte -Dtests.asserts=true -Dtests.file.encoding=ISO-8859-1
   [junit4] ERROR   0.47s J0 | IndexAndTaxonomyReplicationClientTest.testRestart <<<
   [junit4]    > Throwable #1: java.io.IOException: Could not remove the following files (in the order of attempts):
   [junit4]    >    C:\Users\jenkins\workspace\Lucene-Solr-master-Windows\lucene\build\replicator\test\J0\temp\lucene.replicator.IndexAndTaxonomyReplicationClientTest_D65CF6A3038EEDFB-001\replicationClientTest-005\2\index: java.nio.file.DirectoryNotEmptyException: C:\Users\jenkins\workspace\Lucene-Solr-master-Windows\lucene\build\replicator\test\J0\temp\lucene.replicator.IndexAndTaxonomyReplicationClientTest_D65CF6A3038EEDFB-001\replicationClientTest-005\2\index
   [junit4]    >    C:\Users\jenkins\workspace\Lucene-Solr-master-Windows\lucene\build\replicator\test\J0\temp\lucene.replicator.IndexAndTaxonomyReplicationClientTest_D65CF6A3038EEDFB-001\replicationClientTest-005\2: java.nio.file.DirectoryNotEmptyException: C:\Users\jenkins\workspace\Lucene-Solr-master-Windows\lucene\build\replicator\test\J0\temp\lucene.replicator.IndexAndTaxonomyReplicationClientTest_D65CF6A3038EEDFB-001\replicationClientTest-005\2
   [junit4]    > 	at __randomizedtesting.SeedInfo.seed([D65CF6A3038EEDFB:43D11AC2866659EE]:0)
   [junit4]    > 	at org.apache.lucene.util.IOUtils.rm(IOUtils.java:329)
   [junit4]    > 	at org.apache.lucene.replicator.PerSessionDirectoryFactory.cleanupSession(PerSessionDirectoryFactory.java:58)
   [junit4]    > 	at org.apache.lucene.replicator.ReplicationClient.doUpdate(ReplicationClient.java:259)
   [junit4]    > 	at org.apache.lucene.replicator.ReplicationClient.updateNow(ReplicationClient.java:401)
   [junit4]    > 	at org.apache.lucene.replicator.IndexAndTaxonomyReplicationClientTest.testRestart(IndexAndTaxonomyReplicationClientTest.java:247)
   [junit4]    > 	at java.lang.Thread.run(Thread.java:748)
   [junit4]   2> NOTE: leaving temporary files on disk at: C:\Users\jenkins\workspace\Lucene-Solr-master-Windows\lucene\build\replicator\test\J0\temp\lucene.replicator.IndexAndTaxonomyReplicationClientTest_D65CF6A3038EEDFB-001
   [junit4]   2> NOTE: test params are: codec=Asserting(Lucene70): {$full_path$=PostingsFormat(name=Asserting), $facets=TestBloomFilteredLucenePostings(BloomFilteringPostingsFormat(Lucene50(blocksize=128))), $payloads$=FST50}, docValues:{$facets=DocValuesFormat(name=Asserting)}, maxPointsInLeafNode=1889, maxMBSortInHeap=5.95220118520757, sim=Asserting(org.apache.lucene.search.similarities.AssertingSimilarity@3930fe95), locale=sq, timezone=Mexico/BajaNorte
   [junit4]   2> NOTE: Windows 10 10.0 amd64/Oracle Corporation 1.8.0_144 (64-bit)/cpus=3,threads=1,free=36477560,total=100663296
   [junit4]   2> NOTE: All tests run in this JVM: [IndexReplicationClientTest, TestStressNRTReplication, IndexAndTaxonomyReplicationClientTest]
   [junit4] Completed [8/9 (1!)] on J0 in 6.18s, 5 tests, 1 error <<< FAILURES!

[...truncated 3455 lines...]
   [junit4] Suite: org.apache.solr.cloud.autoscaling.TriggerIntegrationTest
   [junit4]   2> 1194498 INFO  (SUITE-TriggerIntegrationTest-seed#[BEA09F488600D5DF]-worker) [    ] o.a.s.SolrTestCaseJ4 SecureRandom sanity checks: test.solr.allowed.securerandom=null & java.security.egd=file:/dev/./urandom
   [junit4]   2> Creating dataDir: C:\Users\jenkins\workspace\Lucene-Solr-master-Windows\solr\build\solr-core\test\J1\temp\solr.cloud.autoscaling.TriggerIntegrationTest_BEA09F488600D5DF-001\init-core-data-001
   [junit4]   2> 1194500 INFO  (SUITE-TriggerIntegrationTest-seed#[BEA09F488600D5DF]-worker) [    ] o.a.s.SolrTestCaseJ4 Using TrieFields (NUMERIC_POINTS_SYSPROP=false) w/NUMERIC_DOCVALUES_SYSPROP=false
   [junit4]   2> 1194505 INFO  (SUITE-TriggerIntegrationTest-seed#[BEA09F488600D5DF]-worker) [    ] o.a.s.SolrTestCaseJ4 Randomized ssl (true) and clientAuth (false) via: @org.apache.solr.util.RandomizeSSL(reason=, value=NaN, ssl=NaN, clientAuth=NaN)
   [junit4]   2> 1194509 INFO  (SUITE-TriggerIntegrationTest-seed#[BEA09F488600D5DF]-worker) [    ] o.a.s.c.MiniSolrCloudCluster Starting cluster of 2 servers in C:\Users\jenkins\workspace\Lucene-Solr-master-Windows\solr\build\solr-core\test\J1\temp\solr.cloud.autoscaling.TriggerIntegrationTest_BEA09F488600D5DF-001\tempDir-001
   [junit4]   2> 1194509 INFO  (SUITE-TriggerIntegrationTest-seed#[BEA09F488600D5DF]-worker) [    ] o.a.s.c.ZkTestServer STARTING ZK TEST SERVER
   [junit4]   2> 1194510 INFO  (Thread-1629) [    ] o.a.s.c.ZkTestServer client port:0.0.0.0/0.0.0.0:0
   [junit4]   2> 1194510 INFO  (Thread-1629) [    ] o.a.s.c.ZkTestServer Starting server
   [junit4]   2> 1194516 ERROR (Thread-1629) [    ] o.a.z.s.ZooKeeperServer ZKShutdownHandler is not registered, so ZooKeeper server won't take any action on ERROR or SHUTDOWN server state changes
   [junit4]   2> 1194609 INFO  (SUITE-TriggerIntegrationTest-seed#[BEA09F488600D5DF]-worker) [    ] o.a.s.c.ZkTestServer start zk server on port:64577
   [junit4]   2> 1194615 INFO  (zkConnectionManagerCallback-2842-thread-1) [    ] o.a.s.c.c.ConnectionManager zkClient has connected
   [junit4]   2> 1194649 INFO  (jetty-launcher-2839-thread-2) [    ] o.e.j.s.Server jetty-9.4.8.v20171121, build timestamp: 2017-11-21T16:27:37-05:00, git hash: 82b8fb23f757335bb3329d540ce37a2a2615f0a8
   [junit4]   2> 1194649 INFO  (jetty-launcher-2839-thread-2) [    ] o.e.j.s.session DefaultSessionIdManager workerName=node0
   [junit4]   2> 1194649 INFO  (jetty-launcher-2839-thread-2) [    ] o.e.j.s.session No SessionScavenger set, using defaults
   [junit4]   2> 1194649 INFO  (jetty-launcher-2839-thread-2) [    ] o.e.j.s.session Scavenging every 600000ms
   [junit4]   2> 1194649 INFO  (jetty-launcher-2839-thread-2) [    ] o.e.j.s.h.ContextHandler Started o.e.j.s.ServletContextHandler@3e69fa3d{/solr,null,AVAILABLE}
   [junit4]   2> 1194652 INFO  (jetty-launcher-2839-thread-1) [    ] o.e.j.s.Server jetty-9.4.8.v20171121, build timestamp: 2017-11-21T16:27:37-05:00, git hash: 82b8fb23f757335bb3329d540ce37a2a2615f0a8
   [junit4]   2> 1194652 INFO  (jetty-launcher-2839-thread-1) [    ] o.e.j.s.session DefaultSessionIdManager workerName=node0
   [junit4]   2> 1194652 INFO  (jetty-launcher-2839-thread-1) [    ] o.e.j.s.session No SessionScavenger set, using defaults
   [junit4]   2> 1194652 INFO  (jetty-launcher-2839-thread-1) [    ] o.e.j.s.session Scavenging every 660000ms
   [junit4]   2> 1194653 INFO  (jetty-launcher-2839-thread-1) [    ] o.e.j.s.h.ContextHandler Started o.e.j.s.ServletContextHandler@4c4c7c5f{/solr,null,AVAILABLE}
   [junit4]   2> 1194663 INFO  (jetty-launcher-2839-thread-2) [    ] o.e.j.s.AbstractConnector Started ServerConnector@5652d11d{SSL,[ssl, http/1.1]}{127.0.0.1:64583}
   [junit4]   2> 1194663 INFO  (jetty-launcher-2839-thread-2) [    ] o.e.j.s.Server Started @1208104ms
   [junit4]   2> 1194664 INFO  (jetty-launcher-2839-thread-2) [    ] o.a.s.c.s.e.JettySolrRunner Jetty properties: {hostContext=/solr, hostPort=64583}
   [junit4]   2> 1194664 ERROR (jetty-launcher-2839-thread-2) [    ] o.a.s.u.StartupLoggingUtils Missing Java Option solr.log.dir. Logging may be missing or incomplete.
   [junit4]   2> 1194664 INFO  (jetty-launcher-2839-thread-2) [    ] o.a.s.s.SolrDispatchFilter  ___      _       Welcome to Apache Solr™ version 8.0.0
   [junit4]   2> 1194664 INFO  (jetty-launcher-2839-thread-2) [    ] o.a.s.s.SolrDispatchFilter / __| ___| |_ _   Starting in cloud mode on port null
   [junit4]   2> 1194664 INFO  (jetty-launcher-2839-thread-2) [    ] o.a.s.s.SolrDispatchFilter \__ \/ _ \ | '_|  Install dir: null
   [junit4]   2> 1194664 INFO  (jetty-launcher-2839-thread-2) [    ] o.a.s.s.SolrDispatchFilter |___/\___/_|_|    Start time: 2018-02-22T09:55:53.148Z
   [junit4]   2> 1194668 INFO  (jetty-launcher-2839-thread-1) [    ] o.e.j.s.AbstractConnector Started ServerConnector@11928f1{SSL,[ssl, http/1.1]}{127.0.0.1:64584}
   [junit4]   2> 1194668 INFO  (jetty-launcher-2839-thread-1) [    ] o.e.j.s.Server Started @1208108ms
   [junit4]   2> 1194668 INFO  (jetty-launcher-2839-thread-1) [    ] o.a.s.c.s.e.JettySolrRunner Jetty properties: {hostContext=/solr, hostPort=64584}
   [junit4]   2> 1194668 ERROR (jetty-launcher-2839-thread-1) [    ] o.a.s.u.StartupLoggingUtils Missing Java Option solr.log.dir. Logging may be missing or incomplete.
   [junit4]   2> 1194668 INFO  (jetty-launcher-2839-thread-1) [    ] o.a.s.s.SolrDispatchFilter  ___      _       Welcome to Apache Solr™ version 8.0.0
   [junit4]   2> 1194668 INFO  (jetty-launcher-2839-thread-1) [    ] o.a.s.s.SolrDispatchFilter / __| ___| |_ _   Starting in cloud mode on port null
   [junit4]   2> 1194668 INFO  (jetty-launcher-2839-thread-1) [    ] o.a.s.s.SolrDispatchFilter \__ \/ _ \ | '_|  Install dir: null
   [junit4]   2> 1194668 INFO  (jetty-launcher-2839-thread-1) [    ] o.a.s.s.SolrDispatchFilter |___/\___/_|_|    Start time: 2018-02-22T09:55:53.152Z
   [junit4]   2> 1194673 INFO  (zkConnectionManagerCallback-2846-thread-1) [    ] o.a.s.c.c.ConnectionManager zkClient has connected
   [junit4]   2> 1194673 INFO  (zkConnectionManagerCallback-2844-thread-1) [    ] o.a.s.c.c.ConnectionManager zkClient has connected
   [junit4]   2> 1194673 INFO  (jetty-launcher-2839-thread-2) [    ] o.a.s.s.SolrDispatchFilter solr.xml found in ZooKeeper. Loading...
   [junit4]   2> 1194674 INFO  (jetty-launcher-2839-thread-1) [    ] o.a.s.s.SolrDispatchFilter solr.xml found in ZooKeeper. Loading...
   [junit4]   2> 1194687 WARN  (NIOServerCxn.Factory:0.0.0.0/0.0.0.0:0) [    ] o.a.z.s.NIOServerCnxn Unable to read additional data from client sessionid 0x100a6fccbe10002, likely client has closed socket
   [junit4]   2> 1194690 INFO  (jetty-launcher-2839-thread-1) [    ] o.a.s.c.ZkContainer Zookeeper client=127.0.0.1:64577/solr
   [junit4]   2> 1194690 INFO  (jetty-launcher-2839-thread-2) [    ] o.a.s.c.ZkContainer Zookeeper client=127.0.0.1:64577/solr
   [junit4]   2> 1194692 INFO  (zkConnectionManagerCallback-2854-thread-1) [    ] o.a.s.c.c.ConnectionManager zkClient has connected
   [junit4]   2> 1194692 INFO  (zkConnectionManagerCallback-2852-thread-1) [    ] o.a.s.c.c.ConnectionManager zkClient has connected
   [junit4]   2> 1194693 WARN  (NIOServerCxn.Factory:0.0.0.0/0.0.0.0:0) [    ] o.a.z.s.NIOServerCnxn Unable to read additional data from client sessionid 0x100a6fccbe10003, likely client has closed socket
   [junit4]   2> 1194696 INFO  (zkConnectionManagerCallback-2856-thread-1-processing-n:127.0.0.1:64584_solr) [n:127.0.0.1:64584_solr    ] o.a.s.c.c.ConnectionManager zkClient has connected
   [junit4]   2> 1194696 INFO  (zkConnectionManagerCallback-2858-thread-1-processing-n:127.0.0.1:64583_solr) [n:127.0.0.1:64583_solr    ] o.a.s.c.c.ConnectionManager zkClient has connected
   [junit4]   2> 1194834 INFO  (jetty-launcher-2839-thread-2) [n:127.0.0.1:64583_solr    ] o.a.s.c.Overseer Overseer (id=null) closing
   [junit4]   2> 1194834 INFO  (jetty-launcher-2839-thread-2) [n:127.0.0.1:64583_solr    ] o.a.s.c.OverseerElectionContext I am going to be the leader 127.0.0.1:64583_solr
   [junit4]   2> 1194838 INFO  (jetty-launcher-2839-thread-2) [n:127.0.0.1:64583_solr    ] o.a.s.c.Overseer Overseer (id=72241198720417798-127.0.0.1:64583_solr-n_0000000000) starting
   [junit4]   2> 1194839 INFO  (jetty-launcher-2839-thread-1) [n:127.0.0.1:64584_solr    ] o.a.s.c.Overseer Overseer (id=null) closing
   [junit4]   2> 1194840 INFO  (jetty-launcher-2839-thread-1) [n:127.0.0.1:64584_solr    ] o.a.s.c.ZkController Register node as live in ZooKeeper:/live_nodes/127.0.0.1:64584_solr
   [junit4]   2> 1194843 INFO  (zkCallback-2855-thread-1-processing-n:127.0.0.1:64584_solr) [n:127.0.0.1:64584_solr    ] o.a.s.c.c.ZkStateReader Updated live nodes from ZooKeeper... (0) -> (1)
   [junit4]   2> 1194843 INFO  (zkCallback-2857-thread-1-processing-n:127.0.0.1:64583_solr) [n:127.0.0.1:64583_solr    ] o.a.s.c.c.ZkStateReader Updated live nodes from ZooKeeper... (0) -> (1)
   [junit4]   2> 1194849 DEBUG (OverseerAutoScalingTriggerThread-72241198720417798-127.0.0.1:64583_solr-n_0000000000) [n:127.0.0.1:64583_solr    ] o.a.s.c.a.OverseerTriggerThread Adding .autoAddReplicas trigger
   [junit4]   2> 1194851 DEBUG (OverseerAutoScalingTriggerThread-72241198720417798-127.0.0.1:64583_solr-n_0000000000) [n:127.0.0.1:64583_solr    ] o.a.s.c.a.OverseerTriggerThread Refreshing /autoscaling.json with znode version 1
   [junit4]   2> 1194852 INFO  (jetty-launcher-2839-thread-2) [n:127.0.0.1:64583_solr    ] o.a.s.c.ZkController Register node as live in ZooKeeper:/live_nodes/127.0.0.1:64583_solr
   [junit4]   2> 1194853 DEBUG (OverseerAutoScalingTriggerThread-72241198720417798-127.0.0.1:64583_solr-n_0000000000) [n:127.0.0.1:64583_solr    ] o.a.s.c.a.NodeLostTrigger Initial livenodes: [127.0.0.1:64584_solr]
   [junit4]   2> 1194853 DEBUG (OverseerAutoScalingTriggerThread-72241198720417798-127.0.0.1:64583_solr-n_0000000000) [n:127.0.0.1:64583_solr    ] o.a.s.c.a.OverseerTriggerThread Current znodeVersion 1, lastZnodeVersion -1
   [junit4]   2> 1194853 DEBUG (OverseerAutoScalingTriggerThread-72241198720417798-127.0.0.1:64583_solr-n_0000000000) [n:127.0.0.1:64583_solr    ] o.a.s.c.a.OverseerTriggerThread Processed trigger updates upto znodeVersion 1
   [junit4]   2> 1194854 INFO  (zkCallback-2855-thread-1-processing-n:127.0.0.1:64584_solr) [n:127.0.0.1:64584_solr    ] o.a.s.c.c.ZkStateReader Updated live nodes from ZooKeeper... (1) -> (2)
   [junit4]   2> 1194855 INFO  (zkCallback-2857-thread-1-processing-n:127.0.0.1:64583_solr) [n:127.0.0.1:64583_solr    ] o.a.s.c.c.ZkStateReader Updated live nodes from ZooKeeper... (1) -> (2)
   [junit4]   2> 1194856 DEBUG (OverseerAutoScalingTriggerThread-72241198720417798-127.0.0.1:64583_solr-n_0000000000) [n:127.0.0.1:64583_solr    ] o.a.s.c.a.OverseerTriggerThread -- clean old nodeAdded markers
   [junit4]   2> 1194856 DEBUG (OverseerAutoScalingTriggerThread-72241198720417798-127.0.0.1:64583_solr-n_0000000000) [n:127.0.0.1:64583_solr    ] o.a.s.c.a.OverseerTriggerThread Current znodeVersion 1, lastZnodeVersion 1
   [junit4]   2> 1194857 DEBUG (ScheduledTrigger-3518-thread-1) [n:127.0.0.1:64583_solr    ] o.a.s.c.a.NodeLostTrigger Running NodeLostTrigger: .auto_add_replicas with currently live nodes: 2
   [junit4]   2> 1195044 INFO  (jetty-launcher-2839-thread-2) [n:127.0.0.1:64583_solr    ] o.a.s.m.r.SolrJmxReporter JMX monitoring for 'solr_64583.solr.node' (registry 'solr.node') enabled at server: com.sun.jmx.mbeanserver.JmxMBeanServer@75104fae
   [junit4]   2> 1195051 INFO  (jetty-launcher-2839-thread-1) [n:127.0.0.1:64584_solr    ] o.a.s.m.r.SolrJmxReporter JMX monitoring for 'solr_64584.solr.node' (registry 'solr.node') enabled at server: com.sun.jmx.mbeanserver.JmxMBeanServer@75104fae
   [junit4]   2> 1195057 INFO  (jetty-launcher-2839-thread-2) [n:127.0.0.1:64583_solr    ] o.a.s.m.r.SolrJmxReporter JMX monitoring for 'solr_64583.solr.jvm' (registry 'solr.jvm') enabled at server: com.sun.jmx.mbeanserver.JmxMBeanServer@75104fae
   [junit4]   2> 1195058 INFO  (jetty-launcher-2839-thread-2) [n:127.0.0.1:64583_solr    ] o.a.s.m.r.SolrJmxReporter JMX monitoring for 'solr_64583.solr.jetty' (registry 'solr.jetty') enabled at server: com.sun.jmx.mbeanserver.JmxMBeanServer@75104fae
   [junit4]   2> 1195060 INFO  (jetty-launcher-2839-thread-1) [n:127.0.0.1:64584_solr    ] o.a.s.m.r.SolrJmxReporter JMX monitoring for 'solr_64584.solr.jvm' (registry 'solr.jvm') enabled at server: com.sun.jmx.mbeanserver.JmxMBeanServer@75104fae
   [junit4]   2> 1195060 INFO  (jetty-launcher-2839-thread-1) [n:127.0.0.1:64584_solr    ] o.a.s.m.r.SolrJmxReporter JMX monitoring for 'solr_64584.solr.jetty' (registry 'solr.jetty') enabled at server: com.sun.jmx.mbeanserver.JmxMBeanServer@75104fae
   [junit4]   2> 1195061 INFO  (jetty-launcher-2839-thread-2) [n:127.0.0.1:64583_solr    ] o.a.s.c.CorePropertiesLocator Found 0 core definitions underneath C:\Users\jenkins\workspace\Lucene-Solr-master-Windows\solr\build\solr-core\test\J1\temp\solr.cloud.autoscaling.TriggerIntegrationTest_BEA09F488600D5DF-001\tempDir-001\node2\.
   [junit4]   2> 1195061 INFO  (jetty-launcher-2839-thread-1) [n:127.0.0.1:64584_solr    ] o.a.s.c.CorePropertiesLocator Found 0 core definitions underneath C:\Users\jenkins\workspace\Lucene-Solr-master-Windows\solr\build\solr-core\test\J1\temp\solr.cloud.autoscaling.TriggerIntegrationTest_BEA09F488600D5DF-001\tempDir-001\node1\.
   [junit4]   2> 1195116 INFO  (zkConnectionManagerCallback-2864-thread-1) [    ] o.a.s.c.c.ConnectionManager zkClient has connected
   [junit4]   2> 1195117 WARN  (NIOServerCxn.Factory:0.0.0.0/0.0.0.0:0) [    ] o.a.z.s.NIOServerCnxn Unable to read additional data from client sessionid 0x100a6fccbe10007, likely client has closed socket
   [junit4]   2> 1195120 INFO  (zkConnectionManagerCallback-2868-thread-1) [    ] o.a.s.c.c.ConnectionManager zkClient has connected
   [junit4]   2> 1195121 INFO  (SUITE-TriggerIntegrationTest-seed#[BEA09F488600D5DF]-worker) [    ] o.a.s.c.c.ZkStateReader Updated live nodes from ZooKeeper... (0) -> (2)
   [junit4]   2> 1195122 INFO  (SUITE-TriggerIntegrationTest-seed#[BEA09F488600D5DF]-worker) [    ] o.a.s.c.s.i.ZkClientClusterStateProvider Cluster at 127.0.0.1:64577/solr ready
   [junit4]   2> 1195140 INFO  (TEST-TriggerIntegrationTest.testNodeAddedTriggerRestoreState-seed#[BEA09F488600D5DF]) [    ] o.a.s.SolrTestCaseJ4 ###Starting testNodeAddedTriggerRestoreState
   [junit4]   2> 1195229 INFO  (qtp2091221447-9968) [n:127.0.0.1:64584_solr    ] o.a.s.h.a.CollectionsHandler Invoked Collection Action :overseerstatus with params action=OVERSEERSTATUS&wt=javabin&version=2 and sendToOCPQueue=true
   [junit4]   2> 1195235 INFO  (qtp2091221447-9968) [n:127.0.0.1:64584_solr    ] o.a.s.s.HttpSolrCall [admin] webapp=null path=/admin/collections params={action=OVERSEERSTATUS&wt=javabin&version=2} status=0 QTime=6
   [junit4]   2> 1195237 INFO  (TEST-TriggerIntegrationTest.testNodeAddedTriggerRestoreState-seed#[BEA09F488600D5DF]) [    ] o.a.s.c.a.ScheduledTriggers -- removing trigger: .auto_add_replicas
   [junit4]   2> 1195240 INFO  (TEST-TriggerIntegrationTest.testNodeAddedTriggerRestoreState-seed#[BEA09F488600D5DF]) [    ] o.a.s.c.a.TriggerIntegrationTest /autoscaling.json reset, new znode version 2
   [junit4]   2> 1195240 DEBUG (zkCallback-2857-thread-1-processing-n:127.0.0.1:64583_solr) [n:127.0.0.1:64583_solr    ] o.a.s.c.a.OverseerTriggerThread Refreshing /autoscaling.json with znode version 2
   [junit4]   2> 1195241 INFO  (TEST-TriggerIntegrationTest.testNodeAddedTriggerRestoreState-seed#[BEA09F488600D5DF]) [    ] o.a.s.c.c.ZkStateReader Updated live nodes from ZooKeeper... (0) -> (2)
   [junit4]   2> 1195241 DEBUG (OverseerAutoScalingTriggerThread-72241198720417798-127.0.0.1:64583_solr-n_0000000000) [n:127.0.0.1:64583_solr    ] o.a.s.c.a.OverseerTriggerThread Processed trigger updates upto znodeVersion 2
   [junit4]   2> 1195241 DEBUG (OverseerAutoScalingTriggerThread-72241198720417798-127.0.0.1:64583_solr-n_0000000000) [n:127.0.0.1:64583_solr    ] o.a.s.c.a.OverseerTriggerThread -- clean old nodeLost markers
   [junit4]   2> 1195243 INFO  (TEST-TriggerIntegrationTest.testNodeAddedTriggerRestoreState-seed#[BEA09F488600D5DF]) [    ] o.e.j.s.AbstractConnector Stopped ServerConnector@5652d11d{SSL,[ssl, http/1.1]}{127.0.0.1:0}
   [junit4]   2> 1195244 INFO  (TEST-TriggerIntegrationTest.testNodeAddedTriggerRestoreState-seed#[BEA09F488600D5DF]) [    ] o.a.s.c.CoreContainer Shutting down CoreContainer instance=1310799694
   [junit4]   2> 1195244 DEBUG (OverseerAutoScalingTriggerThread-72241198720417798-127.0.0.1:64583_solr-n_0000000000) [n:127.0.0.1:64583_solr    ] o.a.s.c.a.OverseerTriggerThread -- clean old nodeAdded markers
   [junit4]   2> 1195244 INFO  (TEST-TriggerIntegrationTest.testNodeAddedTriggerRestoreState-seed#[BEA09F488600D5DF]) [    ] o.a.s.m.SolrMetricManager Closing metric reporters for registry=solr.node, tag=null
   [junit4]   2> 1195244 INFO  (TEST-TriggerIntegrationTest.testNodeAddedTriggerRestoreState-seed#[BEA09F488600D5DF]) [    ] o.a.s.m.r.SolrJmxReporter Closing reporter [org.apache.solr.metrics.reporters.SolrJmxReporter@699d2977: rootName = solr_64583, domain = solr.node, service url = null, agent id = null] for registry solr.node / com.codahale.metrics.MetricRegistry@38c02f61
   [junit4]   2> 1195244 DEBUG (OverseerAutoScalingTriggerThread-72241198720417798-127.0.0.1:64583_solr-n_0000000000) [n:127.0.0.1:64583_solr    ] o.a.s.c.a.OverseerTriggerThread Current znodeVersion 2, lastZnodeVersion 2
   [junit4]   2> 1195248 INFO  (TEST-TriggerIntegrationTest.testNodeAddedTriggerRestoreState-seed#[BEA09F488600D5DF]) [    ] o.a.s.m.SolrMetricManager Closing metric reporters for registry=solr.jvm, tag=null
   [junit4]   2> 1195249 INFO  (TEST-TriggerIntegrationTest.testNodeAddedTriggerRestoreState-seed#[BEA09F488600D5DF]) [    ] o.a.s.m.r.SolrJmxReporter Closing reporter [org.apache.solr.metrics.reporters.SolrJmxReporter@71f2770: rootName = solr_64583, domain = solr.jvm, service url = null, agent id = null] for registry solr.jvm / com.codahale.metrics.MetricRegistry@43e4d4be
   [junit4]   2> 1195251 INFO  (TEST-TriggerIntegrationTest.testNodeAddedTriggerRestoreState-seed#[BEA09F488600D5DF]) [    ] o.a.s.m.SolrMetricManager Closing metric reporters for registry=solr.jetty, tag=null
   [junit4]   2> 1195252 INFO  (TEST-TriggerIntegrationTest.testNodeAddedTriggerRestoreState-seed#[BEA09F488600D5DF]) [    ] o.a.s.m.r.SolrJmxReporter Closing reporter [org.apache.solr.metrics.reporters.SolrJmxReporter@63995947: rootName = solr_64583, domain = solr.jetty, service url = null, agent id = null] for registry solr.jetty / com.codahale.metrics.MetricRegistry@7b552cc7
   [junit4]   2> 1195253 INFO  (TEST-TriggerIntegrationTest.testNodeAddedTriggerRestoreState-seed#[BEA09F488600D5DF]) [    ] o.a.s.c.ZkController Remove node as live in ZooKeeper:/live_nodes/127.0.0.1:64583_solr
   [junit4]   2> 1195254 INFO  (TEST-TriggerIntegrationTest.testNodeAddedTriggerRestoreState-seed#[BEA09F488600D5DF]) [    ] o.a.s.m.SolrMetricManager Closing metric reporters for registry=solr.cluster, tag=null
   [junit4]   2> 1195254 INFO  (TEST-TriggerIntegrationTest.testNodeAddedTriggerRestoreState-seed#[BEA09F488600D5DF]) [    ] o.a.s.c.TransientSolrCoreCacheDefault Allocating transient cache for 2147483647 transient cores
   [junit4]   2> 1195254 INFO  (TEST-TriggerIntegrationTest.testNodeAddedTriggerRestoreState-seed#[BEA09F488600D5DF]) [    ] o.a.s.c.Overseer Overseer (id=72241198720417798-127.0.0.1:64583_solr-n_0000000000) closing
   [junit4]   2> 1195268 INFO  (OverseerStateUpdate-72241198720417798-127.0.0.1:64583_solr-n_0000000000) [n:127.0.0.1:64583_solr    ] o.a.s.c.Overseer Overseer Loop exiting : 127.0.0.1:64583_solr
   [junit4]   2> 1195268 DEBUG (TEST-TriggerIntegrationTest.testNodeAddedTriggerRestoreState-seed#[BEA09F488600D5DF]) [    ] o.a.s.c.a.OverseerTriggerThread OverseerTriggerThread has been closed explicitly
   [junit4]   2> 1195268 WARN  (OverseerAutoScalingTriggerThread-72241198720417798-127.0.0.1:64583_solr-n_0000000000) [n:127.0.0.1:64583_solr    ] o.a.s.c.a.OverseerTriggerThread OverseerTriggerThread woken up but we are closed, exiting.
   [junit4]   2> 1195271 INFO  (zkCallback-2855-thread-1-processing-n:127.0.0.1:64584_solr) [n:127.0.0.1:64584_solr    ] o.a.s.c.c.ZkStateReader Updated live nodes from ZooKeeper... (2) -> (1)
   [junit4]   2> 1195271 INFO  (zkCallback-2857-thread-1-processing-n:127.0.0.1:64583_solr) [n:127.0.0.1:64583_solr    ] o.a.s.c.c.ZkStateReader Updated live nodes from ZooKeeper... (2) -> (1)
   [junit4]   2> 1195271 INFO  (zkCallback-2867-thread-1) [    ] o.a.s.c.c.ZkStateReader Updated live nodes from ZooKeeper... (2) -> (1)
   [junit4]   2> 1195271 INFO  (zkCallback-2867-thread-2) [    ] o.a.s.c.c.ZkStateReader Updated live nodes from ZooKeeper... (2) -> (1)
   [junit4]   2> 1195271 WARN  (NIOServerCxn.Factory:0.0.0.0/0.0.0.0:0) [    ] o.a.z.s.NIOServerCnxn Unable to read additional data from client sessionid 0x100a6fccbe10006, likely client has closed socket
   [junit4]   2> 1195272 INFO  (TEST-TriggerIntegrationTest.testNodeAddedTriggerRestoreState-seed#[BEA09F488600D5DF]) [    ] o.e.j.s.h.ContextHandler Stopped o.e.j.s.ServletContextHandler@3e69fa3d{/solr,null,UNAVAILABLE}
   [junit4]   2> 1195272 INFO  (TEST-TriggerIntegrationTest.testNodeAddedTriggerRestoreState-seed#[BEA09F488600D5DF]) [    ] o.e.j.s.session Stopped scavenging
   [junit4]   2> 1195272 INFO  (zkCallback-2855-thread-2-processing-n:127.0.0.1:64584_solr) [n:127.0.0.1:64584_solr    ] o.a.s.c.OverseerElectionContext I am going to be the leader 127.0.0.1:64584_solr
   [junit4]   2> 1195274 INFO  (zkCallback-2855-thread-2-processing-n:127.0.0.1:64584_solr) [n:127.0.0.1:64584_solr    ] o.a.s.c.Overseer Overseer (id=72241198720417797-127.0.0.1:64584_solr-n_0000000001) starting
   [junit4]   2> 1195279 DEBUG (OverseerAutoScalingTriggerThread-72241198720417797-127.0.0.1:64584_solr-n_0000000001) [n:127.0.0.1:64584_solr    ] o.a.s.c.a.OverseerTriggerThread Adding .autoAddReplicas trigger
   [junit4]   2> 1195279 DEBUG (OverseerAutoScalingTriggerThread-72241198720417797-127.0.0.1:64584_solr-n_0000000001) [n:127.0.0.1:64584_solr    ] o.a.s.c.a.OverseerTriggerThread Refreshing /autoscaling.json with znode version 3
   [junit4]   2> 1195281 DEBUG (OverseerAutoScalingTriggerThread-72241198720417797-127.0.0.1:64584_solr-n_0000000001) [n:127.0.0.1:64584_solr    ] o.a.s.c.a.NodeLostTrigger Initial livenodes: [127.0.0.1:64584_solr]
   [junit4]   2> 1195281 DEBUG (OverseerAutoScalingTriggerThread-72241198720417797-127.0.0.1:64584_solr-n_0000000001) [n:127.0.0.1:64584_solr    ] o.a.s.c.a.OverseerTriggerThread Current znodeVersion 3, lastZnodeVersion -1
   [junit4]   2> 1195281 DEBUG (OverseerAutoScalingTriggerThread-72241198720417797-127.0.0.1:64584_solr-n_0000000001) [n:127.0.0.1:64584_solr    ] o.a.s.c.a.OverseerTriggerThread Processed trigger updates upto znodeVersion 3
   [junit4]   2> 1195283 DEBUG (OverseerAutoScalingTriggerThread-72241198720417797-127.0.0.1:64584_solr-n_0000000001) [n:127.0.0.1:64584_solr    ] o.a.s.c.a.OverseerTriggerThread -- clean old nodeAdded markers
   [junit4]   2> 1195283 DEBUG (OverseerAutoScalingTriggerThread-72241198720417797-127.0.0.1:64584_solr-n_0000000001) [n:127.0.0.1:64584_solr    ] o.a.s.c.a.OverseerTriggerThread Current znodeVersion 3, lastZnodeVersion 3
   [junit4]   2> 1195283 DEBUG (ScheduledTrigger-3527-thread-1) [n:127.0.0.1:64584_solr    ] o.a.s.c.a.NodeLostTrigger Running NodeLostTrigger: .auto_add_replicas with currently live nodes: 1
   [junit4]   2> 1196285 DEBUG (ScheduledTrigger-3527-thread-1) [n:127.0.0.1:64584_solr    ] o.a.s.c.a.NodeLostTrigger Running NodeLostTrigger: .auto_add_replicas with currently live nodes: 1
   [junit4]   2> 1197286 DEBUG (ScheduledTrigger-3527-thread-2) [n:127.0.0.1:64584_solr    ] o.a.s.c.a.NodeLostTrigger Running NodeLostTrigger: .auto_add_replicas with currently live nodes: 1
   [junit4]   2> 1198288 DEBUG (ScheduledTrigger-3527-thread-1) [n:127.0.0.1:64584_solr    ] o.a.s.c.a.NodeLostTrigger Running NodeLostTrigger: .auto_add_replicas with currently live nodes: 1
   [junit4]   2> 1199289 DEBUG (ScheduledTrigger-3527-thread-1) [n:127.0.0.1:64584_solr    ] o.a.s.c.a.NodeLostTrigger Running NodeLostTrigger: .auto_add_replicas with currently live nodes: 1
   [junit4]   2> 1200277 INFO  (TEST-TriggerIntegrationTest.testNodeAddedTriggerRestoreState-seed#[BEA09F488600D5DF]) [    ] o.e.j.s.Server jetty-9.4.8.v20171121, build timestamp: 2017-11-21T16:27:37-05:00, git hash: 82b8fb23f757335bb3329d540ce37a2a2615f0a8
   [junit4]   2> 1200277 INFO  (TEST-TriggerIntegrationTest.testNodeAddedTriggerRestoreState-seed#[BEA09F488600D5DF]) [    ] o.e.j.s.session DefaultSessionIdManager workerName=node0
   [junit4]   2> 1200277 INFO  (TEST-TriggerIntegrationTest.testNodeAddedTriggerRestoreState-seed#[BEA09F488600D5DF]) [    ] o.e.j.s.session No SessionScavenger set, using defaults
   [junit4]   2> 1200277 INFO  (TEST-TriggerIntegrationTest.testNodeAddedTriggerRestoreState-seed#[BEA09F488600D5DF]) [    ] o.e.j.s.session Scavenging every 600000ms
   [junit4]   2> 1200277 INFO  (TEST-TriggerIntegrationTest.testNodeAddedTriggerRestoreState-seed#[BEA09F488600D5DF]) [    ] o.e.j.s.h.ContextHandler Started o.e.j.s.ServletContextHandler@2d3991fe{/solr,null,AVAILABLE}
   [junit4]   2> 1200278 INFO  (TEST-TriggerIntegrationTest.testNodeAddedTriggerRestoreState-seed#[BEA09F488600D5DF]) [    ] o.e.j.s.AbstractConnector Started ServerConnector@cfcd924{SSL,[ssl, http/1.1]}{127.0.0.1:64638}
   [junit4]   2> 1200278 INFO  (TEST-TriggerIntegrationTest.testNodeAddedTriggerRestoreState-seed#[BEA09F488600D5DF]) [    ] o.e.j.s.Server Started @1213719ms
   [junit4]   2> 1200278 INFO  (TEST-TriggerIntegrationTest.testNodeAddedTriggerRestoreState-seed#[BEA09F488600D5DF]) [    ] o.a.s.c.s.e.JettySolrRunner Jetty properties: {hostContext=/solr, hostPort=64638}
   [junit4]   2> 1200278 ERROR (TEST-TriggerIntegrationTest.testNodeAddedTriggerRestoreState-seed#[BEA09F488600D5DF]) [    ] o.a.s.u.StartupLoggingUtils Missing Java Option solr.log.dir. Logging may be missing or incomplete.
   [junit4]   2> 1200278 INFO  (TEST-TriggerIntegrationTest.testNodeAddedTriggerRestoreState-seed#[BEA09F488600D5DF]) [    ] o.a.s.s.SolrDispatchFilter  ___      _       Welcome to Apache Solr™ version 8.0.0
   [junit4]   2> 1200278 INFO  (TEST-TriggerIntegrationTest.testNodeAddedTriggerRestoreState-seed#[BEA09F488600D5DF]) [    ] o.a.s.s.SolrDispatchFilter / __| ___| |_ _   Starting in cloud mode on port null
   [junit4]   2> 1200278 INFO  (TEST-TriggerIntegrationTest.testNodeAddedTriggerRestoreState-seed#[BEA09F488600D5DF]) [    ] o.a.s.s.SolrDispatchFilter \__ \/ _ \ | '_|  Install dir: null
   [junit4]   2> 1200278 INFO  (TEST-TriggerIntegrationTest.testNodeAddedTriggerRestoreState-seed#[BEA09F488600D5DF]) [    ] o.a.s.s.SolrDispatchFilter |___/\___/_|_|    Start time: 2018-02-22T09:55:58.762Z
   [junit4]   2> 1200282 INFO  (zkConnectionManagerCallback-2871-thread-1) [    ] o.a.s.c.c.ConnectionManager zkClient has connected
   [junit4]   2> 1200283 INFO  (TEST-TriggerIntegrationTest.testNodeAddedTriggerRestoreState-seed#[BEA09F488600D5DF]) [    ] o.a.s.s.SolrDispatchFilter solr.xml found in ZooKeeper. Loading...
   [junit4]   2> 1200288 DEBUG (ScheduledTrigger-3527-thread-1) [n:127.0.0.1:64584_solr    ] o.a.s.c.a.NodeLostTrigger Running NodeLostTrigger: .auto_add_replicas with currently live nodes: 1
   [junit4]   2> 1200292 WARN  (NIOServerCxn.Factory:0.0.0.0/0.0.0.0:0) [    ] o.a.z.s.NIOServerCnxn Unable to read additional data from client sessionid 0x100a6fccbe10009, likely client has closed socket
   [junit4]   2> 1200294 INFO  (TEST-TriggerIntegrationTest.testNodeAddedTriggerRestoreState-seed#[BEA09F488600D5DF]) [    ] o.a.s.c.ZkContainer Zookeeper client=127.0.0.1:64577/solr
   [junit4]   2> 1200297 INFO  (zkConnectionManagerCallback-2875-thread-1) [    ] o.a.s.c.c.ConnectionManager zkClient has connected
   [junit4]   2> 1200300 INFO  (zkConnectionManagerCallback-2877-thread-1-processing-n:127.0.0.1:64638_solr) [n:127.0.0.1:64638_solr    ] o.a.s.c.c.ConnectionManager zkClient has connected
   [junit4]   2> 1200308 INFO  (TEST-TriggerIntegrationTest.testNodeAddedTriggerRestoreState-seed#[BEA09F488600D5DF]) [n:127.0.0.1:64638_solr    ] o.a.s.c.c.ZkStateReader Updated live nodes from ZooKeeper... (0) -> (1)
   [junit4]   2> 1200311 INFO  (TEST-TriggerIntegrationTest.testNodeAddedTriggerRestoreState-seed#[BEA09F488600D5DF]) [n:127.0.0.1:64638_solr    ] o.a.s.c.Overseer Overseer (id=null) closing
   [junit4]   2> 1200313 INFO  (TEST-TriggerIntegrationTest.testNodeAddedTriggerRestoreState-seed#[BEA09F488600D5DF]) [n:127.0.0.1:64638_solr    ] o.a.s.c.ZkController Register node as live in ZooKeeper:/live_nodes/127.0.0.1:64638_solr
   [junit4]   2> 1200313 INFO  (zkCallback-2855-thread-2-processing-n:127.0.0.1:64584_solr) [n:127.0.0.1:64584_solr    ] o.a.s.c.c.ZkStateReader Updated live nodes from ZooKeeper... (1) -> (2)
   [junit4]   2> 1200313 INFO  (zkCallback-2867-thread-2) [    ] o.a.s.c.c.ZkStateReader Updated live nodes from ZooKeeper... (1) -> (2)
   [junit4]   2> 1200314 INFO  (zkCallback-2867-thread-1) [    ] o.a.s.c.c.ZkStateReader Updated live nodes from ZooKeeper... (1) -> (2)
   [junit4]   2> 1200315 INFO  (zkCallback-2876-thread-1-processing-n:127.0.0.1:64638_solr) [n:127.0.0.1:64638_solr    ] o.a.s.c.c.ZkStateReader Updated live nodes from ZooKeeper... (1) -> (2)
   [junit4]   2> 1200408 INFO  (TEST-TriggerIntegrationTest.testNodeAddedTriggerRestoreState-seed#[BEA09F488600D5DF]) [n:127.0.0.1:64638_solr    ] o.a.s.m.r.SolrJmxReporter JMX monitoring for 'solr_64638.solr.node' (registry 'solr.node') enabled at server: com.sun.jmx.mbeanserver.JmxMBeanServer@75104fae
   [junit4]   2> 1200415 INFO  (TEST-TriggerIntegrationTest.testNodeAddedTriggerRestoreState-seed#[BEA09F488600D5DF]) [n:127.0.0.1:64638_solr    ] o.a.s.m.r.SolrJmxReporter JMX monitoring for 'solr_64638.solr.jvm' (registry 'solr.jvm') enabled at server: com.sun.jmx.mbeanserver.JmxMBeanServer@75104fae
   [junit4]   2> 1200415 INFO  (TEST-TriggerIntegrationTest.testNodeAddedTriggerRestoreState-seed#[BEA09F488600D5DF]) [n:127.0.0.1:64638_solr    ] o.a.s.m.r.SolrJmxReporter JMX monitoring for 'solr_64638.solr.jetty' (registry 'solr.jetty') enabled at server: com.sun.jmx.mbeanserver.JmxMBeanServer@75104fae
   [junit4]   2> 1200416 INFO  (TEST-TriggerIntegrationTest.testNodeAddedTriggerRestoreState-seed#[BEA09F488600D5DF]) [n:127.0.0.1:64638_solr    ] o.a.s.c.CorePropertiesLocator Found 0 core definitions underneath C:\Users\jenkins\workspace\Lucene-Solr-master-Windows\solr\build\solr-core\test\J1\temp\solr.cloud.autoscaling.TriggerIntegrationTest_BEA09F488600D5DF-001\tempDir-001\node3\.
   [junit4]   2> 1200460 INFO  (qtp2091221447-9970) [n:127.0.0.1:64584_solr    ] o.a.s.s.HttpSolrCall [admin] webapp=null path=/admin/metrics params={prefix=CONTAINER.fs.usableSpace,CORE.coreName&wt=javabin&version=2&group=solr.node,solr.core} status=0 QTime=1
   [junit4]   2> 1200481 INFO  (qtp1443276817-10035) [n:127.0.0.1:64638_solr    ] o.a.s.s.HttpSolrCall [admin] webapp=null path=/admin/metrics params={prefix=CONTAINER.fs.usableSpace,CORE.coreName&wt=javabin&version=2&group=solr.node,solr.core} status=0 QTime=1
   [junit4]   2> 1200482 DEBUG (qtp2091221447-9971) [n:127.0.0.1:64584_solr    ] o.a.s.c.a.AutoScalingHandler Verified autoscaling configuration
   [junit4]   2> 1200483 INFO  (qtp2091221447-9971) [n:127.0.0.1:64584_solr    ] o.a.s.s.HttpSolrCall [admin] webapp=null path=/admin/autoscaling params={wt=javabin&version=2} status=0 QTime=32
   [junit4]   2> 1200483 DEBUG (zkCallback-2855-thread-2-processing-n:127.0.0.1:64584_solr) [n:127.0.0.1:64584_solr    ] o.a.s.c.a.OverseerTriggerThread Refreshing /autoscaling.json with znode version 4
   [junit4]   2> 1200484 DEBUG (zkCallback-2855-thread-2-processing-n:127.0.0.1:64584_solr) [n:127.0.0.1:64584_solr    ] o.a.s.c.a.NodeAddedTrigger Initial livenodes: [127.0.0.1:64584_solr, 127.0.0.1:64638_solr]
   [junit4]   2> 1200484 DEBUG (zkCallback-2855-thread-2-processing-n:127.0.0.1:64584_solr) [n:127.0.0.1:64584_solr    ] o.a.s.c.a.NodeAddedTrigger NodeAddedTrigger node_added_restore_trigger instantiated with properties: {event=nodeAdded, waitFor=5, actions=[{name=test, class=org.apache.solr.cloud.autoscaling.TriggerIntegrationTest$TestTriggerAction}], enabled=true}
   [junit4]   2> 1200485 DEBUG (zkCallback-2855-thread-2-processing-n:127.0.0.1:64584_solr) [n:127.0.0.1:64584_solr    ] o.a.s.c.a.NodeLostTrigger Initial livenodes: [127.0.0.1:64584_solr, 127.0.0.1:64638_solr]
   [junit4]   2> 1200485 DEBUG (OverseerAutoScalingTriggerThread-72241198720417797-127.0.0.1:64584_solr-n_0000000001) [n:127.0.0.1:64584_solr    ] o.a.s.c.a.OverseerTriggerThread Processed trigger updates upto znodeVersion 4
   [junit4]   2> 1200487 INFO  (TEST-TriggerIntegrationTest.testNodeAddedTriggerRestoreState-seed#[BEA09F488600D5DF]) [    ] o.e.j.s.Server jetty-9.4.8.v20171121, build timestamp: 2017-11-21T16:27:37-05:00, git hash: 82b8fb23f757335bb3329d540ce37a2a2615f0a8
   [junit4]   2> 1200487 INFO  (TEST-TriggerIntegrationTest.testNodeAddedTriggerRestoreState-seed#[BEA09F488600D5DF]) [    ] o.e.j.s.session DefaultSessionIdManager workerName=node0
   [junit4]   2> 1200487 INFO  (TEST-TriggerIntegrationTest.testNodeAddedTriggerRestoreState-seed#[BEA09F488600D5DF]) [    ] o.e.j.s.session No SessionScavenger set, using defaults
   [junit4]   2> 1200487 INFO  (TEST-TriggerIntegrationTest.testNodeAddedTriggerRestoreState-seed#[BEA09F488600D5DF]) [    ] o.e.j.s.session Scavenging every 600000ms
   [junit4]   2> 1200487 INFO  (OverseerAutoScalingTriggerThread-72241198720417797-127.0.0.1:64584_solr-n_0000000001) [n:127.0.0.1:64584_solr    ] o.a.s.c.a.TriggerIntegrationTest TestTriggerAction init
   [junit4]   2> 1200488 INFO  (TEST-TriggerIntegrationTest.testNodeAddedTriggerRestoreState-seed#[BEA09F488600D5DF]) [    ] o.e.j.s.h.ContextHandler Started o.e.j.s.ServletContextHandler@62391194{/solr,null,AVAILABLE}
   [junit4]   2> 1200490 INFO  (TEST-TriggerIntegrationTest.testNodeAddedTriggerRestoreState-seed#[BEA09F488600D5DF]) [    ] o.e.j.s.AbstractConnector Started ServerConnector@24da349a{SSL,[ssl, http/1.1]}{127.0.0.1:64652}
   [junit4]   2> 1200490 INFO  (TEST-TriggerIntegrationTest.testNodeAddedTriggerRestoreState-seed#[BEA09F488600D5DF]) [    ] o.e.j.s.Server Started @1213930ms
   [junit4]   2> 1200490 INFO  (TEST-TriggerIntegrationTest.testNodeAddedTriggerRestoreState-seed#[BEA09F488600D5DF]) [    ] o.a.s.c.s.e.JettySolrRunner Jetty properties: {hostContext=/solr, hostPort=64652}
   [junit4]   2> 1200490 ERROR (TEST-TriggerIntegrationTest.testNodeAddedTriggerRestoreState-seed#[BEA09F488600D5DF]) [    ] o.a.s.u.StartupLoggingUtils Missing Java Option solr.log.dir. Logging may be missing or incomplete.
   [junit4]   2> 1200490 INFO  (TEST-TriggerIntegrationTest.testNodeAddedTriggerRestoreState-seed#[BEA09F488600D5DF]) [    ] o.a.s.s.SolrDispatchFilter  ___      _       Welcome to Apache Solr™ version 8.0.0
   [junit4]   2> 1200490 INFO  (TEST-TriggerIntegrationTest.testNodeAddedTriggerRestoreState-seed#[BEA09F488600D5DF]) [    ] o.a.s.s.SolrDispatchFilter / __| ___| |_ _   Starting in cloud mode on port null
   [junit4]   2> 1200490 INFO  (TEST-TriggerIntegrationTest.testNodeAddedTriggerRestoreState-seed#[BEA09F488600D5DF]) [    ] o.a.s.s.SolrDispatchFilter \__ \/ _ \ | '_|  Install dir: null
   [junit4]   2> 1200490 INFO  (TEST-TriggerIntegrationTest.testNodeAddedTriggerRestoreState-seed#[BEA09F488600D5DF]) [    ] o.a.s.s.SolrDispatchFilter |___/\___/_|_|    Start time: 2018-02-22T09:55:58.974Z
   [junit4]   2> 1200490 DEBUG (ScheduledTrigger-3527-thread-3) [n:127.0.0.1:64584_solr    ] o.a.s.c.a.NodeAddedTrigger Running NodeAddedTrigger node_added_restore_trigger
   [junit4]   2> 1200491 DEBUG (ScheduledTrigger-3527-thread-3) [n:127.0.0.1:64584_solr    ] o.a.s.c.a.NodeAddedTrigger Found livenodes: 2
   [junit4]   2> 1200491 DEBUG (OverseerAutoScalingTriggerThread-72241198720417797-127.0.0.1:64584_solr-n_0000000001) [n:127.0.0.1:64584_solr    ] o.a.s.c.a.OverseerTriggerThread Current znodeVersion 4, lastZnodeVersion 4
   [junit4]   2> 1200492 INFO  (zkConnectionManagerCallback-2881-thread-1) [    ] o.a.s.c.c.ConnectionManager zkClient has connected
   [junit4]   2> 1200493 INFO  (TEST-TriggerIntegrationTest.testNodeAddedTriggerRestoreState-seed#[BEA09F488600D5DF]) [    ] o.a.s.s.SolrDispatchFilter solr.xml found in ZooKeeper. Loading...
   [junit4]   2> 1200503 INFO  (TEST-TriggerIntegrationTest.testNodeAddedTriggerRestoreState-seed#[BEA09F488600D5DF]) [    ] o.a.s.c.ZkContainer Zookeeper client=127.0.0.1:64577/solr
   [junit4]   2> 1200505 INFO  (zkConnectionManagerCallback-2885-thread-1) [    ] o.a.s.c.c.ConnectionManager zkClient has connected
   [junit4]   2> 1200509 INFO  (zkConnectionManagerCallback-2887-thread-1-processing-n:127.0.0.1:64652_solr) [n:127.0.0.1:64652_solr    ] o.a.s.c.c.ConnectionManager zkClient has connected
   [junit4]   2> 1200517 INFO  (TEST-TriggerIntegrationTest.testNodeAddedTriggerRestoreState-seed#[BEA09F488600D5DF]) [n:127.0.0.1:64652_solr    ] o.a.s.c.c.ZkStateReader Updated live nodes from ZooKeeper... (0) -> (2)
   [junit4]   2> 1200519 INFO  (TEST-TriggerIntegrationTest.testNodeAddedTriggerRestoreState-seed#[BEA09F488600D5DF]) [n:127.0.0.1:64652_solr    ] o.a.s.c.Overseer Overseer (id=null) closing
   [junit4]   2> 1200521 INFO  (TEST-TriggerIntegrationTest.testNodeAddedTriggerRestoreState-seed#[BEA09F488600D5DF]) [n:127.0.0.1:64652_solr    ] o.a.s.c.ZkController Register node as live in ZooKeeper:/live_nodes/127.0.0.1:64652_solr
   [junit4]   2> 1200522 INFO  (zkCallback-2876-thread-1-processing-n:127.0.0.1:64638_solr) [n:127.0.0.1:64638_solr    ] o.a.s.c.c.ZkStateReader Updated live nodes from ZooKeeper... (2) -> (3)
   [junit4]   2> 1200523 INFO  (zkCallback-2855-thread-2-processing-n:127.0.0.1:64584_solr) [n:127.0.0.1:64584_solr    ] o.a.s.c.c.ZkStateReader Updated live nodes from ZooKeeper... (2) -> (3)
   [junit4]   2> 1200523 INFO  (zkCallback-2867-thread-1) [    ] o.a.s.c.c.ZkStateReader Updated live nodes from ZooKeeper... (2) -> (3)

[...truncated too long message...]

G, group=TGRP-SchemaTest]
   [junit4]    >         at sun.misc.Unsafe.park(Native Method)
   [junit4]    >         at java.util.concurrent.locks.LockSupport.parkNanos(LockSupport.java:215)
   [junit4]    >         at java.util.concurrent.locks.AbstractQueuedSynchronizer$ConditionObject.await(AbstractQueuedSynchronizer.java:2163)
   [junit4]    >         at org.eclipse.jetty.util.thread.ReservedThreadExecutor$ReservedThread.reservedWait(ReservedThreadExecutor.java:308)
   [junit4]    >         at org.eclipse.jetty.util.thread.ReservedThreadExecutor$ReservedThread.run(ReservedThreadExecutor.java:373)
   [junit4]    >         at org.eclipse.jetty.util.thread.QueuedThreadPool.runJob(QueuedThreadPool.java:708)
   [junit4]    >         at org.eclipse.jetty.util.thread.QueuedThreadPool$2.run(QueuedThreadPool.java:626)
   [junit4]    >         at java.lang.Thread.run(Thread.java:748)
   [junit4]    > 	at __randomizedtesting.SeedInfo.seed([A6B750101EDAA2F2]:0)Throwable #2: com.carrotsearch.randomizedtesting.ThreadLeakError: There are still zombie threads that couldn't be terminated:
   [junit4]    >    1) Thread[id=471, name=qtp2023465093-471, state=TIMED_WAITING, group=TGRP-SchemaTest]
   [junit4]    >         at sun.misc.Unsafe.park(Native Method)
   [junit4]    >         at java.util.concurrent.locks.LockSupport.parkNanos(LockSupport.java:215)
   [junit4]    >         at java.util.concurrent.locks.AbstractQueuedSynchronizer$ConditionObject.await(AbstractQueuedSynchronizer.java:2163)
   [junit4]    >         at org.eclipse.jetty.util.thread.ReservedThreadExecutor$ReservedThread.reservedWait(ReservedThreadExecutor.java:308)
   [junit4]    >         at org.eclipse.jetty.util.thread.ReservedThreadExecutor$ReservedThread.run(ReservedThreadExecutor.java:373)
   [junit4]    >         at org.eclipse.jetty.util.thread.QueuedThreadPool.runJob(QueuedThreadPool.java:708)
   [junit4]    >         at org.eclipse.jetty.util.thread.QueuedThreadPool$2.run(QueuedThreadPool.java:626)
   [junit4]    >         at java.lang.Thread.run(Thread.java:748)
   [junit4]    > 	at __randomizedtesting.SeedInfo.seed([A6B750101EDAA2F2]:0)
   [junit4] Completed [73/146 (1!)] on J0 in 76.72s, 35 tests, 2 errors <<< FAILURES!

[...truncated 1683 lines...]
   [junit4] Suite: org.apache.solr.update.processor.TestOpenNLPExtractNamedEntitiesUpdateProcessorFactory
   [junit4]   2> log4j:WARN No appenders could be found for logger (org.apache.solr.SolrTestCaseJ4).
   [junit4]   2> log4j:WARN Please initialize the log4j system properly.
   [junit4]   2> log4j:WARN See http://logging.apache.org/log4j/1.2/faq.html#noconfig for more info.
   [junit4]   2> Creating dataDir: C:\Users\jenkins\workspace\Lucene-Solr-master-Windows\solr\build\contrib\solr-analysis-extras\test\J1\temp\solr.update.processor.TestOpenNLPExtractNamedEntitiesUpdateProcessorFactory_809812095EF79D89-001\init-core-data-001
   [junit4]   2> NOTE: test params are: codec=CheapBastard, sim=Asserting(org.apache.lucene.search.similarities.AssertingSimilarity@841805f), locale=el-GR, timezone=Israel
   [junit4]   2> NOTE: Windows 10 10.0 amd64/Oracle Corporation 1.8.0_144 (64-bit)/cpus=3,threads=1,free=41546232,total=100663296
   [junit4]   2> NOTE: All tests run in this JVM: [TestOpenNLPExtractNamedEntitiesUpdateProcessorFactory]
   [junit4]   2> NOTE: reproduce with: ant test  -Dtestcase=TestOpenNLPExtractNamedEntitiesUpdateProcessorFactory -Dtests.seed=809812095EF79D89 -Dtests.slow=true -Dtests.locale=el-GR -Dtests.timezone=Israel -Dtests.asserts=true -Dtests.file.encoding=Cp1252
   [junit4] ERROR   0.00s J1 | TestOpenNLPExtractNamedEntitiesUpdateProcessorFactory (suite) <<<
   [junit4]    > Throwable #1: java.io.IOException: Could not remove the following files (in the order of attempts):
   [junit4]    >    C:\Users\jenkins\workspace\Lucene-Solr-master-Windows\solr\build\contrib\solr-analysis-extras\test\J1\temp\solr.update.processor.TestOpenNLPExtractNamedEntitiesUpdateProcessorFactory_809812095EF79D89-001\tempDir-001\collection1\conf: java.nio.file.DirectoryNotEmptyException: C:\Users\jenkins\workspace\Lucene-Solr-master-Windows\solr\build\contrib\solr-analysis-extras\test\J1\temp\solr.update.processor.TestOpenNLPExtractNamedEntitiesUpdateProcessorFactory_809812095EF79D89-001\tempDir-001\collection1\conf
   [junit4]    >    C:\Users\jenkins\workspace\Lucene-Solr-master-Windows\solr\build\contrib\solr-analysis-extras\test\J1\temp\solr.update.processor.TestOpenNLPExtractNamedEntitiesUpdateProcessorFactory_809812095EF79D89-001\tempDir-001\collection1: java.nio.file.DirectoryNotEmptyException: C:\Users\jenkins\workspace\Lucene-Solr-master-Windows\solr\build\contrib\solr-analysis-extras\test\J1\temp\solr.update.processor.TestOpenNLPExtractNamedEntitiesUpdateProcessorFactory_809812095EF79D89-001\tempDir-001\collection1
   [junit4]    >    C:\Users\jenkins\workspace\Lucene-Solr-master-Windows\solr\build\contrib\solr-analysis-extras\test\J1\temp\solr.update.processor.TestOpenNLPExtractNamedEntitiesUpdateProcessorFactory_809812095EF79D89-001\tempDir-001: java.nio.file.DirectoryNotEmptyException: C:\Users\jenkins\workspace\Lucene-Solr-master-Windows\solr\build\contrib\solr-analysis-extras\test\J1\temp\solr.update.processor.TestOpenNLPExtractNamedEntitiesUpdateProcessorFactory_809812095EF79D89-001\tempDir-001
   [junit4]    >    C:\Users\jenkins\workspace\Lucene-Solr-master-Windows\solr\build\contrib\solr-analysis-extras\test\J1\temp\solr.update.processor.TestOpenNLPExtractNamedEntitiesUpdateProcessorFactory_809812095EF79D89-001\tempDir-001\collection1\conf\en-test-ner-person.bin: java.nio.file.AccessDeniedException: C:\Users\jenkins\workspace\Lucene-Solr-master-Windows\solr\build\contrib\solr-analysis-extras\test\J1\temp\solr.update.processor.TestOpenNLPExtractNamedEntitiesUpdateProcessorFactory_809812095EF79D89-001\tempDir-001\collection1\conf\en-test-ner-person.bin
   [junit4]    >    C:\Users\jenkins\workspace\Lucene-Solr-master-Windows\solr\build\contrib\solr-analysis-extras\test\J1\temp\solr.update.processor.TestOpenNLPExtractNamedEntitiesUpdateProcessorFactory_809812095EF79D89-001\tempDir-001\collection1\conf\en-test-tokenizer.bin: java.nio.file.AccessDeniedException: C:\Users\jenkins\workspace\Lucene-Solr-master-Windows\solr\build\contrib\solr-analysis-extras\test\J1\temp\solr.update.processor.TestOpenNLPExtractNamedEntitiesUpdateProcessorFactory_809812095EF79D89-001\tempDir-001\collection1\conf\en-test-tokenizer.bin
   [junit4]    >    C:\Users\jenkins\workspace\Lucene-Solr-master-Windows\solr\build\contrib\solr-analysis-extras\test\J1\temp\solr.update.processor.TestOpenNLPExtractNamedEntitiesUpdateProcessorFactory_809812095EF79D89-001\tempDir-001\collection1\conf\en-test-sent.bin: java.nio.file.AccessDeniedException: C:\Users\jenkins\workspace\Lucene-Solr-master-Windows\solr\build\contrib\solr-analysis-extras\test\J1\temp\solr.update.processor.TestOpenNLPExtractNamedEntitiesUpdateProcessorFactory_809812095EF79D89-001\tempDir-001\collection1\conf\en-test-sent.bin
   [junit4]    >    C:\Users\jenkins\workspace\Lucene-Solr-master-Windows\solr\build\contrib\solr-analysis-extras\test\J1\temp\solr.update.processor.TestOpenNLPExtractNamedEntitiesUpdateProcessorFactory_809812095EF79D89-001: java.nio.file.DirectoryNotEmptyException: C:\Users\jenkins\workspace\Lucene-Solr-master-Windows\solr\build\contrib\solr-analysis-extras\test\J1\temp\solr.update.processor.TestOpenNLPExtractNamedEntitiesUpdateProcessorFactory_809812095EF79D89-001
   [junit4]    > 	at __randomizedtesting.SeedInfo.seed([809812095EF79D89]:0)
   [junit4]    > 	at org.apache.lucene.util.IOUtils.rm(IOUtils.java:329)
   [junit4]    > 	at java.lang.Thread.run(Thread.java:748)
   [junit4] Completed [1/5 (1!)] on J1 in 14.08s, 8 tests, 1 error <<< FAILURES!

[...truncated 23138 lines...]
-check-forbidden-all:
[forbidden-apis] Reading bundled API signatures: jdk-unsafe-1.8
[forbidden-apis] Reading bundled API signatures: jdk-deprecated-1.8
[forbidden-apis] Reading bundled API signatures: jdk-non-portable
[forbidden-apis] Reading bundled API signatures: jdk-reflection
[forbidden-apis] Reading bundled API signatures: commons-io-unsafe-2.5
[forbidden-apis] Reading API signatures: C:\Users\jenkins\workspace\Lucene-Solr-master-Windows\lucene\tools\forbiddenApis\base.txt
[forbidden-apis] Reading API signatures: C:\Users\jenkins\workspace\Lucene-Solr-master-Windows\lucene\tools\forbiddenApis\servlet-api.txt
[forbidden-apis] Reading API signatures: C:\Users\jenkins\workspace\Lucene-Solr-master-Windows\lucene\tools\forbiddenApis\solr.txt
[forbidden-apis] Loading classes to check...
[forbidden-apis] Scanning classes for violations...
[forbidden-apis] Forbidden method invocation: java.lang.System#currentTimeMillis() [Use RTimer/TimeOut/System.nanoTime for time comparisons, and `new Date()` output/debugging/stats of timestamps. If for some miscellaneous reason, you absolutely need to use this, use a SuppressForbidden.]
[forbidden-apis]   in org.apache.solr.cloud.autoscaling.ScheduledTriggerTest (ScheduledTriggerTest.java:80)
[forbidden-apis] Scanned 3977 class file(s) for forbidden API invocations (in 4.20s), 1 error(s).

BUILD FAILED
C:\Users\jenkins\workspace\Lucene-Solr-master-Windows\build.xml:618: The following error occurred while executing this line:
C:\Users\jenkins\workspace\Lucene-Solr-master-Windows\build.xml:117: The following error occurred while executing this line:
C:\Users\jenkins\workspace\Lucene-Solr-master-Windows\solr\build.xml:376: The following error occurred while executing this line:
C:\Users\jenkins\workspace\Lucene-Solr-master-Windows\solr\common-build.xml:535: Check for forbidden API calls failed, see log.

Total time: 81 minutes 11 seconds
Build step 'Invoke Ant' marked build as failure
Archiving artifacts
[WARNINGS] Skipping publisher since build result is FAILURE
Recording test results
Email was triggered for: Failure - Any
Sending email for trigger: Failure - Any

Mime
View raw message