lucene-dev mailing list archives

Site index · List index
Message view « Date » · « Thread »
Top « Date » · « Thread »
From Policeman Jenkins Server <jenk...@thetaphi.de>
Subject [JENKINS] Lucene-Solr-master-Windows (64bit/jdk1.8.0_144) - Build # 7167 - Still Unstable!
Date Tue, 13 Feb 2018 03:51:06 GMT
Build: https://jenkins.thetaphi.de/job/Lucene-Solr-master-Windows/7167/
Java: 64bit/jdk1.8.0_144 -XX:+UseCompressedOops -XX:+UseConcMarkSweepGC

7 tests failed.
FAILED:  junit.framework.TestSuite.org.apache.lucene.index.TestBackwardsCompatibility

Error Message:
Could not remove the following files (in the order of attempts):    C:\Users\jenkins\workspace\Lucene-Solr-master-Windows\lucene\build\backward-codecs\test\J0\temp\lucene.index.TestBackwardsCompatibility_6C734063EE733CCB-001\3.6.0-cfs-001: java.nio.file.DirectoryNotEmptyException: C:\Users\jenkins\workspace\Lucene-Solr-master-Windows\lucene\build\backward-codecs\test\J0\temp\lucene.index.TestBackwardsCompatibility_6C734063EE733CCB-001\3.6.0-cfs-001 

Stack Trace:
java.io.IOException: Could not remove the following files (in the order of attempts):
   C:\Users\jenkins\workspace\Lucene-Solr-master-Windows\lucene\build\backward-codecs\test\J0\temp\lucene.index.TestBackwardsCompatibility_6C734063EE733CCB-001\3.6.0-cfs-001: java.nio.file.DirectoryNotEmptyException: C:\Users\jenkins\workspace\Lucene-Solr-master-Windows\lucene\build\backward-codecs\test\J0\temp\lucene.index.TestBackwardsCompatibility_6C734063EE733CCB-001\3.6.0-cfs-001

	at __randomizedtesting.SeedInfo.seed([6C734063EE733CCB]:0)
	at org.apache.lucene.util.IOUtils.rm(IOUtils.java:329)
	at org.apache.lucene.util.TestRuleTemporaryFilesCleanup.afterAlways(TestRuleTemporaryFilesCleanup.java:216)
	at com.carrotsearch.randomizedtesting.rules.TestRuleAdapter$1.afterAlways(TestRuleAdapter.java:31)
	at com.carrotsearch.randomizedtesting.rules.StatementAdapter.evaluate(StatementAdapter.java:43)
	at com.carrotsearch.randomizedtesting.rules.StatementAdapter.evaluate(StatementAdapter.java:36)
	at org.apache.lucene.util.TestRuleAssertionsRequired$1.evaluate(TestRuleAssertionsRequired.java:53)
	at org.apache.lucene.util.TestRuleMarkFailure$1.evaluate(TestRuleMarkFailure.java:47)
	at org.apache.lucene.util.TestRuleIgnoreAfterMaxFailures$1.evaluate(TestRuleIgnoreAfterMaxFailures.java:64)
	at org.apache.lucene.util.TestRuleIgnoreTestSuites$1.evaluate(TestRuleIgnoreTestSuites.java:54)
	at com.carrotsearch.randomizedtesting.rules.StatementAdapter.evaluate(StatementAdapter.java:36)
	at com.carrotsearch.randomizedtesting.ThreadLeakControl$StatementRunner.run(ThreadLeakControl.java:368)
	at java.lang.Thread.run(Thread.java:748)


FAILED:  junit.framework.TestSuite.org.apache.lucene.index.TestBagOfPostings

Error Message:
Could not remove the following files (in the order of attempts):    C:\Users\jenkins\workspace\Lucene-Solr-master-Windows\lucene\build\core\test\J0\temp\lucene.index.TestBagOfPostings_CC59DBBDB60307AF-001\bagofpostings-001: java.nio.file.AccessDeniedException: C:\Users\jenkins\workspace\Lucene-Solr-master-Windows\lucene\build\core\test\J0\temp\lucene.index.TestBagOfPostings_CC59DBBDB60307AF-001\bagofpostings-001    C:\Users\jenkins\workspace\Lucene-Solr-master-Windows\lucene\build\core\test\J0\temp\lucene.index.TestBagOfPostings_CC59DBBDB60307AF-001: java.nio.file.DirectoryNotEmptyException: C:\Users\jenkins\workspace\Lucene-Solr-master-Windows\lucene\build\core\test\J0\temp\lucene.index.TestBagOfPostings_CC59DBBDB60307AF-001 

Stack Trace:
java.io.IOException: Could not remove the following files (in the order of attempts):
   C:\Users\jenkins\workspace\Lucene-Solr-master-Windows\lucene\build\core\test\J0\temp\lucene.index.TestBagOfPostings_CC59DBBDB60307AF-001\bagofpostings-001: java.nio.file.AccessDeniedException: C:\Users\jenkins\workspace\Lucene-Solr-master-Windows\lucene\build\core\test\J0\temp\lucene.index.TestBagOfPostings_CC59DBBDB60307AF-001\bagofpostings-001
   C:\Users\jenkins\workspace\Lucene-Solr-master-Windows\lucene\build\core\test\J0\temp\lucene.index.TestBagOfPostings_CC59DBBDB60307AF-001: java.nio.file.DirectoryNotEmptyException: C:\Users\jenkins\workspace\Lucene-Solr-master-Windows\lucene\build\core\test\J0\temp\lucene.index.TestBagOfPostings_CC59DBBDB60307AF-001

	at __randomizedtesting.SeedInfo.seed([CC59DBBDB60307AF]:0)
	at org.apache.lucene.util.IOUtils.rm(IOUtils.java:329)
	at org.apache.lucene.util.TestRuleTemporaryFilesCleanup.afterAlways(TestRuleTemporaryFilesCleanup.java:216)
	at com.carrotsearch.randomizedtesting.rules.TestRuleAdapter$1.afterAlways(TestRuleAdapter.java:31)
	at com.carrotsearch.randomizedtesting.rules.StatementAdapter.evaluate(StatementAdapter.java:43)
	at com.carrotsearch.randomizedtesting.rules.StatementAdapter.evaluate(StatementAdapter.java:36)
	at org.apache.lucene.util.TestRuleAssertionsRequired$1.evaluate(TestRuleAssertionsRequired.java:53)
	at org.apache.lucene.util.TestRuleMarkFailure$1.evaluate(TestRuleMarkFailure.java:47)
	at org.apache.lucene.util.TestRuleIgnoreAfterMaxFailures$1.evaluate(TestRuleIgnoreAfterMaxFailures.java:64)
	at org.apache.lucene.util.TestRuleIgnoreTestSuites$1.evaluate(TestRuleIgnoreTestSuites.java:54)
	at com.carrotsearch.randomizedtesting.rules.StatementAdapter.evaluate(StatementAdapter.java:36)
	at com.carrotsearch.randomizedtesting.ThreadLeakControl$StatementRunner.run(ThreadLeakControl.java:368)
	at java.lang.Thread.run(Thread.java:748)


FAILED:  junit.framework.TestSuite.org.apache.lucene.store.TestMultiMMap

Error Message:
Could not remove the following files (in the order of attempts):    C:\Users\jenkins\workspace\Lucene-Solr-master-Windows\lucene\build\core\test\J0\temp\lucene.store.TestMultiMMap_CC59DBBDB60307AF-001\testSeekZero-014: java.nio.file.DirectoryNotEmptyException: C:\Users\jenkins\workspace\Lucene-Solr-master-Windows\lucene\build\core\test\J0\temp\lucene.store.TestMultiMMap_CC59DBBDB60307AF-001\testSeekZero-014 

Stack Trace:
java.io.IOException: Could not remove the following files (in the order of attempts):
   C:\Users\jenkins\workspace\Lucene-Solr-master-Windows\lucene\build\core\test\J0\temp\lucene.store.TestMultiMMap_CC59DBBDB60307AF-001\testSeekZero-014: java.nio.file.DirectoryNotEmptyException: C:\Users\jenkins\workspace\Lucene-Solr-master-Windows\lucene\build\core\test\J0\temp\lucene.store.TestMultiMMap_CC59DBBDB60307AF-001\testSeekZero-014

	at __randomizedtesting.SeedInfo.seed([CC59DBBDB60307AF]:0)
	at org.apache.lucene.util.IOUtils.rm(IOUtils.java:329)
	at org.apache.lucene.util.TestRuleTemporaryFilesCleanup.afterAlways(TestRuleTemporaryFilesCleanup.java:216)
	at com.carrotsearch.randomizedtesting.rules.TestRuleAdapter$1.afterAlways(TestRuleAdapter.java:31)
	at com.carrotsearch.randomizedtesting.rules.StatementAdapter.evaluate(StatementAdapter.java:43)
	at com.carrotsearch.randomizedtesting.rules.StatementAdapter.evaluate(StatementAdapter.java:36)
	at org.apache.lucene.util.TestRuleAssertionsRequired$1.evaluate(TestRuleAssertionsRequired.java:53)
	at org.apache.lucene.util.TestRuleMarkFailure$1.evaluate(TestRuleMarkFailure.java:47)
	at org.apache.lucene.util.TestRuleIgnoreAfterMaxFailures$1.evaluate(TestRuleIgnoreAfterMaxFailures.java:64)
	at org.apache.lucene.util.TestRuleIgnoreTestSuites$1.evaluate(TestRuleIgnoreTestSuites.java:54)
	at com.carrotsearch.randomizedtesting.rules.StatementAdapter.evaluate(StatementAdapter.java:36)
	at com.carrotsearch.randomizedtesting.ThreadLeakControl$StatementRunner.run(ThreadLeakControl.java:368)
	at java.lang.Thread.run(Thread.java:748)


FAILED:  org.apache.lucene.replicator.IndexReplicationClientTest.testConsistencyOnExceptions

Error Message:
Captured an uncaught exception in thread: Thread[id=17, name=ReplicationThread-index, state=RUNNABLE, group=TGRP-IndexReplicationClientTest]

Stack Trace:
com.carrotsearch.randomizedtesting.UncaughtExceptionError: Captured an uncaught exception in thread: Thread[id=17, name=ReplicationThread-index, state=RUNNABLE, group=TGRP-IndexReplicationClientTest]
	at __randomizedtesting.SeedInfo.seed([78688A9AC4D6937C:F7E66D3AD6BA6083]:0)
Caused by: java.lang.AssertionError: handler failed too many times: -1
	at __randomizedtesting.SeedInfo.seed([78688A9AC4D6937C]:0)
	at org.apache.lucene.replicator.IndexReplicationClientTest$4.handleUpdateException(IndexReplicationClientTest.java:304)
	at org.apache.lucene.replicator.ReplicationClient$ReplicationThread.run(ReplicationClient.java:77)


FAILED:  junit.framework.TestSuite.org.apache.solr.cloud.api.collections.TestReplicaProperties

Error Message:
Could not remove the following files (in the order of attempts):    C:\Users\jenkins\workspace\Lucene-Solr-master-Windows\solr\build\solr-core\test\J0\temp\solr.cloud.api.collections.TestReplicaProperties_D64B61DA690B05DC-001\shard-2-001\analysisconfs: java.nio.file.DirectoryNotEmptyException: C:\Users\jenkins\workspace\Lucene-Solr-master-Windows\solr\build\solr-core\test\J0\temp\solr.cloud.api.collections.TestReplicaProperties_D64B61DA690B05DC-001\shard-2-001\analysisconfs    C:\Users\jenkins\workspace\Lucene-Solr-master-Windows\solr\build\solr-core\test\J0\temp\solr.cloud.api.collections.TestReplicaProperties_D64B61DA690B05DC-001\shard-2-001: java.nio.file.DirectoryNotEmptyException: C:\Users\jenkins\workspace\Lucene-Solr-master-Windows\solr\build\solr-core\test\J0\temp\solr.cloud.api.collections.TestReplicaProperties_D64B61DA690B05DC-001\shard-2-001 

Stack Trace:
java.io.IOException: Could not remove the following files (in the order of attempts):
   C:\Users\jenkins\workspace\Lucene-Solr-master-Windows\solr\build\solr-core\test\J0\temp\solr.cloud.api.collections.TestReplicaProperties_D64B61DA690B05DC-001\shard-2-001\analysisconfs: java.nio.file.DirectoryNotEmptyException: C:\Users\jenkins\workspace\Lucene-Solr-master-Windows\solr\build\solr-core\test\J0\temp\solr.cloud.api.collections.TestReplicaProperties_D64B61DA690B05DC-001\shard-2-001\analysisconfs
   C:\Users\jenkins\workspace\Lucene-Solr-master-Windows\solr\build\solr-core\test\J0\temp\solr.cloud.api.collections.TestReplicaProperties_D64B61DA690B05DC-001\shard-2-001: java.nio.file.DirectoryNotEmptyException: C:\Users\jenkins\workspace\Lucene-Solr-master-Windows\solr\build\solr-core\test\J0\temp\solr.cloud.api.collections.TestReplicaProperties_D64B61DA690B05DC-001\shard-2-001

	at __randomizedtesting.SeedInfo.seed([D64B61DA690B05DC]:0)
	at org.apache.lucene.util.IOUtils.rm(IOUtils.java:329)
	at org.apache.lucene.util.TestRuleTemporaryFilesCleanup.afterAlways(TestRuleTemporaryFilesCleanup.java:216)
	at com.carrotsearch.randomizedtesting.rules.TestRuleAdapter$1.afterAlways(TestRuleAdapter.java:31)
	at com.carrotsearch.randomizedtesting.rules.StatementAdapter.evaluate(StatementAdapter.java:43)
	at com.carrotsearch.randomizedtesting.rules.StatementAdapter.evaluate(StatementAdapter.java:36)
	at org.apache.lucene.util.TestRuleAssertionsRequired$1.evaluate(TestRuleAssertionsRequired.java:53)
	at org.apache.lucene.util.TestRuleMarkFailure$1.evaluate(TestRuleMarkFailure.java:47)
	at org.apache.lucene.util.TestRuleIgnoreAfterMaxFailures$1.evaluate(TestRuleIgnoreAfterMaxFailures.java:64)
	at org.apache.lucene.util.TestRuleIgnoreTestSuites$1.evaluate(TestRuleIgnoreTestSuites.java:54)
	at com.carrotsearch.randomizedtesting.rules.StatementAdapter.evaluate(StatementAdapter.java:36)
	at com.carrotsearch.randomizedtesting.ThreadLeakControl$StatementRunner.run(ThreadLeakControl.java:368)
	at java.lang.Thread.run(Thread.java:748)


FAILED:  org.apache.solr.handler.TestSolrConfigHandlerConcurrent.test

Error Message:


Stack Trace:
java.lang.NullPointerException
	at __randomizedtesting.SeedInfo.seed([D64B61DA690B05DC:5E1F5E00C7F76824]:0)
	at org.apache.solr.handler.TestSolrConfigHandlerConcurrent.test(TestSolrConfigHandlerConcurrent.java:91)
	at sun.reflect.NativeMethodAccessorImpl.invoke0(Native Method)
	at sun.reflect.NativeMethodAccessorImpl.invoke(NativeMethodAccessorImpl.java:62)
	at sun.reflect.DelegatingMethodAccessorImpl.invoke(DelegatingMethodAccessorImpl.java:43)
	at java.lang.reflect.Method.invoke(Method.java:498)
	at com.carrotsearch.randomizedtesting.RandomizedRunner.invoke(RandomizedRunner.java:1737)
	at com.carrotsearch.randomizedtesting.RandomizedRunner$8.evaluate(RandomizedRunner.java:934)
	at com.carrotsearch.randomizedtesting.RandomizedRunner$9.evaluate(RandomizedRunner.java:970)
	at com.carrotsearch.randomizedtesting.RandomizedRunner$10.evaluate(RandomizedRunner.java:984)
	at org.apache.solr.BaseDistributedSearchTestCase$ShardsRepeatRule$ShardsFixedStatement.callStatement(BaseDistributedSearchTestCase.java:993)
	at org.apache.solr.BaseDistributedSearchTestCase$ShardsRepeatRule$ShardsStatement.evaluate(BaseDistributedSearchTestCase.java:968)
	at com.carrotsearch.randomizedtesting.rules.SystemPropertiesRestoreRule$1.evaluate(SystemPropertiesRestoreRule.java:57)
	at org.apache.lucene.util.TestRuleSetupTeardownChained$1.evaluate(TestRuleSetupTeardownChained.java:49)
	at org.apache.lucene.util.AbstractBeforeAfterRule$1.evaluate(AbstractBeforeAfterRule.java:45)
	at org.apache.lucene.util.TestRuleThreadAndTestName$1.evaluate(TestRuleThreadAndTestName.java:48)
	at org.apache.lucene.util.TestRuleIgnoreAfterMaxFailures$1.evaluate(TestRuleIgnoreAfterMaxFailures.java:64)
	at org.apache.lucene.util.TestRuleMarkFailure$1.evaluate(TestRuleMarkFailure.java:47)
	at com.carrotsearch.randomizedtesting.rules.StatementAdapter.evaluate(StatementAdapter.java:36)
	at com.carrotsearch.randomizedtesting.ThreadLeakControl$StatementRunner.run(ThreadLeakControl.java:368)
	at com.carrotsearch.randomizedtesting.ThreadLeakControl.forkTimeoutingTask(ThreadLeakControl.java:817)
	at com.carrotsearch.randomizedtesting.ThreadLeakControl$3.evaluate(ThreadLeakControl.java:468)
	at com.carrotsearch.randomizedtesting.RandomizedRunner.runSingleTest(RandomizedRunner.java:943)
	at com.carrotsearch.randomizedtesting.RandomizedRunner$5.evaluate(RandomizedRunner.java:829)
	at com.carrotsearch.randomizedtesting.RandomizedRunner$6.evaluate(RandomizedRunner.java:879)
	at com.carrotsearch.randomizedtesting.RandomizedRunner$7.evaluate(RandomizedRunner.java:890)
	at com.carrotsearch.randomizedtesting.rules.StatementAdapter.evaluate(StatementAdapter.java:36)
	at com.carrotsearch.randomizedtesting.rules.SystemPropertiesRestoreRule$1.evaluate(SystemPropertiesRestoreRule.java:57)
	at org.apache.lucene.util.AbstractBeforeAfterRule$1.evaluate(AbstractBeforeAfterRule.java:45)
	at com.carrotsearch.randomizedtesting.rules.StatementAdapter.evaluate(StatementAdapter.java:36)
	at org.apache.lucene.util.TestRuleStoreClassName$1.evaluate(TestRuleStoreClassName.java:41)
	at com.carrotsearch.randomizedtesting.rules.NoShadowingOrOverridesOnMethodsRule$1.evaluate(NoShadowingOrOverridesOnMethodsRule.java:40)
	at com.carrotsearch.randomizedtesting.rules.NoShadowingOrOverridesOnMethodsRule$1.evaluate(NoShadowingOrOverridesOnMethodsRule.java:40)
	at com.carrotsearch.randomizedtesting.rules.StatementAdapter.evaluate(StatementAdapter.java:36)
	at com.carrotsearch.randomizedtesting.rules.StatementAdapter.evaluate(StatementAdapter.java:36)
	at com.carrotsearch.randomizedtesting.rules.StatementAdapter.evaluate(StatementAdapter.java:36)
	at org.apache.lucene.util.TestRuleAssertionsRequired$1.evaluate(TestRuleAssertionsRequired.java:53)
	at org.apache.lucene.util.TestRuleMarkFailure$1.evaluate(TestRuleMarkFailure.java:47)
	at org.apache.lucene.util.TestRuleIgnoreAfterMaxFailures$1.evaluate(TestRuleIgnoreAfterMaxFailures.java:64)
	at org.apache.lucene.util.TestRuleIgnoreTestSuites$1.evaluate(TestRuleIgnoreTestSuites.java:54)
	at com.carrotsearch.randomizedtesting.rules.StatementAdapter.evaluate(StatementAdapter.java:36)
	at com.carrotsearch.randomizedtesting.ThreadLeakControl$StatementRunner.run(ThreadLeakControl.java:368)
	at java.lang.Thread.run(Thread.java:748)


FAILED:  junit.framework.TestSuite.org.apache.solr.update.processor.TestOpenNLPExtractNamedEntitiesUpdateProcessorFactory

Error Message:
Could not remove the following files (in the order of attempts):    C:\Users\jenkins\workspace\Lucene-Solr-master-Windows\solr\build\contrib\solr-analysis-extras\test\J1\temp\solr.update.processor.TestOpenNLPExtractNamedEntitiesUpdateProcessorFactory_C1752F9A009FBD0D-001\tempDir-001\collection1\conf: java.nio.file.DirectoryNotEmptyException: C:\Users\jenkins\workspace\Lucene-Solr-master-Windows\solr\build\contrib\solr-analysis-extras\test\J1\temp\solr.update.processor.TestOpenNLPExtractNamedEntitiesUpdateProcessorFactory_C1752F9A009FBD0D-001\tempDir-001\collection1\conf    C:\Users\jenkins\workspace\Lucene-Solr-master-Windows\solr\build\contrib\solr-analysis-extras\test\J1\temp\solr.update.processor.TestOpenNLPExtractNamedEntitiesUpdateProcessorFactory_C1752F9A009FBD0D-001\tempDir-001\collection1: java.nio.file.DirectoryNotEmptyException: C:\Users\jenkins\workspace\Lucene-Solr-master-Windows\solr\build\contrib\solr-analysis-extras\test\J1\temp\solr.update.processor.TestOpenNLPExtractNamedEntitiesUpdateProcessorFactory_C1752F9A009FBD0D-001\tempDir-001\collection1    C:\Users\jenkins\workspace\Lucene-Solr-master-Windows\solr\build\contrib\solr-analysis-extras\test\J1\temp\solr.update.processor.TestOpenNLPExtractNamedEntitiesUpdateProcessorFactory_C1752F9A009FBD0D-001\tempDir-001: java.nio.file.DirectoryNotEmptyException: C:\Users\jenkins\workspace\Lucene-Solr-master-Windows\solr\build\contrib\solr-analysis-extras\test\J1\temp\solr.update.processor.TestOpenNLPExtractNamedEntitiesUpdateProcessorFactory_C1752F9A009FBD0D-001\tempDir-001    C:\Users\jenkins\workspace\Lucene-Solr-master-Windows\solr\build\contrib\solr-analysis-extras\test\J1\temp\solr.update.processor.TestOpenNLPExtractNamedEntitiesUpdateProcessorFactory_C1752F9A009FBD0D-001\tempDir-001\collection1\conf\en-test-ner-person.bin: java.nio.file.AccessDeniedException: C:\Users\jenkins\workspace\Lucene-Solr-master-Windows\solr\build\contrib\solr-analysis-extras\test\J1\temp\solr.update.processor.TestOpenNLPExtractNamedEntitiesUpdateProcessorFactory_C1752F9A009FBD0D-001\tempDir-001\collection1\conf\en-test-ner-person.bin    C:\Users\jenkins\workspace\Lucene-Solr-master-Windows\solr\build\contrib\solr-analysis-extras\test\J1\temp\solr.update.processor.TestOpenNLPExtractNamedEntitiesUpdateProcessorFactory_C1752F9A009FBD0D-001\tempDir-001\collection1\conf\en-test-tokenizer.bin: java.nio.file.AccessDeniedException: C:\Users\jenkins\workspace\Lucene-Solr-master-Windows\solr\build\contrib\solr-analysis-extras\test\J1\temp\solr.update.processor.TestOpenNLPExtractNamedEntitiesUpdateProcessorFactory_C1752F9A009FBD0D-001\tempDir-001\collection1\conf\en-test-tokenizer.bin    C:\Users\jenkins\workspace\Lucene-Solr-master-Windows\solr\build\contrib\solr-analysis-extras\test\J1\temp\solr.update.processor.TestOpenNLPExtractNamedEntitiesUpdateProcessorFactory_C1752F9A009FBD0D-001\tempDir-001\collection1\conf\en-test-sent.bin: java.nio.file.AccessDeniedException: C:\Users\jenkins\workspace\Lucene-Solr-master-Windows\solr\build\contrib\solr-analysis-extras\test\J1\temp\solr.update.processor.TestOpenNLPExtractNamedEntitiesUpdateProcessorFactory_C1752F9A009FBD0D-001\tempDir-001\collection1\conf\en-test-sent.bin    C:\Users\jenkins\workspace\Lucene-Solr-master-Windows\solr\build\contrib\solr-analysis-extras\test\J1\temp\solr.update.processor.TestOpenNLPExtractNamedEntitiesUpdateProcessorFactory_C1752F9A009FBD0D-001: java.nio.file.DirectoryNotEmptyException: C:\Users\jenkins\workspace\Lucene-Solr-master-Windows\solr\build\contrib\solr-analysis-extras\test\J1\temp\solr.update.processor.TestOpenNLPExtractNamedEntitiesUpdateProcessorFactory_C1752F9A009FBD0D-001 

Stack Trace:
java.io.IOException: Could not remove the following files (in the order of attempts):
   C:\Users\jenkins\workspace\Lucene-Solr-master-Windows\solr\build\contrib\solr-analysis-extras\test\J1\temp\solr.update.processor.TestOpenNLPExtractNamedEntitiesUpdateProcessorFactory_C1752F9A009FBD0D-001\tempDir-001\collection1\conf: java.nio.file.DirectoryNotEmptyException: C:\Users\jenkins\workspace\Lucene-Solr-master-Windows\solr\build\contrib\solr-analysis-extras\test\J1\temp\solr.update.processor.TestOpenNLPExtractNamedEntitiesUpdateProcessorFactory_C1752F9A009FBD0D-001\tempDir-001\collection1\conf
   C:\Users\jenkins\workspace\Lucene-Solr-master-Windows\solr\build\contrib\solr-analysis-extras\test\J1\temp\solr.update.processor.TestOpenNLPExtractNamedEntitiesUpdateProcessorFactory_C1752F9A009FBD0D-001\tempDir-001\collection1: java.nio.file.DirectoryNotEmptyException: C:\Users\jenkins\workspace\Lucene-Solr-master-Windows\solr\build\contrib\solr-analysis-extras\test\J1\temp\solr.update.processor.TestOpenNLPExtractNamedEntitiesUpdateProcessorFactory_C1752F9A009FBD0D-001\tempDir-001\collection1
   C:\Users\jenkins\workspace\Lucene-Solr-master-Windows\solr\build\contrib\solr-analysis-extras\test\J1\temp\solr.update.processor.TestOpenNLPExtractNamedEntitiesUpdateProcessorFactory_C1752F9A009FBD0D-001\tempDir-001: java.nio.file.DirectoryNotEmptyException: C:\Users\jenkins\workspace\Lucene-Solr-master-Windows\solr\build\contrib\solr-analysis-extras\test\J1\temp\solr.update.processor.TestOpenNLPExtractNamedEntitiesUpdateProcessorFactory_C1752F9A009FBD0D-001\tempDir-001
   C:\Users\jenkins\workspace\Lucene-Solr-master-Windows\solr\build\contrib\solr-analysis-extras\test\J1\temp\solr.update.processor.TestOpenNLPExtractNamedEntitiesUpdateProcessorFactory_C1752F9A009FBD0D-001\tempDir-001\collection1\conf\en-test-ner-person.bin: java.nio.file.AccessDeniedException: C:\Users\jenkins\workspace\Lucene-Solr-master-Windows\solr\build\contrib\solr-analysis-extras\test\J1\temp\solr.update.processor.TestOpenNLPExtractNamedEntitiesUpdateProcessorFactory_C1752F9A009FBD0D-001\tempDir-001\collection1\conf\en-test-ner-person.bin
   C:\Users\jenkins\workspace\Lucene-Solr-master-Windows\solr\build\contrib\solr-analysis-extras\test\J1\temp\solr.update.processor.TestOpenNLPExtractNamedEntitiesUpdateProcessorFactory_C1752F9A009FBD0D-001\tempDir-001\collection1\conf\en-test-tokenizer.bin: java.nio.file.AccessDeniedException: C:\Users\jenkins\workspace\Lucene-Solr-master-Windows\solr\build\contrib\solr-analysis-extras\test\J1\temp\solr.update.processor.TestOpenNLPExtractNamedEntitiesUpdateProcessorFactory_C1752F9A009FBD0D-001\tempDir-001\collection1\conf\en-test-tokenizer.bin
   C:\Users\jenkins\workspace\Lucene-Solr-master-Windows\solr\build\contrib\solr-analysis-extras\test\J1\temp\solr.update.processor.TestOpenNLPExtractNamedEntitiesUpdateProcessorFactory_C1752F9A009FBD0D-001\tempDir-001\collection1\conf\en-test-sent.bin: java.nio.file.AccessDeniedException: C:\Users\jenkins\workspace\Lucene-Solr-master-Windows\solr\build\contrib\solr-analysis-extras\test\J1\temp\solr.update.processor.TestOpenNLPExtractNamedEntitiesUpdateProcessorFactory_C1752F9A009FBD0D-001\tempDir-001\collection1\conf\en-test-sent.bin
   C:\Users\jenkins\workspace\Lucene-Solr-master-Windows\solr\build\contrib\solr-analysis-extras\test\J1\temp\solr.update.processor.TestOpenNLPExtractNamedEntitiesUpdateProcessorFactory_C1752F9A009FBD0D-001: java.nio.file.DirectoryNotEmptyException: C:\Users\jenkins\workspace\Lucene-Solr-master-Windows\solr\build\contrib\solr-analysis-extras\test\J1\temp\solr.update.processor.TestOpenNLPExtractNamedEntitiesUpdateProcessorFactory_C1752F9A009FBD0D-001

	at __randomizedtesting.SeedInfo.seed([C1752F9A009FBD0D]:0)
	at org.apache.lucene.util.IOUtils.rm(IOUtils.java:329)
	at org.apache.lucene.util.TestRuleTemporaryFilesCleanup.afterAlways(TestRuleTemporaryFilesCleanup.java:216)
	at com.carrotsearch.randomizedtesting.rules.TestRuleAdapter$1.afterAlways(TestRuleAdapter.java:31)
	at com.carrotsearch.randomizedtesting.rules.StatementAdapter.evaluate(StatementAdapter.java:43)
	at com.carrotsearch.randomizedtesting.rules.StatementAdapter.evaluate(StatementAdapter.java:36)
	at org.apache.lucene.util.TestRuleAssertionsRequired$1.evaluate(TestRuleAssertionsRequired.java:53)
	at org.apache.lucene.util.TestRuleMarkFailure$1.evaluate(TestRuleMarkFailure.java:47)
	at org.apache.lucene.util.TestRuleIgnoreAfterMaxFailures$1.evaluate(TestRuleIgnoreAfterMaxFailures.java:64)
	at org.apache.lucene.util.TestRuleIgnoreTestSuites$1.evaluate(TestRuleIgnoreTestSuites.java:54)
	at com.carrotsearch.randomizedtesting.rules.StatementAdapter.evaluate(StatementAdapter.java:36)
	at com.carrotsearch.randomizedtesting.ThreadLeakControl$StatementRunner.run(ThreadLeakControl.java:368)
	at java.lang.Thread.run(Thread.java:748)




Build Log:
[...truncated 446 lines...]
   [junit4] Suite: org.apache.lucene.store.TestMultiMMap
   [junit4]   2> NOTE: test params are: codec=Asserting(Lucene70): {docid=Lucene50(blocksize=128), junk=PostingsFormat(name=LuceneVarGapFixedInterval)}, docValues:{}, maxPointsInLeafNode=36, maxMBSortInHeap=6.003209200117041, sim=Asserting(org.apache.lucene.search.similarities.AssertingSimilarity@3284247f), locale=ar-BH, timezone=US/Arizona
   [junit4]   2> NOTE: Windows 10 10.0 amd64/Oracle Corporation 1.8.0_144 (64-bit)/cpus=3,threads=1,free=161016320,total=387481600
   [junit4]   2> NOTE: All tests run in this JVM: [TestPrefixQuery, TestQueryBuilder, TestFutureArrays, TestThreadedForceMerge, TestRoaringDocIdSet, TestTimeLimitingCollector, TestCodecUtil, TestCollectionUtil, TestMultiThreadTermVectors, TestField, TestRegexpQuery, TestBoolean2ScorerSupplier, TestSubScorerFreqs, TestLRUQueryCache, TestLockFactory, TestCustomNorms, Test2BBKDPoints, TestIndexWriterMergePolicy, TestArrayUtil, TestPackedTokenAttributeImpl, TestTryDelete, TestIndexWriterExceptions2, TestMixedCodecs, TestQueryRescorer, TestGraphTokenStreamFiniteStrings, TestReaderClosed, TestNeverDelete, TestSpanMultiTermQueryWrapper, TestLSBRadixSorter, TestExternalCodecs, TestSortedSetSortField, TestComplexExplanations, TestMSBRadixSorter, TestDirectory, TestAssertions, TestDocValuesRewriteMethod, TestParallelReaderEmptyIndex, TestUTF32ToUTF8, TestUnicodeUtil, TestIndexTooManyDocs, TestIndependenceChiSquared, TestRollback, TestAllFilesHaveCodecHeader, TestIndexableField, TestIndexInput, TestIndexCommit, TestMultiset, TestFloatRangeFieldQueries, TestSnapshotDeletionPolicy, TestIndexedDISI, TestIndexingSequenceNumbers, TestDoubleValuesSource, TestMergeRateLimiter, TestSpanFirstQuery, TestToken, TestDocValuesIndexing, TestDocumentsWriterDeleteQueue, TestDoc, TestStandardAnalyzer, TestDemo, TestSloppyMath, TestMultiTermsEnum, TestMultiMMap]
   [junit4]   2> NOTE: reproduce with: ant test  -Dtestcase=TestMultiMMap -Dtests.seed=CC59DBBDB60307AF -Dtests.slow=true -Dtests.locale=ar-BH -Dtests.timezone=US/Arizona -Dtests.asserts=true -Dtests.file.encoding=Cp1252
   [junit4] ERROR   0.00s J0 | TestMultiMMap (suite) <<<
   [junit4]    > Throwable #1: java.io.IOException: Could not remove the following files (in the order of attempts):
   [junit4]    >    C:\Users\jenkins\workspace\Lucene-Solr-master-Windows\lucene\build\core\test\J0\temp\lucene.store.TestMultiMMap_CC59DBBDB60307AF-001\testSeekZero-014: java.nio.file.DirectoryNotEmptyException: C:\Users\jenkins\workspace\Lucene-Solr-master-Windows\lucene\build\core\test\J0\temp\lucene.store.TestMultiMMap_CC59DBBDB60307AF-001\testSeekZero-014
   [junit4]    > 	at __randomizedtesting.SeedInfo.seed([CC59DBBDB60307AF]:0)
   [junit4]    > 	at org.apache.lucene.util.IOUtils.rm(IOUtils.java:329)
   [junit4]    > 	at java.lang.Thread.run(Thread.java:748)
   [junit4] Completed [67/480 (1!)] on J0 in 3.14s, 54 tests, 1 error <<< FAILURES!

[...truncated 350 lines...]
   [junit4] Suite: org.apache.lucene.index.TestBagOfPostings
   [junit4]   2> NOTE: test params are: codec=Asserting(Lucene70), sim=Asserting(org.apache.lucene.search.similarities.AssertingSimilarity@692cb62a), locale=sv-SE, timezone=Etc/GMT+9
   [junit4]   2> NOTE: Windows 10 10.0 amd64/Oracle Corporation 1.8.0_144 (64-bit)/cpus=3,threads=1,free=208271184,total=387481600
   [junit4]   2> NOTE: All tests run in this JVM: [TestPrefixQuery, TestQueryBuilder, TestFutureArrays, TestThreadedForceMerge, TestRoaringDocIdSet, TestTimeLimitingCollector, TestCodecUtil, TestCollectionUtil, TestMultiThreadTermVectors, TestField, TestRegexpQuery, TestBoolean2ScorerSupplier, TestSubScorerFreqs, TestLRUQueryCache, TestLockFactory, TestCustomNorms, Test2BBKDPoints, TestIndexWriterMergePolicy, TestArrayUtil, TestPackedTokenAttributeImpl, TestTryDelete, TestIndexWriterExceptions2, TestMixedCodecs, TestQueryRescorer, TestGraphTokenStreamFiniteStrings, TestReaderClosed, TestNeverDelete, TestSpanMultiTermQueryWrapper, TestLSBRadixSorter, TestExternalCodecs, TestSortedSetSortField, TestComplexExplanations, TestMSBRadixSorter, TestDirectory, TestAssertions, TestDocValuesRewriteMethod, TestParallelReaderEmptyIndex, TestUTF32ToUTF8, TestUnicodeUtil, TestIndexTooManyDocs, TestIndependenceChiSquared, TestRollback, TestAllFilesHaveCodecHeader, TestIndexableField, TestIndexInput, TestIndexCommit, TestMultiset, TestFloatRangeFieldQueries, TestSnapshotDeletionPolicy, TestIndexedDISI, TestIndexingSequenceNumbers, TestDoubleValuesSource, TestMergeRateLimiter, TestSpanFirstQuery, TestToken, TestDocValuesIndexing, TestDocumentsWriterDeleteQueue, TestDoc, TestStandardAnalyzer, TestDemo, TestSloppyMath, TestMultiTermsEnum, TestMultiMMap, TestAtomicUpdate, TestDuelingCodecsAtNight, TestTotalHitCountCollector, TestBasicModelIn, TestFilterDirectoryReader, FuzzyTermOnShortTermsTest, TestIndexWriterMaxDocs, TestTimSorterWorstCase, TestLevenshteinAutomata, TestMergedIterator, TestSegmentReader, TestBooleanOr, TestSegmentTermEnum, TestTerms, TestDistributionLL, Test2BSortedDocValuesFixedSorted, TestTermStates, TestBasicModelG, TestSearchWithThreads, TestBlockPostingsFormat, TestElevationComparator, TestAddIndexes, TestBoostQuery, TestDocsAndPositions, TestAllFilesCheckIndexHeader, TestDirectoryReader, TestLiveFieldValues, TestAllFilesHaveChecksumFooter, TestNGramPhraseQuery, TestIndependenceStandardized, TestIntBlockPool, TestParallelLeafReader, TestMaxScoreSumPropagator, TestIndexFileDeleter, TestCustomTermFreq, TestFieldValueQuery, TestAxiomaticSimilarity, TestLogMergePolicy, TestSpanExplanationsOfNonMatches, TestFilterLeafReader, TestCachingTokenFilter, TestCharArrayMap, TestCrash, TestOrdinalMap, TestMaxPosition, TestBagOfPostings]
   [junit4]   2> NOTE: reproduce with: ant test  -Dtestcase=TestBagOfPostings -Dtests.seed=CC59DBBDB60307AF -Dtests.slow=true -Dtests.locale=sv-SE -Dtests.timezone=Etc/GMT+9 -Dtests.asserts=true -Dtests.file.encoding=Cp1252
   [junit4] ERROR   0.00s J0 | TestBagOfPostings (suite) <<<
   [junit4]    > Throwable #1: java.io.IOException: Could not remove the following files (in the order of attempts):
   [junit4]    >    C:\Users\jenkins\workspace\Lucene-Solr-master-Windows\lucene\build\core\test\J0\temp\lucene.index.TestBagOfPostings_CC59DBBDB60307AF-001\bagofpostings-001: java.nio.file.AccessDeniedException: C:\Users\jenkins\workspace\Lucene-Solr-master-Windows\lucene\build\core\test\J0\temp\lucene.index.TestBagOfPostings_CC59DBBDB60307AF-001\bagofpostings-001
   [junit4]    >    C:\Users\jenkins\workspace\Lucene-Solr-master-Windows\lucene\build\core\test\J0\temp\lucene.index.TestBagOfPostings_CC59DBBDB60307AF-001: java.nio.file.DirectoryNotEmptyException: C:\Users\jenkins\workspace\Lucene-Solr-master-Windows\lucene\build\core\test\J0\temp\lucene.index.TestBagOfPostings_CC59DBBDB60307AF-001
   [junit4]    > 	at __randomizedtesting.SeedInfo.seed([CC59DBBDB60307AF]:0)
   [junit4]    > 	at org.apache.lucene.util.IOUtils.rm(IOUtils.java:329)
   [junit4]    > 	at java.lang.Thread.run(Thread.java:748)
   [junit4] Completed [173/480 (2!)] on J0 in 0.54s, 1 test, 1 error <<< FAILURES!

[...truncated 4099 lines...]
   [junit4] Suite: org.apache.lucene.index.TestBackwardsCompatibility
   [junit4] IGNOR/A 0.01s J0 | TestBackwardsCompatibility.testCreateCFS
   [junit4]    > Assumption #1: backcompat creation tests must be run with -Dtests.bwcdir=/path/to/write/indexes
   [junit4] IGNOR/A 0.00s J0 | TestBackwardsCompatibility.testCreateSingleSegmentCFS
   [junit4]    > Assumption #1: backcompat creation tests must be run with -Dtests.bwcdir=/path/to/write/indexes
   [junit4] IGNOR/A 0.00s J0 | TestBackwardsCompatibility.testCreateMoreTermsIndex
   [junit4]    > Assumption #1: backcompat creation tests must be run with -Dtests.bwcdir=/path/to/write/indexes
   [junit4] IGNOR/A 0.00s J0 | TestBackwardsCompatibility.testCreateSortedIndex
   [junit4]    > Assumption #1: backcompat creation tests must be run with -Dtests.bwcdir=/path/to/write/indexes
   [junit4] IGNOR/A 0.00s J0 | TestBackwardsCompatibility.testCreateIndexWithDocValuesUpdates
   [junit4]    > Assumption #1: backcompat creation tests must be run with -Dtests.bwcdir=/path/to/write/indexes
   [junit4] IGNOR/A 0.00s J0 | TestBackwardsCompatibility.testCreateNoCFS
   [junit4]    > Assumption #1: backcompat creation tests must be run with -Dtests.bwcdir=/path/to/write/indexes
   [junit4] IGNOR/A 0.00s J0 | TestBackwardsCompatibility.testCreateEmptyIndex
   [junit4]    > Assumption #1: backcompat creation tests must be run with -Dtests.bwcdir=/path/to/write/indexes
   [junit4] IGNOR/A 0.00s J0 | TestBackwardsCompatibility.testCreateSingleSegmentNoCFS
   [junit4]    > Assumption #1: backcompat creation tests must be run with -Dtests.bwcdir=/path/to/write/indexes
   [junit4]   2> NOTE: test params are: codec=Asserting(Lucene70): {content6=TestBloomFilteredLucenePostings(BloomFilteringPostingsFormat(Lucene50(blocksize=128))), content5=BlockTreeOrds(blocksize=128), content4=PostingsFormat(name=Memory), content3=PostingsFormat(name=Asserting), content2=TestBloomFilteredLucenePostings(BloomFilteringPostingsFormat(Lucene50(blocksize=128))), fie?ld=TestBloomFilteredLucenePostings(BloomFilteringPostingsFormat(Lucene50(blocksize=128))), utf8=PostingsFormat(name=Memory), id=TestBloomFilteredLucenePostings(BloomFilteringPostingsFormat(Lucene50(blocksize=128))), content=PostingsFormat(name=Memory), autf8=PostingsFormat(name=Asserting)}, docValues:{ndv2=DocValuesFormat(name=Lucene70), ndv1=DocValuesFormat(name=Asserting), utf8=DocValuesFormat(name=Asserting), fie?ld=DocValuesFormat(name=Lucene70), dvShort=DocValuesFormat(name=Lucene70), dvInt=DocValuesFormat(name=Asserting), longPoint2d=DocValuesFormat(name=Lucene70), dvBytesSortedVar=DocValuesFormat(name=Lucene70), dvSortedSet=DocValuesFormat(name=Lucene70), content=DocValuesFormat(name=Asserting), floatPoint1d=DocValuesFormat(name=Lucene70), bdv2=DocValuesFormat(name=Lucene70), bdv2_c=DocValuesFormat(name=Lucene70), intPoint1d=DocValuesFormat(name=Memory), bdv1=DocValuesFormat(name=Asserting), bdv1_c=DocValuesFormat(name=Lucene70), doublePoint2d=DocValuesFormat(name=Lucene70), dvBytesDerefVar=DocValuesFormat(name=Lucene70), id=DocValuesFormat(name=Lucene70), binaryPoint2d=DocValuesFormat(name=Asserting), dvSortedNumeric=DocValuesFormat(name=Lucene70), dvBytesDerefFixed=DocValuesFormat(name=Asserting), autf8=DocValuesFormat(name=Lucene70), dvBytesSortedFixed=DocValuesFormat(name=Lucene70), dvBytesStraightVar=DocValuesFormat(name=Memory), dvBytesStraightFixed=DocValuesFormat(name=Lucene70), dvLong=DocValuesFormat(name=Lucene70), longPoint1d=DocValuesFormat(name=Asserting), floatPoint2d=DocValuesFormat(name=Lucene70), dvDouble=DocValuesFormat(name=Lucene70), dvFloat=DocValuesFormat(name=Lucene70), content6=DocValuesFormat(name=Lucene70), content5=DocValuesFormat(name=Memory), dvPacked=DocValuesFormat(name=Lucene70), intPoint2d=DocValuesFormat(name=Lucene70), content4=DocValuesFormat(name=Asserting), content3=DocValuesFormat(name=Lucene70), content2=DocValuesFormat(name=Lucene70), doublePoint1d=DocValuesFormat(name=Lucene70), dvByte=DocValuesFormat(name=Lucene70), ndv1_c=DocValuesFormat(name=Lucene70), ndv2_c=DocValuesFormat(name=Lucene70), binaryPoint1d=DocValuesFormat(name=Lucene70)}, maxPointsInLeafNode=652, maxMBSortInHeap=5.9682174664890075, sim=Asserting(org.apache.lucene.search.similarities.AssertingSimilarity@34df8aaa), locale=tr, timezone=America/Havana
   [junit4]   2> NOTE: Windows 10 10.0 amd64/Oracle Corporation 1.8.0_144 (64-bit)/cpus=3,threads=1,free=82683664,total=97320960
   [junit4]   2> NOTE: All tests run in this JVM: [TestBackwardsCompatibility]
   [junit4]   2> NOTE: reproduce with: ant test  -Dtestcase=TestBackwardsCompatibility -Dtests.seed=6C734063EE733CCB -Dtests.slow=true -Dtests.locale=tr -Dtests.timezone=America/Havana -Dtests.asserts=true -Dtests.file.encoding=Cp1252
   [junit4] ERROR   0.00s J0 | TestBackwardsCompatibility (suite) <<<
   [junit4]    > Throwable #1: java.io.IOException: Could not remove the following files (in the order of attempts):
   [junit4]    >    C:\Users\jenkins\workspace\Lucene-Solr-master-Windows\lucene\build\backward-codecs\test\J0\temp\lucene.index.TestBackwardsCompatibility_6C734063EE733CCB-001\3.6.0-cfs-001: java.nio.file.DirectoryNotEmptyException: C:\Users\jenkins\workspace\Lucene-Solr-master-Windows\lucene\build\backward-codecs\test\J0\temp\lucene.index.TestBackwardsCompatibility_6C734063EE733CCB-001\3.6.0-cfs-001
   [junit4]    > 	at __randomizedtesting.SeedInfo.seed([6C734063EE733CCB]:0)
   [junit4]    > 	at org.apache.lucene.util.IOUtils.rm(IOUtils.java:329)
   [junit4]    > 	at java.lang.Thread.run(Thread.java:748)
   [junit4] Completed [3/3 (1!)] on J0 in 13.29s, 30 tests, 1 error, 8 skipped <<< FAILURES!

[...truncated 4266 lines...]
   [junit4] Suite: org.apache.lucene.replicator.IndexReplicationClientTest
   [junit4]   2> feb 12, 2018 8:24:45 PM com.carrotsearch.randomizedtesting.RandomizedRunner$QueueUncaughtExceptionsHandler uncaughtException
   [junit4]   2> ADVERTENCIA: Uncaught exception in thread: Thread[ReplicationThread-index,5,TGRP-IndexReplicationClientTest]
   [junit4]   2> java.lang.AssertionError: handler failed too many times: -1
   [junit4]   2> 	at __randomizedtesting.SeedInfo.seed([78688A9AC4D6937C]:0)
   [junit4]   2> 	at org.apache.lucene.replicator.IndexReplicationClientTest$4.handleUpdateException(IndexReplicationClientTest.java:304)
   [junit4]   2> 	at org.apache.lucene.replicator.ReplicationClient$ReplicationThread.run(ReplicationClient.java:77)
   [junit4]   2> 
   [junit4]   2> NOTE: reproduce with: ant test  -Dtestcase=IndexReplicationClientTest -Dtests.method=testConsistencyOnExceptions -Dtests.seed=78688A9AC4D6937C -Dtests.slow=true -Dtests.locale=es-PE -Dtests.timezone=America/Costa_Rica -Dtests.asserts=true -Dtests.file.encoding=US-ASCII
   [junit4] ERROR   1.96s J0 | IndexReplicationClientTest.testConsistencyOnExceptions <<<
   [junit4]    > Throwable #1: com.carrotsearch.randomizedtesting.UncaughtExceptionError: Captured an uncaught exception in thread: Thread[id=17, name=ReplicationThread-index, state=RUNNABLE, group=TGRP-IndexReplicationClientTest]
   [junit4]    > 	at __randomizedtesting.SeedInfo.seed([78688A9AC4D6937C:F7E66D3AD6BA6083]:0)
   [junit4]    > Caused by: java.lang.AssertionError: handler failed too many times: -1
   [junit4]    > 	at __randomizedtesting.SeedInfo.seed([78688A9AC4D6937C]:0)
   [junit4]    > 	at org.apache.lucene.replicator.IndexReplicationClientTest$4.handleUpdateException(IndexReplicationClientTest.java:304)
   [junit4]    > 	at org.apache.lucene.replicator.ReplicationClient$ReplicationThread.run(ReplicationClient.java:77)
   [junit4]   2> NOTE: test params are: codec=Asserting(Lucene70): {}, docValues:{}, maxPointsInLeafNode=1092, maxMBSortInHeap=7.6040387664958935, sim=Asserting(org.apache.lucene.search.similarities.AssertingSimilarity@34e9d434), locale=es-PE, timezone=America/Costa_Rica
   [junit4]   2> NOTE: Windows 10 10.0 amd64/Oracle Corporation 1.8.0_144 (64-bit)/cpus=3,threads=1,free=65418072,total=97320960
   [junit4]   2> NOTE: All tests run in this JVM: [LocalReplicatorTest, IndexReplicationClientTest]
   [junit4] Completed [4/9 (1!)] on J0 in 2.70s, 4 tests, 1 error <<< FAILURES!

[...truncated 3467 lines...]
   [junit4] Suite: org.apache.solr.cloud.api.collections.TestReplicaProperties
   [junit4]   2> Creating dataDir: C:\Users\jenkins\workspace\Lucene-Solr-master-Windows\solr\build\solr-core\test\J0\temp\solr.cloud.api.collections.TestReplicaProperties_D64B61DA690B05DC-001\init-core-data-001
   [junit4]   2> 1250596 INFO  (SUITE-TestReplicaProperties-seed#[D64B61DA690B05DC]-worker) [    ] o.a.s.SolrTestCaseJ4 Using PointFields (NUMERIC_POINTS_SYSPROP=true) w/NUMERIC_DOCVALUES_SYSPROP=true
   [junit4]   2> 1250598 INFO  (SUITE-TestReplicaProperties-seed#[D64B61DA690B05DC]-worker) [    ] o.a.s.SolrTestCaseJ4 Randomized ssl (true) and clientAuth (false) via: @org.apache.solr.util.RandomizeSSL(reason=, value=NaN, ssl=NaN, clientAuth=NaN)
   [junit4]   2> 1250610 INFO  (SUITE-TestReplicaProperties-seed#[D64B61DA690B05DC]-worker) [    ] o.a.s.SolrTestCaseJ4 SecureRandom sanity checks: test.solr.allowed.securerandom=null & java.security.egd=file:/dev/./urandom
   [junit4]   2> 1250610 INFO  (SUITE-TestReplicaProperties-seed#[D64B61DA690B05DC]-worker) [    ] o.a.s.BaseDistributedSearchTestCase Setting hostContext system property: /_/
   [junit4]   2> 1250614 INFO  (TEST-TestReplicaProperties.test-seed#[D64B61DA690B05DC]) [    ] o.a.s.c.ZkTestServer STARTING ZK TEST SERVER
   [junit4]   2> 1250632 INFO  (Thread-2371) [    ] o.a.s.c.ZkTestServer client port:0.0.0.0/0.0.0.0:0
   [junit4]   2> 1250633 INFO  (Thread-2371) [    ] o.a.s.c.ZkTestServer Starting server
   [junit4]   2> 1250638 ERROR (Thread-2371) [    ] o.a.z.s.ZooKeeperServer ZKShutdownHandler is not registered, so ZooKeeper server won't take any action on ERROR or SHUTDOWN server state changes
   [junit4]   2> 1250715 INFO  (TEST-TestReplicaProperties.test-seed#[D64B61DA690B05DC]) [    ] o.a.s.c.ZkTestServer start zk server on port:57135
   [junit4]   2> 1250755 INFO  (zkConnectionManagerCallback-1615-thread-1) [    ] o.a.s.c.c.ConnectionManager zkClient has connected
   [junit4]   2> 1250780 INFO  (zkConnectionManagerCallback-1617-thread-1) [    ] o.a.s.c.c.ConnectionManager zkClient has connected
   [junit4]   2> 1250816 INFO  (TEST-TestReplicaProperties.test-seed#[D64B61DA690B05DC]) [    ] o.a.s.c.AbstractZkTestCase put C:\Users\jenkins\workspace\Lucene-Solr-master-Windows\solr\core\src\test-files\solr\collection1\conf\solrconfig-tlog.xml to /configs/conf1/solrconfig.xml
   [junit4]   2> 1250827 INFO  (TEST-TestReplicaProperties.test-seed#[D64B61DA690B05DC]) [    ] o.a.s.c.AbstractZkTestCase put C:\Users\jenkins\workspace\Lucene-Solr-master-Windows\solr\core\src\test-files\solr\collection1\conf\schema15.xml to /configs/conf1/schema.xml
   [junit4]   2> 1250829 INFO  (TEST-TestReplicaProperties.test-seed#[D64B61DA690B05DC]) [    ] o.a.s.c.AbstractZkTestCase put C:\Users\jenkins\workspace\Lucene-Solr-master-Windows\solr\core\src\test-files\solr\collection1\conf\solrconfig.snippet.randomindexconfig.xml to /configs/conf1/solrconfig.snippet.randomindexconfig.xml
   [junit4]   2> 1250831 INFO  (TEST-TestReplicaProperties.test-seed#[D64B61DA690B05DC]) [    ] o.a.s.c.AbstractZkTestCase put C:\Users\jenkins\workspace\Lucene-Solr-master-Windows\solr\core\src\test-files\solr\collection1\conf\stopwords.txt to /configs/conf1/stopwords.txt
   [junit4]   2> 1250834 INFO  (TEST-TestReplicaProperties.test-seed#[D64B61DA690B05DC]) [    ] o.a.s.c.AbstractZkTestCase put C:\Users\jenkins\workspace\Lucene-Solr-master-Windows\solr\core\src\test-files\solr\collection1\conf\protwords.txt to /configs/conf1/protwords.txt
   [junit4]   2> 1250837 INFO  (TEST-TestReplicaProperties.test-seed#[D64B61DA690B05DC]) [    ] o.a.s.c.AbstractZkTestCase put C:\Users\jenkins\workspace\Lucene-Solr-master-Windows\solr\core\src\test-files\solr\collection1\conf\currency.xml to /configs/conf1/currency.xml
   [junit4]   2> 1250842 INFO  (TEST-TestReplicaProperties.test-seed#[D64B61DA690B05DC]) [    ] o.a.s.c.AbstractZkTestCase put C:\Users\jenkins\workspace\Lucene-Solr-master-Windows\solr\core\src\test-files\solr\collection1\conf\enumsConfig.xml to /configs/conf1/enumsConfig.xml
   [junit4]   2> 1250846 INFO  (TEST-TestReplicaProperties.test-seed#[D64B61DA690B05DC]) [    ] o.a.s.c.AbstractZkTestCase put C:\Users\jenkins\workspace\Lucene-Solr-master-Windows\solr\core\src\test-files\solr\collection1\conf\open-exchange-rates.json to /configs/conf1/open-exchange-rates.json
   [junit4]   2> 1250848 INFO  (TEST-TestReplicaProperties.test-seed#[D64B61DA690B05DC]) [    ] o.a.s.c.AbstractZkTestCase put C:\Users\jenkins\workspace\Lucene-Solr-master-Windows\solr\core\src\test-files\solr\collection1\conf\mapping-ISOLatin1Accent.txt to /configs/conf1/mapping-ISOLatin1Accent.txt
   [junit4]   2> 1250851 INFO  (TEST-TestReplicaProperties.test-seed#[D64B61DA690B05DC]) [    ] o.a.s.c.AbstractZkTestCase put C:\Users\jenkins\workspace\Lucene-Solr-master-Windows\solr\core\src\test-files\solr\collection1\conf\old_synonyms.txt to /configs/conf1/old_synonyms.txt
   [junit4]   2> 1250855 INFO  (TEST-TestReplicaProperties.test-seed#[D64B61DA690B05DC]) [    ] o.a.s.c.AbstractZkTestCase put C:\Users\jenkins\workspace\Lucene-Solr-master-Windows\solr\core\src\test-files\solr\collection1\conf\synonyms.txt to /configs/conf1/synonyms.txt
   [junit4]   2> 1250864 INFO  (zkConnectionManagerCallback-1620-thread-1) [    ] o.a.s.c.c.ConnectionManager zkClient has connected
   [junit4]   2> 1250870 INFO  (TEST-TestReplicaProperties.test-seed#[D64B61DA690B05DC]) [    ] o.a.s.c.AbstractFullDistribZkTestBase Will use NRT replicas unless explicitly asked otherwise
   [junit4]   2> 1254937 INFO  (TEST-TestReplicaProperties.test-seed#[D64B61DA690B05DC]) [    ] o.e.j.s.Server jetty-9.4.8.v20171121, build timestamp: 2017-11-21T22:27:37+01:00, git hash: 82b8fb23f757335bb3329d540ce37a2a2615f0a8
   [junit4]   2> 1254937 INFO  (TEST-TestReplicaProperties.test-seed#[D64B61DA690B05DC]) [    ] o.e.j.s.session DefaultSessionIdManager workerName=node0
   [junit4]   2> 1254937 INFO  (TEST-TestReplicaProperties.test-seed#[D64B61DA690B05DC]) [    ] o.e.j.s.session No SessionScavenger set, using defaults
   [junit4]   2> 1254937 INFO  (TEST-TestReplicaProperties.test-seed#[D64B61DA690B05DC]) [    ] o.e.j.s.session Scavenging every 660000ms
   [junit4]   2> 1254937 INFO  (TEST-TestReplicaProperties.test-seed#[D64B61DA690B05DC]) [    ] o.e.j.s.h.ContextHandler Started o.e.j.s.ServletContextHandler@5fb60738{/_,null,AVAILABLE}
   [junit4]   2> 1254937 INFO  (TEST-TestReplicaProperties.test-seed#[D64B61DA690B05DC]) [    ] o.e.j.s.AbstractConnector Started ServerConnector@1391263d{SSL,[ssl, http/1.1]}{127.0.0.1:57145}
   [junit4]   2> 1254937 INFO  (TEST-TestReplicaProperties.test-seed#[D64B61DA690B05DC]) [    ] o.e.j.s.Server Started @1263039ms
   [junit4]   2> 1254937 INFO  (TEST-TestReplicaProperties.test-seed#[D64B61DA690B05DC]) [    ] o.a.s.c.s.e.JettySolrRunner Jetty properties: {solr.data.dir=C:\Users\jenkins\workspace\Lucene-Solr-master-Windows\solr\build\solr-core\test\J0\temp\solr.cloud.api.collections.TestReplicaProperties_D64B61DA690B05DC-001\tempDir-001/control/data, replicaType=NRT, hostContext=/_, hostPort=57145, coreRootDirectory=C:\Users\jenkins\workspace\Lucene-Solr-master-Windows\solr\build\solr-core\test\J0\temp\solr.cloud.api.collections.TestReplicaProperties_D64B61DA690B05DC-001\control-001\cores}
   [junit4]   2> 1254937 ERROR (TEST-TestReplicaProperties.test-seed#[D64B61DA690B05DC]) [    ] o.a.s.u.StartupLoggingUtils Missing Java Option solr.log.dir. Logging may be missing or incomplete.
   [junit4]   2> 1254937 INFO  (TEST-TestReplicaProperties.test-seed#[D64B61DA690B05DC]) [    ] o.a.s.s.SolrDispatchFilter  ___      _       Welcome to Apache Solr? version 8.0.0
   [junit4]   2> 1254937 INFO  (TEST-TestReplicaProperties.test-seed#[D64B61DA690B05DC]) [    ] o.a.s.s.SolrDispatchFilter / __| ___| |_ _   Starting in cloud mode on port null
   [junit4]   2> 1254937 INFO  (TEST-TestReplicaProperties.test-seed#[D64B61DA690B05DC]) [    ] o.a.s.s.SolrDispatchFilter \__ \/ _ \ | '_|  Install dir: null
   [junit4]   2> 1254937 INFO  (TEST-TestReplicaProperties.test-seed#[D64B61DA690B05DC]) [    ] o.a.s.s.SolrDispatchFilter |___/\___/_|_|    Start time: 2018-02-13T02:48:08.794Z
   [junit4]   2> 1255006 INFO  (zkConnectionManagerCallback-1622-thread-1) [    ] o.a.s.c.c.ConnectionManager zkClient has connected
   [junit4]   2> 1255008 INFO  (TEST-TestReplicaProperties.test-seed#[D64B61DA690B05DC]) [    ] o.a.s.s.SolrDispatchFilter Loading solr.xml from SolrHome (not found in ZooKeeper)
   [junit4]   2> 1255008 INFO  (TEST-TestReplicaProperties.test-seed#[D64B61DA690B05DC]) [    ] o.a.s.c.SolrXmlConfig Loading container configuration from C:\Users\jenkins\workspace\Lucene-Solr-master-Windows\solr\build\solr-core\test\J0\temp\solr.cloud.api.collections.TestReplicaProperties_D64B61DA690B05DC-001\control-001\solr.xml
   [junit4]   2> 1255027 INFO  (TEST-TestReplicaProperties.test-seed#[D64B61DA690B05DC]) [    ] o.a.s.c.SolrXmlConfig Configuration parameter autoReplicaFailoverWorkLoopDelay is ignored
   [junit4]   2> 1255027 INFO  (TEST-TestReplicaProperties.test-seed#[D64B61DA690B05DC]) [    ] o.a.s.c.SolrXmlConfig Configuration parameter autoReplicaFailoverBadNodeExpiration is ignored
   [junit4]   2> 1255028 INFO  (TEST-TestReplicaProperties.test-seed#[D64B61DA690B05DC]) [    ] o.a.s.c.SolrXmlConfig MBean server found: com.sun.jmx.mbeanserver.JmxMBeanServer@46d7ad72, but no JMX reporters were configured - adding default JMX reporter.
   [junit4]   2> 1255033 INFO  (TEST-TestReplicaProperties.test-seed#[D64B61DA690B05DC]) [    ] o.a.s.c.ZkContainer Zookeeper client=127.0.0.1:57135/solr
   [junit4]   2> 1255064 INFO  (zkConnectionManagerCallback-1626-thread-1) [    ] o.a.s.c.c.ConnectionManager zkClient has connected
   [junit4]   2> 1255069 WARN  (NIOServerCxn.Factory:0.0.0.0/0.0.0.0:0) [    ] o.a.z.s.NIOServerCnxn Unable to read additional data from client sessionid 0x100771be7890004, likely client has closed socket
   [junit4]   2> 1255072 INFO  (zkConnectionManagerCallback-1628-thread-1-processing-n:127.0.0.1:57145__) [n:127.0.0.1:57145__    ] o.a.s.c.c.ConnectionManager zkClient has connected
   [junit4]   2> 1255435 INFO  (TEST-TestReplicaProperties.test-seed#[D64B61DA690B05DC]) [n:127.0.0.1:57145__    ] o.a.s.c.Overseer Overseer (id=null) closing
   [junit4]   2> 1255436 INFO  (TEST-TestReplicaProperties.test-seed#[D64B61DA690B05DC]) [n:127.0.0.1:57145__    ] o.a.s.c.OverseerElectionContext I am going to be the leader 127.0.0.1:57145__
   [junit4]   2> 1255437 INFO  (TEST-TestReplicaProperties.test-seed#[D64B61DA690B05DC]) [n:127.0.0.1:57145__    ] o.a.s.c.Overseer Overseer (id=72188555770265605-127.0.0.1:57145__-n_0000000000) starting
   [junit4]   2> 1255477 INFO  (TEST-TestReplicaProperties.test-seed#[D64B61DA690B05DC]) [n:127.0.0.1:57145__    ] o.a.s.c.ZkController Register node as live in ZooKeeper:/live_nodes/127.0.0.1:57145__
   [junit4]   2> 1255566 INFO  (zkCallback-1627-thread-1-processing-n:127.0.0.1:57145__) [n:127.0.0.1:57145__    ] o.a.s.c.c.ZkStateReader Updated live nodes from ZooKeeper... (0) -> (1)
   [junit4]   2> 1255680 INFO  (TEST-TestReplicaProperties.test-seed#[D64B61DA690B05DC]) [n:127.0.0.1:57145__    ] o.a.s.m.r.SolrJmxReporter JMX monitoring for 'solr.node' (registry 'solr.node') enabled at server: com.sun.jmx.mbeanserver.JmxMBeanServer@46d7ad72
   [junit4]   2> 1255700 INFO  (TEST-TestReplicaProperties.test-seed#[D64B61DA690B05DC]) [n:127.0.0.1:57145__    ] o.a.s.m.r.SolrJmxReporter JMX monitoring for 'solr.jvm' (registry 'solr.jvm') enabled at server: com.sun.jmx.mbeanserver.JmxMBeanServer@46d7ad72
   [junit4]   2> 1255700 INFO  (TEST-TestReplicaProperties.test-seed#[D64B61DA690B05DC]) [n:127.0.0.1:57145__    ] o.a.s.m.r.SolrJmxReporter JMX monitoring for 'solr.jetty' (registry 'solr.jetty') enabled at server: com.sun.jmx.mbeanserver.JmxMBeanServer@46d7ad72
   [junit4]   2> 1255704 INFO  (TEST-TestReplicaProperties.test-seed#[D64B61DA690B05DC]) [n:127.0.0.1:57145__    ] o.a.s.c.CorePropertiesLocator Found 0 core definitions underneath C:\Users\jenkins\workspace\Lucene-Solr-master-Windows\solr\build\solr-core\test\J0\temp\solr.cloud.api.collections.TestReplicaProperties_D64B61DA690B05DC-001\control-001\cores
   [junit4]   2> 1255795 INFO  (zkConnectionManagerCallback-1634-thread-1) [    ] o.a.s.c.c.ConnectionManager zkClient has connected
   [junit4]   2> 1255796 INFO  (TEST-TestReplicaProperties.test-seed#[D64B61DA690B05DC]) [    ] o.a.s.c.c.ZkStateReader Updated live nodes from ZooKeeper... (0) -> (1)
   [junit4]   2> 1255822 INFO  (TEST-TestReplicaProperties.test-seed#[D64B61DA690B05DC]) [    ] o.a.s.c.s.i.ZkClientClusterStateProvider Cluster at 127.0.0.1:57135/solr ready
   [junit4]   2> 1255897 INFO  (qtp670508437-10414) [n:127.0.0.1:57145__    ] o.a.s.h.a.CollectionsHandler Invoked Collection Action :create with params replicationFactor=1&collection.configName=conf1&name=control_collection&nrtReplicas=1&action=CREATE&numShards=1&createNodeSet=127.0.0.1:57145__&wt=javabin&version=2 and sendToOCPQueue=true
   [junit4]   2> 1255903 INFO  (OverseerThreadFactory-4148-thread-1-processing-n:127.0.0.1:57145__) [n:127.0.0.1:57145__    ] o.a.s.c.a.c.CreateCollectionCmd Create collection control_collection
   [junit4]   2> 1256062 INFO  (qtp670508437-10413) [n:127.0.0.1:57145__    ] o.a.s.h.a.CoreAdminOperation core create command qt=/admin/cores&collection.configName=conf1&newCollection=true&name=control_collection_shard1_replica_n1&action=CREATE&numShards=1&collection=control_collection&shard=shard1&wt=javabin&version=2&replicaType=NRT
   [junit4]   2> 1256062 INFO  (qtp670508437-10413) [n:127.0.0.1:57145__    ] o.a.s.c.TransientSolrCoreCacheDefault Allocating transient cache for 4 transient cores
   [junit4]   2> 1256177 INFO  (zkCallback-1627-thread-1-processing-n:127.0.0.1:57145__) [n:127.0.0.1:57145__    ] o.a.s.c.c.ZkStateReader A cluster state change: [WatchedEvent state:SyncConnected type:NodeDataChanged path:/collections/control_collection/state.json] for collection [control_collection] has occurred - updating... (live nodes size: [1])
   [junit4]   2> 1257192 INFO  (qtp670508437-10413) [n:127.0.0.1:57145__ c:control_collection s:shard1  x:control_collection_shard1_replica_n1] o.a.s.c.SolrConfig Using Lucene MatchVersion: 8.0.0
   [junit4]   2> 1257221 INFO  (qtp670508437-10413) [n:127.0.0.1:57145__ c:control_collection s:shard1  x:control_collection_shard1_replica_n1] o.a.s.s.IndexSchema [control_collection_shard1_replica_n1] Schema name=test
   [junit4]   2> 1257357 INFO  (qtp670508437-10413) [n:127.0.0.1:57145__ c:control_collection s:shard1  x:control_collection_shard1_replica_n1] o.a.s.s.IndexSchema Loaded schema test/1.6 with uniqueid field id
   [junit4]   2> 1257400 INFO  (qtp670508437-10413) [n:127.0.0.1:57145__ c:control_collection s:shard1  x:control_collection_shard1_replica_n1] o.a.s.c.CoreContainer Creating SolrCore 'control_collection_shard1_replica_n1' using configuration from collection control_collection, trusted=true
   [junit4]   2> 1257400 INFO  (qtp670508437-10413) [n:127.0.0.1:57145__ c:control_collection s:shard1  x:control_collection_shard1_replica_n1] o.a.s.m.r.SolrJmxReporter JMX monitoring for 'solr.core.control_collection.shard1.replica_n1' (registry 'solr.core.control_collection.shard1.replica_n1') enabled at server: com.sun.jmx.mbeanserver.JmxMBeanServer@46d7ad72
   [junit4]   2> 1257400 INFO  (qtp670508437-10413) [n:127.0.0.1:57145__ c:control_collection s:shard1  x:control_collection_shard1_replica_n1] o.a.s.c.SolrCore solr.RecoveryStrategy.Builder
   [junit4]   2> 1257400 INFO  (qtp670508437-10413) [n:127.0.0.1:57145__ c:control_collection s:shard1  x:control_collection_shard1_replica_n1] o.a.s.c.SolrCore [[control_collection_shard1_replica_n1] ] Opening new SolrCore at [C:\Users\jenkins\workspace\Lucene-Solr-master-Windows\solr\build\solr-core\test\J0\temp\solr.cloud.api.collections.TestReplicaProperties_D64B61DA690B05DC-001\control-001\cores\control_collection_shard1_replica_n1], dataDir=[C:\Users\jenkins\workspace\Lucene-Solr-master-Windows\solr\build\solr-core\test\J0\temp\solr.cloud.api.collections.TestReplicaProperties_D64B61DA690B05DC-001\control-001\cores\control_collection_shard1_replica_n1\data\]
   [junit4]   2> 1257428 INFO  (qtp670508437-10413) [n:127.0.0.1:57145__ c:control_collection s:shard1  x:control_collection_shard1_replica_n1] o.a.s.u.RandomMergePolicy RandomMergePolicy wrapping class org.apache.lucene.index.TieredMergePolicy: [TieredMergePolicy: maxMergeAtOnce=22, maxMergeAtOnceExplicit=15, maxMergedSegmentMB=46.181640625, floorSegmentMB=1.2548828125, forceMergeDeletesPctAllowed=6.031911595954225, segmentsPerTier=39.0, maxCFSSegmentSizeMB=8.796093022207999E12, noCFSRatio=1.0
   [junit4]   2> 1257438 WARN  (qtp670508437-10413) [n:127.0.0.1:57145__ c:control_collection s:shard1  x:control_collection_shard1_replica_n1] o.a.s.c.RequestHandlers INVALID paramSet a in requestHandler {type = requestHandler,name = /dump,class = DumpRequestHandler,attributes = {initParams=a, name=/dump, class=DumpRequestHandler},args = {defaults={a=A,b=B}}}
   [junit4]   2> 1257783 INFO  (qtp670508437-10413) [n:127.0.0.1:57145__ c:control_collection s:shard1  x:control_collection_shard1_replica_n1] o.a.s.u.UpdateHandler Using UpdateLog implementation: org.apache.solr.update.UpdateLog
   [junit4]   2> 1257783 INFO  (qtp670508437-10413) [n:127.0.0.1:57145__ c:control_collection s:shard1  x:control_collection_shard1_replica_n1] o.a.s.u.UpdateLog Initializing UpdateLog: dataDir= defaultSyncLevel=FLUSH numRecordsToKeep=100 maxNumLogsToKeep=10 numVersionBuckets=65536
   [junit4]   2> 1257785 INFO  (qtp670508437-10413) [n:127.0.0.1:57145__ c:control_collection s:shard1  x:control_collection_shard1_replica_n1] o.a.s.u.CommitTracker Hard AutoCommit: disabled
   [junit4]   2> 1257785 INFO  (qtp670508437-10413) [n:127.0.0.1:57145__ c:control_collection s:shard1  x:control_collection_shard1_replica_n1] o.a.s.u.CommitTracker Soft AutoCommit: disabled
   [junit4]   2> 1257791 INFO  (qtp670508437-10413) [n:127.0.0.1:57145__ c:control_collection s:shard1  x:control_collection_shard1_replica_n1] o.a.s.u.RandomMergePolicy RandomMergePolicy wrapping class org.apache.lucene.index.LogByteSizeMergePolicy: [LogByteSizeMergePolicy: minMergeSize=1677721, mergeFactor=37, maxMergeSize=2147483648, maxMergeSizeForForcedMerge=9223372036854775807, calibrateSizeByDeletes=true, maxMergeDocs=2147483647, maxCFSSegmentSizeMB=8.796093022207999E12, noCFSRatio=0.7682977512247592]
   [junit4]   2> 1257792 INFO  (qtp670508437-10413) [n:127.0.0.1:57145__ c:control_collection s:shard1  x:control_collection_shard1_replica_n1] o.a.s.s.SolrIndexSearcher Opening [Searcher@1ccfc2a9[control_collection_shard1_replica_n1] main]
   [junit4]   2> 1257802 INFO  (qtp670508437-10413) [n:127.0.0.1:57145__ c:control_collection s:shard1  x:control_collection_shard1_replica_n1] o.a.s.r.ManagedResourceStorage Configured ZooKeeperStorageIO with znodeBase: /configs/conf1
   [junit4]   2> 1257802 INFO  (qtp670508437-10413) [n:127.0.0.1:57145__ c:control_collection s:shard1  x:control_collection_shard1_replica_n1] o.a.s.r.ManagedResourceStorage Loaded null at path _rest_managed.json using ZooKeeperStorageIO:path=/configs/conf1
   [junit4]   2> 1257802 INFO  (qtp670508437-10413) [n:127.0.0.1:57145__ c:control_collection s:shard1  x:control_collection_shard1_replica_n1] o.a.s.h.ReplicationHandler Commits will be reserved for 10000ms.
   [junit4]   2> 1257802 INFO  (qtp670508437-10413) [n:127.0.0.1:57145__ c:control_collection s:shard1  x:control_collection_shard1_replica_n1] o.a.s.u.UpdateLog Could not find max version in index or recent updates, using new clock 1592252266351427584
   [junit4]   2> 1257802 INFO  (searcherExecutor-4151-thread-1-processing-n:127.0.0.1:57145__ x:control_collection_shard1_replica_n1 s:shard1 c:control_collection) [n:127.0.0.1:57145__ c:control_collection s:shard1  x:control_collection_shard1_replica_n1] o.a.s.c.SolrCore [control_collection_shard1_replica_n1] Registered new searcher Searcher@1ccfc2a9[control_collection_shard1_replica_n1] main{ExitableDirectoryReader(UninvertingDirectoryReader())}
   [junit4]   2> 1257894 INFO  (qtp670508437-10413) [n:127.0.0.1:57145__ c:control_collection s:shard1  x:control_collection_shard1_replica_n1] o.a.s.c.ShardLeaderElectionContext Enough replicas found to continue.
   [junit4]   2> 1257894 INFO  (qtp670508437-10413) [n:127.0.0.1:57145__ c:control_collection s:shard1  x:control_collection_shard1_replica_n1] o.a.s.c.ShardLeaderElectionContext I may be the new leader - try and sync
   [junit4]   2> 1257894 INFO  (qtp670508437-10413) [n:127.0.0.1:57145__ c:control_collection s:shard1  x:control_collection_shard1_replica_n1] o.a.s.c.SyncStrategy Sync replicas to https://127.0.0.1:57145/_/control_collection_shard1_replica_n1/
   [junit4]   2> 1257894 INFO  (qtp670508437-10413) [n:127.0.0.1:57145__ c:control_collection s:shard1  x:control_collection_shard1_replica_n1] o.a.s.c.SyncStrategy Sync Success - now sync replicas to me
   [junit4]   2> 1257894 INFO  (qtp670508437-10413) [n:127.0.0.1:57145__ c:control_collection s:shard1  x:control_collection_shard1_replica_n1] o.a.s.c.SyncStrategy https://127.0.0.1:57145/_/control_collection_shard1_replica_n1/ has no replicas
   [junit4]   2> 1257894 INFO  (qtp670508437-10413) [n:127.0.0.1:57145__ c:control_collection s:shard1  x:control_collection_shard1_replica_n1] o.a.s.c.ShardLeaderElectionContext Found all replicas participating in election, clear LIR
   [junit4]   2> 1257899 INFO  (qtp670508437-10413) [n:127.0.0.1:57145__ c:control_collection s:shard1  x:control_collection_shard1_replica_n1] o.a.s.c.ShardLeaderElectionContext I am the new leader: https://127.0.0.1:57145/_/control_collection_shard1_replica_n1/ shard1
   [junit4]   2> 1258031 INFO  (zkCallback-1627-thread-1-processing-n:127.0.0.1:57145__) [n:127.0.0.1:57145__    ] o.a.s.c.c.ZkStateReader A cluster state change: [WatchedEvent state:SyncConnected type:NodeDataChanged path:/collections/control_collection/state.json] for collection [control_collection] has occurred - updating... (live nodes size: [1])
   [junit4]   2> 1258086 INFO  (qtp670508437-10413) [n:127.0.0.1:57145__ c:control_collection s:shard1  x:control_collection_shard1_replica_n1] o.a.s.c.ZkController I am the leader, no recovery necessary
   [junit4]   2> 1258089 INFO  (qtp670508437-10413) [n:127.0.0.1:57145__ c:control_collection s:shard1  x:control_collection_shard1_replica_n1] o.a.s.s.HttpSolrCall [admin] webapp=null path=/admin/cores params={qt=/admin/cores&collection.configName=conf1&newCollection=true&name=control_collection_shard1_replica_n1&action=CREATE&numShards=1&collection=control_collection&shard=shard1&wt=javabin&version=2&replicaType=NRT} status=0 QTime=2025
   [junit4]   2> 1258100 INFO  (qtp670508437-10414) [n:127.0.0.1:57145__    ] o.a.s.h.a.CollectionsHandler Wait for new collection to be active for at most 30 seconds. Check all shard replicas
   [junit4]   2> 1258197 INFO  (zkCallback-1627-thread-1-processing-n:127.0.0.1:57145__) [n:127.0.0.1:57145__    ] o.a.s.c.c.ZkStateReader A cluster state change: [WatchedEvent state:SyncConnected type:NodeDataChanged path:/collections/control_collection/state.json] for collection [control_collection] has occurred - updating... (live nodes size: [1])
   [junit4]   2> 1259119 INFO  (qtp670508437-10414) [n:127.0.0.1:57145__    ] o.a.s.s.HttpSolrCall [admin] webapp=null path=/admin/collections params={replicationFactor=1&collection.configName=conf1&name=control_collection&nrtReplicas=1&action=CREATE&numShards=1&createNodeSet=127.0.0.1:57145__&wt=javabin&version=2} status=0 QTime=3221
   [junit4]   2> 1259136 WARN  (NIOServerCxn.Factory:0.0.0.0/0.0.0.0:0) [    ] o.a.z.s.NIOServerCnxn Unable to read additional data from client sessionid 0x100771be7890006, likely client has closed socket
   [junit4]   2> 1259184 INFO  (zkConnectionManagerCallback-1638-thread-1) [    ] o.a.s.c.c.ConnectionManager zkClient has connected
   [junit4]   2> 1259186 INFO  (TEST-TestReplicaProperties.test-seed#[D64B61DA690B05DC]) [    ] o.a.s.c.c.ZkStateReader Updated live nodes from ZooKeeper... (0) -> (1)
   [junit4]   2> 1259188 INFO  (TEST-TestReplicaProperties.test-seed#[D64B61DA690B05DC]) [    ] o.a.s.c.s.i.ZkClientClusterStateProvider Cluster at 127.0.0.1:57135/solr ready
   [junit4]   2> 1259188 INFO  (TEST-TestReplicaProperties.test-seed#[D64B61DA690B05DC]) [    ] o.a.s.c.ChaosMonkey monkey: init - expire sessions:false cause connection loss:false
   [junit4]   2> 1259282 INFO  (qtp670508437-10416) [n:127.0.0.1:57145__    ] o.a.s.h.a.CollectionsHandler Invoked Collection Action :create with params replicationFactor=1&collection.configName=conf1&name=collection1&nrtReplicas=1&action=CREATE&numShards=2&createNodeSet=&stateFormat=2&wt=javabin&version=2 and sendToOCPQueue=true
   [junit4]   2> 1259292 INFO  (OverseerCollectionConfigSetProcessor-72188555770265605-127.0.0.1:57145__-n_0000000000) [n:127.0.0.1:57145__    ] o.a.s.c.OverseerTaskQueue Response ZK path: /overseer/collection-queue-work/qnr-0000000000 doesn't exist.  Requestor may have disconnected from ZooKeeper
   [junit4]   2> 1259293 INFO  (OverseerThreadFactory-4148-thread-2-processing-n:127.0.0.1:57145__) [n:127.0.0.1:57145__    ] o.a.s.c.a.c.CreateCollectionCmd Create collection collection1
   [junit4]   2> 1259294 WARN  (OverseerThreadFactory-4148-thread-2-processing-n:127.0.0.1:57145__) [n:127.0.0.1:57145__    ] o.a.s.c.a.c.CreateCollectionCmd It is unusual to create a collection (collection1) without cores.
   [junit4]   2> 1259567 INFO  (qtp670508437-10416) [n:127.0.0.1:57145__    ] o.a.s.h.a.CollectionsHandler Wait for new collection to be active for at most 30 seconds. Check all shard replicas
   [junit4]   2> 1259583 INFO  (qtp670508437-10416) [n:127.0.0.1:57145__    ] o.a.s.s.HttpSolrCall [admin] webapp=null path=/admin/collections params={replicationFactor=1&collection.configName=conf1&name=collection1&nrtReplicas=1&action=CREATE&numShards=2&createNodeSet=&stateFormat=2&wt=javabin&version=2} status=0 QTime=300
   [junit4]   2> 1261318 INFO  (OverseerCollectionConfigSetProcessor-72188555770265605-127.0.0.1:57145__-n_0000000000) [n:127.0.0.1:57145__    ] o.a.s.c.OverseerTaskQueue Response ZK path: /overseer/collection-queue-work/qnr-0000000002 doesn't exist.  Requestor may have disconnected from ZooKeeper
   [junit4]   2> 1262170 INFO  (TEST-TestReplicaProperties.test-seed#[D64B61DA690B05DC]) [    ] o.a.s.c.AbstractFullDistribZkTestBase create jetty 1 in directory C:\Users\jenkins\workspace\Lucene-Solr-master-Windows\solr\build\solr-core\test\J0\temp\solr.cloud.api.collections.TestReplicaProperties_D64B61DA690B05DC-001\shard-1-001 of type NRT
   [junit4]   2> 1262193 INFO  (TEST-TestReplicaProperties.test-seed#[D64B61DA690B05DC]) [    ] o.e.j.s.Server jetty-9.4.8.v20171121, build timestamp: 2017-11-21T22:27:37+01:00, git hash: 82b8fb23f757335bb3329d540ce37a2a2615f0a8
   [junit4]   2> 1262194 INFO  (TEST-TestReplicaProperties.test-seed#[D64B61DA690B05DC]) [    ] o.e.j.s.session DefaultSessionIdManager workerName=node0
   [junit4]   2> 1262194 INFO  (TEST-TestReplicaProperties.test-seed#[D64B61DA690B05DC]) [    ] o.e.j.s.session No SessionScavenger set, using defaults
   [junit4]   2> 1262194 INFO  (TEST-TestReplicaProperties.test-seed#[D64B61DA690B05DC]) [    ] o.e.j.s.session Scavenging every 600000ms
   [junit4]   2> 1262194 INFO  (TEST-TestReplicaProperties.test-seed#[D64B61DA690B05DC]) [    ] o.e.j.s.h.ContextHandler Started o.e.j.s.ServletContextHandler@1b04bff1{/_,null,AVAILABLE}
   [junit4]   2> 1262195 INFO  (TEST-TestReplicaProperties.test-seed#[D64B61DA690B05DC]) [    ] o.e.j.s.AbstractConnector Started ServerConnector@326c728e{SSL,[ssl, http/1.1]}{127.0.0.1:57174}
   [junit4]   2> 1262195 INFO  (TEST-TestReplicaProperties.test-seed#[D64B61DA690B05DC]) [    ] o.e.j.s.Server Started @1270294ms
   [junit4]   2> 1262196 INFO  (TEST-TestReplicaProperties.test-seed#[D64B61DA690B05DC]) [    ] o.a.s.c.s.e.JettySolrRunner Jetty properties: {solr.data.dir=C:\Users\jenkins\workspace\Lucene-Solr-master-Windows\solr\build\solr-core\test\J0\temp\solr.cloud.api.collections.TestReplicaProperties_D64B61DA690B05DC-001\tempDir-001/jetty1, replicaType=NRT, solrconfig=solrconfig.xml, hostContext=/_, hostPort=57174, coreRootDirectory=C:\Users\jenkins\workspace\Lucene-Solr-master-Windows\solr\build\solr-core\test\J0\..\..\..\..\..\..\..\..\..\Users\jenkins\workspace\Lucene-Solr-master-Windows\solr\build\solr-core\test\J0\temp\solr.cloud.api.collections.TestReplicaProperties_D64B61DA690B05DC-001\shard-1-001\cores}
   [junit4]   2> 1262196 ERROR (TEST-TestReplicaProperties.test-seed#[D64B61DA690B05DC]) [    ] o.a.s.u.StartupLoggingUtils Missing Java Option solr.log.dir. Logging may be missing or incomplete.
   [junit4]   2> 1262196 INFO  (TEST-TestReplicaProperties.test-seed#[D64B61DA690B05DC]) [    ] o.a.s.s.SolrDispatchFilter  ___      _       Welcome to Apache Solr? version 8.0.0
   [junit4]   2> 1262196 INFO  (TEST-TestReplicaProperties.test-seed#[D64B61DA690B05DC]) [    ] o.a.s.s.SolrDispatchFilter / __| ___| |_ _   Starting in cloud mode on port null
   [junit4]   2> 1262196 INFO  (TEST-TestReplicaProperties.test-seed#[D64B61DA690B05DC]) [    ] o.a.s.s.SolrDispatchFilter \__ \/ _ \ | '_|  Install dir: null
   [junit4]   2> 1262196 INFO  (TEST-TestReplicaProperties.test-seed#[D64B61DA690B05DC]) [    ] o.a.s.s.SolrDispatchFilter |___/\___/_|_|    Start time: 2018-02-13T02:48:16.053Z
   [junit4]   2> 1262222 INFO  (zkConnectionManagerCallback-1640-thread-1) [    ] o.a.s.c.c.ConnectionManager zkClient has connected
   [junit4]   2> 1262251 INFO  (TEST-TestReplicaProperties.test-seed#[D64B61DA690B05DC]) [    ] o.a.s.s.SolrDispatchFilter Loading solr.xml from SolrHome (not found in ZooKeeper)
   [junit4]   2> 1262252 INFO  (TEST-TestReplicaProperties.test-seed#[D64B61DA690B05DC]) [    ] o.a.s.c.SolrXmlConfig Loading container configuration from C:\Users\jenkins\workspace\Lucene-Solr-master-Windows\solr\build\solr-core\test\J0\temp\solr.cloud.api.collections.TestReplicaProperties_D64B61DA690B05DC-001\shard-1-001\solr.xml
   [junit4]   2> 1262276 INFO  (TEST-TestReplicaProperties.test-seed#[D64B61DA690B05DC]) [    ] o.a.s.c.SolrXmlConfig Configuration parameter autoReplicaFailoverWorkLoopDelay is ignored
   [junit4]   2> 1262276 INFO  (TEST-TestReplicaProperties.test-seed#[D64B61DA690B05DC]) [    ] o.a.s.c.SolrXmlConfig Configuration parameter autoReplicaFailoverBadNodeExpiration is ignored
   [junit4]   2> 1262277 INFO  (TEST-TestReplicaProperties.test-seed#[D64B61DA690B05DC]) [    ] o.a.s.c.SolrXmlConfig MBean server found: com.sun.jmx.mbeanserver.JmxMBeanServer@46d7ad72, but no JMX reporters were configured - adding default JMX reporter.
   [junit4]   2> 1262306 INFO  (TEST-TestReplicaProperties.test-seed#[D64B61DA690B05DC]) [    ] o.a.s.c.ZkContainer Zookeeper client=127.0.0.1:57135/solr
   [junit4]   2> 1262310 INFO  (zkConnectionManagerCallback-1644-thread-1) [    ] o.a.s.c.c.ConnectionManager zkClient has connected
   [junit4]   2> 1262364 INFO  (zkConnectionManagerCallback-1646-thread-1-processing-n:127.0.0.1:57174__) [n:127.0.0.1:57174__    ] o.a.s.c.c.ConnectionManager zkClient has connected
   [junit4]   2> 1262385 INFO  (TEST-TestReplicaProperties.test-seed#[D64B61DA690B05DC]) [n:127.0.0.1:57174__    ] o.a.s.c.c.ZkStateReader Updated live nodes from ZooKeeper... (0) -> (1)
   [junit4]   2> 1262394 INFO  (TEST-TestReplicaProperties.test-seed#[D64B61DA690B05DC]) [n:127.0.0.1:57174__    ] o.a.s.c.Overseer Overseer (id=null) closing
   [junit4]   2> 1262397 INFO  (TEST-TestReplicaProperties.test-seed#[D64B61DA690B05DC]) [n:127.0.0.1:57174__    ] o.a.s.c.ZkController Register node as live in ZooKeeper:/live_nodes/127.0.0.1:57174__
   [junit4]   2> 1262457 INFO  (zkCallback-1627-thread-2-processing-n:127.0.0.1:57145__) [n:127.0.0.1:57145__    ] o.a.s.c.c.ZkStateReader Updated live nodes from ZooKeeper... (1) -> (2)
   [junit4]   2> 1262471 INFO  (zkCallback-1637-thread-1) [    ] o.a.s.c.c.ZkStateReader Updated live nodes from ZooKeeper... (1) -> (2)
   [junit4]   2> 1262481 INFO  (zkCallback-1645-thread-1-processing-n:127.0.0.1:57174__) [n:127.0.0.1:57174__    ] o.a.s.c.c.ZkStateReader Updated live nodes from ZooKeeper... (1) -> (2)
   [junit4]   2> 1262659 INFO  (TEST-TestReplicaProperties.test-seed#[D64B61DA690B05DC]) [n:127.0.0.1:57174__    ] o.a.s.m.r.SolrJmxReporter JMX monitoring for 'solr.node' (registry 'solr.node') enabled at server: com.sun.jmx.mbeanserver.JmxMBeanServer@46d7ad72
   [junit4]   2> 1262665 INFO  (TEST-TestReplicaProperties.test-seed#[D64B61DA690B05DC]) [n:127.0.0.1:57174__    ] o.a.s.m.r.SolrJmxReporter JMX monitoring for 'solr.jvm' (registry 'solr.jvm') enabled at server: com.sun.jmx.mbeanserver.JmxMBeanServer@46d7ad72
   [junit4]   2> 1262665 INFO  (TEST-TestReplicaProperties.test-seed#[D64B61DA690B05DC]) [n:127.0.0.1:57174__    ] o.a.s.m.r.SolrJmxReporter JMX monitoring for 'solr.jetty' (registry 'solr.jetty') enabled at server: com.sun.jmx.mbeanserver.JmxMBeanServer@46d7ad72
   [junit4]   2> 1262665 INFO  (TEST-TestReplicaProperties.test-seed#[D64B61DA690B05DC]) [n:127.0.0.1:57174__    ] o.a.s.c.CorePropertiesLocator Found 0 core definitions underneath C:\Users\jenkins\workspace\Lucene-Solr-master-Windows\solr\build\solr-core\test\J0\..\..\..\..\..\..\..\..\..\Users\jenkins\workspace\Lucene-Solr-master-Windows\solr\build\solr-core\test\J0\temp\solr.cloud.api.collections.TestReplicaProperties_D64B61DA690B05DC-001\shard-1-001\cores
   [junit4]   2> 1262757 INFO  (qtp670508437-10414) [n:127.0.0.1:57145__    ] o.a.s.h.a.CollectionsHandler Invoked Collection Action :addreplica with params node=127.0.0.1:57174__&action=ADDREPLICA&collection=collection1&shard=shard2&type=NRT&wt=javabin&version=2 and sendToOCPQueue=true
   [junit4]   2> 1262772 INFO  (OverseerThreadFactory-4148-thread-3-processing-n:127.0.0.1:57145__) [n:127.0.0.1:57145__    ] o.a.s.c.a.c.AddReplicaCmd Node Identified 127.0.0.1:57174__ for creating new replica
   [junit4]   2> 1262906 INFO  (qtp108330740-10464) [n:127.0.0.1:57174__    ] o.a.s.h.a.CoreAdminOperation core create command qt=/admin/cores&collection.configName=conf1&name=collection1_shard2_replica_n41&action=CREATE&collection=collection1&shard=shard2&wt=javabin&version=2&replicaType=NRT
   [junit4]   2> 1262908 INFO  (qtp108330740-10464) [n:127.0.0.1:57174__    ] o.a.s.c.TransientSolrCoreCacheDefault Allocating transient cache for 4 transient cores
   [junit4]   2> 1262914 INFO  (zkCallback-1645-thread-1-processing-n:127.0.0.1:57174__) [n:127.0.0.1:57174__    ] o.a.s.c.c.ZkStateReader A cluster state change: [WatchedEvent state:SyncConnected type:NodeDataChanged path:/collections/collection1/state.json] for collection [collection1] has occurred - updating... (live nodes size: [2])
   [junit4]   2> 1263972 INFO  (qtp108330740-10464) [n:127.0.0.1:57174__ c:collection1 s:shard2  x:collection1_shard2_replica_n41] o.a.s.c.SolrConfig Using Lucene MatchVersion: 8.0.0
   [junit4]   2> 1263996 INFO  (qtp108330740-10464) [n:127.0.0.1:57174__ c:collection1 s:shard2  x:collection1_shard2_replica_n41] o.a.s.s.IndexSchema [collection1_shard2_replica_n41] Schema name=test
   [junit4]   2> 1264137 INFO  (qtp108330740-10464) [n:127.0.0.1:57174__ c:collection1 s:shard2  x:collection1_shard2_replica_n41] o.a.s.s.IndexSchema Loaded schema test/1.6 with uniqueid field id
   [junit4]   2> 1264189 INFO  (qtp108330740-10464) [n:127.0.0.1:57174__ c:collection1 s:shard2  x:collection1_shard2_replica_n41] o.a.s.c.CoreContainer Creating SolrCore 'collection1_shard2_replica_n41' using configuration from collection collection1, trusted=true
   [junit4]   2> 1264189 INFO  (qtp108330740-10464) [n:127.0.0.1:57174__ c:collection1 s:shard2  x:collection1_shard2_replica_n41] o.a.s.m.r.SolrJmxReporter JMX monitoring for 'solr.core.collection1.shard2.replica_n41' (registry 'solr.core.collection1.shard2.replica_n41') enabled at server: com.sun.jmx.mbeanserver.JmxMBeanServer@46d7ad72
   [junit4]   2> 1264189 INFO  (qtp108330740-10464) [n:127.0.0.1:57174__ c:collection1 s:shard2  x:collection1_shard2_replica_n41] o.a.s.c.SolrCore solr.RecoveryStrategy.Builder
   [junit4]   2> 1264189 INFO  (qtp108330740-10464) [n:127.0.0.1:57174__ c:collection1 s:shard2  x:collection1_shard2_replica_n41] o.a.s.c.SolrCore [[collection1_shard2_replica_n41] ] Opening new SolrCore at [C:\Users\jenkins\workspace\Lucene-Solr-master-Windows\solr\build\solr-core\test\J0\temp\solr.cloud.api.collections.TestReplicaProperties_D64B61DA690B05DC-001\shard-1-001\cores\collection1_shard2_replica_n41], dataDir=[C:\Users\jenkins\workspace\Lucene-Solr-master-Windows\solr\build\solr-core\test\J0\..\..\..\..\..\..\..\..\..\Users\jenkins\workspace\Lucene-Solr-master-Windows\solr\build\solr-core\test\J0\temp\solr.cloud.api.collections.TestReplicaProperties_D64B61DA690B05DC-001\shard-1-001\cores\collection1_shard2_replica_n41\data\]
   [junit4]   2> 1264210 INFO  (qtp108330740-10464) [n:127.0.0.1:57174__ c:collection1 s:shard2  x:collection1_shard2_replica_n41] o.a.s.u.RandomMergePolicy RandomMergePolicy wrapping class org.apache.lucene.index.TieredMergePolicy: [TieredMergePolicy: maxMergeAtOnce=22, maxMergeAtOnceExplicit=15, maxMergedSegmentMB=46.181640625, floorSegmentMB=1.2548828125, forceMergeDeletesPctAllowed=6.031911595954225, segmentsPerTier=39.0, maxCFSSegmentSizeMB=8.796093022207999E12, noCFSRatio=1.0
   [junit4]   2> 1264210 WARN  (qtp108330740-10464) [n:127.0.0.1:57174__ c:collection1 s:shard2  x:collection1_shard2_replica_n41] o.a.s.c.RequestHandlers INVALID paramSet a in requestHandler {type = requestHandler,name = /dump,class = DumpRequestHandler,attributes = {initParams=a, name=/dump, class=DumpRequestHandler},args = {defaults={a=A,b=B}}}
   [junit4]   2> 1264395 INFO  (qtp108330740-10464) [n:127.0.0.1:57174__ c:collection1 s:shard2  x:collection1_shard2_replica_n41] o.a.s.u.UpdateHandler Using UpdateLog implementation: org.apache.solr.update.UpdateLog
   [junit4]   2> 1264395 INFO  (qtp108330740-10464) [n:127.0.0.1:57174__ c:collection1 s:shard2  x:collection1_shard2_replica_n41] o.a.s.u.UpdateLog Initializing UpdateLog: dataDir= defaultSyncLevel=FLUSH numRecordsToKeep=100 maxNumLogsToKeep=10 numVersionBuckets=65536
   [junit4]   2> 1264398 INFO  (qtp108330740-10464) [n:127.0.0.1:57174__ c:collection1 s:shard2  x:collection1_shard2_replica_n41] o.a.s.u.CommitTracker Hard AutoCommit: disabled
   [junit4]   2> 1264398 INFO  (qtp108330740-10464) [n:127.0.0.1:57174__ c:collection1 s:shard2  x:collection1_shard2_replica_n41] o.a.s.u.CommitTracker Soft AutoCommit: disabled
   [junit4]   2> 1264400 INFO  (qtp108330740-10464) [n:127.0.0.1:57174__ c:collection1 s:shard2  x:collection1_shard2_replica_n41] o.a.s.u.RandomMergePolicy RandomMergePolicy wrapping class org.apache.lucene.index.LogByteSizeMergePolicy: [LogByteSizeMergePolicy: minMergeSize=1677721, mergeFactor=37, maxMergeSize=2147483648, maxMergeSizeForForcedMerge=9223372036854775807, calibrateSizeByDeletes=true, maxMergeDocs=2147483647, maxCFSSegmentSizeMB=8.796093022207999E12, noCFSRatio=0.7682977512247592]
   [junit4]   2> 1264403 INFO  (qtp108330740-10464) [n:127.0.0.1:57174__ c:collection1 s:shard2  x:collection1_shard2_replica_n41] o.a.s.s.SolrIndexSearcher Opening [Searcher@43bc3ceb[collection1_shard2_replica_n41] main]
   [junit4]   2> 1264404 INFO  (qtp108330740-10464) [n:127.0.0.1:57174__ c:collection1 s:shard2  x:collection1_shard2_replica_n41] o.a.s.r.ManagedResourceStorage Configured ZooKeeperStorageIO with znodeBase: /configs/conf1
   [junit4]   2> 1264405 INFO  (qtp108330740-10464) [n:127.0.0.1:57174__ c:collection1 s:shard2  x:collection1_shard2_replica_n41] o.a.s.r.ManagedResourceStorage Loaded null at path _rest_managed.json using ZooKeeperStorageIO:path=/configs/conf1
   [junit4]   2> 1264406 INFO  (qtp108330740-10464) [n:127.0.0.1:57174__ c:collection1 s:shard2  x:collection1_shard2_replica_n41] o.a.s.h.ReplicationHandler Commits will be reserved for 10000ms.
   [junit4]   2> 1264407 INFO  (searcherExecutor-4162-thread-1-processing-n:127.0.0.1:57174__ x:collection1_shard2_replica_n41 s:shard2 c:collection1) [n:127.0.0.1:57174__ c:collection1 s:shard2  x:collection1_shard2_replica_n41] o.a.s.c.SolrCore [collection1_shard2_replica_n41] Registered new searcher Searcher@43bc3ceb[collection1_shard2_replica_n41] main{ExitableDirectoryReader(UninvertingDirectoryReader())}
   [junit4]   2> 1264407 INFO  (qtp108330740-10464) [n:127.0.0.1:57174__ c:collection1 s:shard2  x:collection1_shard2_replica_n41] o.a.s.u.UpdateLog Could not find max version in index or recent updates, using new clock 1592252273277272064
   [junit4]   2> 1264422 INFO  (qtp108330740-10464) [n:127.0.0.1:57174__ c:collection1 s:shard2  x:collection1_shard2_replica_n41] o.a.s.c.ShardLeaderElectionContext Enough replicas found to continue.
   [junit4]   2> 1264422 INFO  (qtp108330740-10464) [n:127.0.0.1:57174__ c:collection1 s:shard2  x:collection1_shard2_replica_n41] o.a.s.c.ShardLeaderElectionContext I may be the new leader - try and sync
   [junit4]   2> 1264422 INFO  (qtp108330740-10464) [n:127.0.0.1:57174__ c:collection1 s:shard2  x:collection1_shard2_replica_n41] o.a.s.c.SyncStrategy Sync replicas to https://127.0.0.1:57174/_/collection1_shard2_replica_n41/
   [junit4]   2> 1264422 INFO  (qtp108330740-10464) [n:127.0.0.1:57174__ c:collection1 s:shard2  x:collection1_shard2_replica_n41] o.a.s.c.SyncStrategy Sync Success - now sync replicas to me
   [junit4]   2> 1264422 INFO  (qtp108330740-10464) [n:127.0.0.1:57174__ c:collection1 s:shard2  x:collection1_shard2_replica_n41] o.a.s.c.SyncStrategy https://127.0.0.1:57174/_/collection1_shard2_replica_n41/ has no replicas
   [junit4]   2> 1264422 INFO  (qtp108330740-10464) [n:127.0.0.1:57174__ c:collection1 s:shard2  x:collection1_shard2_replica_n41] o.a.s.c.ShardLeaderElectionContext Found all replicas participating in election, clear LIR
   [junit4]   2> 1264430 INFO  (qtp108330740-10464) [n:127.0.0.1:57174__ c:collection1 s:shard2  x:collection1_shard2_replica_n41] o.a.s.c.ShardLeaderElectionContext I am the new leader: https://127.0.0.1:57174/_/collection1_shard2_replica_n41/ shard2
   [junit4]   2> 1264535 INFO  (zkCallback-1645-thread-1-processing-n:127.0.0.1:57174__) [n:127.0.0.1:57174__    ] o.a.s.c.c.ZkStateReader A cluster state change: [WatchedEvent state:SyncConnected type:NodeDataChanged path:/collections/collection1/state.json] for collection [collection1] has occurred - updating... (live nodes size: [2])
   [junit4]   2> 1264537 INFO  (qtp108330740-10464) [n:127.0.0.1:57174__ c:collection1 s:shard2  x:collection1_shard2_replica_n41] o.a.s.c.ZkController I am the leader, no recovery necessary
   [junit4]   2> 1264540 INFO  (qtp108330740-10464) [n:127.0.0.1:57174__ c:collection1 s:shard2  x:collection1_shard2_replica_n41] o.a.s.s.HttpSolrCall [admin] webapp=null path=/admin/cores params={qt=/admin/cores&collection.configName=conf1&name=collection1_shard2_replica_n41&action=CREATE&collection=collection1&shard=shard2&wt=javabin&version=2&replicaType=NRT} status=0 QTime=1633
   [junit4]   2> 1264543 INFO  (qtp670508437-10414) [n:127.0.0.1:57145__    ] o.a.s.s.HttpSolrCall [admin] webapp=null path=/admin/collections params={node=127.0.0.1:57174__&action=ADDREPLICA&collection=collection1&shard=shard2&type=NRT&wt=javabin&version=2} status=0 QTime=1786
   [junit4]   2> 1264668 INFO  (zkCallback-1645-thread-1-processing-n:127.0.0.1:57174__) [n:127.0.0.1:57174__    ] o.a.s.c.c.ZkStateReader A cluster state change: [WatchedEvent state:SyncConnected type:NodeDataChanged path:/collections/collection1/state.json] for collection [collection1] has occurred - updating... (live nodes size: [2])
   [junit4]   2> 1264855 INFO  (OverseerCollectionConfigSetProcessor-72188555770265605-127.0.0.1:57145__-n_0000000000) [n:127.0.0.1:57145__    ] o.a.s.c.OverseerTaskQueue Response ZK path: /overseer/collection-queue-work/qnr-0000000004 doesn't exist.  Requestor may have disconnected from ZooKeeper
   [junit4]   2> 1266332 INFO  (TEST-TestReplicaProperties.test-seed#[D64B61DA690B05DC]) [    ] o.a.s.c.AbstractFullDistribZkTestBase create jetty 2 in directory C:\Users\jenkins\workspace\Lucene-Solr-master-Windows\solr\build\solr-core\test\J0\temp\solr.cloud.api.collections.TestReplicaProperties_D64B61DA690B05DC-001\shard-2-001 of type NRT
   [junit4]   2> 1266335 INFO  (TEST-TestReplicaProperties.test-seed#[D64B61DA690B05DC]) [    ] o.e.j.s.Server jetty-9.4.8.v20171121, build timestamp: 2017-11-21T22:27:37+01:00, git hash: 82b8fb23f757335bb3329d540ce37a2a2615f0a8
   [junit4]   2> 1266335 INFO  (TEST-TestReplicaProperties.test-seed#[D64B61DA690B05DC]) [    ] o.e.j.s.session DefaultSessionIdManager workerName=node0
   [junit4]   2> 1266335 INFO  (TEST-TestReplicaProperties.test-seed#[D64B61DA690B05DC]) [    ] o.e.j.s.session No SessionScavenger set, using defaults
   [junit4]   2> 1266335 INFO  (TEST-TestReplicaProperties.test-seed#[D64B61DA690B05DC]) [    ] o.e.j.s.session Scavenging every 660000ms
   [junit4]   2> 1266336 INFO  (TEST-TestReplicaProperties.test-seed#[D64B61DA690B05DC]) [    ] o.e.j.s.h.ContextHandler Started o.e.j.s.ServletContextHandler@67ff69cf{/_,null,AVAILABLE}
   [junit4]   2> 1266337 INFO  (TEST-TestReplicaProperties.test-seed#[D64B61DA690B05DC]) [    ] o.e.j.s.AbstractConnector Started ServerConnector@dd8ef97{SSL,[ssl, http/1.1]}{127.0.0.1:57194}
   [junit4]   2> 1266337 INFO  (TEST-TestReplicaProperties.test-seed#[D64B61DA690B05DC]) [    ] o.e.j.s.Server Started @1274435ms
   [junit4]   2> 1266337 INFO  (TEST-TestReplicaProperties.test-seed#[D64B61DA690B05DC]) [    ] o.a.s.c.s.e.JettySolrRunner Jetty properties: {solr.data.dir=C:\Users\jenkins\workspace\Lucene-Solr-master-Windows\solr\build\solr-core\test\J0\temp\solr.cloud.api.collections.TestReplicaProperties_D64B61DA690B05DC-001\tempDir-001/jetty2, solrconfig=solrconfig.xml, hostContext=/_, hostPort=57194, coreRootDirectory=C:\Users\jenkins\workspace\Lucene-Solr-master-Windows\solr\build\solr-core\test\J0\..\..\..\..\..\..\..\..\..\Users\jenkins\workspace\Lucene-Solr-master-Windows\solr\build\solr-core\test\J0\temp\solr.cloud.api.collections.TestReplicaProperties_D64B61DA690B05DC-001\shard-2-001\cores}
   [junit4]   2> 1266337 ERROR (TEST-TestReplicaProperties.test-seed#[D64B61DA690B05DC]) [    ] o.a.s.u.StartupLoggingUtils Missing Java Option solr.log.dir. Logging may be missing or incomplete.
   [junit4]   2> 1266349 INFO  (TEST-TestReplicaProperties.test-seed#[D64B61DA690B05DC]) [    ] o.a.s.s.SolrDispatchFilter  ___      _       Welcome to Apache Solr? version 8.0.0
   [junit4]   2> 1266349 INFO  (TEST-TestReplicaProperties.test-seed#[D64B61DA690B05DC]) [    ] o.a.s.s.SolrDispatchFilter / __| ___| |_ _   Starting in cloud mode on port null
   [junit4]   2> 1266349 INFO  (TEST-TestReplicaProperties.test-seed#[D64B61DA690B05DC]) [    ] o.a.s.s.SolrDispatchFilter \__ \/ _ \ | '_|  Install dir: null
   [junit4]   2> 1266349 INFO  (TEST-TestReplicaProperties.test-seed#[D64B61DA690B05DC]) [    ] o.a.s.s.SolrDispatchFilter |___/\___/_|_|    Start time: 2018-02-13T02:48:20.206Z
   [junit4]   2> 1266355 INFO  (zkConnectionManagerCallback-1650-thread-1) [    ] o.a.s.c.c.ConnectionManager zkClient has connected
   [junit4]   2> 1266358 INFO  (TEST-TestReplicaProperties.test-seed#[D64B61DA690B05DC]) [    ] o.a.s.s.SolrDispatchFilter Loading solr.xml from SolrHome (not found in ZooKeeper)
   [junit4]   2> 1266358 INFO  (TEST-TestReplicaProperties.test-seed#[D64B61DA690B05DC]) [    ] o.a.s.c.SolrXmlConfig Loading container configuration from C:\Users\jenkins\workspace\Lucene-Solr-master-Windows\solr\build\solr-core\test\J0\temp\solr.cloud.api.collections.TestReplicaProperties_D64B61DA690B05DC-001\shard-2-001\solr.xml
   [junit4]   2> 1266368 INFO  (TEST-TestReplicaProperties.test-seed#[D64B61DA690B05DC]) [    ] o.a.s.c.SolrXmlConfig Configuration parameter autoReplicaFailoverWorkLoopDelay is ignored
   [junit4]   2> 1266369 INFO  (TEST-TestReplicaProperties.test-seed#[D64B61DA690B05DC]) [    ] o.a.s.c.SolrXmlConfig Configuration parameter autoReplicaFailoverBadNodeExpiration is ignored
   [junit4]   2> 1266369 INFO  (TEST-TestReplicaProperties.test-seed#[D64B61DA690B05DC]) [    ] o.a.s.c.SolrXmlConfig MBean server found: com.sun.jmx.mbeanserver.JmxMBeanServer@46d7ad72, but no JMX reporters were configured - adding default JMX reporter.
   [junit4]   2> 1266375 INFO  (TEST-TestReplicaProperties.test-seed#[D64B61DA690B05DC]) [    ] o.a.s.c.ZkContainer Zookeeper client=127.0.0.1:57135/solr
   [junit4]   2> 1266378 INFO  (zkConnectionManagerCallback-1654-thread-1) [    ] o.a.s.c.c.ConnectionManager zkClient has connected
   [junit4]   2> 1266383 WARN  (NIOServerCxn.Factory:0.0.0.0/0.0.0.0:0) [    ] o.a.z.s.NIOServerCnxn Unable to read additional data from client sessionid 0x100771be789000c, likely client has closed socket
   [junit4]   2> 1266386 INFO  (zkConnectionManagerCallback-1656-thread-1-processing-n:127.0.0.1:57194__) [n:127.0.0.1:57194__    ] o.a.s.c.c.ConnectionManager zkClient has connected
   [junit4]   2> 1266398 INFO  (TEST-TestReplicaProperties.test-seed#[D64B61DA690B05DC]) [n:127.0.0.1:57194__    ] o.a.s.c.c.ZkStateReader Updated live nodes from ZooKeeper... (0) -> (2)
   [junit4]   2> 1266401 INFO  (TEST-TestReplicaProperties.test-seed#[D64B61DA690B05DC]) [n:127.0.0.1:57194__    ] o.a.s.c.Overseer Overseer (id=null) closing
   [junit4]   2> 1266404 INFO  (TEST-TestReplicaProperties.test-seed#[D64B61DA690B05DC]) [n:127.0.0.1:57194__    ] o.a.s.c.ZkController Register node as live in ZooKeeper:/live_nodes/127.0.0.1:57194__
   [junit4]   2> 1266405 INFO  (zkCallback-1627-thread-2-processing-n:127.0.0.1:57145__) [n:127.0.0.1:57145__    ] o.a.s.c.c.ZkStateReader Updated live nodes from ZooKeeper... (2) -> (3)
   [junit4]   2> 1266405 INFO  (zkCallback-1645-thread-1-processing-n:127.0.0.1:57174__) [n:127.0.0.1:57174__    ] o.a.s.c.c.ZkStateReader Updated live nodes from ZooKeeper... (2) -> (3)
   [junit4]   2> 1266406 INFO  (zkCallback-1637-thread-1) [    ] o.a.s.c.c.ZkStateReader Updated live nodes fr

[...truncated too long message...]

est, TestPartialUpdateDeduplication, PeerSyncReplicationTest, TestSSLRandomization, SampleTest, BJQParserTest, TestBinaryField, TestConfigSets, TestNonDefinedSimilarityFactory, TestSubQueryTransformer, CursorPagingTest, TestCollationField, RAMDirectoryFactoryTest, TestSortableTextField, TestSolrCloudWithKerberosAlt, AutoScalingHandlerTest, SSLMigrationTest, LeaderInitiatedRecoveryOnShardRestartTest, TestConfigSetsAPIExclusivity, TestDocBasedVersionConstraints, TestClusterProperties, TestTrie, RecoveryZkTest, StatelessScriptUpdateProcessorFactoryTest, TestBlobHandler, TestNumericRangeQuery32, PeerSyncWithIndexFingerprintCachingTest, TestLazyCores, TestUtilizeNode, LeaderElectionIntegrationTest, TestTriggerIntegration, ZkCLITest, TestPhraseSuggestions, SolrCoreMetricManagerTest, DistributedFacetPivotSmallAdvancedTest, TestMultiWordSynonyms, TestReplicationHandlerBackup, TestClassicSimilarityFactory, CoreAdminRequestStatusTest, TestHdfsCloudBackupRestore, TestBlendedInfixSuggestions, ConfigureRecoveryStrategyTest, TestRawTransformer, NodeMutatorTest, TestRestoreCore, BasicZkTest, AddBlockUpdateTest, SolrSlf4jReporterTest, SuggesterFSTTest, ZkStateReaderTest, TestXIncludeConfig, GraphQueryTest, ResponseHeaderTest, JavabinLoaderTest, TestLegacyFieldCache, SolrGangliaReporterTest, TestElisionMultitermQuery, ZkFailoverTest, SuggestComponentTest, BasicDistributedZkTest, TestImplicitCoreProperties, TestGroupingSearch, TestCSVResponseWriter, TestCollapseQParserPlugin, TestLegacyTerms, BasicAuthIntegrationTest, SubstringBytesRefFilterTest, TestCharFilters, FieldMutatingUpdateProcessorTest, HdfsChaosMonkeySafeLeaderTest, TestManagedResourceStorage, TestOnReconnectListenerSupport, CreateCollectionCleanupTest, TestSchemaManager, TestIntervalFaceting, SignatureUpdateProcessorFactoryTest, TestAuthenticationFramework, InfoHandlerTest, TestManagedStopFilterFactory, DirectoryFactoryTest, FileUtilsTest, AnalyticsQueryTest, DistributedFacetPivotWhiteBoxTest, TestIBSimilarityFactory, TestLFUCache, HdfsUnloadDistributedZkTest, SuggesterTSTTest, SparseHLLTest, StressHdfsTest, UnloadDistributedZkTest, ShardRoutingTest, ZkSolrClientTest, TestZkChroot, ShardRoutingCustomTest, TestFaceting, TestRecovery, TestStressReorder, TestReload, TestStressVersions, TestRangeQuery, QueryElevationComponentTest, BadIndexSchemaTest, ConvertedLegacyTest, TestFunctionQuery, BasicFunctionalityTest, TestBadConfig, HighlighterTest, SimplePostToolTest, TestCoreDiscovery, SpellCheckCollatorTest, SolrRequestParserTest, TestFoldingMultitermQuery, DocValuesTest, SolrCoreCheckLockOnStartupTest, TestAtomicUpdateErrorCases, DirectUpdateHandlerOptimizeTest, DocValuesMultiTest, SolrInfoBeanTest, IndexBasedSpellCheckerTest, LukeRequestHandlerTest, PrimitiveFieldTypeTest, TestOmitPositions, TermsComponentTest, FieldAnalysisRequestHandlerTest, FastVectorHighlighterTest, LoggingHandlerTest, IndexSchemaTest, MBeansHandlerTest, MultiTermTest, NumericFieldsTest, TestConfig, TestFuzzyAnalyzedSuggestions, TestPostingsSolrHighlighter, EchoParamsTest, TestBM25SimilarityFactory, TestFastOutputStream, TestFastLRUCache, ChaosMonkeyNothingIsSafeTest, CloudExitableDirectoryReaderTest, CollectionsAPISolrJTest, DeleteStatusTest, DistribCursorPagingTest, DocValuesNotIndexedTest, HealthCheckHandlerTest, HttpPartitionTest, LeaderElectionContextKeyTest, LeaderFailoverAfterPartitionTest, MigrateRouteKeyTest, OverseerCollectionConfigSetProcessorTest, OverseerModifyCollectionTest, OverseerStatusTest, OverseerTaskQueueTest, RecoveryAfterSoftCommitTest, RemoteQueryErrorTest, ReplicationFactorTest, RestartWhileUpdatingTest, SharedFSAutoReplicaFailoverTest, SolrCloudExampleTest, TestCloudPseudoReturnFields, TestCloudRecovery, TestCryptoKeys, TestDistribDocBasedVersion, TestPrepRecovery, CollectionTooManyReplicasTest, ConcurrentDeleteAndCreateCollectionTest, SimpleCollectionCreateDeleteTest, TestCollectionAPI, TestLocalFSCloudBackupRestore, AutoAddReplicasIntegrationTest, NodeAddedTriggerTest, TestClusterStateProvider, TestDistribStateManager, TestGenericDistributedQueue, TestLargeCluster, HDFSCollectionsAPITest, HdfsRecoverLeaseTest, HdfsRecoveryZkTest, HdfsSyncSliceTest, HdfsThreadLeakTest, HdfsTlogReplayBufferedWhileIndexingTest, HdfsWriteToMultipleCollectionsTest, ImplicitSnitchTest, RuleEngineTest, RulesTest, TestSolrCloudSnapshots, TestReqParamsAPI, TestSQLHandlerNonCloud, TestSolrConfigHandlerCloud, TestSolrConfigHandlerConcurrent]
   [junit4] Completed [629/776 (2!)] on J0 in 23.76s, 1 test, 1 error <<< FAILURES!

[...truncated 2935 lines...]
   [junit4] Suite: org.apache.solr.update.processor.TestOpenNLPExtractNamedEntitiesUpdateProcessorFactory
   [junit4]   2> Creating dataDir: C:\Users\jenkins\workspace\Lucene-Solr-master-Windows\solr\build\contrib\solr-analysis-extras\test\J1\temp\solr.update.processor.TestOpenNLPExtractNamedEntitiesUpdateProcessorFactory_C1752F9A009FBD0D-001\init-core-data-001
   [junit4]   2> NOTE: test params are: codec=Asserting(Lucene70): {}, docValues:{}, maxPointsInLeafNode=637, maxMBSortInHeap=6.636081000420775, sim=Asserting(org.apache.lucene.search.similarities.AssertingSimilarity@3706af12), locale=en-IE, timezone=Etc/GMT+5
   [junit4]   2> NOTE: Windows 10 10.0 amd64/Oracle Corporation 1.8.0_144 (64-bit)/cpus=3,threads=1,free=72300632,total=97320960
   [junit4]   2> NOTE: All tests run in this JVM: [TestFoldingMultitermExtrasQuery, TestICUCollationFieldOptions, TestOpenNLPExtractNamedEntitiesUpdateProcessorFactory]
   [junit4]   2> NOTE: reproduce with: ant test  -Dtestcase=TestOpenNLPExtractNamedEntitiesUpdateProcessorFactory -Dtests.seed=C1752F9A009FBD0D -Dtests.slow=true -Dtests.locale=en-IE -Dtests.timezone=Etc/GMT+5 -Dtests.asserts=true -Dtests.file.encoding=ISO-8859-1
   [junit4] ERROR   0.00s J1 | TestOpenNLPExtractNamedEntitiesUpdateProcessorFactory (suite) <<<
   [junit4]    > Throwable #1: java.io.IOException: Could not remove the following files (in the order of attempts):
   [junit4]    >    C:\Users\jenkins\workspace\Lucene-Solr-master-Windows\solr\build\contrib\solr-analysis-extras\test\J1\temp\solr.update.processor.TestOpenNLPExtractNamedEntitiesUpdateProcessorFactory_C1752F9A009FBD0D-001\tempDir-001\collection1\conf: java.nio.file.DirectoryNotEmptyException: C:\Users\jenkins\workspace\Lucene-Solr-master-Windows\solr\build\contrib\solr-analysis-extras\test\J1\temp\solr.update.processor.TestOpenNLPExtractNamedEntitiesUpdateProcessorFactory_C1752F9A009FBD0D-001\tempDir-001\collection1\conf
   [junit4]    >    C:\Users\jenkins\workspace\Lucene-Solr-master-Windows\solr\build\contrib\solr-analysis-extras\test\J1\temp\solr.update.processor.TestOpenNLPExtractNamedEntitiesUpdateProcessorFactory_C1752F9A009FBD0D-001\tempDir-001\collection1: java.nio.file.DirectoryNotEmptyException: C:\Users\jenkins\workspace\Lucene-Solr-master-Windows\solr\build\contrib\solr-analysis-extras\test\J1\temp\solr.update.processor.TestOpenNLPExtractNamedEntitiesUpdateProcessorFactory_C1752F9A009FBD0D-001\tempDir-001\collection1
   [junit4]    >    C:\Users\jenkins\workspace\Lucene-Solr-master-Windows\solr\build\contrib\solr-analysis-extras\test\J1\temp\solr.update.processor.TestOpenNLPExtractNamedEntitiesUpdateProcessorFactory_C1752F9A009FBD0D-001\tempDir-001: java.nio.file.DirectoryNotEmptyException: C:\Users\jenkins\workspace\Lucene-Solr-master-Windows\solr\build\contrib\solr-analysis-extras\test\J1\temp\solr.update.processor.TestOpenNLPExtractNamedEntitiesUpdateProcessorFactory_C1752F9A009FBD0D-001\tempDir-001
   [junit4]    >    C:\Users\jenkins\workspace\Lucene-Solr-master-Windows\solr\build\contrib\solr-analysis-extras\test\J1\temp\solr.update.processor.TestOpenNLPExtractNamedEntitiesUpdateProcessorFactory_C1752F9A009FBD0D-001\tempDir-001\collection1\conf\en-test-ner-person.bin: java.nio.file.AccessDeniedException: C:\Users\jenkins\workspace\Lucene-Solr-master-Windows\solr\build\contrib\solr-analysis-extras\test\J1\temp\solr.update.processor.TestOpenNLPExtractNamedEntitiesUpdateProcessorFactory_C1752F9A009FBD0D-001\tempDir-001\collection1\conf\en-test-ner-person.bin
   [junit4]    >    C:\Users\jenkins\workspace\Lucene-Solr-master-Windows\solr\build\contrib\solr-analysis-extras\test\J1\temp\solr.update.processor.TestOpenNLPExtractNamedEntitiesUpdateProcessorFactory_C1752F9A009FBD0D-001\tempDir-001\collection1\conf\en-test-tokenizer.bin: java.nio.file.AccessDeniedException: C:\Users\jenkins\workspace\Lucene-Solr-master-Windows\solr\build\contrib\solr-analysis-extras\test\J1\temp\solr.update.processor.TestOpenNLPExtractNamedEntitiesUpdateProcessorFactory_C1752F9A009FBD0D-001\tempDir-001\collection1\conf\en-test-tokenizer.bin
   [junit4]    >    C:\Users\jenkins\workspace\Lucene-Solr-master-Windows\solr\build\contrib\solr-analysis-extras\test\J1\temp\solr.update.processor.TestOpenNLPExtractNamedEntitiesUpdateProcessorFactory_C1752F9A009FBD0D-001\tempDir-001\collection1\conf\en-test-sent.bin: java.nio.file.AccessDeniedException: C:\Users\jenkins\workspace\Lucene-Solr-master-Windows\solr\build\contrib\solr-analysis-extras\test\J1\temp\solr.update.processor.TestOpenNLPExtractNamedEntitiesUpdateProcessorFactory_C1752F9A009FBD0D-001\tempDir-001\collection1\conf\en-test-sent.bin
   [junit4]    >    C:\Users\jenkins\workspace\Lucene-Solr-master-Windows\solr\build\contrib\solr-analysis-extras\test\J1\temp\solr.update.processor.TestOpenNLPExtractNamedEntitiesUpdateProcessorFactory_C1752F9A009FBD0D-001: java.nio.file.DirectoryNotEmptyException: C:\Users\jenkins\workspace\Lucene-Solr-master-Windows\solr\build\contrib\solr-analysis-extras\test\J1\temp\solr.update.processor.TestOpenNLPExtractNamedEntitiesUpdateProcessorFactory_C1752F9A009FBD0D-001
   [junit4]    > 	at __randomizedtesting.SeedInfo.seed([C1752F9A009FBD0D]:0)
   [junit4]    > 	at org.apache.lucene.util.IOUtils.rm(IOUtils.java:329)
   [junit4]    > 	at java.lang.Thread.run(Thread.java:748)
   [junit4] Completed [5/5 (1!)] on J1 in 1.56s, 8 tests, 1 error <<< FAILURES!

[...truncated 46059 lines...]

Mime
View raw message