lucene-dev mailing list archives

Site index · List index
Message view « Date » · « Thread »
Top « Date » · « Thread »
From Policeman Jenkins Server <jenk...@thetaphi.de>
Subject [JENKINS] Lucene-Solr-7.x-Linux (32bit/jdk1.8.0_144) - Build # 1212 - Still Unstable!
Date Sun, 21 Jan 2018 06:22:48 GMT
Build: https://jenkins.thetaphi.de/job/Lucene-Solr-7.x-Linux/1212/
Java: 32bit/jdk1.8.0_144 -server -XX:+UseParallelGC

2 tests failed.
FAILED:  org.apache.solr.cloud.FullSolrCloudDistribCmdsTest.test

Error Message:
Could not find collection:collection2

Stack Trace:
java.lang.AssertionError: Could not find collection:collection2
	at __randomizedtesting.SeedInfo.seed([E85A51084DDF657F:600E6ED2E3230887]:0)
	at org.junit.Assert.fail(Assert.java:93)
	at org.junit.Assert.assertTrue(Assert.java:43)
	at org.junit.Assert.assertNotNull(Assert.java:526)
	at org.apache.solr.cloud.AbstractDistribZkTestBase.waitForRecoveriesToFinish(AbstractDistribZkTestBase.java:155)
	at org.apache.solr.cloud.AbstractDistribZkTestBase.waitForRecoveriesToFinish(AbstractDistribZkTestBase.java:140)
	at org.apache.solr.cloud.AbstractDistribZkTestBase.waitForRecoveriesToFinish(AbstractDistribZkTestBase.java:135)
	at org.apache.solr.cloud.AbstractFullDistribZkTestBase.waitForRecoveriesToFinish(AbstractFullDistribZkTestBase.java:915)
	at org.apache.solr.cloud.FullSolrCloudDistribCmdsTest.testIndexingBatchPerRequestWithHttpSolrClient(FullSolrCloudDistribCmdsTest.java:612)
	at org.apache.solr.cloud.FullSolrCloudDistribCmdsTest.test(FullSolrCloudDistribCmdsTest.java:152)
	at sun.reflect.NativeMethodAccessorImpl.invoke0(Native Method)
	at sun.reflect.NativeMethodAccessorImpl.invoke(NativeMethodAccessorImpl.java:62)
	at sun.reflect.DelegatingMethodAccessorImpl.invoke(DelegatingMethodAccessorImpl.java:43)
	at java.lang.reflect.Method.invoke(Method.java:498)
	at com.carrotsearch.randomizedtesting.RandomizedRunner.invoke(RandomizedRunner.java:1737)
	at com.carrotsearch.randomizedtesting.RandomizedRunner$8.evaluate(RandomizedRunner.java:934)
	at com.carrotsearch.randomizedtesting.RandomizedRunner$9.evaluate(RandomizedRunner.java:970)
	at com.carrotsearch.randomizedtesting.RandomizedRunner$10.evaluate(RandomizedRunner.java:984)
	at org.apache.solr.BaseDistributedSearchTestCase$ShardsRepeatRule$ShardsFixedStatement.callStatement(BaseDistributedSearchTestCase.java:993)
	at org.apache.solr.BaseDistributedSearchTestCase$ShardsRepeatRule$ShardsStatement.evaluate(BaseDistributedSearchTestCase.java:968)
	at com.carrotsearch.randomizedtesting.rules.SystemPropertiesRestoreRule$1.evaluate(SystemPropertiesRestoreRule.java:57)
	at org.apache.lucene.util.TestRuleSetupTeardownChained$1.evaluate(TestRuleSetupTeardownChained.java:49)
	at org.apache.lucene.util.AbstractBeforeAfterRule$1.evaluate(AbstractBeforeAfterRule.java:45)
	at org.apache.lucene.util.TestRuleThreadAndTestName$1.evaluate(TestRuleThreadAndTestName.java:48)
	at org.apache.lucene.util.TestRuleIgnoreAfterMaxFailures$1.evaluate(TestRuleIgnoreAfterMaxFailures.java:64)
	at org.apache.lucene.util.TestRuleMarkFailure$1.evaluate(TestRuleMarkFailure.java:47)
	at com.carrotsearch.randomizedtesting.rules.StatementAdapter.evaluate(StatementAdapter.java:36)
	at com.carrotsearch.randomizedtesting.ThreadLeakControl$StatementRunner.run(ThreadLeakControl.java:368)
	at com.carrotsearch.randomizedtesting.ThreadLeakControl.forkTimeoutingTask(ThreadLeakControl.java:817)
	at com.carrotsearch.randomizedtesting.ThreadLeakControl$3.evaluate(ThreadLeakControl.java:468)
	at com.carrotsearch.randomizedtesting.RandomizedRunner.runSingleTest(RandomizedRunner.java:943)
	at com.carrotsearch.randomizedtesting.RandomizedRunner$5.evaluate(RandomizedRunner.java:829)
	at com.carrotsearch.randomizedtesting.RandomizedRunner$6.evaluate(RandomizedRunner.java:879)
	at com.carrotsearch.randomizedtesting.RandomizedRunner$7.evaluate(RandomizedRunner.java:890)
	at com.carrotsearch.randomizedtesting.rules.StatementAdapter.evaluate(StatementAdapter.java:36)
	at com.carrotsearch.randomizedtesting.rules.SystemPropertiesRestoreRule$1.evaluate(SystemPropertiesRestoreRule.java:57)
	at org.apache.lucene.util.AbstractBeforeAfterRule$1.evaluate(AbstractBeforeAfterRule.java:45)
	at com.carrotsearch.randomizedtesting.rules.StatementAdapter.evaluate(StatementAdapter.java:36)
	at org.apache.lucene.util.TestRuleStoreClassName$1.evaluate(TestRuleStoreClassName.java:41)
	at com.carrotsearch.randomizedtesting.rules.NoShadowingOrOverridesOnMethodsRule$1.evaluate(NoShadowingOrOverridesOnMethodsRule.java:40)
	at com.carrotsearch.randomizedtesting.rules.NoShadowingOrOverridesOnMethodsRule$1.evaluate(NoShadowingOrOverridesOnMethodsRule.java:40)
	at com.carrotsearch.randomizedtesting.rules.StatementAdapter.evaluate(StatementAdapter.java:36)
	at com.carrotsearch.randomizedtesting.rules.StatementAdapter.evaluate(StatementAdapter.java:36)
	at com.carrotsearch.randomizedtesting.rules.StatementAdapter.evaluate(StatementAdapter.java:36)
	at org.apache.lucene.util.TestRuleAssertionsRequired$1.evaluate(TestRuleAssertionsRequired.java:53)
	at org.apache.lucene.util.TestRuleMarkFailure$1.evaluate(TestRuleMarkFailure.java:47)
	at org.apache.lucene.util.TestRuleIgnoreAfterMaxFailures$1.evaluate(TestRuleIgnoreAfterMaxFailures.java:64)
	at org.apache.lucene.util.TestRuleIgnoreTestSuites$1.evaluate(TestRuleIgnoreTestSuites.java:54)
	at com.carrotsearch.randomizedtesting.rules.StatementAdapter.evaluate(StatementAdapter.java:36)
	at com.carrotsearch.randomizedtesting.ThreadLeakControl$StatementRunner.run(ThreadLeakControl.java:368)
	at java.lang.Thread.run(Thread.java:748)


FAILED:  junit.framework.TestSuite.org.apache.solr.cloud.TestSolrCloudWithSecureImpersonation

Error Message:
2 threads leaked from SUITE scope at org.apache.solr.cloud.TestSolrCloudWithSecureImpersonation:     1) Thread[id=17468, name=jetty-launcher-3870-thread-2-EventThread, state=TIMED_WAITING, group=TGRP-TestSolrCloudWithSecureImpersonation]         at sun.misc.Unsafe.park(Native Method)         at java.util.concurrent.locks.LockSupport.parkNanos(LockSupport.java:215)         at java.util.concurrent.locks.AbstractQueuedSynchronizer.doAcquireSharedNanos(AbstractQueuedSynchronizer.java:1037)         at java.util.concurrent.locks.AbstractQueuedSynchronizer.tryAcquireSharedNanos(AbstractQueuedSynchronizer.java:1328)         at java.util.concurrent.CountDownLatch.await(CountDownLatch.java:277)         at org.apache.curator.CuratorZookeeperClient.internalBlockUntilConnectedOrTimedOut(CuratorZookeeperClient.java:323)         at org.apache.curator.RetryLoop.callWithRetry(RetryLoop.java:105)         at org.apache.curator.framework.imps.GetDataBuilderImpl.pathInForeground(GetDataBuilderImpl.java:288)         at org.apache.curator.framework.imps.GetDataBuilderImpl.forPath(GetDataBuilderImpl.java:279)         at org.apache.curator.framework.imps.GetDataBuilderImpl.forPath(GetDataBuilderImpl.java:41)         at org.apache.curator.framework.recipes.shared.SharedValue.readValue(SharedValue.java:244)         at org.apache.curator.framework.recipes.shared.SharedValue.access$100(SharedValue.java:44)         at org.apache.curator.framework.recipes.shared.SharedValue$1.process(SharedValue.java:61)         at org.apache.curator.framework.imps.NamespaceWatcher.process(NamespaceWatcher.java:67)         at org.apache.zookeeper.ClientCnxn$EventThread.processEvent(ClientCnxn.java:530)         at org.apache.zookeeper.ClientCnxn$EventThread.run(ClientCnxn.java:505)    2) Thread[id=17470, name=jetty-launcher-3870-thread-1-EventThread, state=TIMED_WAITING, group=TGRP-TestSolrCloudWithSecureImpersonation]         at sun.misc.Unsafe.park(Native Method)         at java.util.concurrent.locks.LockSupport.parkNanos(LockSupport.java:215)         at java.util.concurrent.locks.AbstractQueuedSynchronizer.doAcquireSharedNanos(AbstractQueuedSynchronizer.java:1037)         at java.util.concurrent.locks.AbstractQueuedSynchronizer.tryAcquireSharedNanos(AbstractQueuedSynchronizer.java:1328)         at java.util.concurrent.CountDownLatch.await(CountDownLatch.java:277)         at org.apache.curator.CuratorZookeeperClient.internalBlockUntilConnectedOrTimedOut(CuratorZookeeperClient.java:323)         at org.apache.curator.RetryLoop.callWithRetry(RetryLoop.java:105)         at org.apache.curator.framework.imps.GetDataBuilderImpl.pathInForeground(GetDataBuilderImpl.java:288)         at org.apache.curator.framework.imps.GetDataBuilderImpl.forPath(GetDataBuilderImpl.java:279)         at org.apache.curator.framework.imps.GetDataBuilderImpl.forPath(GetDataBuilderImpl.java:41)         at org.apache.curator.framework.recipes.shared.SharedValue.readValue(SharedValue.java:244)         at org.apache.curator.framework.recipes.shared.SharedValue.access$100(SharedValue.java:44)         at org.apache.curator.framework.recipes.shared.SharedValue$1.process(SharedValue.java:61)         at org.apache.curator.framework.imps.NamespaceWatcher.process(NamespaceWatcher.java:67)         at org.apache.zookeeper.ClientCnxn$EventThread.processEvent(ClientCnxn.java:530)         at org.apache.zookeeper.ClientCnxn$EventThread.run(ClientCnxn.java:505)

Stack Trace:
com.carrotsearch.randomizedtesting.ThreadLeakError: 2 threads leaked from SUITE scope at org.apache.solr.cloud.TestSolrCloudWithSecureImpersonation: 
   1) Thread[id=17468, name=jetty-launcher-3870-thread-2-EventThread, state=TIMED_WAITING, group=TGRP-TestSolrCloudWithSecureImpersonation]
        at sun.misc.Unsafe.park(Native Method)
        at java.util.concurrent.locks.LockSupport.parkNanos(LockSupport.java:215)
        at java.util.concurrent.locks.AbstractQueuedSynchronizer.doAcquireSharedNanos(AbstractQueuedSynchronizer.java:1037)
        at java.util.concurrent.locks.AbstractQueuedSynchronizer.tryAcquireSharedNanos(AbstractQueuedSynchronizer.java:1328)
        at java.util.concurrent.CountDownLatch.await(CountDownLatch.java:277)
        at org.apache.curator.CuratorZookeeperClient.internalBlockUntilConnectedOrTimedOut(CuratorZookeeperClient.java:323)
        at org.apache.curator.RetryLoop.callWithRetry(RetryLoop.java:105)
        at org.apache.curator.framework.imps.GetDataBuilderImpl.pathInForeground(GetDataBuilderImpl.java:288)
        at org.apache.curator.framework.imps.GetDataBuilderImpl.forPath(GetDataBuilderImpl.java:279)
        at org.apache.curator.framework.imps.GetDataBuilderImpl.forPath(GetDataBuilderImpl.java:41)
        at org.apache.curator.framework.recipes.shared.SharedValue.readValue(SharedValue.java:244)
        at org.apache.curator.framework.recipes.shared.SharedValue.access$100(SharedValue.java:44)
        at org.apache.curator.framework.recipes.shared.SharedValue$1.process(SharedValue.java:61)
        at org.apache.curator.framework.imps.NamespaceWatcher.process(NamespaceWatcher.java:67)
        at org.apache.zookeeper.ClientCnxn$EventThread.processEvent(ClientCnxn.java:530)
        at org.apache.zookeeper.ClientCnxn$EventThread.run(ClientCnxn.java:505)
   2) Thread[id=17470, name=jetty-launcher-3870-thread-1-EventThread, state=TIMED_WAITING, group=TGRP-TestSolrCloudWithSecureImpersonation]
        at sun.misc.Unsafe.park(Native Method)
        at java.util.concurrent.locks.LockSupport.parkNanos(LockSupport.java:215)
        at java.util.concurrent.locks.AbstractQueuedSynchronizer.doAcquireSharedNanos(AbstractQueuedSynchronizer.java:1037)
        at java.util.concurrent.locks.AbstractQueuedSynchronizer.tryAcquireSharedNanos(AbstractQueuedSynchronizer.java:1328)
        at java.util.concurrent.CountDownLatch.await(CountDownLatch.java:277)
        at org.apache.curator.CuratorZookeeperClient.internalBlockUntilConnectedOrTimedOut(CuratorZookeeperClient.java:323)
        at org.apache.curator.RetryLoop.callWithRetry(RetryLoop.java:105)
        at org.apache.curator.framework.imps.GetDataBuilderImpl.pathInForeground(GetDataBuilderImpl.java:288)
        at org.apache.curator.framework.imps.GetDataBuilderImpl.forPath(GetDataBuilderImpl.java:279)
        at org.apache.curator.framework.imps.GetDataBuilderImpl.forPath(GetDataBuilderImpl.java:41)
        at org.apache.curator.framework.recipes.shared.SharedValue.readValue(SharedValue.java:244)
        at org.apache.curator.framework.recipes.shared.SharedValue.access$100(SharedValue.java:44)
        at org.apache.curator.framework.recipes.shared.SharedValue$1.process(SharedValue.java:61)
        at org.apache.curator.framework.imps.NamespaceWatcher.process(NamespaceWatcher.java:67)
        at org.apache.zookeeper.ClientCnxn$EventThread.processEvent(ClientCnxn.java:530)
        at org.apache.zookeeper.ClientCnxn$EventThread.run(ClientCnxn.java:505)
	at __randomizedtesting.SeedInfo.seed([E85A51084DDF657F]:0)




Build Log:
[...truncated 12988 lines...]
   [junit4] Suite: org.apache.solr.cloud.FullSolrCloudDistribCmdsTest
   [junit4]   2> 1235530 INFO  (SUITE-FullSolrCloudDistribCmdsTest-seed#[E85A51084DDF657F]-worker) [    ] o.a.s.SolrTestCaseJ4 SecureRandom sanity checks: test.solr.allowed.securerandom=null & java.security.egd=file:/dev/./urandom
   [junit4]   2> Creating dataDir: /home/jenkins/workspace/Lucene-Solr-7.x-Linux/solr/build/solr-core/test/J2/temp/solr.cloud.FullSolrCloudDistribCmdsTest_E85A51084DDF657F-001/init-core-data-001
   [junit4]   2> 1235531 WARN  (SUITE-FullSolrCloudDistribCmdsTest-seed#[E85A51084DDF657F]-worker) [    ] o.a.s.SolrTestCaseJ4 startTrackingSearchers: numOpens=10 numCloses=10
   [junit4]   2> 1235531 INFO  (SUITE-FullSolrCloudDistribCmdsTest-seed#[E85A51084DDF657F]-worker) [    ] o.a.s.SolrTestCaseJ4 Using TrieFields (NUMERIC_POINTS_SYSPROP=false) w/NUMERIC_DOCVALUES_SYSPROP=false
   [junit4]   2> 1235533 INFO  (SUITE-FullSolrCloudDistribCmdsTest-seed#[E85A51084DDF657F]-worker) [    ] o.a.s.SolrTestCaseJ4 Randomized ssl (false) and clientAuth (false) via: @org.apache.solr.SolrTestCaseJ4$SuppressSSL(bugUrl=https://issues.apache.org/jira/browse/SOLR-5776)
   [junit4]   2> 1235533 INFO  (SUITE-FullSolrCloudDistribCmdsTest-seed#[E85A51084DDF657F]-worker) [    ] o.a.s.BaseDistributedSearchTestCase Setting hostContext system property: /wb/l
   [junit4]   2> 1235535 INFO  (TEST-FullSolrCloudDistribCmdsTest.test-seed#[E85A51084DDF657F]) [    ] o.a.s.c.ZkTestServer STARTING ZK TEST SERVER
   [junit4]   2> 1235536 INFO  (Thread-4650) [    ] o.a.s.c.ZkTestServer client port:0.0.0.0/0.0.0.0:0
   [junit4]   2> 1235536 INFO  (Thread-4650) [    ] o.a.s.c.ZkTestServer Starting server
   [junit4]   2> 1235537 ERROR (Thread-4650) [    ] o.a.z.s.ZooKeeperServer ZKShutdownHandler is not registered, so ZooKeeper server won't take any action on ERROR or SHUTDOWN server state changes
   [junit4]   2> 1235636 INFO  (TEST-FullSolrCloudDistribCmdsTest.test-seed#[E85A51084DDF657F]) [    ] o.a.s.c.ZkTestServer start zk server on port:43319
   [junit4]   2> 1235638 INFO  (zkConnectionManagerCallback-2493-thread-1) [    ] o.a.s.c.c.ConnectionManager zkClient has connected
   [junit4]   2> 1235641 INFO  (zkConnectionManagerCallback-2495-thread-1) [    ] o.a.s.c.c.ConnectionManager zkClient has connected
   [junit4]   2> 1235645 INFO  (TEST-FullSolrCloudDistribCmdsTest.test-seed#[E85A51084DDF657F]) [    ] o.a.s.c.AbstractZkTestCase put /home/jenkins/workspace/Lucene-Solr-7.x-Linux/solr/core/src/test-files/solr/collection1/conf/solrconfig-tlog.xml to /configs/conf1/solrconfig.xml
   [junit4]   2> 1235647 INFO  (TEST-FullSolrCloudDistribCmdsTest.test-seed#[E85A51084DDF657F]) [    ] o.a.s.c.AbstractZkTestCase put /home/jenkins/workspace/Lucene-Solr-7.x-Linux/solr/core/src/test-files/solr/collection1/conf/schema15.xml to /configs/conf1/schema.xml
   [junit4]   2> 1235648 INFO  (TEST-FullSolrCloudDistribCmdsTest.test-seed#[E85A51084DDF657F]) [    ] o.a.s.c.AbstractZkTestCase put /home/jenkins/workspace/Lucene-Solr-7.x-Linux/solr/core/src/test-files/solr/collection1/conf/solrconfig.snippet.randomindexconfig.xml to /configs/conf1/solrconfig.snippet.randomindexconfig.xml
   [junit4]   2> 1235649 INFO  (TEST-FullSolrCloudDistribCmdsTest.test-seed#[E85A51084DDF657F]) [    ] o.a.s.c.AbstractZkTestCase put /home/jenkins/workspace/Lucene-Solr-7.x-Linux/solr/core/src/test-files/solr/collection1/conf/stopwords.txt to /configs/conf1/stopwords.txt
   [junit4]   2> 1235650 INFO  (TEST-FullSolrCloudDistribCmdsTest.test-seed#[E85A51084DDF657F]) [    ] o.a.s.c.AbstractZkTestCase put /home/jenkins/workspace/Lucene-Solr-7.x-Linux/solr/core/src/test-files/solr/collection1/conf/protwords.txt to /configs/conf1/protwords.txt
   [junit4]   2> 1235651 INFO  (TEST-FullSolrCloudDistribCmdsTest.test-seed#[E85A51084DDF657F]) [    ] o.a.s.c.AbstractZkTestCase put /home/jenkins/workspace/Lucene-Solr-7.x-Linux/solr/core/src/test-files/solr/collection1/conf/currency.xml to /configs/conf1/currency.xml
   [junit4]   2> 1235652 INFO  (TEST-FullSolrCloudDistribCmdsTest.test-seed#[E85A51084DDF657F]) [    ] o.a.s.c.AbstractZkTestCase put /home/jenkins/workspace/Lucene-Solr-7.x-Linux/solr/core/src/test-files/solr/collection1/conf/enumsConfig.xml to /configs/conf1/enumsConfig.xml
   [junit4]   2> 1235652 INFO  (TEST-FullSolrCloudDistribCmdsTest.test-seed#[E85A51084DDF657F]) [    ] o.a.s.c.AbstractZkTestCase put /home/jenkins/workspace/Lucene-Solr-7.x-Linux/solr/core/src/test-files/solr/collection1/conf/open-exchange-rates.json to /configs/conf1/open-exchange-rates.json
   [junit4]   2> 1235653 INFO  (TEST-FullSolrCloudDistribCmdsTest.test-seed#[E85A51084DDF657F]) [    ] o.a.s.c.AbstractZkTestCase put /home/jenkins/workspace/Lucene-Solr-7.x-Linux/solr/core/src/test-files/solr/collection1/conf/mapping-ISOLatin1Accent.txt to /configs/conf1/mapping-ISOLatin1Accent.txt
   [junit4]   2> 1235654 INFO  (TEST-FullSolrCloudDistribCmdsTest.test-seed#[E85A51084DDF657F]) [    ] o.a.s.c.AbstractZkTestCase put /home/jenkins/workspace/Lucene-Solr-7.x-Linux/solr/core/src/test-files/solr/collection1/conf/old_synonyms.txt to /configs/conf1/old_synonyms.txt
   [junit4]   2> 1235655 INFO  (TEST-FullSolrCloudDistribCmdsTest.test-seed#[E85A51084DDF657F]) [    ] o.a.s.c.AbstractZkTestCase put /home/jenkins/workspace/Lucene-Solr-7.x-Linux/solr/core/src/test-files/solr/collection1/conf/synonyms.txt to /configs/conf1/synonyms.txt
   [junit4]   2> 1235656 INFO  (TEST-FullSolrCloudDistribCmdsTest.test-seed#[E85A51084DDF657F]) [    ] o.a.s.c.AbstractFullDistribZkTestBase Will use NRT replicas unless explicitly asked otherwise
   [junit4]   2> 1235741 INFO  (TEST-FullSolrCloudDistribCmdsTest.test-seed#[E85A51084DDF657F]) [    ] o.e.j.s.Server jetty-9.4.8.v20171121, build timestamp: ????-??-??T??:??:??-08:00, git hash: 82b8fb23f757335bb3329d540ce37a2a2615f0a8
   [junit4]   2> 1235742 INFO  (TEST-FullSolrCloudDistribCmdsTest.test-seed#[E85A51084DDF657F]) [    ] o.e.j.s.session DefaultSessionIdManager workerName=node0
   [junit4]   2> 1235742 INFO  (TEST-FullSolrCloudDistribCmdsTest.test-seed#[E85A51084DDF657F]) [    ] o.e.j.s.session No SessionScavenger set, using defaults
   [junit4]   2> 1235742 INFO  (TEST-FullSolrCloudDistribCmdsTest.test-seed#[E85A51084DDF657F]) [    ] o.e.j.s.session Scavenging every 600000ms
   [junit4]   2> 1235743 INFO  (TEST-FullSolrCloudDistribCmdsTest.test-seed#[E85A51084DDF657F]) [    ] o.e.j.s.h.ContextHandler Started o.e.j.s.ServletContextHandler@41d505{/wb/l,null,AVAILABLE}
   [junit4]   2> 1235743 INFO  (TEST-FullSolrCloudDistribCmdsTest.test-seed#[E85A51084DDF657F]) [    ] o.e.j.s.AbstractConnector Started ServerConnector@74f718{HTTP/1.1,[http/1.1]}{127.0.0.1:41237}
   [junit4]   2> 1235743 INFO  (TEST-FullSolrCloudDistribCmdsTest.test-seed#[E85A51084DDF657F]) [    ] o.e.j.s.Server Started @1237285ms
   [junit4]   2> 1235743 INFO  (TEST-FullSolrCloudDistribCmdsTest.test-seed#[E85A51084DDF657F]) [    ] o.a.s.c.s.e.JettySolrRunner Jetty properties: {solr.data.dir=/home/jenkins/workspace/Lucene-Solr-7.x-Linux/solr/build/solr-core/test/J2/temp/solr.cloud.FullSolrCloudDistribCmdsTest_E85A51084DDF657F-001/tempDir-001/control/data, hostContext=/wb/l, hostPort=41237, coreRootDirectory=/home/jenkins/workspace/Lucene-Solr-7.x-Linux/solr/build/solr-core/test/J2/temp/solr.cloud.FullSolrCloudDistribCmdsTest_E85A51084DDF657F-001/control-001/cores}
   [junit4]   2> 1235743 ERROR (TEST-FullSolrCloudDistribCmdsTest.test-seed#[E85A51084DDF657F]) [    ] o.a.s.u.StartupLoggingUtils Missing Java Option solr.log.dir. Logging may be missing or incomplete.
   [junit4]   2> 1235743 INFO  (TEST-FullSolrCloudDistribCmdsTest.test-seed#[E85A51084DDF657F]) [    ] o.a.s.s.SolrDispatchFilter  ___      _       Welcome to Apache Solr? version 7.3.0
   [junit4]   2> 1235743 INFO  (TEST-FullSolrCloudDistribCmdsTest.test-seed#[E85A51084DDF657F]) [    ] o.a.s.s.SolrDispatchFilter / __| ___| |_ _   Starting in cloud mode on port null
   [junit4]   2> 1235743 INFO  (TEST-FullSolrCloudDistribCmdsTest.test-seed#[E85A51084DDF657F]) [    ] o.a.s.s.SolrDispatchFilter \__ \/ _ \ | '_|  Install dir: null
   [junit4]   2> 1235743 INFO  (TEST-FullSolrCloudDistribCmdsTest.test-seed#[E85A51084DDF657F]) [    ] o.a.s.s.SolrDispatchFilter |___/\___/_|_|    Start time: 2018-01-21T05:46:32.550Z
   [junit4]   2> 1235744 INFO  (zkConnectionManagerCallback-2497-thread-1) [    ] o.a.s.c.c.ConnectionManager zkClient has connected
   [junit4]   2> 1235745 WARN  (NIOServerCxn.Factory:0.0.0.0/0.0.0.0:0) [    ] o.a.z.s.NIOServerCnxn caught end of stream exception
   [junit4]   2> EndOfStreamException: Unable to read additional data from client sessionid 0x161174104180002, likely client has closed socket
   [junit4]   2> 	at org.apache.zookeeper.server.NIOServerCnxn.doIO(NIOServerCnxn.java:239)
   [junit4]   2> 	at org.apache.zookeeper.server.NIOServerCnxnFactory.run(NIOServerCnxnFactory.java:203)
   [junit4]   2> 	at java.lang.Thread.run(Thread.java:748)
   [junit4]   2> 1235745 INFO  (TEST-FullSolrCloudDistribCmdsTest.test-seed#[E85A51084DDF657F]) [    ] o.a.s.s.SolrDispatchFilter Loading solr.xml from SolrHome (not found in ZooKeeper)
   [junit4]   2> 1235745 INFO  (TEST-FullSolrCloudDistribCmdsTest.test-seed#[E85A51084DDF657F]) [    ] o.a.s.c.SolrXmlConfig Loading container configuration from /home/jenkins/workspace/Lucene-Solr-7.x-Linux/solr/build/solr-core/test/J2/temp/solr.cloud.FullSolrCloudDistribCmdsTest_E85A51084DDF657F-001/control-001/solr.xml
   [junit4]   2> 1235747 INFO  (TEST-FullSolrCloudDistribCmdsTest.test-seed#[E85A51084DDF657F]) [    ] o.a.s.c.SolrXmlConfig Configuration parameter autoReplicaFailoverWorkLoopDelay is ignored
   [junit4]   2> 1235747 INFO  (TEST-FullSolrCloudDistribCmdsTest.test-seed#[E85A51084DDF657F]) [    ] o.a.s.c.SolrXmlConfig Configuration parameter autoReplicaFailoverBadNodeExpiration is ignored
   [junit4]   2> 1235748 INFO  (TEST-FullSolrCloudDistribCmdsTest.test-seed#[E85A51084DDF657F]) [    ] o.a.s.c.SolrXmlConfig MBean server found: com.sun.jmx.mbeanserver.JmxMBeanServer@fa4772, but no JMX reporters were configured - adding default JMX reporter.
   [junit4]   2> 1235750 INFO  (TEST-FullSolrCloudDistribCmdsTest.test-seed#[E85A51084DDF657F]) [    ] o.a.s.c.ZkContainer Zookeeper client=127.0.0.1:43319/solr
   [junit4]   2> 1235751 INFO  (zkConnectionManagerCallback-2501-thread-1) [    ] o.a.s.c.c.ConnectionManager zkClient has connected
   [junit4]   2> 1235752 INFO  (zkConnectionManagerCallback-2503-thread-1-processing-n:127.0.0.1:41237_wb%2Fl) [n:127.0.0.1:41237_wb%2Fl    ] o.a.s.c.c.ConnectionManager zkClient has connected
   [junit4]   2> 1235781 INFO  (TEST-FullSolrCloudDistribCmdsTest.test-seed#[E85A51084DDF657F]) [n:127.0.0.1:41237_wb%2Fl    ] o.a.s.c.Overseer Overseer (id=null) closing
   [junit4]   2> 1235781 INFO  (TEST-FullSolrCloudDistribCmdsTest.test-seed#[E85A51084DDF657F]) [n:127.0.0.1:41237_wb%2Fl    ] o.a.s.c.OverseerElectionContext I am going to be the leader 127.0.0.1:41237_wb%2Fl
   [junit4]   2> 1235781 INFO  (TEST-FullSolrCloudDistribCmdsTest.test-seed#[E85A51084DDF657F]) [n:127.0.0.1:41237_wb%2Fl    ] o.a.s.c.Overseer Overseer (id=99386234787856388-127.0.0.1:41237_wb%2Fl-n_0000000000) starting
   [junit4]   2> 1235784 INFO  (TEST-FullSolrCloudDistribCmdsTest.test-seed#[E85A51084DDF657F]) [n:127.0.0.1:41237_wb%2Fl    ] o.a.s.c.ZkController Register node as live in ZooKeeper:/live_nodes/127.0.0.1:41237_wb%2Fl
   [junit4]   2> 1235785 INFO  (zkCallback-2502-thread-1-processing-n:127.0.0.1:41237_wb%2Fl) [n:127.0.0.1:41237_wb%2Fl    ] o.a.s.c.c.ZkStateReader Updated live nodes from ZooKeeper... (0) -> (1)
   [junit4]   2> 1235847 INFO  (TEST-FullSolrCloudDistribCmdsTest.test-seed#[E85A51084DDF657F]) [n:127.0.0.1:41237_wb%2Fl    ] o.a.s.m.r.SolrJmxReporter JMX monitoring for 'solr.node' (registry 'solr.node') enabled at server: com.sun.jmx.mbeanserver.JmxMBeanServer@fa4772
   [junit4]   2> 1235853 INFO  (TEST-FullSolrCloudDistribCmdsTest.test-seed#[E85A51084DDF657F]) [n:127.0.0.1:41237_wb%2Fl    ] o.a.s.m.r.SolrJmxReporter JMX monitoring for 'solr.jvm' (registry 'solr.jvm') enabled at server: com.sun.jmx.mbeanserver.JmxMBeanServer@fa4772
   [junit4]   2> 1235853 INFO  (TEST-FullSolrCloudDistribCmdsTest.test-seed#[E85A51084DDF657F]) [n:127.0.0.1:41237_wb%2Fl    ] o.a.s.m.r.SolrJmxReporter JMX monitoring for 'solr.jetty' (registry 'solr.jetty') enabled at server: com.sun.jmx.mbeanserver.JmxMBeanServer@fa4772
   [junit4]   2> 1235854 INFO  (TEST-FullSolrCloudDistribCmdsTest.test-seed#[E85A51084DDF657F]) [n:127.0.0.1:41237_wb%2Fl    ] o.a.s.c.CorePropertiesLocator Found 0 core definitions underneath /home/jenkins/workspace/Lucene-Solr-7.x-Linux/solr/build/solr-core/test/J2/temp/solr.cloud.FullSolrCloudDistribCmdsTest_E85A51084DDF657F-001/control-001/cores
   [junit4]   2> 1235868 INFO  (zkConnectionManagerCallback-2509-thread-1) [    ] o.a.s.c.c.ConnectionManager zkClient has connected
   [junit4]   2> 1235869 INFO  (TEST-FullSolrCloudDistribCmdsTest.test-seed#[E85A51084DDF657F]) [    ] o.a.s.c.c.ZkStateReader Updated live nodes from ZooKeeper... (0) -> (1)
   [junit4]   2> 1235870 INFO  (TEST-FullSolrCloudDistribCmdsTest.test-seed#[E85A51084DDF657F]) [    ] o.a.s.c.s.i.ZkClientClusterStateProvider Cluster at 127.0.0.1:43319/solr ready
   [junit4]   2> 1235871 INFO  (qtp15203938-13486) [n:127.0.0.1:41237_wb%2Fl    ] o.a.s.h.a.CollectionsHandler Invoked Collection Action :create with params replicationFactor=1&collection.configName=conf1&name=control_collection&nrtReplicas=1&action=CREATE&numShards=1&createNodeSet=127.0.0.1:41237_wb%252Fl&wt=javabin&version=2 and sendToOCPQueue=true
   [junit4]   2> 1235873 INFO  (OverseerThreadFactory-5167-thread-1-processing-n:127.0.0.1:41237_wb%2Fl) [n:127.0.0.1:41237_wb%2Fl    ] o.a.s.c.a.c.CreateCollectionCmd Create collection control_collection
   [junit4]   2> 1235978 INFO  (qtp15203938-13522) [n:127.0.0.1:41237_wb%2Fl    ] o.a.s.h.a.CoreAdminOperation core create command qt=/admin/cores&collection.configName=conf1&newCollection=true&name=control_collection_shard1_replica_n1&action=CREATE&numShards=1&collection=control_collection&shard=shard1&wt=javabin&version=2&replicaType=NRT
   [junit4]   2> 1235979 INFO  (qtp15203938-13522) [n:127.0.0.1:41237_wb%2Fl    ] o.a.s.c.TransientSolrCoreCacheDefault Allocating transient cache for 4 transient cores
   [junit4]   2> 1236086 INFO  (zkCallback-2502-thread-1-processing-n:127.0.0.1:41237_wb%2Fl) [n:127.0.0.1:41237_wb%2Fl    ] o.a.s.c.c.ZkStateReader A cluster state change: [WatchedEvent state:SyncConnected type:NodeDataChanged path:/collections/control_collection/state.json] for collection [control_collection] has occurred - updating... (live nodes size: [1])
   [junit4]   2> 1237031 INFO  (qtp15203938-13522) [n:127.0.0.1:41237_wb%2Fl c:control_collection s:shard1  x:control_collection_shard1_replica_n1] o.a.s.c.SolrConfig Using Lucene MatchVersion: 7.3.0
   [junit4]   2> 1237042 INFO  (qtp15203938-13522) [n:127.0.0.1:41237_wb%2Fl c:control_collection s:shard1  x:control_collection_shard1_replica_n1] o.a.s.s.IndexSchema [control_collection_shard1_replica_n1] Schema name=test
   [junit4]   2> 1237125 INFO  (qtp15203938-13522) [n:127.0.0.1:41237_wb%2Fl c:control_collection s:shard1  x:control_collection_shard1_replica_n1] o.a.s.s.IndexSchema Loaded schema test/1.6 with uniqueid field id
   [junit4]   2> 1237136 INFO  (qtp15203938-13522) [n:127.0.0.1:41237_wb%2Fl c:control_collection s:shard1  x:control_collection_shard1_replica_n1] o.a.s.c.CoreContainer Creating SolrCore 'control_collection_shard1_replica_n1' using configuration from collection control_collection, trusted=true
   [junit4]   2> 1237136 INFO  (qtp15203938-13522) [n:127.0.0.1:41237_wb%2Fl c:control_collection s:shard1  x:control_collection_shard1_replica_n1] o.a.s.m.r.SolrJmxReporter JMX monitoring for 'solr.core.control_collection.shard1.replica_n1' (registry 'solr.core.control_collection.shard1.replica_n1') enabled at server: com.sun.jmx.mbeanserver.JmxMBeanServer@fa4772
   [junit4]   2> 1237137 INFO  (qtp15203938-13522) [n:127.0.0.1:41237_wb%2Fl c:control_collection s:shard1  x:control_collection_shard1_replica_n1] o.a.s.c.SolrCore solr.RecoveryStrategy.Builder
   [junit4]   2> 1237137 INFO  (qtp15203938-13522) [n:127.0.0.1:41237_wb%2Fl c:control_collection s:shard1  x:control_collection_shard1_replica_n1] o.a.s.c.SolrCore [[control_collection_shard1_replica_n1] ] Opening new SolrCore at [/home/jenkins/workspace/Lucene-Solr-7.x-Linux/solr/build/solr-core/test/J2/temp/solr.cloud.FullSolrCloudDistribCmdsTest_E85A51084DDF657F-001/control-001/cores/control_collection_shard1_replica_n1], dataDir=[/home/jenkins/workspace/Lucene-Solr-7.x-Linux/solr/build/solr-core/test/J2/temp/solr.cloud.FullSolrCloudDistribCmdsTest_E85A51084DDF657F-001/control-001/cores/control_collection_shard1_replica_n1/data/]
   [junit4]   2> 1237139 INFO  (qtp15203938-13522) [n:127.0.0.1:41237_wb%2Fl c:control_collection s:shard1  x:control_collection_shard1_replica_n1] o.a.s.u.RandomMergePolicy RandomMergePolicy wrapping class org.apache.lucene.index.TieredMergePolicy: [TieredMergePolicy: maxMergeAtOnce=37, maxMergeAtOnceExplicit=48, maxMergedSegmentMB=60.1494140625, floorSegmentMB=1.2294921875, forceMergeDeletesPctAllowed=10.811039269288742, segmentsPerTier=41.0, maxCFSSegmentSizeMB=8.796093022207999E12, noCFSRatio=0.0
   [junit4]   2> 1237141 WARN  (qtp15203938-13522) [n:127.0.0.1:41237_wb%2Fl c:control_collection s:shard1  x:control_collection_shard1_replica_n1] o.a.s.c.RequestHandlers INVALID paramSet a in requestHandler {type = requestHandler,name = /dump,class = DumpRequestHandler,attributes = {initParams=a, name=/dump, class=DumpRequestHandler},args = {defaults={a=A,b=B}}}
   [junit4]   2> 1237180 INFO  (qtp15203938-13522) [n:127.0.0.1:41237_wb%2Fl c:control_collection s:shard1  x:control_collection_shard1_replica_n1] o.a.s.u.UpdateHandler Using UpdateLog implementation: org.apache.solr.update.UpdateLog
   [junit4]   2> 1237180 INFO  (qtp15203938-13522) [n:127.0.0.1:41237_wb%2Fl c:control_collection s:shard1  x:control_collection_shard1_replica_n1] o.a.s.u.UpdateLog Initializing UpdateLog: dataDir= defaultSyncLevel=FLUSH numRecordsToKeep=100 maxNumLogsToKeep=10 numVersionBuckets=65536
   [junit4]   2> 1237181 INFO  (qtp15203938-13522) [n:127.0.0.1:41237_wb%2Fl c:control_collection s:shard1  x:control_collection_shard1_replica_n1] o.a.s.u.CommitTracker Hard AutoCommit: disabled
   [junit4]   2> 1237181 INFO  (qtp15203938-13522) [n:127.0.0.1:41237_wb%2Fl c:control_collection s:shard1  x:control_collection_shard1_replica_n1] o.a.s.u.CommitTracker Soft AutoCommit: disabled
   [junit4]   2> 1237182 INFO  (qtp15203938-13522) [n:127.0.0.1:41237_wb%2Fl c:control_collection s:shard1  x:control_collection_shard1_replica_n1] o.a.s.u.RandomMergePolicy RandomMergePolicy wrapping class org.apache.lucene.index.TieredMergePolicy: [TieredMergePolicy: maxMergeAtOnce=28, maxMergeAtOnceExplicit=12, maxMergedSegmentMB=4.091796875, floorSegmentMB=1.7578125, forceMergeDeletesPctAllowed=25.41074357631232, segmentsPerTier=44.0, maxCFSSegmentSizeMB=8.796093022207999E12, noCFSRatio=1.0
   [junit4]   2> 1237182 INFO  (qtp15203938-13522) [n:127.0.0.1:41237_wb%2Fl c:control_collection s:shard1  x:control_collection_shard1_replica_n1] o.a.s.s.SolrIndexSearcher Opening [Searcher@78aa60[control_collection_shard1_replica_n1] main]
   [junit4]   2> 1237183 INFO  (qtp15203938-13522) [n:127.0.0.1:41237_wb%2Fl c:control_collection s:shard1  x:control_collection_shard1_replica_n1] o.a.s.r.ManagedResourceStorage Configured ZooKeeperStorageIO with znodeBase: /configs/conf1
   [junit4]   2> 1237183 INFO  (qtp15203938-13522) [n:127.0.0.1:41237_wb%2Fl c:control_collection s:shard1  x:control_collection_shard1_replica_n1] o.a.s.r.ManagedResourceStorage Loaded null at path _rest_managed.json using ZooKeeperStorageIO:path=/configs/conf1
   [junit4]   2> 1237184 INFO  (qtp15203938-13522) [n:127.0.0.1:41237_wb%2Fl c:control_collection s:shard1  x:control_collection_shard1_replica_n1] o.a.s.h.ReplicationHandler Commits will be reserved for 10000ms.
   [junit4]   2> 1237184 INFO  (qtp15203938-13522) [n:127.0.0.1:41237_wb%2Fl c:control_collection s:shard1  x:control_collection_shard1_replica_n1] o.a.s.u.UpdateLog Could not find max version in index or recent updates, using new clock 1590179758332706816
   [junit4]   2> 1237186 INFO  (searcherExecutor-5170-thread-1-processing-n:127.0.0.1:41237_wb%2Fl x:control_collection_shard1_replica_n1 s:shard1 c:control_collection) [n:127.0.0.1:41237_wb%2Fl c:control_collection s:shard1  x:control_collection_shard1_replica_n1] o.a.s.c.SolrCore [control_collection_shard1_replica_n1] Registered new searcher Searcher@78aa60[control_collection_shard1_replica_n1] main{ExitableDirectoryReader(UninvertingDirectoryReader())}
   [junit4]   2> 1237189 INFO  (qtp15203938-13522) [n:127.0.0.1:41237_wb%2Fl c:control_collection s:shard1  x:control_collection_shard1_replica_n1] o.a.s.c.ShardLeaderElectionContext Enough replicas found to continue.
   [junit4]   2> 1237189 INFO  (qtp15203938-13522) [n:127.0.0.1:41237_wb%2Fl c:control_collection s:shard1  x:control_collection_shard1_replica_n1] o.a.s.c.ShardLeaderElectionContext I may be the new leader - try and sync
   [junit4]   2> 1237189 INFO  (qtp15203938-13522) [n:127.0.0.1:41237_wb%2Fl c:control_collection s:shard1  x:control_collection_shard1_replica_n1] o.a.s.c.SyncStrategy Sync replicas to http://127.0.0.1:41237/wb/l/control_collection_shard1_replica_n1/
   [junit4]   2> 1237189 INFO  (qtp15203938-13522) [n:127.0.0.1:41237_wb%2Fl c:control_collection s:shard1  x:control_collection_shard1_replica_n1] o.a.s.c.SyncStrategy Sync Success - now sync replicas to me
   [junit4]   2> 1237189 INFO  (qtp15203938-13522) [n:127.0.0.1:41237_wb%2Fl c:control_collection s:shard1  x:control_collection_shard1_replica_n1] o.a.s.c.SyncStrategy http://127.0.0.1:41237/wb/l/control_collection_shard1_replica_n1/ has no replicas
   [junit4]   2> 1237189 INFO  (qtp15203938-13522) [n:127.0.0.1:41237_wb%2Fl c:control_collection s:shard1  x:control_collection_shard1_replica_n1] o.a.s.c.ShardLeaderElectionContext Found all replicas participating in election, clear LIR
   [junit4]   2> 1237195 INFO  (qtp15203938-13522) [n:127.0.0.1:41237_wb%2Fl c:control_collection s:shard1  x:control_collection_shard1_replica_n1] o.a.s.c.ShardLeaderElectionContext I am the new leader: http://127.0.0.1:41237/wb/l/control_collection_shard1_replica_n1/ shard1
   [junit4]   2> 1237296 INFO  (zkCallback-2502-thread-2-processing-n:127.0.0.1:41237_wb%2Fl) [n:127.0.0.1:41237_wb%2Fl    ] o.a.s.c.c.ZkStateReader A cluster state change: [WatchedEvent state:SyncConnected type:NodeDataChanged path:/collections/control_collection/state.json] for collection [control_collection] has occurred - updating... (live nodes size: [1])
   [junit4]   2> 1237345 INFO  (qtp15203938-13522) [n:127.0.0.1:41237_wb%2Fl c:control_collection s:shard1  x:control_collection_shard1_replica_n1] o.a.s.c.ZkController I am the leader, no recovery necessary
   [junit4]   2> 1237396 INFO  (qtp15203938-13522) [n:127.0.0.1:41237_wb%2Fl c:control_collection s:shard1  x:control_collection_shard1_replica_n1] o.a.s.s.HttpSolrCall [admin] webapp=null path=/admin/cores params={qt=/admin/cores&collection.configName=conf1&newCollection=true&name=control_collection_shard1_replica_n1&action=CREATE&numShards=1&collection=control_collection&shard=shard1&wt=javabin&version=2&replicaType=NRT} status=0 QTime=1418
   [junit4]   2> 1237398 INFO  (qtp15203938-13486) [n:127.0.0.1:41237_wb%2Fl    ] o.a.s.h.a.CollectionsHandler Wait for new collection to be active for at most 30 seconds. Check all shard replicas
   [junit4]   2> 1237447 INFO  (zkCallback-2502-thread-2-processing-n:127.0.0.1:41237_wb%2Fl) [n:127.0.0.1:41237_wb%2Fl    ] o.a.s.c.c.ZkStateReader A cluster state change: [WatchedEvent state:SyncConnected type:NodeDataChanged path:/collections/control_collection/state.json] for collection [control_collection] has occurred - updating... (live nodes size: [1])
   [junit4]   2> 1237874 INFO  (OverseerCollectionConfigSetProcessor-99386234787856388-127.0.0.1:41237_wb%2Fl-n_0000000000) [n:127.0.0.1:41237_wb%2Fl    ] o.a.s.c.OverseerTaskQueue Response ZK path: /overseer/collection-queue-work/qnr-0000000000 doesn't exist.  Requestor may have disconnected from ZooKeeper
   [junit4]   2> 1238398 INFO  (qtp15203938-13486) [n:127.0.0.1:41237_wb%2Fl    ] o.a.s.s.HttpSolrCall [admin] webapp=null path=/admin/collections params={replicationFactor=1&collection.configName=conf1&name=control_collection&nrtReplicas=1&action=CREATE&numShards=1&createNodeSet=127.0.0.1:41237_wb%252Fl&wt=javabin&version=2} status=0 QTime=2526
   [junit4]   2> 1238403 INFO  (zkConnectionManagerCallback-2513-thread-1) [    ] o.a.s.c.c.ConnectionManager zkClient has connected
   [junit4]   2> 1238404 INFO  (TEST-FullSolrCloudDistribCmdsTest.test-seed#[E85A51084DDF657F]) [    ] o.a.s.c.c.ZkStateReader Updated live nodes from ZooKeeper... (0) -> (1)
   [junit4]   2> 1238405 INFO  (TEST-FullSolrCloudDistribCmdsTest.test-seed#[E85A51084DDF657F]) [    ] o.a.s.c.s.i.ZkClientClusterStateProvider Cluster at 127.0.0.1:43319/solr ready
   [junit4]   2> 1238405 INFO  (TEST-FullSolrCloudDistribCmdsTest.test-seed#[E85A51084DDF657F]) [    ] o.a.s.c.ChaosMonkey monkey: init - expire sessions:false cause connection loss:false
   [junit4]   2> 1238405 INFO  (qtp15203938-13521) [n:127.0.0.1:41237_wb%2Fl    ] o.a.s.h.a.CollectionsHandler Invoked Collection Action :create with params replicationFactor=1&collection.configName=conf1&name=collection1&nrtReplicas=1&action=CREATE&numShards=3&createNodeSet=&stateFormat=2&wt=javabin&version=2 and sendToOCPQueue=true
   [junit4]   2> 1238410 INFO  (OverseerThreadFactory-5167-thread-2-processing-n:127.0.0.1:41237_wb%2Fl) [n:127.0.0.1:41237_wb%2Fl    ] o.a.s.c.a.c.CreateCollectionCmd Create collection collection1
   [junit4]   2> 1238410 WARN  (OverseerThreadFactory-5167-thread-2-processing-n:127.0.0.1:41237_wb%2Fl) [n:127.0.0.1:41237_wb%2Fl    ] o.a.s.c.a.c.CreateCollectionCmd It is unusual to create a collection (collection1) without cores.
   [junit4]   2> 1238615 INFO  (qtp15203938-13521) [n:127.0.0.1:41237_wb%2Fl    ] o.a.s.h.a.CollectionsHandler Wait for new collection to be active for at most 30 seconds. Check all shard replicas
   [junit4]   2> 1238615 INFO  (qtp15203938-13521) [n:127.0.0.1:41237_wb%2Fl    ] o.a.s.s.HttpSolrCall [admin] webapp=null path=/admin/collections params={replicationFactor=1&collection.configName=conf1&name=collection1&nrtReplicas=1&action=CREATE&numShards=3&createNodeSet=&stateFormat=2&wt=javabin&version=2} status=0 QTime=209
   [junit4]   2> 1238710 INFO  (TEST-FullSolrCloudDistribCmdsTest.test-seed#[E85A51084DDF657F]) [    ] o.a.s.c.AbstractFullDistribZkTestBase create jetty 1 in directory /home/jenkins/workspace/Lucene-Solr-7.x-Linux/solr/build/solr-core/test/J2/temp/solr.cloud.FullSolrCloudDistribCmdsTest_E85A51084DDF657F-001/shard-1-001 of type NRT
   [junit4]   2> 1238710 INFO  (TEST-FullSolrCloudDistribCmdsTest.test-seed#[E85A51084DDF657F]) [    ] o.e.j.s.Server jetty-9.4.8.v20171121, build timestamp: ????-??-??T??:??:??-08:00, git hash: 82b8fb23f757335bb3329d540ce37a2a2615f0a8
   [junit4]   2> 1238711 INFO  (TEST-FullSolrCloudDistribCmdsTest.test-seed#[E85A51084DDF657F]) [    ] o.e.j.s.session DefaultSessionIdManager workerName=node0
   [junit4]   2> 1238711 INFO  (TEST-FullSolrCloudDistribCmdsTest.test-seed#[E85A51084DDF657F]) [    ] o.e.j.s.session No SessionScavenger set, using defaults
   [junit4]   2> 1238711 INFO  (TEST-FullSolrCloudDistribCmdsTest.test-seed#[E85A51084DDF657F]) [    ] o.e.j.s.session Scavenging every 660000ms
   [junit4]   2> 1238711 INFO  (TEST-FullSolrCloudDistribCmdsTest.test-seed#[E85A51084DDF657F]) [    ] o.e.j.s.h.ContextHandler Started o.e.j.s.ServletContextHandler@acf738{/wb/l,null,AVAILABLE}
   [junit4]   2> 1238711 INFO  (TEST-FullSolrCloudDistribCmdsTest.test-seed#[E85A51084DDF657F]) [    ] o.e.j.s.AbstractConnector Started ServerConnector@7eba99{HTTP/1.1,[http/1.1]}{127.0.0.1:42631}
   [junit4]   2> 1238711 INFO  (TEST-FullSolrCloudDistribCmdsTest.test-seed#[E85A51084DDF657F]) [    ] o.e.j.s.Server Started @1240253ms
   [junit4]   2> 1238711 INFO  (TEST-FullSolrCloudDistribCmdsTest.test-seed#[E85A51084DDF657F]) [    ] o.a.s.c.s.e.JettySolrRunner Jetty properties: {solr.data.dir=/home/jenkins/workspace/Lucene-Solr-7.x-Linux/solr/build/solr-core/test/J2/temp/solr.cloud.FullSolrCloudDistribCmdsTest_E85A51084DDF657F-001/tempDir-001/jetty1, solrconfig=solrconfig.xml, hostContext=/wb/l, hostPort=42631, coreRootDirectory=/home/jenkins/workspace/Lucene-Solr-7.x-Linux/solr/build/solr-core/test/J2/temp/solr.cloud.FullSolrCloudDistribCmdsTest_E85A51084DDF657F-001/shard-1-001/cores}
   [junit4]   2> 1238712 ERROR (TEST-FullSolrCloudDistribCmdsTest.test-seed#[E85A51084DDF657F]) [    ] o.a.s.u.StartupLoggingUtils Missing Java Option solr.log.dir. Logging may be missing or incomplete.
   [junit4]   2> 1238712 INFO  (TEST-FullSolrCloudDistribCmdsTest.test-seed#[E85A51084DDF657F]) [    ] o.a.s.s.SolrDispatchFilter  ___      _       Welcome to Apache Solr? version 7.3.0
   [junit4]   2> 1238712 INFO  (TEST-FullSolrCloudDistribCmdsTest.test-seed#[E85A51084DDF657F]) [    ] o.a.s.s.SolrDispatchFilter / __| ___| |_ _   Starting in cloud mode on port null
   [junit4]   2> 1238712 INFO  (TEST-FullSolrCloudDistribCmdsTest.test-seed#[E85A51084DDF657F]) [    ] o.a.s.s.SolrDispatchFilter \__ \/ _ \ | '_|  Install dir: null
   [junit4]   2> 1238712 INFO  (TEST-FullSolrCloudDistribCmdsTest.test-seed#[E85A51084DDF657F]) [    ] o.a.s.s.SolrDispatchFilter |___/\___/_|_|    Start time: 2018-01-21T05:46:35.519Z
   [junit4]   2> 1238713 INFO  (zkConnectionManagerCallback-2515-thread-1) [    ] o.a.s.c.c.ConnectionManager zkClient has connected
   [junit4]   2> 1238714 INFO  (TEST-FullSolrCloudDistribCmdsTest.test-seed#[E85A51084DDF657F]) [    ] o.a.s.s.SolrDispatchFilter Loading solr.xml from SolrHome (not found in ZooKeeper)
   [junit4]   2> 1238714 INFO  (TEST-FullSolrCloudDistribCmdsTest.test-seed#[E85A51084DDF657F]) [    ] o.a.s.c.SolrXmlConfig Loading container configuration from /home/jenkins/workspace/Lucene-Solr-7.x-Linux/solr/build/solr-core/test/J2/temp/solr.cloud.FullSolrCloudDistribCmdsTest_E85A51084DDF657F-001/shard-1-001/solr.xml
   [junit4]   2> 1238716 INFO  (TEST-FullSolrCloudDistribCmdsTest.test-seed#[E85A51084DDF657F]) [    ] o.a.s.c.SolrXmlConfig Configuration parameter autoReplicaFailoverWorkLoopDelay is ignored
   [junit4]   2> 1238716 INFO  (TEST-FullSolrCloudDistribCmdsTest.test-seed#[E85A51084DDF657F]) [    ] o.a.s.c.SolrXmlConfig Configuration parameter autoReplicaFailoverBadNodeExpiration is ignored
   [junit4]   2> 1238717 INFO  (TEST-FullSolrCloudDistribCmdsTest.test-seed#[E85A51084DDF657F]) [    ] o.a.s.c.SolrXmlConfig MBean server found: com.sun.jmx.mbeanserver.JmxMBeanServer@fa4772, but no JMX reporters were configured - adding default JMX reporter.
   [junit4]   2> 1238722 INFO  (TEST-FullSolrCloudDistribCmdsTest.test-seed#[E85A51084DDF657F]) [    ] o.a.s.c.ZkContainer Zookeeper client=127.0.0.1:43319/solr
   [junit4]   2> 1238723 INFO  (zkConnectionManagerCallback-2519-thread-1) [    ] o.a.s.c.c.ConnectionManager zkClient has connected
   [junit4]   2> 1238724 INFO  (zkConnectionManagerCallback-2521-thread-1-processing-n:127.0.0.1:42631_wb%2Fl) [n:127.0.0.1:42631_wb%2Fl    ] o.a.s.c.c.ConnectionManager zkClient has connected
   [junit4]   2> 1238727 INFO  (TEST-FullSolrCloudDistribCmdsTest.test-seed#[E85A51084DDF657F]) [n:127.0.0.1:42631_wb%2Fl    ] o.a.s.c.c.ZkStateReader Updated live nodes from ZooKeeper... (0) -> (1)
   [junit4]   2> 1238727 INFO  (TEST-FullSolrCloudDistribCmdsTest.test-seed#[E85A51084DDF657F]) [n:127.0.0.1:42631_wb%2Fl    ] o.a.s.c.Overseer Overseer (id=null) closing
   [junit4]   2> 1238728 INFO  (TEST-FullSolrCloudDistribCmdsTest.test-seed#[E85A51084DDF657F]) [n:127.0.0.1:42631_wb%2Fl    ] o.a.s.c.ZkController Register node as live in ZooKeeper:/live_nodes/127.0.0.1:42631_wb%2Fl
   [junit4]   2> 1238728 INFO  (zkCallback-2502-thread-2-processing-n:127.0.0.1:41237_wb%2Fl) [n:127.0.0.1:41237_wb%2Fl    ] o.a.s.c.c.ZkStateReader Updated live nodes from ZooKeeper... (1) -> (2)
   [junit4]   2> 1238728 INFO  (zkCallback-2520-thread-1-processing-n:127.0.0.1:42631_wb%2Fl) [n:127.0.0.1:42631_wb%2Fl    ] o.a.s.c.c.ZkStateReader Updated live nodes from ZooKeeper... (1) -> (2)
   [junit4]   2> 1238729 INFO  (zkCallback-2512-thread-1) [    ] o.a.s.c.c.ZkStateReader Updated live nodes from ZooKeeper... (1) -> (2)
   [junit4]   2> 1238802 INFO  (TEST-FullSolrCloudDistribCmdsTest.test-seed#[E85A51084DDF657F]) [n:127.0.0.1:42631_wb%2Fl    ] o.a.s.m.r.SolrJmxReporter JMX monitoring for 'solr.node' (registry 'solr.node') enabled at server: com.sun.jmx.mbeanserver.JmxMBeanServer@fa4772
   [junit4]   2> 1238809 INFO  (TEST-FullSolrCloudDistribCmdsTest.test-seed#[E85A51084DDF657F]) [n:127.0.0.1:42631_wb%2Fl    ] o.a.s.m.r.SolrJmxReporter JMX monitoring for 'solr.jvm' (registry 'solr.jvm') enabled at server: com.sun.jmx.mbeanserver.JmxMBeanServer@fa4772
   [junit4]   2> 1238809 INFO  (TEST-FullSolrCloudDistribCmdsTest.test-seed#[E85A51084DDF657F]) [n:127.0.0.1:42631_wb%2Fl    ] o.a.s.m.r.SolrJmxReporter JMX monitoring for 'solr.jetty' (registry 'solr.jetty') enabled at server: com.sun.jmx.mbeanserver.JmxMBeanServer@fa4772
   [junit4]   2> 1238811 INFO  (TEST-FullSolrCloudDistribCmdsTest.test-seed#[E85A51084DDF657F]) [n:127.0.0.1:42631_wb%2Fl    ] o.a.s.c.CorePropertiesLocator Found 0 core definitions underneath /home/jenkins/workspace/Lucene-Solr-7.x-Linux/solr/build/solr-core/test/J2/temp/solr.cloud.FullSolrCloudDistribCmdsTest_E85A51084DDF657F-001/shard-1-001/cores
   [junit4]   2> 1238831 INFO  (qtp15203938-13491) [n:127.0.0.1:41237_wb%2Fl    ] o.a.s.h.a.CollectionsHandler Invoked Collection Action :addreplica with params node=127.0.0.1:42631_wb%252Fl&action=ADDREPLICA&collection=collection1&shard=shard2&type=NRT&wt=javabin&version=2 and sendToOCPQueue=true
   [junit4]   2> 1238832 INFO  (OverseerCollectionConfigSetProcessor-99386234787856388-127.0.0.1:41237_wb%2Fl-n_0000000000) [n:127.0.0.1:41237_wb%2Fl    ] o.a.s.c.OverseerTaskQueue Response ZK path: /overseer/collection-queue-work/qnr-0000000002 doesn't exist.  Requestor may have disconnected from ZooKeeper
   [junit4]   2> 1238833 INFO  (OverseerThreadFactory-5167-thread-3-processing-n:127.0.0.1:41237_wb%2Fl) [n:127.0.0.1:41237_wb%2Fl    ] o.a.s.c.a.c.AddReplicaCmd Node Identified 127.0.0.1:42631_wb%2Fl for creating new replica
   [junit4]   2> 1238834 INFO  (qtp7673607-13538) [n:127.0.0.1:42631_wb%2Fl    ] o.a.s.h.a.CoreAdminOperation core create command qt=/admin/cores&collection.configName=conf1&name=collection1_shard2_replica_n61&action=CREATE&collection=collection1&shard=shard2&wt=javabin&version=2&replicaType=NRT
   [junit4]   2> 1238834 INFO  (qtp7673607-13538) [n:127.0.0.1:42631_wb%2Fl    ] o.a.s.c.TransientSolrCoreCacheDefault Allocating transient cache for 4 transient cores
   [junit4]   2> 1238936 INFO  (zkCallback-2520-thread-1-processing-n:127.0.0.1:42631_wb%2Fl) [n:127.0.0.1:42631_wb%2Fl    ] o.a.s.c.c.ZkStateReader A cluster state change: [WatchedEvent state:SyncConnected type:NodeDataChanged path:/collections/collection1/state.json] for collection [collection1] has occurred - updating... (live nodes size: [2])
   [junit4]   2> 1239844 INFO  (qtp7673607-13538) [n:127.0.0.1:42631_wb%2Fl c:collection1 s:shard2  x:collection1_shard2_replica_n61] o.a.s.c.SolrConfig Using Lucene MatchVersion: 7.3.0
   [junit4]   2> 1239853 INFO  (qtp7673607-13538) [n:127.0.0.1:42631_wb%2Fl c:collection1 s:shard2  x:collection1_shard2_replica_n61] o.a.s.s.IndexSchema [collection1_shard2_replica_n61] Schema name=test
   [junit4]   2> 1239912 INFO  (qtp7673607-13538) [n:127.0.0.1:42631_wb%2Fl c:collection1 s:shard2  x:collection1_shard2_replica_n61] o.a.s.s.IndexSchema Loaded schema test/1.6 with uniqueid field id
   [junit4]   2> 1239920 INFO  (qtp7673607-13538) [n:127.0.0.1:42631_wb%2Fl c:collection1 s:shard2  x:collection1_shard2_replica_n61] o.a.s.c.CoreContainer Creating SolrCore 'collection1_shard2_replica_n61' using configuration from collection collection1, trusted=true
   [junit4]   2> 1239920 INFO  (qtp7673607-13538) [n:127.0.0.1:42631_wb%2Fl c:collection1 s:shard2  x:collection1_shard2_replica_n61] o.a.s.m.r.SolrJmxReporter JMX monitoring for 'solr.core.collection1.shard2.replica_n61' (registry 'solr.core.collection1.shard2.replica_n61') enabled at server: com.sun.jmx.mbeanserver.JmxMBeanServer@fa4772
   [junit4]   2> 1239921 INFO  (qtp7673607-13538) [n:127.0.0.1:42631_wb%2Fl c:collection1 s:shard2  x:collection1_shard2_replica_n61] o.a.s.c.SolrCore solr.RecoveryStrategy.Builder
   [junit4]   2> 1239921 INFO  (qtp7673607-13538) [n:127.0.0.1:42631_wb%2Fl c:collection1 s:shard2  x:collection1_shard2_replica_n61] o.a.s.c.SolrCore [[collection1_shard2_replica_n61] ] Opening new SolrCore at [/home/jenkins/workspace/Lucene-Solr-7.x-Linux/solr/build/solr-core/test/J2/temp/solr.cloud.FullSolrCloudDistribCmdsTest_E85A51084DDF657F-001/shard-1-001/cores/collection1_shard2_replica_n61], dataDir=[/home/jenkins/workspace/Lucene-Solr-7.x-Linux/solr/build/solr-core/test/J2/temp/solr.cloud.FullSolrCloudDistribCmdsTest_E85A51084DDF657F-001/shard-1-001/cores/collection1_shard2_replica_n61/data/]
   [junit4]   2> 1239923 INFO  (qtp7673607-13538) [n:127.0.0.1:42631_wb%2Fl c:collection1 s:shard2  x:collection1_shard2_replica_n61] o.a.s.u.RandomMergePolicy RandomMergePolicy wrapping class org.apache.lucene.index.TieredMergePolicy: [TieredMergePolicy: maxMergeAtOnce=37, maxMergeAtOnceExplicit=48, maxMergedSegmentMB=60.1494140625, floorSegmentMB=1.2294921875, forceMergeDeletesPctAllowed=10.811039269288742, segmentsPerTier=41.0, maxCFSSegmentSizeMB=8.796093022207999E12, noCFSRatio=0.0
   [junit4]   2> 1239925 WARN  (qtp7673607-13538) [n:127.0.0.1:42631_wb%2Fl c:collection1 s:shard2  x:collection1_shard2_replica_n61] o.a.s.c.RequestHandlers INVALID paramSet a in requestHandler {type = requestHandler,name = /dump,class = DumpRequestHandler,attributes = {initParams=a, name=/dump, class=DumpRequestHandler},args = {defaults={a=A,b=B}}}
   [junit4]   2> 1239966 INFO  (qtp7673607-13538) [n:127.0.0.1:42631_wb%2Fl c:collection1 s:shard2  x:collection1_shard2_replica_n61] o.a.s.u.UpdateHandler Using UpdateLog implementation: org.apache.solr.update.UpdateLog
   [junit4]   2> 1239967 INFO  (qtp7673607-13538) [n:127.0.0.1:42631_wb%2Fl c:collection1 s:shard2  x:collection1_shard2_replica_n61] o.a.s.u.UpdateLog Initializing UpdateLog: dataDir= defaultSyncLevel=FLUSH numRecordsToKeep=100 maxNumLogsToKeep=10 numVersionBuckets=65536
   [junit4]   2> 1239967 INFO  (qtp7673607-13538) [n:127.0.0.1:42631_wb%2Fl c:collection1 s:shard2  x:collection1_shard2_replica_n61] o.a.s.u.CommitTracker Hard AutoCommit: disabled
   [junit4]   2> 1239967 INFO  (qtp7673607-13538) [n:127.0.0.1:42631_wb%2Fl c:collection1 s:shard2  x:collection1_shard2_replica_n61] o.a.s.u.CommitTracker Soft AutoCommit: disabled
   [junit4]   2> 1239968 INFO  (qtp7673607-13538) [n:127.0.0.1:42631_wb%2Fl c:collection1 s:shard2  x:collection1_shard2_replica_n61] o.a.s.u.RandomMergePolicy RandomMergePolicy wrapping class org.apache.lucene.index.TieredMergePolicy: [TieredMergePolicy: maxMergeAtOnce=28, maxMergeAtOnceExplicit=12, maxMergedSegmentMB=4.091796875, floorSegmentMB=1.7578125, forceMergeDeletesPctAllowed=25.41074357631232, segmentsPerTier=44.0, maxCFSSegmentSizeMB=8.796093022207999E12, noCFSRatio=1.0
   [junit4]   2> 1239968 INFO  (qtp7673607-13538) [n:127.0.0.1:42631_wb%2Fl c:collection1 s:shard2  x:collection1_shard2_replica_n61] o.a.s.s.SolrIndexSearcher Opening [Searcher@918a0d[collection1_shard2_replica_n61] main]
   [junit4]   2> 1239969 INFO  (qtp7673607-13538) [n:127.0.0.1:42631_wb%2Fl c:collection1 s:shard2  x:collection1_shard2_replica_n61] o.a.s.r.ManagedResourceStorage Configured ZooKeeperStorageIO with znodeBase: /configs/conf1
   [junit4]   2> 1239969 INFO  (qtp7673607-13538) [n:127.0.0.1:42631_wb%2Fl c:collection1 s:shard2  x:collection1_shard2_replica_n61] o.a.s.r.ManagedResourceStorage Loaded null at path _rest_managed.json using ZooKeeperStorageIO:path=/configs/conf1
   [junit4]   2> 1239970 INFO  (qtp7673607-13538) [n:127.0.0.1:42631_wb%2Fl c:collection1 s:shard2  x:collection1_shard2_replica_n61] o.a.s.h.ReplicationHandler Commits will be reserved for 10000ms.
   [junit4]   2> 1239971 INFO  (searcherExecutor-5181-thread-1-processing-n:127.0.0.1:42631_wb%2Fl x:collection1_shard2_replica_n61 s:shard2 c:collection1) [n:127.0.0.1:42631_wb%2Fl c:collection1 s:shard2  x:collection1_shard2_replica_n61] o.a.s.c.SolrCore [collection1_shard2_replica_n61] Registered new searcher Searcher@918a0d[collection1_shard2_replica_n61] main{ExitableDirectoryReader(UninvertingDirectoryReader())}
   [junit4]   2> 1239971 INFO  (qtp7673607-13538) [n:127.0.0.1:42631_wb%2Fl c:collection1 s:shard2  x:collection1_shard2_replica_n61] o.a.s.u.UpdateLog Could not find max version in index or recent updates, using new clock 1590179761255088128
   [junit4]   2> 1239974 INFO  (qtp7673607-13538) [n:127.0.0.1:42631_wb%2Fl c:collection1 s:shard2  x:collection1_shard2_replica_n61] o.a.s.c.ShardLeaderElectionContext Enough replicas found to continue.
   [junit4]   2> 1239974 INFO  (qtp7673607-13538) [n:127.0.0.1:42631_wb%2Fl c:collection1 s:shard2  x:collection1_shard2_replica_n61] o.a.s.c.ShardLeaderElectionContext I may be the new leader - try and sync
   [junit4]   2> 1239974 INFO  (qtp7673607-13538) [n:127.0.0.1:42631_wb%2Fl c:collection1 s:shard2  x:collection1_shard2_replica_n61] o.a.s.c.SyncStrategy Sync replicas to http://127.0.0.1:42631/wb/l/collection1_shard2_replica_n61/
   [junit4]   2> 1239974 INFO  (qtp7673607-13538) [n:127.0.0.1:42631_wb%2Fl c:collection1 s:shard2  x:collection1_shard2_replica_n61] o.a.s.c.SyncStrategy Sync Success - now sync replicas to me
   [junit4]   2> 1239974 INFO  (qtp7673607-13538) [n:127.0.0.1:42631_wb%2Fl c:collection1 s:shard2  x:collection1_shard2_replica_n61] o.a.s.c.SyncStrategy http://127.0.0.1:42631/wb/l/collection1_shard2_replica_n61/ has no replicas
   [junit4]   2> 1239974 INFO  (qtp7673607-13538) [n:127.0.0.1:42631_wb%2Fl c:collection1 s:shard2  x:collection1_shard2_replica_n61] o.a.s.c.ShardLeaderElectionContext Found all replicas participating in election, clear LIR
   [junit4]   2> 1239975 INFO  (qtp7673607-13538) [n:127.0.0.1:42631_wb%2Fl c:collection1 s:shard2  x:collection1_shard2_replica_n61] o.a.s.c.ShardLeaderElectionContext I am the new leader: http://127.0.0.1:42631/wb/l/collection1_shard2_replica_n61/ shard2
   [junit4]   2> 1240076 INFO  (zkCallback-2520-thread-1-processing-n:127.0.0.1:42631_wb%2Fl) [n:127.0.0.1:42631_wb%2Fl    ] o.a.s.c.c.ZkStateReader A cluster state change: [WatchedEvent state:SyncConnected type:NodeDataChanged path:/collections/collection1/state.json] for collection [collection1] has occurred - updating... (live nodes size: [2])
   [junit4]   2> 1240126 INFO  (qtp7673607-13538) [n:127.0.0.1:42631_wb%2Fl c:collection1 s:shard2  x:collection1_shard2_replica_n61] o.a.s.c.ZkController I am the leader, no recovery necessary
   [junit4]   2> 1240127 INFO  (qtp7673607-13538) [n:127.0.0.1:42631_wb%2Fl c:collection1 s:shard2  x:collection1_shard2_replica_n61] o.a.s.s.HttpSolrCall [admin] webapp=null path=/admin/cores params={qt=/admin/cores&collection.configName=conf1&name=collection1_shard2_replica_n61&action=CREATE&collection=collection1&shard=shard2&wt=javabin&version=2&replicaType=NRT} status=0 QTime=1293
   [junit4]   2> 1240128 INFO  (qtp15203938-13491) [n:127.0.0.1:41237_wb%2Fl    ] o.a.s.s.HttpSolrCall [admin] webapp=null path=/admin/collections params={node=127.0.0.1:42631_wb%252Fl&action=ADDREPLICA&collection=collection1&shard=shard2&type=NRT&wt=javabin&version=2} status=0 QTime=1297
   [junit4]   2> 1240205 INFO  (TEST-FullSolrCloudDistribCmdsTest.test-seed#[E85A51084DDF657F]) [    ] o.a.s.c.AbstractFullDistribZkTestBase create jetty 2 in directory /home/jenkins/workspace/Lucene-Solr-7.x-Linux/solr/build/solr-core/test/J2/temp/solr.cloud.FullSolrCloudDistribCmdsTest_E85A51084DDF657F-001/shard-2-001 of type NRT
   [junit4]   2> 1240206 INFO  (TEST-FullSolrCloudDistribCmdsTest.test-seed#[E85A51084DDF657F]) [    ] o.e.j.s.Server jetty-9.4.8.v20171121, build timestamp: ????-??-??T??:??:??-08:00, git hash: 82b8fb23f757335bb3329d540ce37a2a2615f0a8
   [junit4]   2> 1240206 INFO  (TEST-FullSolrCloudDistribCmdsTest.test-seed#[E85A51084DDF657F]) [    ] o.e.j.s.session DefaultSessionIdManager workerName=node0
   [junit4]   2> 1240206 INFO  (TEST-FullSolrCloudDistribCmdsTest.test-seed#[E85A51084DDF657F]) [    ] o.e.j.s.session No SessionScavenger set, using defaults
   [junit4]   2> 1240206 INFO  (TEST-FullSolrCloudDistribCmdsTest.test-seed#[E85A51084DDF657F]) [    ] o.e.j.s.session Scavenging every 600000ms
   [junit4]   2> 1240206 INFO  (TEST-FullSolrCloudDistribCmdsTest.test-seed#[E85A51084DDF657F]) [    ] o.e.j.s.h.ContextHandler Started o.e.j.s.ServletContextHandler@1403b9f{/wb/l,null,AVAILABLE}
   [junit4]   2> 1240207 INFO  (TEST-FullSolrCloudDistribCmdsTest.test-seed#[E85A51084DDF657F]) [    ] o.e.j.s.AbstractConnector Started ServerConnector@9f489e{HTTP/1.1,[http/1.1]}{127.0.0.1:44677}
   [junit4]   2> 1240207 INFO  (TEST-FullSolrCloudDistribCmdsTest.test-seed#[E85A51084DDF657F]) [    ] o.e.j.s.Server Started @1241749ms
   [junit4]   2> 1240207 INFO  (TEST-FullSolrCloudDistribCmdsTest.test-seed#[E85A51084DDF657F]) [    ] o.a.s.c.s.e.JettySolrRunner Jetty properties: {solr.data.dir=/home/jenkins/workspace/Lucene-Solr-7.x-Linux/solr/build/solr-core/test/J2/temp/solr.cloud.FullSolrCloudDistribCmdsTest_E85A51084DDF657F-001/tempDir-001/jetty2, replicaType=NRT, solrconfig=solrconfig.xml, hostContext=/wb/l, hostPort=44677, coreRootDirectory=/home/jenkins/workspace/Lucene-Solr-7.x-Linux/solr/build/solr-core/test/J2/../../../../../../../../../home/jenkins/workspace/Lucene-Solr-7.x-Linux/solr/build/solr-core/test/J2/temp/solr.cloud.FullSolrCloudDistribCmdsTest_E85A51084DDF657F-001/shard-2-001/cores}
   [junit4]   2> 1240207 ERROR (TEST-FullSolrCloudDistribCmdsTest.test-seed#[E85A51084DDF657F]) [    ] o.a.s.u.StartupLoggingUtils Missing Java Option solr.log.dir. Logging may be missing or incomplete.
   [junit4]   2> 1240207 INFO  (TEST-FullSolrCloudDistribCmdsTest.test-seed#[E85A51084DDF657F]) [    ] o.a.s.s.SolrDispatchFilter  ___      _       Welcome to Apache Solr? version 7.3.0
   [junit4]   2> 1240207 INFO  (TEST-FullSolrCloudDistribCmdsTest.test-seed#[E85A51084DDF657F]) [    ] o.a.s.s.SolrDispatchFilter / __| ___| |_ _   Starting in cloud mode on port null
   [junit4]   2> 1240207 INFO  (TEST-FullSolrCloudDistribCmdsTest.test-seed#[E85A51084DDF657F]) [    ] o.a.s.s.SolrDispatchFilter \__ \/ _ \ | '_|  Install dir: null
   [junit4]   2> 1240207 INFO  (TEST-FullSolrCloudDistribCmdsTest.test-seed#[E85A51084DDF657F]) [    ] o.a.s.s.SolrDispatchFilter |___/\___/_|_|    Start time: 2018-01-21T05:46:37.014Z
   [junit4]   2> 1240208 INFO  (zkConnectionManagerCallback-2525-thread-1) [    ] o.a.s.c.c.ConnectionManager zkClient has connected
   [junit4]   2> 1240209 INFO  (TEST-FullSolrCloudDistribCmdsTest.test-seed#[E85A51084DDF657F]) [    ] o.a.s.s.SolrDispatchFilter Loading solr.xml from SolrHome (not found in ZooKeeper)
   [junit4]   2> 1240209 INFO  (TEST-FullSolrCloudDistribCmdsTest.test-seed#[E85A51084DDF657F]) [    ] o.a.s.c.SolrXmlConfig Loading container configuration from /home/jenkins/workspace/Lucene-Solr-7.x-Linux/solr/build/solr-core/test/J2/temp/solr.cloud.FullSolrCloudDistribCmdsTest_E85A51084DDF657F-001/shard-2-001/solr.xml
   [junit4]   2> 1240211 INFO  (TEST-FullSolrCloudDistribCmdsTest.test-seed#[E85A51084DDF657F]) [    ] o.a.s.c.SolrXmlConfig Configuration parameter autoReplicaFailoverWorkLoopDelay is ignored
   [junit4]   2> 1240211 INFO  (TEST-FullSolrCloudDistribCmdsTest.test-seed#[E85A51084DDF657F]) [    ] o.a.s.c.SolrXmlConfig Configuration parameter autoReplicaFailoverBadNodeExpiration is ignored
   [junit4]   2> 1240212 INFO  (TEST-FullSolrCloudDistribCmdsTest.test-seed#[E85A51084DDF657F]) [    ] o.a.s.c.SolrXmlConfig MBean server found: com.sun.jmx.mbeanserver.JmxMBeanServer@fa4772, but no JMX reporters were configured - adding default JMX reporter.
   [junit4]   2> 1240214 INFO  (TEST-FullSolrCloudDistribCmdsTest.test-seed#[E85A51084DDF657F]) [    ] o.a.s.c.ZkContainer Zookeeper client=127.0.0.1:43319/solr
   [junit4]   2> 1240215 INFO  (zkConnectionManagerCallback-2529-thread-1) [    ] o.a.s.c.c.ConnectionManager zkClient has connected
   [junit4]   2> 1240216 INFO  (zkConnectionManagerCallback-2531-thread-1-processing-n:127.0.0.1:44677_wb%2Fl) [n:127.0.0.1:44677_wb%2Fl    ] o.a.s.c.c.ConnectionManager zkClient has connected
   [junit4]   2> 1240218 INFO  (TEST-FullSolrCloudDistribCmdsTest.test-seed#[E85A51084DDF657F]) [n:127.0.0.1:44677_wb%2Fl    ] o.a.s.c.c.ZkStateReader Updated live nodes from ZooKeeper... (0) -> (2)
   [junit4]   2> 1240219 INFO  (TEST-FullSolrCloudDistribCmdsTest.test-seed#[E85A51084DDF657F]) [n:127.0.0.1:44677_wb%2Fl    ] o.a.s.c.Overseer Overseer (id=null) closing
   [junit4]   2> 1240220 INFO  (TEST-FullSolrCloudDistribCmdsTest.test-seed#[E85A51084DDF657F]) [n:127.0.0.1:44677_wb%2Fl    ] o.a.s.c.ZkController Register node as live in ZooKeeper:/live_nodes/127.0.0.1:44677_wb%2Fl
   [junit4]   2> 1240220 INFO  (zkCallback-2520-thread-1-processing-n:127.0.0.1:42631_wb%2Fl) [n:127.0.0.1:42631_wb%2Fl    ] o.a.s.c.c.ZkStateReader Updated live nodes from ZooKeeper... (2) -> (3)
   [junit4]   2> 1240220 INFO  (zkCallback-2512-thread-1) [    ] o.a.s.c.c.ZkStateReader Updated live nodes from ZooKeeper... (2) -> (3)
   [junit4]   2> 1240221 INFO  (zkCallback-2530-thread-1-processing-n:127.0.0.1:44677_wb%2Fl) [n:127.0.0.1:44677_wb%2Fl    ] o.a.s.c.c.ZkStateReader Updated live nodes from ZooKeeper... (2) -> (3)
   [junit4]   2> 1240221 INFO  (zkCallback-2502-thread-2-processing-n:127.0.0.1:41237_wb%2Fl) [n:127.0.0.1:41237_wb%2Fl    ] o.a.s.c.c.ZkStateReader Updated live nodes from ZooKeeper... (2) -> (3)
   [junit4]   2> 1240304 INFO  (TEST-FullSolrCloudDistribCmdsTest.test-seed#[E85A51084DDF657F]) [n:127.0.0.1:44677_wb%2Fl    ] o.a.s.m.r.SolrJmxReporter JMX monitoring for 'solr.node' (registry 'solr.node') enabled at server: com.sun.jmx.mbeanserver.JmxMBeanServer@fa4772
   [junit4]   2> 1240312 INFO  (TEST-FullSolrCloudDistribCmdsTest.test-seed#[E85A51084DDF657F]) [n:127.0.0.1:44677_wb%2Fl    ] o.a.s.m.r.SolrJmxReporter JMX monitoring for 'solr.jvm' (registry 'solr.jvm') enabled at server: com.sun.jmx.mbeanserver.JmxMBeanServer@fa4772
   [junit4]   2> 1240312 INFO  (TEST-FullSolrCloudDistribCmdsTest.test-seed#[E85A51084DDF657F]) [n:127.0.0.1:44677_wb%2Fl    ] o.a.s.m.r.SolrJmxReporter JMX monitoring for 'solr.jetty' (registry 'solr.jetty') enabled at server: com.sun.jmx.mbeanserver.JmxMBeanServer@fa4772
   [junit4]   2> 1240313 INFO  (TEST-FullSolrCloudDistribCmdsTest.test-seed#[E85A51084DDF657F]) [n:127.0.0.1:44677_wb%2Fl    ] o.a.s.c.CorePropertiesLocator Found 0 core definitions underneath /home/jenkins/workspace/Lucene-Solr-7.x-Linux/solr/build/solr-core/test/J2/../../../../../../../../../home/jenkins/workspace/Lucene-Solr-7.x-Linux/solr/build/solr-core/test/J2/temp/solr.cloud.FullSolrCloudDistribCmdsTest_E85A51084DDF657F-001/shard-2-001/cores
   [junit4]   2> 1240321 INFO  (zkCallback-2520-thread-1-processing-n:127.0.0.1:42631_wb%2Fl) [n:127.0.0.1:42631_wb%2Fl    ] o.a.s.c.c.ZkStateReader A cluster state change: [WatchedEvent state:SyncConnected type:NodeDataChanged path:/collections/collection1/state.json] for collection [collection1] has occurred - updating... (live nodes size: [3])
   [junit4]   2> 1240345 INFO  (qtp15203938-13521) [n:127.0.0.1:41237_wb%2Fl    ] o.a.s.h.a.CollectionsHandler Invoked Collection Action :addreplica with params node=127.0.0.1:44677_wb%252Fl&action=ADDREPLICA&collection=collection1&shard=shard3&type=NRT&wt=javabin&version=2 and sendToOCPQueue=true
   [junit4]   2> 1240347 INFO  (OverseerCollectionConfigSetProcessor-99386234787856388-127.0.0.1:41237_wb%2Fl-n_0000000000) [n:127.0.0.1:41237_wb%2Fl    ] o.a.s.c.OverseerTaskQueue Response ZK path: /overseer/collection-queue-work/qnr-0000000004 doesn't exist.  Requestor may have disconnected from ZooKeeper
   [junit4]   2> 1240347 INFO  (OverseerThreadFactory-5167-thread-4-processing-n:127.0.0.1:41237_wb%2Fl) [n:127.0.0.1:41237_wb%2Fl    ] o.a.s.c.a.c.AddReplicaCmd Node Identified 127.0.0.1:44677_wb%2Fl for creating new replica
   [junit4]   2> 1240348 INFO  (qtp25301523-13570) [n:127.0.0.1:44677_wb%2Fl    ] o.a.s.h.a.CoreAdminOperation core create command qt=/admin/cores&collection.configName=conf1&name=collection1_shard3_replica_n63&action=CREATE&collection=collection1&shard=shard3&wt=javabin&version=2&replicaType=NRT
   [junit4]   2> 1240348 INFO  (qtp25301523-13570) [n:127.0.0.1:44677_wb%2Fl    ] o.a.s.c.TransientSolrCoreCacheDefault Allocating transient cache for 4 transient cores
   [junit4]   2> 1240450 INFO  (zkCallback-2520-thread-1-processing-n:127.0.0.1:42631_wb%2Fl) [n:127.0.0.1:42631_wb%2Fl    ] o.a.s.c.c.ZkStateReader A cluster state change: [WatchedEvent state:SyncConnected type:NodeDataChanged path:/collections/collection1/state.json] for collection [collection1] has occurred - updating... (live nodes size: [3])
   [junit4]   2> 1240450 INFO  (zkCallback-2530-thread-1-processing-n:127.0.0.1:44677_wb%2Fl) [n:127.0.0.1:44677_wb%2Fl    ] o.a.s.c.c.ZkStateReader A cluster state change: [WatchedEvent state:SyncConnected type:NodeDataChanged path:/collections/collection1/state.json] for collection [collection1] has occurred - updating... (live nodes size: [3])
   [junit4]   2> 1241392 INFO  (qtp25301523-13570) [n:127.0.0.1:44677_wb%2Fl c:collection1 s:shard3  x:collection1_shard3_replica_n63] o.a.s.c.SolrConfig Using Lucene MatchVersion: 7.3.0
   [junit4]   2> 1241408 INFO  (qtp25301523-13570) [n:127.0.0.1:44677_wb%2Fl c:collection1 s:shard3  x:collection1_shard3_replica_n63] o.a.s.s.IndexSchema [collection1_shard3_replica_n63] Schema name=test
   [junit4]   2> 1241463 INFO  (qtp25301523-13570) [n:127.0.0.1:44677_wb%2Fl c:collection1 s:shard3  x:collection1_shard3_replica_n63] o.a.s.s.IndexSchema Loaded schema test/1.6 with uniqueid field id
   [junit4]   2> 1241470 INFO  (qtp25301523-13570) [n:127.0.0.1:44677_wb%2Fl c:collection1 s:shard3  x:collection1_shard3_replica_n63] o.a.s.c.CoreContainer Creating SolrCore 'collection1_shard3_replica_n63' using configuration from collection collection1, trusted=true
   [junit4]   2> 1241470 INFO  (qtp25301523-13570) [n:127.0.0.1:44677_wb%2Fl c:collection1 s:shard3  x:collection1_shard3_replica_n63] o.a.s.m.r.SolrJmxReporter JMX monitoring for 'solr.core.collection1.shard3.replica_n63' (registry 'solr.core.collection1.shard3.replica_n63') enabled at server: com.sun.jmx.mbeanserver.JmxMBeanServer@fa4772
   [junit4]   2> 1241471 INFO  (qtp25301523-13570) [n:127.0.0.1:44677_wb%2Fl c:collection1 s:shard3  x:collection1_shard3_replica_n63] o.a.s.c.SolrCore solr.RecoveryStrategy.Builder
   [junit4]   2> 1241471 INFO  (qtp25301523-13570) [n:127.0.0.1:44677_wb%2Fl c:collection1 s:shard3  x:collection1_shard3_replica_n63] o.a.s.c.SolrCore [[collection1_shard3_replica_n63] ] Opening new SolrCore at [/home/jenkins/workspace/Lucene-Solr-7.x-Linux/solr/build/solr-core/test/J2/temp/solr.cloud.FullSolrCloudDistribCmdsTest_E85A51084DDF657F-001/shard-2-001/cores/collection1_shard3_replica_n63], dataDir=[/home/jenkins/workspace/Lucene-Solr-7.x-Linux/solr/build/solr-core/test/J2/../../../../../../../../../home/jenkins/workspace/Lucene-Solr-7.x-Linux/solr/build/solr-core/test/J2/temp/solr.cloud.FullSolrCloudDistribCmdsTest_E85A51084DDF657F-001/shard-2-001/cores/collection1_shard3_replica_n63/data/]
   [junit4]   2> 1241472 INFO  (qtp25301523-13570) [n:127.0.0.1:44677_wb%2Fl c:collection1 s:shard3  x:collection1_shard3_replica_n63] o.a.s.u.RandomMergePolicy RandomMergePolicy wrapping class org.apache.lucene.index.TieredMergePolicy: [TieredMergePolicy: maxMergeAtOnce=37, maxMergeAtOnceExplicit=48, maxMergedSegmentMB=60.1494140625, floorSegmentMB=1.2294921875, forceMergeDeletesPctAllowed=10.811039269288742, segmentsPerTier=41.0, maxCFSSegmentSizeMB=8.796093022207999E12, noCFSRatio=0.0
   [junit4]   2> 1241474 WARN  (qtp25301523-13570) [n:127.0.0.1:44677_wb%2Fl c:collection1 s:shard3  x:collection1_shard3_replica_n63] o.a.s.c.RequestHandlers INVALID paramSet a in requestHandler {type = requestHandler,name = /dump,class = DumpRequestHandler,attributes = {initParams=a, name=/dump, class=DumpRequestHandler},args = {defaults={a=A,b=B}}}
   [junit4]   2> 1241508 INFO  (qtp25301523-13570) [n:127.0.0.1:44677_wb%2Fl c:collection1 s:shard3  x:collection1_shard3_replica_n63] o.a.s.u.UpdateHandler Using UpdateLog implementation: org.apache.solr.update.UpdateLog
   [junit4]   2> 1241508 INFO  (qtp25301523-13570) [n:127.0.0.1:44677_wb%2Fl c:collection1 s:shard3  x:collection1_shard3_replica_n63] o.a.s.u.UpdateLog Initializing UpdateLog: dataDir= defaultSyncLevel=FLUSH numRecordsToKeep=100 maxNumLogsToKeep=10 numVersionBuckets=65536
   [junit4]   2> 1241509 INFO  (qtp25301523-13570) [n:127.0.0.1:44677_wb%2Fl c:collection1 s:shard3  x:collection1_shard3_replica_n63] o.a.s.u.CommitTracker Hard AutoCommit: disabled
   [junit4]   2> 1241509 INFO  (qtp25301523-13570) [n:127.0.0.1:44677_wb%2Fl c:collection1 s:shard3  x:collection1_shard3_replica_n63] o.a.s.u.CommitTracker Soft AutoCommit: disabled
   [junit4]   2> 1241511 INFO  (qtp25301523-13570) [n:127.0.0.1:44677_wb%2Fl c:collection1 s:shard3  x:collection1_shard3_replica_n63] o.a.s.u.RandomMergePolicy RandomMergePolicy wrapping class org.apache.lucene.index.TieredMergePolicy: [TieredMergePolicy: maxMergeAtOnce=28, maxMergeAtOnceExplicit=12, maxMergedSegmentMB=4.091796875, floorSegmentMB=1.7578125, forceMergeDeletesPctAllowed=25.41074357631232, segmentsPerTier=44.0, maxCFSSegmentSizeMB=8.796093022207999E12, noCFSRatio=1.0
   [junit4]   2> 1241511 INFO  (qtp25301523-13570) [n:127.0.0.1:44677_wb%2Fl c:collection1 s:shard3  x:collection1_shard3_replica_n63] o.a.s.s.SolrIndexSearcher Opening [Searcher@6af371[collection1_shard3_replica_n63] main]
   [junit4]   2> 1241512 INFO  (qtp25301523-13570) [n:127.0.0.1:44677_wb%2Fl c:collection1 s:shard3  x:collection1_shard3_replica_n63] o.a.s.r.ManagedResourceStorage Configured ZooKeeperStorageIO with znodeBase: /configs/conf1
   [junit4]   2> 1241512 INFO  (qtp25301523-13570) [n:127.0.0.1:44677_wb%2Fl c:collection1 s:shard3  x:collection1_shard3_replica_n63] o.a.s.r.ManagedResourceStorage Loaded null at path _rest_managed.json using ZooKeeperStorageIO:path=/configs/conf1
   [junit4]   2> 1241512 INFO  (qtp25301523-13570) [n:127.0.0.1:44677_wb%2Fl c:collection1 s:shard3  x:collection1_shard3_replica_n63] o.a.s.h.ReplicationHandler Commits will be reserved for 10000ms.
   [junit4]   2> 1241512 INFO  (qtp25301523-13570) [n:127.0.0.1:44677_wb%2Fl c:collection1 s:shard3  x:collection1_shard3_replica_n63] o.a.s.u.UpdateLog Could not find max version in index or recent updates, using new clock 1590179762870943744
   [junit4]   2> 1241513 INFO  (searcherExecutor-5192-thread-1-processing-n:127.0.0.1:44677_wb%2Fl x:collection1_shard3_replica_n63 s:shard3 c:collection1) [n:127.0.0.1:44677_wb%2Fl c:collection1 s:shard3  x:collection1_shard3_replica_n63] o.a.s.c.SolrCore [collection1_shard3_replica_n63] Registered new searcher Searcher@6af371[collection1_shard3_replica_n63] main{ExitableDirectoryReader(UninvertingDirectoryReader())}
   [junit4]   2> 1241515 INFO  (qtp25301523-13570) [n:127.0.0.1:44677_wb%2Fl c:collection1 s:shard3  x:collection1_shard3_replica_n63] o.a.s.c.ShardLeaderElectionContext Enough replicas found to continue.
   [junit4]   2> 1241515 INFO  (qtp25301523-13570) [n:127.0.0.1:44677_wb%2Fl c:collection1 s:shard3  x:collection1_shard3_replica_n63] o.a.s.c.ShardLeaderElectionContext I may be the new leader - try and sync
   [junit4]   2> 1241515 INFO  (qtp25301523-13570) [n:127.0.0.1:44677_wb%2Fl c:collection1 s:shard3  x:collection1_shard3_replica_n63] o.a.s.c.SyncStrategy Sync replicas to http://127.0.0.1:44677/wb/l/collection1_shard3_replica_n63/
   [junit4]   2> 1241515 INFO  (qtp25301523-13570) [n:127.0.0.1:44677_wb%2Fl c:collection1 s:shard3  x:collection1_shard3_replica_n63] o.a.s.c.SyncStrategy Sync Success - now sync replicas to me
   [junit4]   2> 1241515 INFO  (qtp25301523-13570) [n:127.0.0.1:44677_wb%2Fl c:collection1 s:shard3  x:collection1_shard3_replica_n63] o.a.s.c.SyncStrategy http://127.0.0.1:44677/wb/l/collection1_shard3_replica_n63/ has no replicas
   [junit4]   2> 1241515 INFO  (qtp25301523-13570) [n:127.0.0.1:44677_wb%2Fl c:collection1 s:shard3  x:collection1_shard3_replica_n63] o.a.s.c.ShardLeaderElectionContext Found all replicas participating in election, clear LIR
   [junit4]   2> 1241516 INFO  (qtp25301523-13570) [n:127.0.0.1:44677_wb%2Fl c:collection1 s:shard3  x:collection1_shard3_replica_n63] o.a.s.c.ShardLeaderElectionContext I am the new leader: http://127.0.0.1:44677/wb/l/collection1_shard3_replica_n63/ shard3
   [junit4]   2> 1241617 INFO  (zkCallback-2520-thread-1-processing-n:127.0.0.1:42631_wb%2Fl) [n:127.0.0.1:42631_wb%2Fl    ] o.a.s.c.c.ZkStateReader A cluster state change: [WatchedEvent state:SyncConnected type:NodeDataChanged path:/collections/collection1/state.json] for collection [collection1] has occurred - updating... (live nodes size: [3])
   [junit4]   2> 1241617 INFO  (zkCallback-2530-thread-1-processing-n:127.0.0.1:44677_wb%2Fl) [n:127.0.0.1:44677_wb%2Fl    ] o.a.s.c.c.ZkStateReader A cluster state change: [WatchedEvent state:SyncConnected type:NodeDataChanged path:/collections/collection1/state.json] for collection [collection1] has occurred - updating... (live nodes size: [3])
   [junit4]   2> 1241666 INFO  (qtp25301523-13570) [n:127.0.0.1:44677_wb%2Fl c:collection1 s:shard3  x:collection1_shard3_replica_n63] o.a.s.c.ZkController I am the leader, no recovery necessary
   [junit4]   2> 1241668 INFO  (qtp25301523-13570) [n:127.0.0.1:44677_wb%2Fl c:collection1 s:shard3  x:collection1_shard3_replica_n63] o.a.s.s.HttpSolrCall [admin] webapp=null path=/admin/cores params={qt=/admin/cores&collection.configName=conf1&name=collection1_shard3_replica_n63&action=CREATE&collection=collection1&shard=shard3&wt=javabin&version=2&replicaType=NRT} status=0 QTime=1320
   [junit4]   2> 1241670 INFO  (qtp15203938-13521) [n:127.0.0.1:41237_wb%2Fl    ] o.a.s.s.HttpSolrCall [admin] webapp=null path=/admin/collections params={node=127.0.0.1:44677_wb%252Fl&action=ADDREPLICA&collection=collection1&shard=shard3&type=NRT&wt=javabin&version=2} status=0 QTime=1324
   [junit4]   2> 1241757 INFO  (TEST-FullSolrCloudDistribCmdsTest.test-seed#[E85A51084DDF657F]) [    ] o.a.s.c.AbstractFullDistribZkTestBase create jetty 3 in directory /home/jenkins/workspace/Lucene-Solr-7.x-Linux/solr/build/solr-core/test/J2/temp/solr.cloud.FullSolrCloudDistribCmdsTest_E85A51084DDF657F-001/shard-3-001 of type NRT
   [junit4]   2> 1241758 INFO  (TEST-FullSolrCloudDistribCmdsTest.test-seed#[E85A51084DDF657F]) [    ] o.e.j.s.Server jetty-9.4.8.v20171121, build timestamp: ????-??-??T??:??:??-08:00, git hash: 82b8fb23f757335bb3329d540ce37a2a2615f0a8
   [junit4]   2> 1241759 INFO  (TEST-FullSolrCloudDistribCmdsTest.test-seed#[E85A51084DDF657F]) [    ] o.e.j.s.session DefaultSessionIdManager workerName=node0
   [junit4]   2> 1241759 INFO  (TEST-FullSolrCloudDistribCmdsTest.test-seed#[E85A51084DDF657F]) [    ] o.e.j.s.session No SessionScavenger set, using defaults
   [junit4]   2> 1241759 INFO  (TEST-FullSolrCloudDistribCmdsTest.test-seed#[E85A51084DDF657F]) [    ] o.e.j.s.session Scavenging every 660000ms
   [junit4]   2> 1241759 INFO  (TEST-FullSolrCloudDistribCmdsTest.test-seed#[E85A51084DDF657F]) [    ] o.e.j.s.h.ContextHandler Started o.e.j.s.ServletContextHandler@b865ae{/wb/l,null,AVAILABLE}
   [junit4]   2> 1241760 INFO  (TEST-FullSolrCloudDistribCmdsTest.test-seed#[E85A51084DDF657F]) [    ] o.e.j.s.AbstractConnector Started ServerConnector@188e2bb{HTTP/1.1,[http/1.1]}{127.0.0.1:38613}
   [junit4]   2> 1241760 INFO  (TEST-FullSolrCloudDistribCmdsTest.test-seed#[E85A51084DDF657F]) [    ] o.e.j.s.Server Started @1243302ms
   [junit4]   2> 1241760 INFO  (TEST-FullSolrCloudDistribCmdsTest.test-seed#[E85A51084DDF657F]) [    ] o.a.s.c.s.e.JettySolrRunner Jetty properties: {solr.data.dir=/home/jenkins/workspace/Lucene-Solr-7.x-Linux/solr/build/solr-core/test/J2/temp/solr.cloud.FullSolrCloudDistribCmdsTest_E85A51084DDF657F-001/tempDir-001/jetty3, solrconfig=solrconfig.xml, hostContext=/wb/l, hostPort=38613, coreRootDirectory=/home/jenkins/workspace/Lucene-Solr-7.x-Linux/solr/build/solr-core/test/J2/../../../../../../../../../home/jenkins/workspace/Lucene-Solr-7.x-Linux/solr/build/solr-core/test/J2/temp/solr.cloud.FullSolrCloudDistribCmdsTest_E85A51084DDF657F-001/shard-3-001/cores}
   [junit4]   2> 1241760 ERROR (TEST-FullSolrCloudDistribCmdsTest.test-seed#[E85A51084DDF657F]) [    ] o.a.s.u.StartupLoggingUtils Missing Java Option solr.log.dir. Logging may be missing or incomplete.
   [junit4]   2> 1241760 INFO  (TEST-FullSolrCloudDistribCmdsTest.test-seed#[E85A51084DDF657F]) [    ] o.a.s.s.SolrDispatchFilter  ___      _       Welcome to Apache Solr? version 7.3.0
   [junit4]   2> 1241760 INFO  (TEST-FullSolrCloudDistribCmdsTest.test-seed#[E85A51084DDF657F]) [    ] o.a.s.s.SolrDispatchFilter / __| ___| |_ _   Starting in cloud mode on port null
   [junit4]   2> 1241760 INFO  (TEST-FullSolrCloudDistribCmdsTest.test-seed#[E85A51084DDF657F]) [    ] o.a.s.s.SolrDispatchFilter \__ \/ _ \ | '_|  Install dir: null
   [junit4]   2> 1241760 INFO  (TEST-FullSolrCloudDistribCmdsTest.test-seed#[E85A51084DDF657F]) [    ] o.a.s.s.SolrDispatchFilter |___/\___/_|_|    Start time: 2018-01-21T05:46:38.567Z
   [junit4]   2> 1241761 INFO  (zkConnectionManagerCallback-2535-thread-1) [    ] o.a.s.c.c.ConnectionManager zkClient has connected
   [junit4]   2> 1241762 INFO  (TEST-FullSolrCloudDistribCmdsTest.test-seed#[E85A51084DDF657F]) [    ] o.a.s.s.SolrDispatchFilter Loading solr.xml from SolrHome (not found in ZooKeeper)
   [junit4]   2> 1241762 INFO  (TEST-FullSolrCloudDistribCmdsTest.test-seed#[E85A51084DDF657F]) [    ] o.a.s.c.SolrXmlConfig Loading container configuration from /home/jenkins/workspace/Lucene-Solr-7.x-Linux/solr/build/solr-core/test/J2/temp/solr.cloud.FullSolrCloudDistribCmdsTest_E85A51084DDF657F-001/shard-3-001/solr.xml
   [junit4]   2> 1241764 INFO  (TEST-FullSolrCloudDistribCmdsTest.test-seed#[E85A51084DDF657F]) [    ] o.a.s.c.SolrXmlConfig Configuration parameter autoReplicaFailoverWorkLoopDelay is ignored
   [junit4]   2> 1241764 INFO  (TEST-FullSolrCloudDistribCmdsTest.test-seed#[E85A51084DDF657F]) [    ] o.a.s.c.SolrXmlConfig Configuration parameter autoReplicaFailoverBadNodeExpiration is ignored
   [junit4]   2> 1241764 INFO  (TEST-FullSolrCloudDistribCmdsTest.test-seed#[E85A51084DDF657F]) [    ] o.a.s.c.SolrXmlConfig MBean server found: com.sun.jmx.mbeanserver.JmxMBeanServer@fa4772, but no JMX reporters were configured - adding default JMX reporter.
   [junit4]   2> 1241767 INFO  (TEST-FullSolrCloudDistribCmdsTest.test-seed#[E85A51084DDF657F]) [    ] o.a.s.c.ZkContainer Zookeeper client=127.0.0.1:43319/solr
   [junit4]   2> 1241767 INFO  (zkConnectionManagerCallback-2539-thread-1) [    ] o.a.s.c.c.ConnectionManager zkClient has connected
   [junit4]   2> 1241768 INFO  (zkCallback-2520-thread-1-processing-n:127.0.0.1:42631_wb%2Fl) [n:127.0.0.1:42631_wb%2Fl    ] o.a.s.c.c.ZkStateReader A cluster state change: [WatchedEvent state:SyncConnected type:NodeDataChanged path:/collections/collection1/state.json] for collection [collection1] has occurred - updating... (live nodes size: [3])
   [junit4]   2> 1241768 INFO  (zkCallback-2530-thread-1-processing-n:127.0.0.1:44677_wb%2Fl) [n:127.0.0.1:44677_wb%2Fl    ] o.a.s.c.c.ZkStateReader A cluster state change: [WatchedEvent state:SyncConnected type:NodeDataChanged path:/collections/collection1/state.json] for collection [collection1] has occurred - updating... (live nodes size: [3])
   [junit4]   2> 1241769 INFO  (zkConnectionManagerCallback-2541-thread-1-processing-n:127.0.0.1:38613_wb%2Fl) [n:127.0.0.1:38613_wb%2Fl    ] o.a.s.c.c.ConnectionManager zkClient has connected
   [junit4]   2> 1241771 INFO  (TEST-FullSolrCloudDistribCmdsTest.test-seed#[E85A51084DDF657F]) [n:127.0.0.1:38613_wb%2Fl    ] o.a.s.c.c.ZkStateReader Updated live nodes from ZooKeeper... (0) -> (3)
   [junit4]   2> 1241771 INFO  (TEST-FullSolrCloudDistribCmdsTest.test-seed#[E85A51084DDF657F]) [n:127.0.0.1:38613_wb%2Fl    ] o.a.s.c.Overseer Overseer (id=null) closing
   [junit4]   2> 1241772 INFO  (TEST-FullSolrCloudDistribCmdsTest.test-seed#[E85A51084DDF657F]) [n:127.0.0.1:38613_wb%2Fl    ] o.a.s.c.ZkController Register node as live in ZooKeeper:/live_nodes/127.0.0.1:38613_wb%2Fl
   [junit4]   2> 1241772 INFO  (zkCallback-2520-thread-1-processing-n:127.0.0.1:42631_wb%2Fl) [n:127.0.0.1:42631_wb%2Fl    ] o.a.s.c.c.ZkStateReader Updated live nodes from ZooKeeper... (3) -> (4)
   [junit4]   2> 1241772 INFO  (zkCallback-2502-thread-2-processing-n:127.0.0.1:41237_wb%2Fl) [n:127.0.0.1:41237_wb%2Fl    ] o.a.s.c.c.ZkStateReader Updated live nodes from ZooKeeper... (3) -> (4)
   [junit4]   2> 1241772 INFO  (zkCallback-2530-thread-1-processing-n:127.0.0.1:44677_wb%2Fl) [n:127.0.0.1:44677_wb%2Fl    ] o.a.s.c.c.ZkStateReader Updated live nodes from ZooKeeper... (3) -> (4)
   [junit4]   2> 1241772 INFO  (zkCallback-2512-thread-1) [    ] o.a.s.c.c.ZkStateReader Updated live nodes from ZooKeeper... (3) -> (4)
   [junit4]   2> 1241773 INFO  (zkCallback-2540-thread-1-processing-n:127.0.0.1:38613_wb%2Fl) [n:127.0.0.1:38613_wb%2Fl    ] o.a.s.c.c.ZkStateReader Updated live nodes from ZooKeeper... (3) -> (4)
   [junit4]   2> 1241869 INFO  (TEST-FullSolrCloudDistribCmdsTest.test-seed#[E85A51084DDF657F]) [n:127.0.0.1:38613_wb%2Fl    ] o.a.s.m.r.SolrJmxReporter JMX monitoring for 'solr.node' (registry 'solr.node') enabled at server: com.sun.jmx.mbeanserver.JmxMBeanServer@fa4772
   [junit4]   2> 1241876 INFO  (TEST-FullSolrCloudDistribCmdsTest.test-seed#[E85A51084DDF657F]) [n:127.0.0.1:38613_wb%2Fl    ] o.a.s.m.r.SolrJmxReporter JMX monitoring for 'solr.jvm' (registry 'solr.jvm') enabled at server: com.sun.jmx.mbeanserver.JmxMBeanServer@fa4772
   [junit4]   2> 1241876 INFO  (TEST-FullSolrCloudDistribCmdsTest.test-seed#[E85A51084DDF657F]) [n:127.0.0.1:38613_wb%2Fl    ] o.a.s.m.r.SolrJmxReporter JMX monitoring for 'solr.jetty' (registry 'solr.jetty') enabled at server: com.sun.jmx.mbeanserver.JmxMBeanServer@fa4772
   [junit4]   2> 1241877 INFO  (TEST-FullSolrCloudDistribCmdsTest.test-seed#[E85A51084DDF657F]) [n:127.0.0.1:38613_wb%2Fl    ] o.a.s.c.CorePropertiesLocator Found 0 core definitions underneath /home/jenkins/workspace/Lucene-Solr-7.x-Linux/solr/build/solr-core/test/J2/../../../../../../../../../home/jenkins/workspace/Lucene-Solr-7.x-Linux/solr/build/solr-core/test/J2/temp/solr.cloud.FullSolrCloudDistribCmdsTest_E85A51084DDF657F-001/shard-3-001/cores
   [junit4]   2> 1241908 INFO  (qtp26464423-13601) [n:127.0.0.1:38613_wb%2Fl    ] o.a.s.h.a.CollectionsHandler Invoked Collection Action :addreplica with params node=127.0.0.1:38613_wb%252Fl&action=ADDREPLICA&collection=collection1&shard=shard1&type=NRT&wt=javabin&version=2 and sendToOCPQueue=true
   [junit4]   2> 1241910 INFO  (OverseerCollectionConfigSetProcessor-99386234787856388-127.0.0.1:41237_wb%2Fl-n_0000000000) [n:127.0.0.1:41237_wb%2Fl    ] o.a.s.c.OverseerTaskQueue Response ZK path: /overseer/collection-queue-work/qnr-0000000006 doesn't exist.  Requestor may have disconnected from ZooKeeper
   [junit4]   2> 1241910 INFO  (OverseerThreadFactory-5167-thread-5-processing-n:127.0.0.1:41237_wb%2Fl) [n:127.0.0.1:41237_wb%2Fl    ] o.a.s.c.a.c.AddReplicaCmd Node Identified 127.0.0.1:38613_wb%2Fl for creating new replica
   [junit4]   2> 1241912 INFO  (qtp26464423-13627) [n:127.0.0.1:38613_wb%2Fl    ] o.a.s.h.a.CoreAdminOperation core create command qt=/admin/cores&collection.configName=conf1&name=collection1_shard1_replica_n65&action=CREATE&collection=collection1&shard=shard1&wt=javabin&version=2&replicaType=NRT
   [junit4]   2> 1241912 INFO  (qtp26464423-13627) [n:127.0.0.1:38613_wb%2Fl    ] o.a.s.c.TransientSolrCoreCacheDefault Allocating transient cache for 4 transient cores
   [junit4]   2> 1242015 INFO  (zkCallback-2530-thread-1-processing-n:127.0.0.1:44677_wb%2Fl) [n:127.0.0.1:44677_wb%2Fl    ] o.a.s.c.c.ZkStateReader A cluster state change: [WatchedEvent state:SyncConnected type:NodeDataChanged path:/collections/collection1/state.json] for collection [collection1] has occurred - updating... (live nodes size: [4])
   [junit4]   2> 1242015 INFO  (zkCallback-2540-thread-1-processing-n:127.0.0.1:38613_wb%2Fl) [n:127.0.0.1:38613_wb%2Fl    ] o.a.s.c.c.ZkStateReader A cluster state change: [WatchedEvent state:SyncConnected type:NodeDataChanged path:/collections/collection1/state.json] for collection [collection1] has occurred - updating... (live nodes size: [4])
   [junit4]   2> 1242015 INFO  (zkCallback-2520-thread-1-processing-n:127.0.0.1:42631_wb%2Fl) [n:127.0.0.1:42631_wb%2Fl    ] o.a.s.c.c.ZkStateReader A cluster state change: [WatchedEvent state:SyncConnected type:NodeDataChanged path:/collections/collection1/state.json] for collection [collection1] has occurred - updating... (live nodes size: [4])
   [junit4]   2> 1242987 INFO  (qtp26464423-13627) [n:127.0.0.1:38613_wb%2Fl c:collection1 s:shard1  x:collection1_shard1_replica_n65] o.a.s.c.SolrConfig Using Lucene MatchVersion: 7.3.0
   [junit4]   2> 1242995 INFO  (qtp26464423-13627) [n:127.0.0.1:38613_wb%2Fl c:collection1 s:shard1  x:collection1_shard1_replica_n65] o.a.s.s.IndexSchema [collection1_shard1_replica_n65] Schema name=test
   [junit4]   2> 1243044 INFO  (qtp26464423-13627) [n:127.0.0.1:38613_wb%2Fl c:collection1 s:shard1  x:collection1_shard1_replica_n65] o.a.s.s.IndexSchema Loaded schema test/1.6 with uniqueid field id
   [junit4]   2> 1243051 INFO  (qtp26464423-13627) [n:127.0.0.1:38613_wb%2Fl c:collection1 s:shard1  x:collection1_shard1_replica_n65] o.a.s.c.CoreContainer Creating SolrCore 'collection1_shard1_replica_n65' using configuration from collection collection1, trusted=true
   [junit4]   2> 1243052 INFO  (qtp26464423-13627) [n:127.0.0.1:38613_wb%2Fl c:collection1 s:shard1  x:collection1_shard1_replica_n65] o.a.s.m.r.SolrJmxReporter JMX monitoring for 'solr.core.collection1.shard1.replica_n65' (registry 'solr.core.collection1.shard1.replica_n65') enabled at server: com.sun.jmx.mbeanserver.JmxMBeanServer@fa4772
   [junit4]   2> 1243052 INFO  (qtp26464423-13627) [n:127.0.0.1:38613_wb%2Fl c:collection1 s:shard1  x:collection1_shard1_replica_n65] o.a.s.c.SolrCore solr.RecoveryStrategy.Builder
   [junit4]   2> 1243052 INFO  (qtp26464423-13627) [n:127.0.0.1:38613_wb%2Fl c:collection1 s:shard1  x:collection1_shard1_replica_n65] o.a.s.c.SolrCore [[collection1_shard1_replica_n65] ] Opening new SolrCore at [/home/jenkins/workspace/Lucene-Solr-7.x-Linux/solr/build/solr-core/test/J2/temp/solr.cloud.FullSolrCloudDistribCmdsTest_E85A51084DDF657F-001/shard-3-001/cores/collection1_shard1_replica_n65], dataDir=[/home/jenkins/workspace/Lucene-Solr-7.x-Linux/solr/build/solr-core/test/J2/../../../../../../../../../home/jenkins/workspace/Lucene-Solr-7.x-Linux/solr/build/solr-core/test/J2/temp/solr.cloud.FullSolrCloudDistribCmdsTest_E85A51084DDF657F-001/shard-3-001/cores/collection1_shard1_replica_n65/data/]
   [junit4]   2> 1243053 INFO  (qtp26464423-13627) [n:127.0.0.1:38613_wb%2Fl c:collection1 s:shard1  x:collection1_shard1_replica_n65] o.a.s.u.RandomMergePolicy RandomMergePolicy wrapping class org.apache.lucene.index.TieredMergePolicy: [TieredMergePolicy: maxMergeAtOnce=37, maxMergeAtOnceExplicit=48, maxMergedSegmentMB=60.1494140625, floorSegmentMB=1.2294921875, forceMergeDeletesPctAllowed=10.811039269288742, segmentsPerTier=41.0, maxCFSSegmentSizeMB=8.796093022207999E12, noCFSRatio=0.0
   [junit4]   2> 1243055 WARN  (qtp26464423-13627) [n:127.0.0.1:38613_wb%2Fl c:collection1 s:shard1  x:collection1_shard1_replica_n65] o.a.s.c.RequestHandlers INVALID paramSet a in requestHandler {type = requestHandler,name = /dump,class = DumpRequestHandler,attributes = {initParams=a, name=/dump, class=DumpRequestHandler},args = {defaults={a=A,b=B}}}
   [junit4]   2> 1243079 INFO  (qtp26464423-13627) [n:127.0.0.1:38613_wb%2Fl c:collection1 s:shard1  x:collection1_shard1_replica_n65] o.a.s.u.UpdateHandler Using UpdateLog implementation: org.apache.solr.update.UpdateLog
   [junit4]   2> 1243079 INFO  (qtp26464423-13627) [n:127.0.0.1:38613_wb%2Fl c:collection1 s:shard1  x:collection1_shard1_replica_n65] o.a.s.u.UpdateLog Initializing UpdateLog: dataDir= defaultSyncLevel=FLUSH numRecordsToKeep=100 maxNumLogsToKeep=10 numVersionBuckets=65536
   [junit4]   2> 1243080 INFO  (qtp26464423-13627) [n:127.0.0.1:38613_wb%2Fl c:collection1 s:shard1  x:collection1_shard1_replica_n65] o.a.s.u.CommitTracker Hard AutoCommit: disabled
   [junit4]   2> 1243080 INFO  (qtp26464423-13627) [n:127.0.0.1:38613_wb%2Fl c:collection1 s:shard1  x:collection1_shard1_replica_n65] o.a.s.u.CommitTracker Soft AutoCommit: disabled
   [junit4]   2> 1243081 INFO  (qtp26464423-13627) [n:127.0.0.1:38613_wb%2Fl c:collection1 s:shard1  x:collection1_sha

[...truncated too long message...]

.shared.SharedValue.access$100(SharedValue.java:44)
   [junit4]   2> 	at org.apache.curator.framework.recipes.shared.SharedValue$1.process(SharedValue.java:61)
   [junit4]   2> 	at org.apache.curator.framework.imps.NamespaceWatcher.process(NamespaceWatcher.java:67)
   [junit4]   2> 	at org.apache.zookeeper.ClientCnxn$EventThread.processEvent(ClientCnxn.java:530)
   [junit4]   2> 	at org.apache.zookeeper.ClientCnxn$EventThread.run(ClientCnxn.java:505)
   [junit4]   2> Jan 21, 2018 5:56:11 AM com.carrotsearch.randomizedtesting.ThreadLeakControl tryToInterruptAll
   [junit4]   2> INFO: All leaked threads terminated.
   [junit4]   2> NOTE: test params are: codec=Asserting(Lucene70): {}, docValues:{}, maxPointsInLeafNode=1848, maxMBSortInHeap=5.628196505420811, sim=RandomSimilarity(queryNorm=true): {}, locale=es-DO, timezone=America/Guadeloupe
   [junit4]   2> NOTE: Linux 4.13.0-26-generic i386/Oracle Corporation 1.8.0_144 (32-bit)/cpus=8,threads=1,free=169384992,total=525074432
   [junit4]   2> NOTE: All tests run in this JVM: [HttpPartitionTest, CoreMergeIndexesAdminHandlerTest, TestElisionMultitermQuery, TestFieldCacheVsDocValues, AddReplicaTest, OverseerRolesTest, TestShortCircuitedRequests, DOMUtilTest, AutoAddReplicasIntegrationTest, TestFreeTextSuggestions, BasicFunctionalityTest, TestTriggerIntegration, BigEndianAscendingWordDeserializerTest, TestInPlaceUpdatesDistrib, TestReversedWildcardFilterFactory, SolrShardReporterTest, TestGenericDistributedQueue, DistributedFacetPivotSmallTest, ShardRoutingCustomTest, SoftAutoCommitTest, TestLockTree, DistributedIntervalFacetingTest, TestInitQParser, BadComponentTest, TestClusterProperties, TestDynamicFieldCollectionResource, TestSolrCloudWithHadoopAuthPlugin, ScriptEngineTest, PeerSyncTest, TestRecovery, ZkControllerTest, TestObjectReleaseTracker, SolrCoreTest, SimplePostToolTest, XsltUpdateRequestHandlerTest, PrimUtilsTest, SampleTest, OverriddenZkACLAndCredentialsProvidersTest, HdfsNNFailoverTest, CollectionReloadTest, TestDistributedStatsComponentCardinality, TimeRoutedAliasUpdateProcessorTest, RulesTest, RequiredFieldsTest, TestQueryWrapperFilter, ChaosMonkeySafeLeaderTest, TestLeaderElectionWithEmptyReplica, TestAnalyzeInfixSuggestions, TestStandardQParsers, TestLegacyField, TestCloudPseudoReturnFields, CachingDirectoryFactoryTest, SolrInfoBeanTest, TestPivotHelperCode, TestRandomFlRTGCloud, TestCollectionAPI, SliceStateTest, TestQueryUtils, QueryElevationComponentTest, TestOverriddenPrefixQueryForCustomFieldType, VersionInfoTest, TestComplexPhraseQParserPlugin, TestScoreJoinQPNoScore, DistributedQueryComponentOptimizationTest, DistributedMLTComponentTest, SortByFunctionTest, QueryParsingTest, TestReload, TestFuzzyAnalyzedSuggestions, CurrencyRangeFacetCloudTest, TestJavabinTupleStreamParser, TestSha256AuthenticationProvider, TestNRTOpen, BlockDirectoryTest, AlternateDirectoryTest, HdfsLockFactoryTest, SolrMetricManagerTest, TestAuthorizationFramework, TestSurroundQueryParser, AddBlockUpdateTest, StressHdfsTest, LeaderFailureAfterFreshStartTest, TestSchemaNameResource, TestSystemCollAutoCreate, TestLRUCache, BlockJoinFacetDistribTest, ClassificationUpdateProcessorTest, JvmMetricsTest, LoggingHandlerTest, SearchHandlerTest, DeleteShardTest, DeleteLastCustomShardedReplicaTest, TestZkChroot, HttpTriggerListenerTest, OverseerTest, ReplaceNodeTest, TestSolrCloudSnapshots, TestExportWriter, TestEmbeddedSolrServerAdminHandler, TestSubQueryTransformerDistrib, BasicAuthIntegrationTest, TestRequestForwarding, SolrGangliaReporterTest, CloudMLTQParserTest, VMParamsZkACLAndCredentialsProvidersTest, TestBM25SimilarityFactory, TestLocalFSCloudBackupRestore, HdfsCollectionsAPIDistributedZkTest, BadCopyFieldTest, DirectUpdateHandlerOptimizeTest, TestDocBasedVersionConstraints, PolyFieldTest, SOLR749Test, TestBulkSchemaConcurrent, TestConfigsApi, PrimitiveFieldTypeTest, CSVRequestHandlerTest, HLLUtilTest, TestComputePlanAction, TestNodeLostTrigger, DirectoryFactoryTest, TestSweetSpotSimilarityFactory, TestXIncludeConfig, SchemaApiFailureTest, TestJettySolrRunner, ResourceLoaderTest, RecoveryZkTest, TestRandomFaceting, LeaderElectionTest, TestRandomDVFaceting, DistributedSpellCheckComponentTest, TestStressVersions, TestSolr4Spatial, TestGroupingSearch, TestBadConfig, DistributedQueryElevationComponentTest, SuggesterFSTTest, TestTrie, SuggesterWFSTTest, SchemaVersionSpecificBehaviorTest, TestPseudoReturnFields, FieldMutatingUpdateProcessorTest, TestRemoteStreaming, TestQueryTypes, XmlUpdateRequestHandlerTest, DocumentBuilderTest, TestIndexingPerformance, FieldAnalysisRequestHandlerTest, IndexSchemaRuntimeFieldTest, UpdateRequestProcessorFactoryTest, TestAnalyzedSuggestions, TestPartialUpdateDeduplication, TestQuerySenderListener, TestSolrIndexConfig, TestStressRecovery, TestHighlightDedupGrouping, TestTolerantSearch, TestEmbeddedSolrServerConstructors, ConnectionReuseTest, AssignBackwardCompatibilityTest, CollectionStateFormat2Test, DeleteReplicaTest, DistribCursorPagingTest, DocValuesNotIndexedTest, LeaderElectionContextKeyTest, LeaderFailoverAfterPartitionTest, MultiThreadedOCPTest, SSLMigrationTest, SaslZkACLProviderTest, SolrXmlInZkTest, TestCloudDeleteByQuery, TestCloudInspectUtil, TestCloudJSONFacetJoinDomain, TestConfigSetsAPI, TestSizeLimitedDistributedMap, TestSkipOverseerOperations, TestSolrCloudWithSecureImpersonation]
   [junit4]   2> NOTE: reproduce with: ant test  -Dtestcase=TestSolrCloudWithSecureImpersonation -Dtests.seed=E85A51084DDF657F -Dtests.multiplier=3 -Dtests.slow=true -Dtests.locale=es-DO -Dtests.timezone=America/Guadeloupe -Dtests.asserts=true -Dtests.file.encoding=US-ASCII
   [junit4] ERROR   0.00s J1 | TestSolrCloudWithSecureImpersonation (suite) <<<
   [junit4]    > Throwable #1: com.carrotsearch.randomizedtesting.ThreadLeakError: 2 threads leaked from SUITE scope at org.apache.solr.cloud.TestSolrCloudWithSecureImpersonation: 
   [junit4]    >    1) Thread[id=17468, name=jetty-launcher-3870-thread-2-EventThread, state=TIMED_WAITING, group=TGRP-TestSolrCloudWithSecureImpersonation]
   [junit4]    >         at sun.misc.Unsafe.park(Native Method)
   [junit4]    >         at java.util.concurrent.locks.LockSupport.parkNanos(LockSupport.java:215)
   [junit4]    >         at java.util.concurrent.locks.AbstractQueuedSynchronizer.doAcquireSharedNanos(AbstractQueuedSynchronizer.java:1037)
   [junit4]    >         at java.util.concurrent.locks.AbstractQueuedSynchronizer.tryAcquireSharedNanos(AbstractQueuedSynchronizer.java:1328)
   [junit4]    >         at java.util.concurrent.CountDownLatch.await(CountDownLatch.java:277)
   [junit4]    >         at org.apache.curator.CuratorZookeeperClient.internalBlockUntilConnectedOrTimedOut(CuratorZookeeperClient.java:323)
   [junit4]    >         at org.apache.curator.RetryLoop.callWithRetry(RetryLoop.java:105)
   [junit4]    >         at org.apache.curator.framework.imps.GetDataBuilderImpl.pathInForeground(GetDataBuilderImpl.java:288)
   [junit4]    >         at org.apache.curator.framework.imps.GetDataBuilderImpl.forPath(GetDataBuilderImpl.java:279)
   [junit4]    >         at org.apache.curator.framework.imps.GetDataBuilderImpl.forPath(GetDataBuilderImpl.java:41)
   [junit4]    >         at org.apache.curator.framework.recipes.shared.SharedValue.readValue(SharedValue.java:244)
   [junit4]    >         at org.apache.curator.framework.recipes.shared.SharedValue.access$100(SharedValue.java:44)
   [junit4]    >         at org.apache.curator.framework.recipes.shared.SharedValue$1.process(SharedValue.java:61)
   [junit4]    >         at org.apache.curator.framework.imps.NamespaceWatcher.process(NamespaceWatcher.java:67)
   [junit4]    >         at org.apache.zookeeper.ClientCnxn$EventThread.processEvent(ClientCnxn.java:530)
   [junit4]    >         at org.apache.zookeeper.ClientCnxn$EventThread.run(ClientCnxn.java:505)
   [junit4]    >    2) Thread[id=17470, name=jetty-launcher-3870-thread-1-EventThread, state=TIMED_WAITING, group=TGRP-TestSolrCloudWithSecureImpersonation]
   [junit4]    >         at sun.misc.Unsafe.park(Native Method)
   [junit4]    >         at java.util.concurrent.locks.LockSupport.parkNanos(LockSupport.java:215)
   [junit4]    >         at java.util.concurrent.locks.AbstractQueuedSynchronizer.doAcquireSharedNanos(AbstractQueuedSynchronizer.java:1037)
   [junit4]    >         at java.util.concurrent.locks.AbstractQueuedSynchronizer.tryAcquireSharedNanos(AbstractQueuedSynchronizer.java:1328)
   [junit4]    >         at java.util.concurrent.CountDownLatch.await(CountDownLatch.java:277)
   [junit4]    >         at org.apache.curator.CuratorZookeeperClient.internalBlockUntilConnectedOrTimedOut(CuratorZookeeperClient.java:323)
   [junit4]    >         at org.apache.curator.RetryLoop.callWithRetry(RetryLoop.java:105)
   [junit4]    >         at org.apache.curator.framework.imps.GetDataBuilderImpl.pathInForeground(GetDataBuilderImpl.java:288)
   [junit4]    >         at org.apache.curator.framework.imps.GetDataBuilderImpl.forPath(GetDataBuilderImpl.java:279)
   [junit4]    >         at org.apache.curator.framework.imps.GetDataBuilderImpl.forPath(GetDataBuilderImpl.java:41)
   [junit4]    >         at org.apache.curator.framework.recipes.shared.SharedValue.readValue(SharedValue.java:244)
   [junit4]    >         at org.apache.curator.framework.recipes.shared.SharedValue.access$100(SharedValue.java:44)
   [junit4]    >         at org.apache.curator.framework.recipes.shared.SharedValue$1.process(SharedValue.java:61)
   [junit4]    >         at org.apache.curator.framework.imps.NamespaceWatcher.process(NamespaceWatcher.java:67)
   [junit4]    >         at org.apache.zookeeper.ClientCnxn$EventThread.processEvent(ClientCnxn.java:530)
   [junit4]    >         at org.apache.zookeeper.ClientCnxn$EventThread.run(ClientCnxn.java:505)
   [junit4]    > 	at __randomizedtesting.SeedInfo.seed([E85A51084DDF657F]:0)
   [junit4] Completed [556/767 (2!)] on J1 in 36.62s, 12 tests, 1 error <<< FAILURES!

[...truncated 44690 lines...]

Mime
View raw message