lucene-dev mailing list archives

Site index · List index
Message view « Date » · « Thread »
Top « Date » · « Thread »
From Policeman Jenkins Server <jenk...@thetaphi.de>
Subject [JENKINS] Lucene-Solr-7.x-Linux (64bit/jdk-9.0.1) - Build # 1200 - Still Unstable!
Date Fri, 19 Jan 2018 13:50:57 GMT
Build: https://jenkins.thetaphi.de/job/Lucene-Solr-7.x-Linux/1200/
Java: 64bit/jdk-9.0.1 -XX:-UseCompressedOops -XX:+UseParallelGC

3 tests failed.
FAILED:  junit.framework.TestSuite.org.apache.solr.cloud.ChaosMonkeyNothingIsSafeTest

Error Message:
9 threads leaked from SUITE scope at org.apache.solr.cloud.ChaosMonkeyNothingIsSafeTest:     1) Thread[id=19508, name=TEST-ChaosMonkeyNothingIsSafeTest.test-seed#[AD5BDDE049B9EE7E]-EventThread, state=WAITING, group=TGRP-ChaosMonkeyNothingIsSafeTest]         at java.base@9.0.1/jdk.internal.misc.Unsafe.park(Native Method)         at java.base@9.0.1/java.util.concurrent.locks.LockSupport.park(LockSupport.java:194)         at java.base@9.0.1/java.util.concurrent.locks.AbstractQueuedSynchronizer$ConditionObject.await(AbstractQueuedSynchronizer.java:2062)         at java.base@9.0.1/java.util.concurrent.LinkedBlockingQueue.take(LinkedBlockingQueue.java:435)         at app//org.apache.zookeeper.ClientCnxn$EventThread.run(ClientCnxn.java:501)    2) Thread[id=19507, name=TEST-ChaosMonkeyNothingIsSafeTest.test-seed#[AD5BDDE049B9EE7E]-SendThread(127.0.0.1:41781), state=TIMED_WAITING, group=TGRP-ChaosMonkeyNothingIsSafeTest]         at java.base@9.0.1/java.lang.Thread.sleep(Native Method)         at app//org.apache.zookeeper.client.StaticHostProvider.next(StaticHostProvider.java:101)         at app//org.apache.zookeeper.ClientCnxn$SendThread.startConnect(ClientCnxn.java:997)         at app//org.apache.zookeeper.ClientCnxn$SendThread.run(ClientCnxn.java:1060)    3) Thread[id=19506, name=Connection evictor, state=TIMED_WAITING, group=TGRP-ChaosMonkeyNothingIsSafeTest]         at java.base@9.0.1/java.lang.Thread.sleep(Native Method)         at app//org.apache.http.impl.client.IdleConnectionEvictor$1.run(IdleConnectionEvictor.java:66)         at java.base@9.0.1/java.lang.Thread.run(Thread.java:844)    4) Thread[id=19531, name=zkCallback-3968-thread-1, state=TIMED_WAITING, group=TGRP-ChaosMonkeyNothingIsSafeTest]         at java.base@9.0.1/jdk.internal.misc.Unsafe.park(Native Method)         at java.base@9.0.1/java.util.concurrent.locks.LockSupport.parkNanos(LockSupport.java:234)         at java.base@9.0.1/java.util.concurrent.SynchronousQueue$TransferStack.awaitFulfill(SynchronousQueue.java:462)         at java.base@9.0.1/java.util.concurrent.SynchronousQueue$TransferStack.transfer(SynchronousQueue.java:361)         at java.base@9.0.1/java.util.concurrent.SynchronousQueue.poll(SynchronousQueue.java:937)         at java.base@9.0.1/java.util.concurrent.ThreadPoolExecutor.getTask(ThreadPoolExecutor.java:1091)         at java.base@9.0.1/java.util.concurrent.ThreadPoolExecutor.runWorker(ThreadPoolExecutor.java:1152)         at java.base@9.0.1/java.util.concurrent.ThreadPoolExecutor$Worker.run(ThreadPoolExecutor.java:641)         at java.base@9.0.1/java.lang.Thread.run(Thread.java:844)    5) Thread[id=19733, name=zkCallback-3968-thread-3, state=TIMED_WAITING, group=TGRP-ChaosMonkeyNothingIsSafeTest]         at java.base@9.0.1/jdk.internal.misc.Unsafe.park(Native Method)         at java.base@9.0.1/java.util.concurrent.locks.LockSupport.parkNanos(LockSupport.java:234)         at java.base@9.0.1/java.util.concurrent.SynchronousQueue$TransferStack.awaitFulfill(SynchronousQueue.java:462)         at java.base@9.0.1/java.util.concurrent.SynchronousQueue$TransferStack.transfer(SynchronousQueue.java:361)         at java.base@9.0.1/java.util.concurrent.SynchronousQueue.poll(SynchronousQueue.java:937)         at java.base@9.0.1/java.util.concurrent.ThreadPoolExecutor.getTask(ThreadPoolExecutor.java:1091)         at java.base@9.0.1/java.util.concurrent.ThreadPoolExecutor.runWorker(ThreadPoolExecutor.java:1152)         at java.base@9.0.1/java.util.concurrent.ThreadPoolExecutor$Worker.run(ThreadPoolExecutor.java:641)         at java.base@9.0.1/java.lang.Thread.run(Thread.java:844)    6) Thread[id=19729, name=zkCallback-3968-thread-2, state=TIMED_WAITING, group=TGRP-ChaosMonkeyNothingIsSafeTest]         at java.base@9.0.1/jdk.internal.misc.Unsafe.park(Native Method)         at java.base@9.0.1/java.util.concurrent.locks.LockSupport.parkNanos(LockSupport.java:234)         at java.base@9.0.1/java.util.concurrent.SynchronousQueue$TransferStack.awaitFulfill(SynchronousQueue.java:462)         at java.base@9.0.1/java.util.concurrent.SynchronousQueue$TransferStack.transfer(SynchronousQueue.java:361)         at java.base@9.0.1/java.util.concurrent.SynchronousQueue.poll(SynchronousQueue.java:937)         at java.base@9.0.1/java.util.concurrent.ThreadPoolExecutor.getTask(ThreadPoolExecutor.java:1091)         at java.base@9.0.1/java.util.concurrent.ThreadPoolExecutor.runWorker(ThreadPoolExecutor.java:1152)         at java.base@9.0.1/java.util.concurrent.ThreadPoolExecutor$Worker.run(ThreadPoolExecutor.java:641)         at java.base@9.0.1/java.lang.Thread.run(Thread.java:844)    7) Thread[id=19847, name=zkCallback-3968-thread-5, state=TIMED_WAITING, group=TGRP-ChaosMonkeyNothingIsSafeTest]         at java.base@9.0.1/jdk.internal.misc.Unsafe.park(Native Method)         at java.base@9.0.1/java.util.concurrent.locks.LockSupport.parkNanos(LockSupport.java:234)         at java.base@9.0.1/java.util.concurrent.SynchronousQueue$TransferStack.awaitFulfill(SynchronousQueue.java:462)         at java.base@9.0.1/java.util.concurrent.SynchronousQueue$TransferStack.transfer(SynchronousQueue.java:361)         at java.base@9.0.1/java.util.concurrent.SynchronousQueue.poll(SynchronousQueue.java:937)         at java.base@9.0.1/java.util.concurrent.ThreadPoolExecutor.getTask(ThreadPoolExecutor.java:1091)         at java.base@9.0.1/java.util.concurrent.ThreadPoolExecutor.runWorker(ThreadPoolExecutor.java:1152)         at java.base@9.0.1/java.util.concurrent.ThreadPoolExecutor$Worker.run(ThreadPoolExecutor.java:641)         at java.base@9.0.1/java.lang.Thread.run(Thread.java:844)    8) Thread[id=19759, name=zkCallback-3968-thread-4, state=TIMED_WAITING, group=TGRP-ChaosMonkeyNothingIsSafeTest]         at java.base@9.0.1/jdk.internal.misc.Unsafe.park(Native Method)         at java.base@9.0.1/java.util.concurrent.locks.LockSupport.parkNanos(LockSupport.java:234)         at java.base@9.0.1/java.util.concurrent.SynchronousQueue$TransferStack.awaitFulfill(SynchronousQueue.java:462)         at java.base@9.0.1/java.util.concurrent.SynchronousQueue$TransferStack.transfer(SynchronousQueue.java:361)         at java.base@9.0.1/java.util.concurrent.SynchronousQueue.poll(SynchronousQueue.java:937)         at java.base@9.0.1/java.util.concurrent.ThreadPoolExecutor.getTask(ThreadPoolExecutor.java:1091)         at java.base@9.0.1/java.util.concurrent.ThreadPoolExecutor.runWorker(ThreadPoolExecutor.java:1152)         at java.base@9.0.1/java.util.concurrent.ThreadPoolExecutor$Worker.run(ThreadPoolExecutor.java:641)         at java.base@9.0.1/java.lang.Thread.run(Thread.java:844)    9) Thread[id=19509, name=zkConnectionManagerCallback-3969-thread-1, state=WAITING, group=TGRP-ChaosMonkeyNothingIsSafeTest]         at java.base@9.0.1/jdk.internal.misc.Unsafe.park(Native Method)         at java.base@9.0.1/java.util.concurrent.locks.LockSupport.park(LockSupport.java:194)         at java.base@9.0.1/java.util.concurrent.locks.AbstractQueuedSynchronizer$ConditionObject.await(AbstractQueuedSynchronizer.java:2062)         at java.base@9.0.1/java.util.concurrent.LinkedBlockingQueue.take(LinkedBlockingQueue.java:435)         at java.base@9.0.1/java.util.concurrent.ThreadPoolExecutor.getTask(ThreadPoolExecutor.java:1092)         at java.base@9.0.1/java.util.concurrent.ThreadPoolExecutor.runWorker(ThreadPoolExecutor.java:1152)         at java.base@9.0.1/java.util.concurrent.ThreadPoolExecutor$Worker.run(ThreadPoolExecutor.java:641)         at java.base@9.0.1/java.lang.Thread.run(Thread.java:844)

Stack Trace:
com.carrotsearch.randomizedtesting.ThreadLeakError: 9 threads leaked from SUITE scope at org.apache.solr.cloud.ChaosMonkeyNothingIsSafeTest: 
   1) Thread[id=19508, name=TEST-ChaosMonkeyNothingIsSafeTest.test-seed#[AD5BDDE049B9EE7E]-EventThread, state=WAITING, group=TGRP-ChaosMonkeyNothingIsSafeTest]
        at java.base@9.0.1/jdk.internal.misc.Unsafe.park(Native Method)
        at java.base@9.0.1/java.util.concurrent.locks.LockSupport.park(LockSupport.java:194)
        at java.base@9.0.1/java.util.concurrent.locks.AbstractQueuedSynchronizer$ConditionObject.await(AbstractQueuedSynchronizer.java:2062)
        at java.base@9.0.1/java.util.concurrent.LinkedBlockingQueue.take(LinkedBlockingQueue.java:435)
        at app//org.apache.zookeeper.ClientCnxn$EventThread.run(ClientCnxn.java:501)
   2) Thread[id=19507, name=TEST-ChaosMonkeyNothingIsSafeTest.test-seed#[AD5BDDE049B9EE7E]-SendThread(127.0.0.1:41781), state=TIMED_WAITING, group=TGRP-ChaosMonkeyNothingIsSafeTest]
        at java.base@9.0.1/java.lang.Thread.sleep(Native Method)
        at app//org.apache.zookeeper.client.StaticHostProvider.next(StaticHostProvider.java:101)
        at app//org.apache.zookeeper.ClientCnxn$SendThread.startConnect(ClientCnxn.java:997)
        at app//org.apache.zookeeper.ClientCnxn$SendThread.run(ClientCnxn.java:1060)
   3) Thread[id=19506, name=Connection evictor, state=TIMED_WAITING, group=TGRP-ChaosMonkeyNothingIsSafeTest]
        at java.base@9.0.1/java.lang.Thread.sleep(Native Method)
        at app//org.apache.http.impl.client.IdleConnectionEvictor$1.run(IdleConnectionEvictor.java:66)
        at java.base@9.0.1/java.lang.Thread.run(Thread.java:844)
   4) Thread[id=19531, name=zkCallback-3968-thread-1, state=TIMED_WAITING, group=TGRP-ChaosMonkeyNothingIsSafeTest]
        at java.base@9.0.1/jdk.internal.misc.Unsafe.park(Native Method)
        at java.base@9.0.1/java.util.concurrent.locks.LockSupport.parkNanos(LockSupport.java:234)
        at java.base@9.0.1/java.util.concurrent.SynchronousQueue$TransferStack.awaitFulfill(SynchronousQueue.java:462)
        at java.base@9.0.1/java.util.concurrent.SynchronousQueue$TransferStack.transfer(SynchronousQueue.java:361)
        at java.base@9.0.1/java.util.concurrent.SynchronousQueue.poll(SynchronousQueue.java:937)
        at java.base@9.0.1/java.util.concurrent.ThreadPoolExecutor.getTask(ThreadPoolExecutor.java:1091)
        at java.base@9.0.1/java.util.concurrent.ThreadPoolExecutor.runWorker(ThreadPoolExecutor.java:1152)
        at java.base@9.0.1/java.util.concurrent.ThreadPoolExecutor$Worker.run(ThreadPoolExecutor.java:641)
        at java.base@9.0.1/java.lang.Thread.run(Thread.java:844)
   5) Thread[id=19733, name=zkCallback-3968-thread-3, state=TIMED_WAITING, group=TGRP-ChaosMonkeyNothingIsSafeTest]
        at java.base@9.0.1/jdk.internal.misc.Unsafe.park(Native Method)
        at java.base@9.0.1/java.util.concurrent.locks.LockSupport.parkNanos(LockSupport.java:234)
        at java.base@9.0.1/java.util.concurrent.SynchronousQueue$TransferStack.awaitFulfill(SynchronousQueue.java:462)
        at java.base@9.0.1/java.util.concurrent.SynchronousQueue$TransferStack.transfer(SynchronousQueue.java:361)
        at java.base@9.0.1/java.util.concurrent.SynchronousQueue.poll(SynchronousQueue.java:937)
        at java.base@9.0.1/java.util.concurrent.ThreadPoolExecutor.getTask(ThreadPoolExecutor.java:1091)
        at java.base@9.0.1/java.util.concurrent.ThreadPoolExecutor.runWorker(ThreadPoolExecutor.java:1152)
        at java.base@9.0.1/java.util.concurrent.ThreadPoolExecutor$Worker.run(ThreadPoolExecutor.java:641)
        at java.base@9.0.1/java.lang.Thread.run(Thread.java:844)
   6) Thread[id=19729, name=zkCallback-3968-thread-2, state=TIMED_WAITING, group=TGRP-ChaosMonkeyNothingIsSafeTest]
        at java.base@9.0.1/jdk.internal.misc.Unsafe.park(Native Method)
        at java.base@9.0.1/java.util.concurrent.locks.LockSupport.parkNanos(LockSupport.java:234)
        at java.base@9.0.1/java.util.concurrent.SynchronousQueue$TransferStack.awaitFulfill(SynchronousQueue.java:462)
        at java.base@9.0.1/java.util.concurrent.SynchronousQueue$TransferStack.transfer(SynchronousQueue.java:361)
        at java.base@9.0.1/java.util.concurrent.SynchronousQueue.poll(SynchronousQueue.java:937)
        at java.base@9.0.1/java.util.concurrent.ThreadPoolExecutor.getTask(ThreadPoolExecutor.java:1091)
        at java.base@9.0.1/java.util.concurrent.ThreadPoolExecutor.runWorker(ThreadPoolExecutor.java:1152)
        at java.base@9.0.1/java.util.concurrent.ThreadPoolExecutor$Worker.run(ThreadPoolExecutor.java:641)
        at java.base@9.0.1/java.lang.Thread.run(Thread.java:844)
   7) Thread[id=19847, name=zkCallback-3968-thread-5, state=TIMED_WAITING, group=TGRP-ChaosMonkeyNothingIsSafeTest]
        at java.base@9.0.1/jdk.internal.misc.Unsafe.park(Native Method)
        at java.base@9.0.1/java.util.concurrent.locks.LockSupport.parkNanos(LockSupport.java:234)
        at java.base@9.0.1/java.util.concurrent.SynchronousQueue$TransferStack.awaitFulfill(SynchronousQueue.java:462)
        at java.base@9.0.1/java.util.concurrent.SynchronousQueue$TransferStack.transfer(SynchronousQueue.java:361)
        at java.base@9.0.1/java.util.concurrent.SynchronousQueue.poll(SynchronousQueue.java:937)
        at java.base@9.0.1/java.util.concurrent.ThreadPoolExecutor.getTask(ThreadPoolExecutor.java:1091)
        at java.base@9.0.1/java.util.concurrent.ThreadPoolExecutor.runWorker(ThreadPoolExecutor.java:1152)
        at java.base@9.0.1/java.util.concurrent.ThreadPoolExecutor$Worker.run(ThreadPoolExecutor.java:641)
        at java.base@9.0.1/java.lang.Thread.run(Thread.java:844)
   8) Thread[id=19759, name=zkCallback-3968-thread-4, state=TIMED_WAITING, group=TGRP-ChaosMonkeyNothingIsSafeTest]
        at java.base@9.0.1/jdk.internal.misc.Unsafe.park(Native Method)
        at java.base@9.0.1/java.util.concurrent.locks.LockSupport.parkNanos(LockSupport.java:234)
        at java.base@9.0.1/java.util.concurrent.SynchronousQueue$TransferStack.awaitFulfill(SynchronousQueue.java:462)
        at java.base@9.0.1/java.util.concurrent.SynchronousQueue$TransferStack.transfer(SynchronousQueue.java:361)
        at java.base@9.0.1/java.util.concurrent.SynchronousQueue.poll(SynchronousQueue.java:937)
        at java.base@9.0.1/java.util.concurrent.ThreadPoolExecutor.getTask(ThreadPoolExecutor.java:1091)
        at java.base@9.0.1/java.util.concurrent.ThreadPoolExecutor.runWorker(ThreadPoolExecutor.java:1152)
        at java.base@9.0.1/java.util.concurrent.ThreadPoolExecutor$Worker.run(ThreadPoolExecutor.java:641)
        at java.base@9.0.1/java.lang.Thread.run(Thread.java:844)
   9) Thread[id=19509, name=zkConnectionManagerCallback-3969-thread-1, state=WAITING, group=TGRP-ChaosMonkeyNothingIsSafeTest]
        at java.base@9.0.1/jdk.internal.misc.Unsafe.park(Native Method)
        at java.base@9.0.1/java.util.concurrent.locks.LockSupport.park(LockSupport.java:194)
        at java.base@9.0.1/java.util.concurrent.locks.AbstractQueuedSynchronizer$ConditionObject.await(AbstractQueuedSynchronizer.java:2062)
        at java.base@9.0.1/java.util.concurrent.LinkedBlockingQueue.take(LinkedBlockingQueue.java:435)
        at java.base@9.0.1/java.util.concurrent.ThreadPoolExecutor.getTask(ThreadPoolExecutor.java:1092)
        at java.base@9.0.1/java.util.concurrent.ThreadPoolExecutor.runWorker(ThreadPoolExecutor.java:1152)
        at java.base@9.0.1/java.util.concurrent.ThreadPoolExecutor$Worker.run(ThreadPoolExecutor.java:641)
        at java.base@9.0.1/java.lang.Thread.run(Thread.java:844)
	at __randomizedtesting.SeedInfo.seed([AD5BDDE049B9EE7E]:0)


FAILED:  junit.framework.TestSuite.org.apache.solr.cloud.ChaosMonkeyNothingIsSafeTest

Error Message:
There are still zombie threads that couldn't be terminated:    1) Thread[id=19507, name=TEST-ChaosMonkeyNothingIsSafeTest.test-seed#[AD5BDDE049B9EE7E]-SendThread(127.0.0.1:41781), state=TIMED_WAITING, group=TGRP-ChaosMonkeyNothingIsSafeTest]         at java.base@9.0.1/java.lang.Thread.sleep(Native Method)         at app//org.apache.zookeeper.ClientCnxn$SendThread.run(ClientCnxn.java:1051)    2) Thread[id=19531, name=zkCallback-3968-thread-1, state=TIMED_WAITING, group=TGRP-ChaosMonkeyNothingIsSafeTest]         at java.base@9.0.1/jdk.internal.misc.Unsafe.park(Native Method)         at java.base@9.0.1/java.util.concurrent.locks.LockSupport.parkNanos(LockSupport.java:234)         at java.base@9.0.1/java.util.concurrent.SynchronousQueue$TransferStack.awaitFulfill(SynchronousQueue.java:462)         at java.base@9.0.1/java.util.concurrent.SynchronousQueue$TransferStack.transfer(SynchronousQueue.java:361)         at java.base@9.0.1/java.util.concurrent.SynchronousQueue.poll(SynchronousQueue.java:937)         at java.base@9.0.1/java.util.concurrent.ThreadPoolExecutor.getTask(ThreadPoolExecutor.java:1091)         at java.base@9.0.1/java.util.concurrent.ThreadPoolExecutor.runWorker(ThreadPoolExecutor.java:1152)         at java.base@9.0.1/java.util.concurrent.ThreadPoolExecutor$Worker.run(ThreadPoolExecutor.java:641)         at java.base@9.0.1/java.lang.Thread.run(Thread.java:844)    3) Thread[id=19733, name=zkCallback-3968-thread-3, state=TIMED_WAITING, group=TGRP-ChaosMonkeyNothingIsSafeTest]         at java.base@9.0.1/jdk.internal.misc.Unsafe.park(Native Method)         at java.base@9.0.1/java.util.concurrent.locks.LockSupport.parkNanos(LockSupport.java:234)         at java.base@9.0.1/java.util.concurrent.SynchronousQueue$TransferStack.awaitFulfill(SynchronousQueue.java:462)         at java.base@9.0.1/java.util.concurrent.SynchronousQueue$TransferStack.transfer(SynchronousQueue.java:361)         at java.base@9.0.1/java.util.concurrent.SynchronousQueue.poll(SynchronousQueue.java:937)         at java.base@9.0.1/java.util.concurrent.ThreadPoolExecutor.getTask(ThreadPoolExecutor.java:1091)         at java.base@9.0.1/java.util.concurrent.ThreadPoolExecutor.runWorker(ThreadPoolExecutor.java:1152)         at java.base@9.0.1/java.util.concurrent.ThreadPoolExecutor$Worker.run(ThreadPoolExecutor.java:641)         at java.base@9.0.1/java.lang.Thread.run(Thread.java:844)    4) Thread[id=19729, name=zkCallback-3968-thread-2, state=TIMED_WAITING, group=TGRP-ChaosMonkeyNothingIsSafeTest]         at java.base@9.0.1/jdk.internal.misc.Unsafe.park(Native Method)         at java.base@9.0.1/java.util.concurrent.locks.LockSupport.parkNanos(LockSupport.java:234)         at java.base@9.0.1/java.util.concurrent.SynchronousQueue$TransferStack.awaitFulfill(SynchronousQueue.java:462)         at java.base@9.0.1/java.util.concurrent.SynchronousQueue$TransferStack.transfer(SynchronousQueue.java:361)         at java.base@9.0.1/java.util.concurrent.SynchronousQueue.poll(SynchronousQueue.java:937)         at java.base@9.0.1/java.util.concurrent.ThreadPoolExecutor.getTask(ThreadPoolExecutor.java:1091)         at java.base@9.0.1/java.util.concurrent.ThreadPoolExecutor.runWorker(ThreadPoolExecutor.java:1152)         at java.base@9.0.1/java.util.concurrent.ThreadPoolExecutor$Worker.run(ThreadPoolExecutor.java:641)         at java.base@9.0.1/java.lang.Thread.run(Thread.java:844)    5) Thread[id=19847, name=zkCallback-3968-thread-5, state=TIMED_WAITING, group=TGRP-ChaosMonkeyNothingIsSafeTest]         at java.base@9.0.1/jdk.internal.misc.Unsafe.park(Native Method)         at java.base@9.0.1/java.util.concurrent.locks.LockSupport.parkNanos(LockSupport.java:234)         at java.base@9.0.1/java.util.concurrent.SynchronousQueue$TransferStack.awaitFulfill(SynchronousQueue.java:462)         at java.base@9.0.1/java.util.concurrent.SynchronousQueue$TransferStack.transfer(SynchronousQueue.java:361)         at java.base@9.0.1/java.util.concurrent.SynchronousQueue.poll(SynchronousQueue.java:937)         at java.base@9.0.1/java.util.concurrent.ThreadPoolExecutor.getTask(ThreadPoolExecutor.java:1091)         at java.base@9.0.1/java.util.concurrent.ThreadPoolExecutor.runWorker(ThreadPoolExecutor.java:1152)         at java.base@9.0.1/java.util.concurrent.ThreadPoolExecutor$Worker.run(ThreadPoolExecutor.java:641)         at java.base@9.0.1/java.lang.Thread.run(Thread.java:844)    6) Thread[id=19759, name=zkCallback-3968-thread-4, state=TIMED_WAITING, group=TGRP-ChaosMonkeyNothingIsSafeTest]         at java.base@9.0.1/jdk.internal.misc.Unsafe.park(Native Method)         at java.base@9.0.1/java.util.concurrent.locks.LockSupport.parkNanos(LockSupport.java:234)         at java.base@9.0.1/java.util.concurrent.SynchronousQueue$TransferStack.awaitFulfill(SynchronousQueue.java:462)         at java.base@9.0.1/java.util.concurrent.SynchronousQueue$TransferStack.transfer(SynchronousQueue.java:361)         at java.base@9.0.1/java.util.concurrent.SynchronousQueue.poll(SynchronousQueue.java:937)         at java.base@9.0.1/java.util.concurrent.ThreadPoolExecutor.getTask(ThreadPoolExecutor.java:1091)         at java.base@9.0.1/java.util.concurrent.ThreadPoolExecutor.runWorker(ThreadPoolExecutor.java:1152)         at java.base@9.0.1/java.util.concurrent.ThreadPoolExecutor$Worker.run(ThreadPoolExecutor.java:641)         at java.base@9.0.1/java.lang.Thread.run(Thread.java:844)    7) Thread[id=19509, name=zkConnectionManagerCallback-3969-thread-1, state=WAITING, group=TGRP-ChaosMonkeyNothingIsSafeTest]         at java.base@9.0.1/jdk.internal.misc.Unsafe.park(Native Method)         at java.base@9.0.1/java.util.concurrent.locks.LockSupport.park(LockSupport.java:194)         at java.base@9.0.1/java.util.concurrent.locks.AbstractQueuedSynchronizer$ConditionObject.await(AbstractQueuedSynchronizer.java:2062)         at java.base@9.0.1/java.util.concurrent.LinkedBlockingQueue.take(LinkedBlockingQueue.java:435)         at java.base@9.0.1/java.util.concurrent.ThreadPoolExecutor.getTask(ThreadPoolExecutor.java:1092)         at java.base@9.0.1/java.util.concurrent.ThreadPoolExecutor.runWorker(ThreadPoolExecutor.java:1152)         at java.base@9.0.1/java.util.concurrent.ThreadPoolExecutor$Worker.run(ThreadPoolExecutor.java:641)         at java.base@9.0.1/java.lang.Thread.run(Thread.java:844)

Stack Trace:
com.carrotsearch.randomizedtesting.ThreadLeakError: There are still zombie threads that couldn't be terminated:
   1) Thread[id=19507, name=TEST-ChaosMonkeyNothingIsSafeTest.test-seed#[AD5BDDE049B9EE7E]-SendThread(127.0.0.1:41781), state=TIMED_WAITING, group=TGRP-ChaosMonkeyNothingIsSafeTest]
        at java.base@9.0.1/java.lang.Thread.sleep(Native Method)
        at app//org.apache.zookeeper.ClientCnxn$SendThread.run(ClientCnxn.java:1051)
   2) Thread[id=19531, name=zkCallback-3968-thread-1, state=TIMED_WAITING, group=TGRP-ChaosMonkeyNothingIsSafeTest]
        at java.base@9.0.1/jdk.internal.misc.Unsafe.park(Native Method)
        at java.base@9.0.1/java.util.concurrent.locks.LockSupport.parkNanos(LockSupport.java:234)
        at java.base@9.0.1/java.util.concurrent.SynchronousQueue$TransferStack.awaitFulfill(SynchronousQueue.java:462)
        at java.base@9.0.1/java.util.concurrent.SynchronousQueue$TransferStack.transfer(SynchronousQueue.java:361)
        at java.base@9.0.1/java.util.concurrent.SynchronousQueue.poll(SynchronousQueue.java:937)
        at java.base@9.0.1/java.util.concurrent.ThreadPoolExecutor.getTask(ThreadPoolExecutor.java:1091)
        at java.base@9.0.1/java.util.concurrent.ThreadPoolExecutor.runWorker(ThreadPoolExecutor.java:1152)
        at java.base@9.0.1/java.util.concurrent.ThreadPoolExecutor$Worker.run(ThreadPoolExecutor.java:641)
        at java.base@9.0.1/java.lang.Thread.run(Thread.java:844)
   3) Thread[id=19733, name=zkCallback-3968-thread-3, state=TIMED_WAITING, group=TGRP-ChaosMonkeyNothingIsSafeTest]
        at java.base@9.0.1/jdk.internal.misc.Unsafe.park(Native Method)
        at java.base@9.0.1/java.util.concurrent.locks.LockSupport.parkNanos(LockSupport.java:234)
        at java.base@9.0.1/java.util.concurrent.SynchronousQueue$TransferStack.awaitFulfill(SynchronousQueue.java:462)
        at java.base@9.0.1/java.util.concurrent.SynchronousQueue$TransferStack.transfer(SynchronousQueue.java:361)
        at java.base@9.0.1/java.util.concurrent.SynchronousQueue.poll(SynchronousQueue.java:937)
        at java.base@9.0.1/java.util.concurrent.ThreadPoolExecutor.getTask(ThreadPoolExecutor.java:1091)
        at java.base@9.0.1/java.util.concurrent.ThreadPoolExecutor.runWorker(ThreadPoolExecutor.java:1152)
        at java.base@9.0.1/java.util.concurrent.ThreadPoolExecutor$Worker.run(ThreadPoolExecutor.java:641)
        at java.base@9.0.1/java.lang.Thread.run(Thread.java:844)
   4) Thread[id=19729, name=zkCallback-3968-thread-2, state=TIMED_WAITING, group=TGRP-ChaosMonkeyNothingIsSafeTest]
        at java.base@9.0.1/jdk.internal.misc.Unsafe.park(Native Method)
        at java.base@9.0.1/java.util.concurrent.locks.LockSupport.parkNanos(LockSupport.java:234)
        at java.base@9.0.1/java.util.concurrent.SynchronousQueue$TransferStack.awaitFulfill(SynchronousQueue.java:462)
        at java.base@9.0.1/java.util.concurrent.SynchronousQueue$TransferStack.transfer(SynchronousQueue.java:361)
        at java.base@9.0.1/java.util.concurrent.SynchronousQueue.poll(SynchronousQueue.java:937)
        at java.base@9.0.1/java.util.concurrent.ThreadPoolExecutor.getTask(ThreadPoolExecutor.java:1091)
        at java.base@9.0.1/java.util.concurrent.ThreadPoolExecutor.runWorker(ThreadPoolExecutor.java:1152)
        at java.base@9.0.1/java.util.concurrent.ThreadPoolExecutor$Worker.run(ThreadPoolExecutor.java:641)
        at java.base@9.0.1/java.lang.Thread.run(Thread.java:844)
   5) Thread[id=19847, name=zkCallback-3968-thread-5, state=TIMED_WAITING, group=TGRP-ChaosMonkeyNothingIsSafeTest]
        at java.base@9.0.1/jdk.internal.misc.Unsafe.park(Native Method)
        at java.base@9.0.1/java.util.concurrent.locks.LockSupport.parkNanos(LockSupport.java:234)
        at java.base@9.0.1/java.util.concurrent.SynchronousQueue$TransferStack.awaitFulfill(SynchronousQueue.java:462)
        at java.base@9.0.1/java.util.concurrent.SynchronousQueue$TransferStack.transfer(SynchronousQueue.java:361)
        at java.base@9.0.1/java.util.concurrent.SynchronousQueue.poll(SynchronousQueue.java:937)
        at java.base@9.0.1/java.util.concurrent.ThreadPoolExecutor.getTask(ThreadPoolExecutor.java:1091)
        at java.base@9.0.1/java.util.concurrent.ThreadPoolExecutor.runWorker(ThreadPoolExecutor.java:1152)
        at java.base@9.0.1/java.util.concurrent.ThreadPoolExecutor$Worker.run(ThreadPoolExecutor.java:641)
        at java.base@9.0.1/java.lang.Thread.run(Thread.java:844)
   6) Thread[id=19759, name=zkCallback-3968-thread-4, state=TIMED_WAITING, group=TGRP-ChaosMonkeyNothingIsSafeTest]
        at java.base@9.0.1/jdk.internal.misc.Unsafe.park(Native Method)
        at java.base@9.0.1/java.util.concurrent.locks.LockSupport.parkNanos(LockSupport.java:234)
        at java.base@9.0.1/java.util.concurrent.SynchronousQueue$TransferStack.awaitFulfill(SynchronousQueue.java:462)
        at java.base@9.0.1/java.util.concurrent.SynchronousQueue$TransferStack.transfer(SynchronousQueue.java:361)
        at java.base@9.0.1/java.util.concurrent.SynchronousQueue.poll(SynchronousQueue.java:937)
        at java.base@9.0.1/java.util.concurrent.ThreadPoolExecutor.getTask(ThreadPoolExecutor.java:1091)
        at java.base@9.0.1/java.util.concurrent.ThreadPoolExecutor.runWorker(ThreadPoolExecutor.java:1152)
        at java.base@9.0.1/java.util.concurrent.ThreadPoolExecutor$Worker.run(ThreadPoolExecutor.java:641)
        at java.base@9.0.1/java.lang.Thread.run(Thread.java:844)
   7) Thread[id=19509, name=zkConnectionManagerCallback-3969-thread-1, state=WAITING, group=TGRP-ChaosMonkeyNothingIsSafeTest]
        at java.base@9.0.1/jdk.internal.misc.Unsafe.park(Native Method)
        at java.base@9.0.1/java.util.concurrent.locks.LockSupport.park(LockSupport.java:194)
        at java.base@9.0.1/java.util.concurrent.locks.AbstractQueuedSynchronizer$ConditionObject.await(AbstractQueuedSynchronizer.java:2062)
        at java.base@9.0.1/java.util.concurrent.LinkedBlockingQueue.take(LinkedBlockingQueue.java:435)
        at java.base@9.0.1/java.util.concurrent.ThreadPoolExecutor.getTask(ThreadPoolExecutor.java:1092)
        at java.base@9.0.1/java.util.concurrent.ThreadPoolExecutor.runWorker(ThreadPoolExecutor.java:1152)
        at java.base@9.0.1/java.util.concurrent.ThreadPoolExecutor$Worker.run(ThreadPoolExecutor.java:641)
        at java.base@9.0.1/java.lang.Thread.run(Thread.java:844)
	at __randomizedtesting.SeedInfo.seed([AD5BDDE049B9EE7E]:0)


FAILED:  org.apache.solr.cloud.ChaosMonkeyNothingIsSafeTest.test

Error Message:
Timeout occured while waiting response from server at: http://127.0.0.1:43015/collection1

Stack Trace:
org.apache.solr.client.solrj.SolrServerException: Timeout occured while waiting response from server at: http://127.0.0.1:43015/collection1
	at __randomizedtesting.SeedInfo.seed([AD5BDDE049B9EE7E:250FE23AE7458386]:0)
	at org.apache.solr.client.solrj.impl.HttpSolrClient.executeMethod(HttpSolrClient.java:654)
	at org.apache.solr.client.solrj.impl.HttpSolrClient.request(HttpSolrClient.java:255)
	at org.apache.solr.client.solrj.impl.HttpSolrClient.request(HttpSolrClient.java:244)
	at org.apache.solr.client.solrj.impl.LBHttpSolrClient.doRequest(LBHttpSolrClient.java:483)
	at org.apache.solr.client.solrj.impl.LBHttpSolrClient.request(LBHttpSolrClient.java:413)
	at org.apache.solr.client.solrj.impl.CloudSolrClient.sendRequest(CloudSolrClient.java:1104)
	at org.apache.solr.client.solrj.impl.CloudSolrClient.requestWithRetryOnStaleState(CloudSolrClient.java:884)
	at org.apache.solr.client.solrj.impl.CloudSolrClient.request(CloudSolrClient.java:817)
	at org.apache.solr.client.solrj.SolrRequest.process(SolrRequest.java:194)
	at org.apache.solr.client.solrj.SolrClient.commit(SolrClient.java:484)
	at org.apache.solr.client.solrj.SolrClient.commit(SolrClient.java:463)
	at org.apache.solr.cloud.AbstractFullDistribZkTestBase.commit(AbstractFullDistribZkTestBase.java:1591)
	at org.apache.solr.cloud.ChaosMonkeyNothingIsSafeTest.test(ChaosMonkeyNothingIsSafeTest.java:212)
	at java.base/jdk.internal.reflect.NativeMethodAccessorImpl.invoke0(Native Method)
	at java.base/jdk.internal.reflect.NativeMethodAccessorImpl.invoke(NativeMethodAccessorImpl.java:62)
	at java.base/jdk.internal.reflect.DelegatingMethodAccessorImpl.invoke(DelegatingMethodAccessorImpl.java:43)
	at java.base/java.lang.reflect.Method.invoke(Method.java:564)
	at com.carrotsearch.randomizedtesting.RandomizedRunner.invoke(RandomizedRunner.java:1737)
	at com.carrotsearch.randomizedtesting.RandomizedRunner$8.evaluate(RandomizedRunner.java:934)
	at com.carrotsearch.randomizedtesting.RandomizedRunner$9.evaluate(RandomizedRunner.java:970)
	at com.carrotsearch.randomizedtesting.RandomizedRunner$10.evaluate(RandomizedRunner.java:984)
	at org.apache.solr.BaseDistributedSearchTestCase$ShardsRepeatRule$ShardsFixedStatement.callStatement(BaseDistributedSearchTestCase.java:993)
	at org.apache.solr.BaseDistributedSearchTestCase$ShardsRepeatRule$ShardsStatement.evaluate(BaseDistributedSearchTestCase.java:968)
	at com.carrotsearch.randomizedtesting.rules.SystemPropertiesRestoreRule$1.evaluate(SystemPropertiesRestoreRule.java:57)
	at org.apache.lucene.util.TestRuleSetupTeardownChained$1.evaluate(TestRuleSetupTeardownChained.java:49)
	at org.apache.lucene.util.AbstractBeforeAfterRule$1.evaluate(AbstractBeforeAfterRule.java:45)
	at org.apache.lucene.util.TestRuleThreadAndTestName$1.evaluate(TestRuleThreadAndTestName.java:48)
	at org.apache.lucene.util.TestRuleIgnoreAfterMaxFailures$1.evaluate(TestRuleIgnoreAfterMaxFailures.java:64)
	at org.apache.lucene.util.TestRuleMarkFailure$1.evaluate(TestRuleMarkFailure.java:47)
	at com.carrotsearch.randomizedtesting.rules.StatementAdapter.evaluate(StatementAdapter.java:36)
	at com.carrotsearch.randomizedtesting.ThreadLeakControl$StatementRunner.run(ThreadLeakControl.java:368)
	at com.carrotsearch.randomizedtesting.ThreadLeakControl.forkTimeoutingTask(ThreadLeakControl.java:817)
	at com.carrotsearch.randomizedtesting.ThreadLeakControl$3.evaluate(ThreadLeakControl.java:468)
	at com.carrotsearch.randomizedtesting.RandomizedRunner.runSingleTest(RandomizedRunner.java:943)
	at com.carrotsearch.randomizedtesting.RandomizedRunner$5.evaluate(RandomizedRunner.java:829)
	at com.carrotsearch.randomizedtesting.RandomizedRunner$6.evaluate(RandomizedRunner.java:879)
	at com.carrotsearch.randomizedtesting.RandomizedRunner$7.evaluate(RandomizedRunner.java:890)
	at com.carrotsearch.randomizedtesting.rules.StatementAdapter.evaluate(StatementAdapter.java:36)
	at com.carrotsearch.randomizedtesting.rules.SystemPropertiesRestoreRule$1.evaluate(SystemPropertiesRestoreRule.java:57)
	at org.apache.lucene.util.AbstractBeforeAfterRule$1.evaluate(AbstractBeforeAfterRule.java:45)
	at com.carrotsearch.randomizedtesting.rules.StatementAdapter.evaluate(StatementAdapter.java:36)
	at org.apache.lucene.util.TestRuleStoreClassName$1.evaluate(TestRuleStoreClassName.java:41)
	at com.carrotsearch.randomizedtesting.rules.NoShadowingOrOverridesOnMethodsRule$1.evaluate(NoShadowingOrOverridesOnMethodsRule.java:40)
	at com.carrotsearch.randomizedtesting.rules.NoShadowingOrOverridesOnMethodsRule$1.evaluate(NoShadowingOrOverridesOnMethodsRule.java:40)
	at com.carrotsearch.randomizedtesting.rules.StatementAdapter.evaluate(StatementAdapter.java:36)
	at com.carrotsearch.randomizedtesting.rules.StatementAdapter.evaluate(StatementAdapter.java:36)
	at org.apache.lucene.util.TestRuleAssertionsRequired$1.evaluate(TestRuleAssertionsRequired.java:53)
	at org.apache.lucene.util.TestRuleMarkFailure$1.evaluate(TestRuleMarkFailure.java:47)
	at org.apache.lucene.util.TestRuleIgnoreAfterMaxFailures$1.evaluate(TestRuleIgnoreAfterMaxFailures.java:64)
	at org.apache.lucene.util.TestRuleIgnoreTestSuites$1.evaluate(TestRuleIgnoreTestSuites.java:54)
	at com.carrotsearch.randomizedtesting.rules.StatementAdapter.evaluate(StatementAdapter.java:36)
	at com.carrotsearch.randomizedtesting.ThreadLeakControl$StatementRunner.run(ThreadLeakControl.java:368)
	at java.base/java.lang.Thread.run(Thread.java:844)
Caused by: java.net.SocketTimeoutException: Read timed out
	at java.base/java.net.SocketInputStream.socketRead0(Native Method)
	at java.base/java.net.SocketInputStream.socketRead(SocketInputStream.java:116)
	at java.base/java.net.SocketInputStream.read(SocketInputStream.java:171)
	at java.base/java.net.SocketInputStream.read(SocketInputStream.java:141)
	at org.apache.http.impl.io.SessionInputBufferImpl.streamRead(SessionInputBufferImpl.java:137)
	at org.apache.http.impl.io.SessionInputBufferImpl.fillBuffer(SessionInputBufferImpl.java:153)
	at org.apache.http.impl.io.SessionInputBufferImpl.readLine(SessionInputBufferImpl.java:282)
	at org.apache.http.impl.conn.DefaultHttpResponseParser.parseHead(DefaultHttpResponseParser.java:138)
	at org.apache.http.impl.conn.DefaultHttpResponseParser.parseHead(DefaultHttpResponseParser.java:56)
	at org.apache.http.impl.io.AbstractMessageParser.parse(AbstractMessageParser.java:259)
	at org.apache.http.impl.DefaultBHttpClientConnection.receiveResponseHeader(DefaultBHttpClientConnection.java:163)
	at org.apache.http.impl.conn.CPoolProxy.receiveResponseHeader(CPoolProxy.java:165)
	at org.apache.http.protocol.HttpRequestExecutor.doReceiveResponse(HttpRequestExecutor.java:273)
	at org.apache.http.protocol.HttpRequestExecutor.execute(HttpRequestExecutor.java:125)
	at org.apache.http.impl.execchain.MainClientExec.execute(MainClientExec.java:272)
	at org.apache.http.impl.execchain.ProtocolExec.execute(ProtocolExec.java:185)
	at org.apache.http.impl.execchain.RetryExec.execute(RetryExec.java:89)
	at org.apache.http.impl.execchain.RedirectExec.execute(RedirectExec.java:111)
	at org.apache.http.impl.client.InternalHttpClient.doExecute(InternalHttpClient.java:185)
	at org.apache.http.impl.client.CloseableHttpClient.execute(CloseableHttpClient.java:83)
	at org.apache.http.impl.client.CloseableHttpClient.execute(CloseableHttpClient.java:56)
	at org.apache.solr.client.solrj.impl.HttpSolrClient.executeMethod(HttpSolrClient.java:542)
	... 52 more




Build Log:
[...truncated 13351 lines...]
   [junit4] Suite: org.apache.solr.cloud.ChaosMonkeyNothingIsSafeTest
   [junit4]   2> Creating dataDir: /home/jenkins/workspace/Lucene-Solr-7.x-Linux/solr/build/solr-core/test/J0/temp/solr.cloud.ChaosMonkeyNothingIsSafeTest_AD5BDDE049B9EE7E-001/init-core-data-001
   [junit4]   2> 2428675 WARN  (SUITE-ChaosMonkeyNothingIsSafeTest-seed#[AD5BDDE049B9EE7E]-worker) [    ] o.a.s.SolrTestCaseJ4 startTrackingSearchers: numOpens=30 numCloses=30
   [junit4]   2> 2428675 INFO  (SUITE-ChaosMonkeyNothingIsSafeTest-seed#[AD5BDDE049B9EE7E]-worker) [    ] o.a.s.SolrTestCaseJ4 Using PointFields (NUMERIC_POINTS_SYSPROP=true) w/NUMERIC_DOCVALUES_SYSPROP=true
   [junit4]   2> 2428676 INFO  (SUITE-ChaosMonkeyNothingIsSafeTest-seed#[AD5BDDE049B9EE7E]-worker) [    ] o.a.s.SolrTestCaseJ4 Randomized ssl (false) and clientAuth (false) via: @org.apache.solr.SolrTestCaseJ4$SuppressSSL(bugUrl="https://issues.apache.org/jira/browse/SOLR-5776")
   [junit4]   2> 2428676 INFO  (SUITE-ChaosMonkeyNothingIsSafeTest-seed#[AD5BDDE049B9EE7E]-worker) [    ] o.a.s.SolrTestCaseJ4 SecureRandom sanity checks: test.solr.allowed.securerandom=null & java.security.egd=file:/dev/./urandom
   [junit4]   2> 2428676 INFO  (SUITE-ChaosMonkeyNothingIsSafeTest-seed#[AD5BDDE049B9EE7E]-worker) [    ] o.a.s.BaseDistributedSearchTestCase Setting hostContext system property: /
   [junit4]   2> 2428677 INFO  (TEST-ChaosMonkeyNothingIsSafeTest.test-seed#[AD5BDDE049B9EE7E]) [    ] o.a.s.c.ZkTestServer STARTING ZK TEST SERVER
   [junit4]   2> 2428677 INFO  (Thread-4932) [    ] o.a.s.c.ZkTestServer client port:0.0.0.0/0.0.0.0:0
   [junit4]   2> 2428677 INFO  (Thread-4932) [    ] o.a.s.c.ZkTestServer Starting server
   [junit4]   2> 2428678 ERROR (Thread-4932) [    ] o.a.z.s.ZooKeeperServer ZKShutdownHandler is not registered, so ZooKeeper server won't take any action on ERROR or SHUTDOWN server state changes
   [junit4]   2> 2428777 INFO  (TEST-ChaosMonkeyNothingIsSafeTest.test-seed#[AD5BDDE049B9EE7E]) [    ] o.a.s.c.ZkTestServer start zk server on port:41781
   [junit4]   2> 2428778 INFO  (zkConnectionManagerCallback-3949-thread-1) [    ] o.a.s.c.c.ConnectionManager zkClient has connected
   [junit4]   2> 2428779 INFO  (zkConnectionManagerCallback-3951-thread-1) [    ] o.a.s.c.c.ConnectionManager zkClient has connected
   [junit4]   2> 2428781 INFO  (TEST-ChaosMonkeyNothingIsSafeTest.test-seed#[AD5BDDE049B9EE7E]) [    ] o.a.s.c.AbstractZkTestCase put /home/jenkins/workspace/Lucene-Solr-7.x-Linux/solr/core/src/test-files/solr/collection1/conf/solrconfig-tlog.xml to /configs/conf1/solrconfig.xml
   [junit4]   2> 2428781 INFO  (TEST-ChaosMonkeyNothingIsSafeTest.test-seed#[AD5BDDE049B9EE7E]) [    ] o.a.s.c.AbstractZkTestCase put /home/jenkins/workspace/Lucene-Solr-7.x-Linux/solr/core/src/test-files/solr/collection1/conf/schema15.xml to /configs/conf1/schema.xml
   [junit4]   2> 2428782 INFO  (TEST-ChaosMonkeyNothingIsSafeTest.test-seed#[AD5BDDE049B9EE7E]) [    ] o.a.s.c.AbstractZkTestCase put /home/jenkins/workspace/Lucene-Solr-7.x-Linux/solr/core/src/test-files/solr/collection1/conf/solrconfig.snippet.randomindexconfig.xml to /configs/conf1/solrconfig.snippet.randomindexconfig.xml
   [junit4]   2> 2428782 INFO  (TEST-ChaosMonkeyNothingIsSafeTest.test-seed#[AD5BDDE049B9EE7E]) [    ] o.a.s.c.AbstractZkTestCase put /home/jenkins/workspace/Lucene-Solr-7.x-Linux/solr/core/src/test-files/solr/collection1/conf/stopwords.txt to /configs/conf1/stopwords.txt
   [junit4]   2> 2428783 INFO  (TEST-ChaosMonkeyNothingIsSafeTest.test-seed#[AD5BDDE049B9EE7E]) [    ] o.a.s.c.AbstractZkTestCase put /home/jenkins/workspace/Lucene-Solr-7.x-Linux/solr/core/src/test-files/solr/collection1/conf/protwords.txt to /configs/conf1/protwords.txt
   [junit4]   2> 2428783 INFO  (TEST-ChaosMonkeyNothingIsSafeTest.test-seed#[AD5BDDE049B9EE7E]) [    ] o.a.s.c.AbstractZkTestCase put /home/jenkins/workspace/Lucene-Solr-7.x-Linux/solr/core/src/test-files/solr/collection1/conf/currency.xml to /configs/conf1/currency.xml
   [junit4]   2> 2428784 INFO  (TEST-ChaosMonkeyNothingIsSafeTest.test-seed#[AD5BDDE049B9EE7E]) [    ] o.a.s.c.AbstractZkTestCase put /home/jenkins/workspace/Lucene-Solr-7.x-Linux/solr/core/src/test-files/solr/collection1/conf/enumsConfig.xml to /configs/conf1/enumsConfig.xml
   [junit4]   2> 2428784 INFO  (TEST-ChaosMonkeyNothingIsSafeTest.test-seed#[AD5BDDE049B9EE7E]) [    ] o.a.s.c.AbstractZkTestCase put /home/jenkins/workspace/Lucene-Solr-7.x-Linux/solr/core/src/test-files/solr/collection1/conf/open-exchange-rates.json to /configs/conf1/open-exchange-rates.json
   [junit4]   2> 2428785 INFO  (TEST-ChaosMonkeyNothingIsSafeTest.test-seed#[AD5BDDE049B9EE7E]) [    ] o.a.s.c.AbstractZkTestCase put /home/jenkins/workspace/Lucene-Solr-7.x-Linux/solr/core/src/test-files/solr/collection1/conf/mapping-ISOLatin1Accent.txt to /configs/conf1/mapping-ISOLatin1Accent.txt
   [junit4]   2> 2428785 INFO  (TEST-ChaosMonkeyNothingIsSafeTest.test-seed#[AD5BDDE049B9EE7E]) [    ] o.a.s.c.AbstractZkTestCase put /home/jenkins/workspace/Lucene-Solr-7.x-Linux/solr/core/src/test-files/solr/collection1/conf/old_synonyms.txt to /configs/conf1/old_synonyms.txt
   [junit4]   2> 2428786 INFO  (TEST-ChaosMonkeyNothingIsSafeTest.test-seed#[AD5BDDE049B9EE7E]) [    ] o.a.s.c.AbstractZkTestCase put /home/jenkins/workspace/Lucene-Solr-7.x-Linux/solr/core/src/test-files/solr/collection1/conf/synonyms.txt to /configs/conf1/synonyms.txt
   [junit4]   2> 2428786 INFO  (TEST-ChaosMonkeyNothingIsSafeTest.test-seed#[AD5BDDE049B9EE7E]) [    ] o.a.s.c.AbstractFullDistribZkTestBase Will use TLOG replicas unless explicitly asked otherwise
   [junit4]   2> 2428872 INFO  (TEST-ChaosMonkeyNothingIsSafeTest.test-seed#[AD5BDDE049B9EE7E]) [    ] o.e.j.s.Server jetty-9.4.8.v20171121, build timestamp: 2017-11-22T03:57:37+06:30, git hash: 82b8fb23f757335bb3329d540ce37a2a2615f0a8
   [junit4]   2> 2428873 INFO  (TEST-ChaosMonkeyNothingIsSafeTest.test-seed#[AD5BDDE049B9EE7E]) [    ] o.e.j.s.session DefaultSessionIdManager workerName=node0
   [junit4]   2> 2428873 INFO  (TEST-ChaosMonkeyNothingIsSafeTest.test-seed#[AD5BDDE049B9EE7E]) [    ] o.e.j.s.session No SessionScavenger set, using defaults
   [junit4]   2> 2428873 INFO  (TEST-ChaosMonkeyNothingIsSafeTest.test-seed#[AD5BDDE049B9EE7E]) [    ] o.e.j.s.session Scavenging every 600000ms
   [junit4]   2> 2428873 INFO  (TEST-ChaosMonkeyNothingIsSafeTest.test-seed#[AD5BDDE049B9EE7E]) [    ] o.e.j.s.h.ContextHandler Started o.e.j.s.ServletContextHandler@1db177a5{/,null,AVAILABLE}
   [junit4]   2> 2428874 INFO  (TEST-ChaosMonkeyNothingIsSafeTest.test-seed#[AD5BDDE049B9EE7E]) [    ] o.e.j.s.AbstractConnector Started ServerConnector@47eb51b9{HTTP/1.1,[http/1.1]}{127.0.0.1:37011}
   [junit4]   2> 2428874 INFO  (TEST-ChaosMonkeyNothingIsSafeTest.test-seed#[AD5BDDE049B9EE7E]) [    ] o.e.j.s.Server Started @2432115ms
   [junit4]   2> 2428874 INFO  (TEST-ChaosMonkeyNothingIsSafeTest.test-seed#[AD5BDDE049B9EE7E]) [    ] o.a.s.c.s.e.JettySolrRunner Jetty properties: {hostContext=/, solr.data.dir=/home/jenkins/workspace/Lucene-Solr-7.x-Linux/solr/build/solr-core/test/J0/temp/solr.cloud.ChaosMonkeyNothingIsSafeTest_AD5BDDE049B9EE7E-001/tempDir-001/control/data, hostPort=37011, coreRootDirectory=/home/jenkins/workspace/Lucene-Solr-7.x-Linux/solr/build/solr-core/test/J0/temp/solr.cloud.ChaosMonkeyNothingIsSafeTest_AD5BDDE049B9EE7E-001/control-001/cores}
   [junit4]   2> 2428874 ERROR (TEST-ChaosMonkeyNothingIsSafeTest.test-seed#[AD5BDDE049B9EE7E]) [    ] o.a.s.u.StartupLoggingUtils Missing Java Option solr.log.dir. Logging may be missing or incomplete.
   [junit4]   2> 2428875 INFO  (TEST-ChaosMonkeyNothingIsSafeTest.test-seed#[AD5BDDE049B9EE7E]) [    ] o.a.s.s.SolrDispatchFilter  ___      _       Welcome to Apache Solr™ version 7.3.0
   [junit4]   2> 2428875 INFO  (TEST-ChaosMonkeyNothingIsSafeTest.test-seed#[AD5BDDE049B9EE7E]) [    ] o.a.s.s.SolrDispatchFilter / __| ___| |_ _   Starting in cloud mode on port null
   [junit4]   2> 2428875 INFO  (TEST-ChaosMonkeyNothingIsSafeTest.test-seed#[AD5BDDE049B9EE7E]) [    ] o.a.s.s.SolrDispatchFilter \__ \/ _ \ | '_|  Install dir: null
   [junit4]   2> 2428875 INFO  (TEST-ChaosMonkeyNothingIsSafeTest.test-seed#[AD5BDDE049B9EE7E]) [    ] o.a.s.s.SolrDispatchFilter |___/\___/_|_|    Start time: 2018-01-19T13:18:04.977115Z
   [junit4]   2> 2428875 INFO  (zkConnectionManagerCallback-3953-thread-1) [    ] o.a.s.c.c.ConnectionManager zkClient has connected
   [junit4]   2> 2428876 INFO  (TEST-ChaosMonkeyNothingIsSafeTest.test-seed#[AD5BDDE049B9EE7E]) [    ] o.a.s.s.SolrDispatchFilter Loading solr.xml from SolrHome (not found in ZooKeeper)
   [junit4]   2> 2428876 INFO  (TEST-ChaosMonkeyNothingIsSafeTest.test-seed#[AD5BDDE049B9EE7E]) [    ] o.a.s.c.SolrXmlConfig Loading container configuration from /home/jenkins/workspace/Lucene-Solr-7.x-Linux/solr/build/solr-core/test/J0/temp/solr.cloud.ChaosMonkeyNothingIsSafeTest_AD5BDDE049B9EE7E-001/control-001/solr.xml
   [junit4]   2> 2428877 INFO  (TEST-ChaosMonkeyNothingIsSafeTest.test-seed#[AD5BDDE049B9EE7E]) [    ] o.a.s.c.SolrXmlConfig Configuration parameter autoReplicaFailoverWorkLoopDelay is ignored
   [junit4]   2> 2428877 INFO  (TEST-ChaosMonkeyNothingIsSafeTest.test-seed#[AD5BDDE049B9EE7E]) [    ] o.a.s.c.SolrXmlConfig Configuration parameter autoReplicaFailoverBadNodeExpiration is ignored
   [junit4]   2> 2428878 INFO  (TEST-ChaosMonkeyNothingIsSafeTest.test-seed#[AD5BDDE049B9EE7E]) [    ] o.a.s.c.SolrXmlConfig MBean server found: com.sun.jmx.mbeanserver.JmxMBeanServer@60496d76, but no JMX reporters were configured - adding default JMX reporter.
   [junit4]   2> 2428879 INFO  (TEST-ChaosMonkeyNothingIsSafeTest.test-seed#[AD5BDDE049B9EE7E]) [    ] o.a.s.c.ZkContainer Zookeeper client=127.0.0.1:41781/solr
   [junit4]   2> 2428880 INFO  (zkConnectionManagerCallback-3957-thread-1) [    ] o.a.s.c.c.ConnectionManager zkClient has connected
   [junit4]   2> 2428881 WARN  (NIOServerCxn.Factory:0.0.0.0/0.0.0.0:0) [    ] o.a.z.s.NIOServerCnxn caught end of stream exception
   [junit4]   2> EndOfStreamException: Unable to read additional data from client sessionid 0x1610e91b1ec0003, likely client has closed socket
   [junit4]   2> 	at org.apache.zookeeper.server.NIOServerCnxn.doIO(NIOServerCnxn.java:239)
   [junit4]   2> 	at org.apache.zookeeper.server.NIOServerCnxnFactory.run(NIOServerCnxnFactory.java:203)
   [junit4]   2> 	at java.base/java.lang.Thread.run(Thread.java:844)
   [junit4]   2> 2428881 INFO  (zkConnectionManagerCallback-3959-thread-1-processing-n:127.0.0.1:37011_) [n:127.0.0.1:37011_    ] o.a.s.c.c.ConnectionManager zkClient has connected
   [junit4]   2> 2428908 INFO  (TEST-ChaosMonkeyNothingIsSafeTest.test-seed#[AD5BDDE049B9EE7E]) [n:127.0.0.1:37011_    ] o.a.s.c.Overseer Overseer (id=null) closing
   [junit4]   2> 2428908 INFO  (TEST-ChaosMonkeyNothingIsSafeTest.test-seed#[AD5BDDE049B9EE7E]) [n:127.0.0.1:37011_    ] o.a.s.c.OverseerElectionContext I am going to be the leader 127.0.0.1:37011_
   [junit4]   2> 2428909 INFO  (TEST-ChaosMonkeyNothingIsSafeTest.test-seed#[AD5BDDE049B9EE7E]) [n:127.0.0.1:37011_    ] o.a.s.c.Overseer Overseer (id=99376685696942084-127.0.0.1:37011_-n_0000000000) starting
   [junit4]   2> 2428915 INFO  (TEST-ChaosMonkeyNothingIsSafeTest.test-seed#[AD5BDDE049B9EE7E]) [n:127.0.0.1:37011_    ] o.a.s.c.ZkController Register node as live in ZooKeeper:/live_nodes/127.0.0.1:37011_
   [junit4]   2> 2428916 INFO  (zkCallback-3958-thread-1-processing-n:127.0.0.1:37011_) [n:127.0.0.1:37011_    ] o.a.s.c.c.ZkStateReader Updated live nodes from ZooKeeper... (0) -> (1)
   [junit4]   2> 2428944 INFO  (TEST-ChaosMonkeyNothingIsSafeTest.test-seed#[AD5BDDE049B9EE7E]) [n:127.0.0.1:37011_    ] o.a.s.m.r.SolrJmxReporter JMX monitoring for 'solr.node' (registry 'solr.node') enabled at server: com.sun.jmx.mbeanserver.JmxMBeanServer@60496d76
   [junit4]   2> 2428949 INFO  (TEST-ChaosMonkeyNothingIsSafeTest.test-seed#[AD5BDDE049B9EE7E]) [n:127.0.0.1:37011_    ] o.a.s.m.r.SolrJmxReporter JMX monitoring for 'solr.jvm' (registry 'solr.jvm') enabled at server: com.sun.jmx.mbeanserver.JmxMBeanServer@60496d76
   [junit4]   2> 2428949 INFO  (TEST-ChaosMonkeyNothingIsSafeTest.test-seed#[AD5BDDE049B9EE7E]) [n:127.0.0.1:37011_    ] o.a.s.m.r.SolrJmxReporter JMX monitoring for 'solr.jetty' (registry 'solr.jetty') enabled at server: com.sun.jmx.mbeanserver.JmxMBeanServer@60496d76
   [junit4]   2> 2428950 INFO  (TEST-ChaosMonkeyNothingIsSafeTest.test-seed#[AD5BDDE049B9EE7E]) [n:127.0.0.1:37011_    ] o.a.s.c.CorePropertiesLocator Found 0 core definitions underneath /home/jenkins/workspace/Lucene-Solr-7.x-Linux/solr/build/solr-core/test/J0/temp/solr.cloud.ChaosMonkeyNothingIsSafeTest_AD5BDDE049B9EE7E-001/control-001/cores
   [junit4]   2> 2428966 INFO  (zkConnectionManagerCallback-3965-thread-1) [    ] o.a.s.c.c.ConnectionManager zkClient has connected
   [junit4]   2> 2428966 INFO  (TEST-ChaosMonkeyNothingIsSafeTest.test-seed#[AD5BDDE049B9EE7E]) [    ] o.a.s.c.c.ZkStateReader Updated live nodes from ZooKeeper... (0) -> (1)
   [junit4]   2> 2428967 INFO  (TEST-ChaosMonkeyNothingIsSafeTest.test-seed#[AD5BDDE049B9EE7E]) [    ] o.a.s.c.s.i.ZkClientClusterStateProvider Cluster at 127.0.0.1:41781/solr ready
   [junit4]   2> 2428968 INFO  (qtp1574877577-19460) [n:127.0.0.1:37011_    ] o.a.s.h.a.CollectionsHandler Invoked Collection Action :create with params replicationFactor=1&collection.configName=conf1&name=control_collection&nrtReplicas=1&action=CREATE&numShards=1&createNodeSet=127.0.0.1:37011_&wt=javabin&version=2 and sendToOCPQueue=true
   [junit4]   2> 2428969 INFO  (OverseerThreadFactory-3434-thread-1-processing-n:127.0.0.1:37011_) [n:127.0.0.1:37011_    ] o.a.s.c.a.c.CreateCollectionCmd Create collection control_collection
   [junit4]   2> 2429073 INFO  (qtp1574877577-19496) [n:127.0.0.1:37011_    ] o.a.s.h.a.CoreAdminOperation core create command qt=/admin/cores&collection.configName=conf1&newCollection=true&name=control_collection_shard1_replica_n1&action=CREATE&numShards=1&collection=control_collection&shard=shard1&wt=javabin&version=2&replicaType=NRT
   [junit4]   2> 2429073 INFO  (qtp1574877577-19496) [n:127.0.0.1:37011_    ] o.a.s.c.TransientSolrCoreCacheDefault Allocating transient cache for 4 transient cores
   [junit4]   2> 2429177 INFO  (zkCallback-3958-thread-1-processing-n:127.0.0.1:37011_) [n:127.0.0.1:37011_    ] o.a.s.c.c.ZkStateReader A cluster state change: [WatchedEvent state:SyncConnected type:NodeDataChanged path:/collections/control_collection/state.json] for collection [control_collection] has occurred - updating... (live nodes size: [1])
   [junit4]   2> 2430109 INFO  (qtp1574877577-19496) [n:127.0.0.1:37011_ c:control_collection s:shard1  x:control_collection_shard1_replica_n1] o.a.s.c.SolrConfig Using Lucene MatchVersion: 7.3.0
   [junit4]   2> 2430123 INFO  (qtp1574877577-19496) [n:127.0.0.1:37011_ c:control_collection s:shard1  x:control_collection_shard1_replica_n1] o.a.s.s.IndexSchema [control_collection_shard1_replica_n1] Schema name=test
   [junit4]   2> 2430180 INFO  (qtp1574877577-19496) [n:127.0.0.1:37011_ c:control_collection s:shard1  x:control_collection_shard1_replica_n1] o.a.s.s.IndexSchema Loaded schema test/1.6 with uniqueid field id
   [junit4]   2> 2430186 INFO  (qtp1574877577-19496) [n:127.0.0.1:37011_ c:control_collection s:shard1  x:control_collection_shard1_replica_n1] o.a.s.c.CoreContainer Creating SolrCore 'control_collection_shard1_replica_n1' using configuration from collection control_collection, trusted=true
   [junit4]   2> 2430186 INFO  (qtp1574877577-19496) [n:127.0.0.1:37011_ c:control_collection s:shard1  x:control_collection_shard1_replica_n1] o.a.s.m.r.SolrJmxReporter JMX monitoring for 'solr.core.control_collection.shard1.replica_n1' (registry 'solr.core.control_collection.shard1.replica_n1') enabled at server: com.sun.jmx.mbeanserver.JmxMBeanServer@60496d76
   [junit4]   2> 2430188 INFO  (qtp1574877577-19496) [n:127.0.0.1:37011_ c:control_collection s:shard1  x:control_collection_shard1_replica_n1] o.a.s.c.SolrCore solr.RecoveryStrategy.Builder
   [junit4]   2> 2430188 INFO  (qtp1574877577-19496) [n:127.0.0.1:37011_ c:control_collection s:shard1  x:control_collection_shard1_replica_n1] o.a.s.c.SolrCore [[control_collection_shard1_replica_n1] ] Opening new SolrCore at [/home/jenkins/workspace/Lucene-Solr-7.x-Linux/solr/build/solr-core/test/J0/temp/solr.cloud.ChaosMonkeyNothingIsSafeTest_AD5BDDE049B9EE7E-001/control-001/cores/control_collection_shard1_replica_n1], dataDir=[/home/jenkins/workspace/Lucene-Solr-7.x-Linux/solr/build/solr-core/test/J0/temp/solr.cloud.ChaosMonkeyNothingIsSafeTest_AD5BDDE049B9EE7E-001/control-001/cores/control_collection_shard1_replica_n1/data/]
   [junit4]   2> 2430191 INFO  (qtp1574877577-19496) [n:127.0.0.1:37011_ c:control_collection s:shard1  x:control_collection_shard1_replica_n1] o.a.s.u.RandomMergePolicy RandomMergePolicy wrapping class org.apache.lucene.index.LogByteSizeMergePolicy: [LogByteSizeMergePolicy: minMergeSize=1677721, mergeFactor=38, maxMergeSize=2147483648, maxMergeSizeForForcedMerge=9223372036854775807, calibrateSizeByDeletes=true, maxMergeDocs=2147483647, maxCFSSegmentSizeMB=8.796093022207999E12, noCFSRatio=1.0]
   [junit4]   2> 2430212 WARN  (qtp1574877577-19496) [n:127.0.0.1:37011_ c:control_collection s:shard1  x:control_collection_shard1_replica_n1] o.a.s.c.RequestHandlers INVALID paramSet a in requestHandler {type = requestHandler,name = /dump,class = DumpRequestHandler,attributes = {initParams=a, name=/dump, class=DumpRequestHandler},args = {defaults={a=A,b=B}}}
   [junit4]   2> 2430236 INFO  (qtp1574877577-19496) [n:127.0.0.1:37011_ c:control_collection s:shard1  x:control_collection_shard1_replica_n1] o.a.s.u.UpdateHandler Using UpdateLog implementation: org.apache.solr.update.UpdateLog
   [junit4]   2> 2430236 INFO  (qtp1574877577-19496) [n:127.0.0.1:37011_ c:control_collection s:shard1  x:control_collection_shard1_replica_n1] o.a.s.u.UpdateLog Initializing UpdateLog: dataDir= defaultSyncLevel=FLUSH numRecordsToKeep=100 maxNumLogsToKeep=10 numVersionBuckets=65536
   [junit4]   2> 2430236 INFO  (qtp1574877577-19496) [n:127.0.0.1:37011_ c:control_collection s:shard1  x:control_collection_shard1_replica_n1] o.a.s.u.CommitTracker Hard AutoCommit: if uncommited for 15000ms; 
   [junit4]   2> 2430236 INFO  (qtp1574877577-19496) [n:127.0.0.1:37011_ c:control_collection s:shard1  x:control_collection_shard1_replica_n1] o.a.s.u.CommitTracker Soft AutoCommit: disabled
   [junit4]   2> 2430237 INFO  (qtp1574877577-19496) [n:127.0.0.1:37011_ c:control_collection s:shard1  x:control_collection_shard1_replica_n1] o.a.s.u.RandomMergePolicy RandomMergePolicy wrapping class org.apache.lucene.index.TieredMergePolicy: [TieredMergePolicy: maxMergeAtOnce=34, maxMergeAtOnceExplicit=18, maxMergedSegmentMB=46.2998046875, floorSegmentMB=0.4140625, forceMergeDeletesPctAllowed=29.761873275649602, segmentsPerTier=50.0, maxCFSSegmentSizeMB=8.796093022207999E12, noCFSRatio=0.8207317434734356
   [junit4]   2> 2430238 INFO  (qtp1574877577-19496) [n:127.0.0.1:37011_ c:control_collection s:shard1  x:control_collection_shard1_replica_n1] o.a.s.s.SolrIndexSearcher Opening [Searcher@3b050e18[control_collection_shard1_replica_n1] main]
   [junit4]   2> 2430238 INFO  (qtp1574877577-19496) [n:127.0.0.1:37011_ c:control_collection s:shard1  x:control_collection_shard1_replica_n1] o.a.s.r.ManagedResourceStorage Configured ZooKeeperStorageIO with znodeBase: /configs/conf1
   [junit4]   2> 2430238 INFO  (qtp1574877577-19496) [n:127.0.0.1:37011_ c:control_collection s:shard1  x:control_collection_shard1_replica_n1] o.a.s.r.ManagedResourceStorage Loaded null at path _rest_managed.json using ZooKeeperStorageIO:path=/configs/conf1
   [junit4]   2> 2430239 INFO  (qtp1574877577-19496) [n:127.0.0.1:37011_ c:control_collection s:shard1  x:control_collection_shard1_replica_n1] o.a.s.h.ReplicationHandler Commits will be reserved for 10000ms.
   [junit4]   2> 2430239 INFO  (searcherExecutor-3437-thread-1-processing-n:127.0.0.1:37011_ x:control_collection_shard1_replica_n1 s:shard1 c:control_collection) [n:127.0.0.1:37011_ c:control_collection s:shard1  x:control_collection_shard1_replica_n1] o.a.s.c.SolrCore [control_collection_shard1_replica_n1] Registered new searcher Searcher@3b050e18[control_collection_shard1_replica_n1] main{ExitableDirectoryReader(UninvertingDirectoryReader())}
   [junit4]   2> 2430239 INFO  (qtp1574877577-19496) [n:127.0.0.1:37011_ c:control_collection s:shard1  x:control_collection_shard1_replica_n1] o.a.s.u.UpdateLog Could not find max version in index or recent updates, using new clock 1590026972787900416
   [junit4]   2> 2430242 INFO  (qtp1574877577-19496) [n:127.0.0.1:37011_ c:control_collection s:shard1  x:control_collection_shard1_replica_n1] o.a.s.c.ShardLeaderElectionContext Enough replicas found to continue.
   [junit4]   2> 2430242 INFO  (qtp1574877577-19496) [n:127.0.0.1:37011_ c:control_collection s:shard1  x:control_collection_shard1_replica_n1] o.a.s.c.ShardLeaderElectionContext I may be the new leader - try and sync
   [junit4]   2> 2430242 INFO  (qtp1574877577-19496) [n:127.0.0.1:37011_ c:control_collection s:shard1  x:control_collection_shard1_replica_n1] o.a.s.c.SyncStrategy Sync replicas to http://127.0.0.1:37011/control_collection_shard1_replica_n1/
   [junit4]   2> 2430242 INFO  (qtp1574877577-19496) [n:127.0.0.1:37011_ c:control_collection s:shard1  x:control_collection_shard1_replica_n1] o.a.s.c.SyncStrategy Sync Success - now sync replicas to me
   [junit4]   2> 2430242 INFO  (qtp1574877577-19496) [n:127.0.0.1:37011_ c:control_collection s:shard1  x:control_collection_shard1_replica_n1] o.a.s.c.SyncStrategy http://127.0.0.1:37011/control_collection_shard1_replica_n1/ has no replicas
   [junit4]   2> 2430242 INFO  (qtp1574877577-19496) [n:127.0.0.1:37011_ c:control_collection s:shard1  x:control_collection_shard1_replica_n1] o.a.s.c.ShardLeaderElectionContext Found all replicas participating in election, clear LIR
   [junit4]   2> 2430244 INFO  (qtp1574877577-19496) [n:127.0.0.1:37011_ c:control_collection s:shard1  x:control_collection_shard1_replica_n1] o.a.s.c.ShardLeaderElectionContext I am the new leader: http://127.0.0.1:37011/control_collection_shard1_replica_n1/ shard1
   [junit4]   2> 2430345 INFO  (zkCallback-3958-thread-2-processing-n:127.0.0.1:37011_) [n:127.0.0.1:37011_    ] o.a.s.c.c.ZkStateReader A cluster state change: [WatchedEvent state:SyncConnected type:NodeDataChanged path:/collections/control_collection/state.json] for collection [control_collection] has occurred - updating... (live nodes size: [1])
   [junit4]   2> 2430394 INFO  (qtp1574877577-19496) [n:127.0.0.1:37011_ c:control_collection s:shard1  x:control_collection_shard1_replica_n1] o.a.s.c.ZkController I am the leader, no recovery necessary
   [junit4]   2> 2430400 INFO  (qtp1574877577-19496) [n:127.0.0.1:37011_ c:control_collection s:shard1  x:control_collection_shard1_replica_n1] o.a.s.s.HttpSolrCall [admin] webapp=null path=/admin/cores params={qt=/admin/cores&collection.configName=conf1&newCollection=true&name=control_collection_shard1_replica_n1&action=CREATE&numShards=1&collection=control_collection&shard=shard1&wt=javabin&version=2&replicaType=NRT} status=0 QTime=1326
   [junit4]   2> 2430402 INFO  (qtp1574877577-19460) [n:127.0.0.1:37011_    ] o.a.s.h.a.CollectionsHandler Wait for new collection to be active for at most 30 seconds. Check all shard replicas
   [junit4]   2> 2430497 INFO  (zkCallback-3958-thread-2-processing-n:127.0.0.1:37011_) [n:127.0.0.1:37011_    ] o.a.s.c.c.ZkStateReader A cluster state change: [WatchedEvent state:SyncConnected type:NodeDataChanged path:/collections/control_collection/state.json] for collection [control_collection] has occurred - updating... (live nodes size: [1])
   [junit4]   2> 2430970 INFO  (OverseerCollectionConfigSetProcessor-99376685696942084-127.0.0.1:37011_-n_0000000000) [n:127.0.0.1:37011_    ] o.a.s.c.OverseerTaskQueue Response ZK path: /overseer/collection-queue-work/qnr-0000000000 doesn't exist.  Requestor may have disconnected from ZooKeeper
   [junit4]   2> 2431403 INFO  (qtp1574877577-19460) [n:127.0.0.1:37011_    ] o.a.s.s.HttpSolrCall [admin] webapp=null path=/admin/collections params={replicationFactor=1&collection.configName=conf1&name=control_collection&nrtReplicas=1&action=CREATE&numShards=1&createNodeSet=127.0.0.1:37011_&wt=javabin&version=2} status=0 QTime=2434
   [junit4]   2> 2431406 INFO  (zkConnectionManagerCallback-3969-thread-1) [    ] o.a.s.c.c.ConnectionManager zkClient has connected
   [junit4]   2> 2431407 INFO  (TEST-ChaosMonkeyNothingIsSafeTest.test-seed#[AD5BDDE049B9EE7E]) [    ] o.a.s.c.c.ZkStateReader Updated live nodes from ZooKeeper... (0) -> (1)
   [junit4]   2> 2431408 INFO  (TEST-ChaosMonkeyNothingIsSafeTest.test-seed#[AD5BDDE049B9EE7E]) [    ] o.a.s.c.s.i.ZkClientClusterStateProvider Cluster at 127.0.0.1:41781/solr ready
   [junit4]   2> 2431409 INFO  (TEST-ChaosMonkeyNothingIsSafeTest.test-seed#[AD5BDDE049B9EE7E]) [    ] o.a.s.c.ChaosMonkey monkey: init - expire sessions:false cause connection loss:false
   [junit4]   2> 2431409 INFO  (qtp1574877577-19495) [n:127.0.0.1:37011_    ] o.a.s.h.a.CollectionsHandler Invoked Collection Action :create with params replicationFactor=1&collection.configName=conf1&name=collection1&nrtReplicas=1&action=CREATE&numShards=3&createNodeSet=&stateFormat=2&wt=javabin&version=2 and sendToOCPQueue=true
   [junit4]   2> 2431411 INFO  (OverseerThreadFactory-3434-thread-2-processing-n:127.0.0.1:37011_) [n:127.0.0.1:37011_    ] o.a.s.c.a.c.CreateCollectionCmd Create collection collection1
   [junit4]   2> 2431412 WARN  (OverseerThreadFactory-3434-thread-2-processing-n:127.0.0.1:37011_) [n:127.0.0.1:37011_    ] o.a.s.c.a.c.CreateCollectionCmd It is unusual to create a collection (collection1) without cores.
   [junit4]   2> 2431614 INFO  (qtp1574877577-19495) [n:127.0.0.1:37011_    ] o.a.s.h.a.CollectionsHandler Wait for new collection to be active for at most 30 seconds. Check all shard replicas
   [junit4]   2> 2431614 INFO  (qtp1574877577-19495) [n:127.0.0.1:37011_    ] o.a.s.s.HttpSolrCall [admin] webapp=null path=/admin/collections params={replicationFactor=1&collection.configName=conf1&name=collection1&nrtReplicas=1&action=CREATE&numShards=3&createNodeSet=&stateFormat=2&wt=javabin&version=2} status=0 QTime=205
   [junit4]   2> 2431706 INFO  (TEST-ChaosMonkeyNothingIsSafeTest.test-seed#[AD5BDDE049B9EE7E]) [    ] o.a.s.c.AbstractFullDistribZkTestBase create jetty 1 in directory /home/jenkins/workspace/Lucene-Solr-7.x-Linux/solr/build/solr-core/test/J0/temp/solr.cloud.ChaosMonkeyNothingIsSafeTest_AD5BDDE049B9EE7E-001/shard-1-001 of type TLOG
   [junit4]   2> 2431707 INFO  (TEST-ChaosMonkeyNothingIsSafeTest.test-seed#[AD5BDDE049B9EE7E]) [    ] o.e.j.s.Server jetty-9.4.8.v20171121, build timestamp: 2017-11-22T03:57:37+06:30, git hash: 82b8fb23f757335bb3329d540ce37a2a2615f0a8
   [junit4]   2> 2431708 INFO  (TEST-ChaosMonkeyNothingIsSafeTest.test-seed#[AD5BDDE049B9EE7E]) [    ] o.e.j.s.session DefaultSessionIdManager workerName=node0
   [junit4]   2> 2431708 INFO  (TEST-ChaosMonkeyNothingIsSafeTest.test-seed#[AD5BDDE049B9EE7E]) [    ] o.e.j.s.session No SessionScavenger set, using defaults
   [junit4]   2> 2431708 INFO  (TEST-ChaosMonkeyNothingIsSafeTest.test-seed#[AD5BDDE049B9EE7E]) [    ] o.e.j.s.session Scavenging every 660000ms
   [junit4]   2> 2431708 INFO  (TEST-ChaosMonkeyNothingIsSafeTest.test-seed#[AD5BDDE049B9EE7E]) [    ] o.e.j.s.h.ContextHandler Started o.e.j.s.ServletContextHandler@8b8a91{/,null,AVAILABLE}
   [junit4]   2> 2431708 INFO  (TEST-ChaosMonkeyNothingIsSafeTest.test-seed#[AD5BDDE049B9EE7E]) [    ] o.e.j.s.AbstractConnector Started ServerConnector@2dc1aa43{HTTP/1.1,[http/1.1]}{127.0.0.1:45907}
   [junit4]   2> 2431708 INFO  (TEST-ChaosMonkeyNothingIsSafeTest.test-seed#[AD5BDDE049B9EE7E]) [    ] o.e.j.s.Server Started @2434949ms
   [junit4]   2> 2431708 INFO  (TEST-ChaosMonkeyNothingIsSafeTest.test-seed#[AD5BDDE049B9EE7E]) [    ] o.a.s.c.s.e.JettySolrRunner Jetty properties: {hostContext=/, solrconfig=solrconfig.xml, solr.data.dir=/home/jenkins/workspace/Lucene-Solr-7.x-Linux/solr/build/solr-core/test/J0/temp/solr.cloud.ChaosMonkeyNothingIsSafeTest_AD5BDDE049B9EE7E-001/tempDir-001/jetty1, hostPort=45907, coreRootDirectory=/home/jenkins/workspace/Lucene-Solr-7.x-Linux/solr/build/solr-core/test/J0/temp/solr.cloud.ChaosMonkeyNothingIsSafeTest_AD5BDDE049B9EE7E-001/shard-1-001/cores, replicaType=TLOG}
   [junit4]   2> 2431708 ERROR (TEST-ChaosMonkeyNothingIsSafeTest.test-seed#[AD5BDDE049B9EE7E]) [    ] o.a.s.u.StartupLoggingUtils Missing Java Option solr.log.dir. Logging may be missing or incomplete.
   [junit4]   2> 2431709 INFO  (TEST-ChaosMonkeyNothingIsSafeTest.test-seed#[AD5BDDE049B9EE7E]) [    ] o.a.s.s.SolrDispatchFilter  ___      _       Welcome to Apache Solr™ version 7.3.0
   [junit4]   2> 2431709 INFO  (TEST-ChaosMonkeyNothingIsSafeTest.test-seed#[AD5BDDE049B9EE7E]) [    ] o.a.s.s.SolrDispatchFilter / __| ___| |_ _   Starting in cloud mode on port null
   [junit4]   2> 2431709 INFO  (TEST-ChaosMonkeyNothingIsSafeTest.test-seed#[AD5BDDE049B9EE7E]) [    ] o.a.s.s.SolrDispatchFilter \__ \/ _ \ | '_|  Install dir: null
   [junit4]   2> 2431709 INFO  (TEST-ChaosMonkeyNothingIsSafeTest.test-seed#[AD5BDDE049B9EE7E]) [    ] o.a.s.s.SolrDispatchFilter |___/\___/_|_|    Start time: 2018-01-19T13:18:07.811143Z
   [junit4]   2> 2431710 INFO  (zkConnectionManagerCallback-3971-thread-1) [    ] o.a.s.c.c.ConnectionManager zkClient has connected
   [junit4]   2> 2431710 INFO  (TEST-ChaosMonkeyNothingIsSafeTest.test-seed#[AD5BDDE049B9EE7E]) [    ] o.a.s.s.SolrDispatchFilter Loading solr.xml from SolrHome (not found in ZooKeeper)
   [junit4]   2> 2431710 INFO  (TEST-ChaosMonkeyNothingIsSafeTest.test-seed#[AD5BDDE049B9EE7E]) [    ] o.a.s.c.SolrXmlConfig Loading container configuration from /home/jenkins/workspace/Lucene-Solr-7.x-Linux/solr/build/solr-core/test/J0/temp/solr.cloud.ChaosMonkeyNothingIsSafeTest_AD5BDDE049B9EE7E-001/shard-1-001/solr.xml
   [junit4]   2> 2431712 INFO  (TEST-ChaosMonkeyNothingIsSafeTest.test-seed#[AD5BDDE049B9EE7E]) [    ] o.a.s.c.SolrXmlConfig Configuration parameter autoReplicaFailoverWorkLoopDelay is ignored
   [junit4]   2> 2431712 INFO  (TEST-ChaosMonkeyNothingIsSafeTest.test-seed#[AD5BDDE049B9EE7E]) [    ] o.a.s.c.SolrXmlConfig Configuration parameter autoReplicaFailoverBadNodeExpiration is ignored
   [junit4]   2> 2431712 INFO  (TEST-ChaosMonkeyNothingIsSafeTest.test-seed#[AD5BDDE049B9EE7E]) [    ] o.a.s.c.SolrXmlConfig MBean server found: com.sun.jmx.mbeanserver.JmxMBeanServer@60496d76, but no JMX reporters were configured - adding default JMX reporter.
   [junit4]   2> 2431714 INFO  (TEST-ChaosMonkeyNothingIsSafeTest.test-seed#[AD5BDDE049B9EE7E]) [    ] o.a.s.c.ZkContainer Zookeeper client=127.0.0.1:41781/solr
   [junit4]   2> 2431717 INFO  (zkConnectionManagerCallback-3975-thread-1) [    ] o.a.s.c.c.ConnectionManager zkClient has connected
   [junit4]   2> 2431718 INFO  (zkConnectionManagerCallback-3977-thread-1-processing-n:127.0.0.1:45907_) [n:127.0.0.1:45907_    ] o.a.s.c.c.ConnectionManager zkClient has connected
   [junit4]   2> 2431720 INFO  (TEST-ChaosMonkeyNothingIsSafeTest.test-seed#[AD5BDDE049B9EE7E]) [n:127.0.0.1:45907_    ] o.a.s.c.c.ZkStateReader Updated live nodes from ZooKeeper... (0) -> (1)
   [junit4]   2> 2431721 INFO  (TEST-ChaosMonkeyNothingIsSafeTest.test-seed#[AD5BDDE049B9EE7E]) [n:127.0.0.1:45907_    ] o.a.s.c.Overseer Overseer (id=null) closing
   [junit4]   2> 2431722 INFO  (TEST-ChaosMonkeyNothingIsSafeTest.test-seed#[AD5BDDE049B9EE7E]) [n:127.0.0.1:45907_    ] o.a.s.c.ZkController Register node as live in ZooKeeper:/live_nodes/127.0.0.1:45907_
   [junit4]   2> 2431722 INFO  (zkCallback-3958-thread-2-processing-n:127.0.0.1:37011_) [n:127.0.0.1:37011_    ] o.a.s.c.c.ZkStateReader Updated live nodes from ZooKeeper... (1) -> (2)
   [junit4]   2> 2431722 INFO  (zkCallback-3976-thread-1-processing-n:127.0.0.1:45907_) [n:127.0.0.1:45907_    ] o.a.s.c.c.ZkStateReader Updated live nodes from ZooKeeper... (1) -> (2)
   [junit4]   2> 2431722 INFO  (zkCallback-3968-thread-1) [    ] o.a.s.c.c.ZkStateReader Updated live nodes from ZooKeeper... (1) -> (2)
   [junit4]   2> 2431764 INFO  (TEST-ChaosMonkeyNothingIsSafeTest.test-seed#[AD5BDDE049B9EE7E]) [n:127.0.0.1:45907_    ] o.a.s.m.r.SolrJmxReporter JMX monitoring for 'solr.node' (registry 'solr.node') enabled at server: com.sun.jmx.mbeanserver.JmxMBeanServer@60496d76
   [junit4]   2> 2431774 INFO  (TEST-ChaosMonkeyNothingIsSafeTest.test-seed#[AD5BDDE049B9EE7E]) [n:127.0.0.1:45907_    ] o.a.s.m.r.SolrJmxReporter JMX monitoring for 'solr.jvm' (registry 'solr.jvm') enabled at server: com.sun.jmx.mbeanserver.JmxMBeanServer@60496d76
   [junit4]   2> 2431775 INFO  (TEST-ChaosMonkeyNothingIsSafeTest.test-seed#[AD5BDDE049B9EE7E]) [n:127.0.0.1:45907_    ] o.a.s.m.r.SolrJmxReporter JMX monitoring for 'solr.jetty' (registry 'solr.jetty') enabled at server: com.sun.jmx.mbeanserver.JmxMBeanServer@60496d76
   [junit4]   2> 2431776 INFO  (TEST-ChaosMonkeyNothingIsSafeTest.test-seed#[AD5BDDE049B9EE7E]) [n:127.0.0.1:45907_    ] o.a.s.c.CorePropertiesLocator Found 0 core definitions underneath /home/jenkins/workspace/Lucene-Solr-7.x-Linux/solr/build/solr-core/test/J0/temp/solr.cloud.ChaosMonkeyNothingIsSafeTest_AD5BDDE049B9EE7E-001/shard-1-001/cores
   [junit4]   2> 2431804 INFO  (qtp1574877577-19465) [n:127.0.0.1:37011_    ] o.a.s.h.a.CollectionsHandler Invoked Collection Action :addreplica with params node=127.0.0.1:45907_&action=ADDREPLICA&collection=collection1&shard=shard2&type=TLOG&wt=javabin&version=2 and sendToOCPQueue=true
   [junit4]   2> 2431805 INFO  (OverseerCollectionConfigSetProcessor-99376685696942084-127.0.0.1:37011_-n_0000000000) [n:127.0.0.1:37011_    ] o.a.s.c.OverseerTaskQueue Response ZK path: /overseer/collection-queue-work/qnr-0000000002 doesn't exist.  Requestor may have disconnected from ZooKeeper
   [junit4]   2> 2431805 INFO  (OverseerThreadFactory-3434-thread-3-processing-n:127.0.0.1:37011_) [n:127.0.0.1:37011_    ] o.a.s.c.a.c.AddReplicaCmd Node Identified 127.0.0.1:45907_ for creating new replica
   [junit4]   2> 2431806 INFO  (qtp15114149-19512) [n:127.0.0.1:45907_    ] o.a.s.h.a.CoreAdminOperation core create command qt=/admin/cores&collection.configName=conf1&name=collection1_shard2_replica_t61&action=CREATE&collection=collection1&shard=shard2&wt=javabin&version=2&replicaType=TLOG
   [junit4]   2> 2431807 INFO  (qtp15114149-19512) [n:127.0.0.1:45907_    ] o.a.s.c.TransientSolrCoreCacheDefault Allocating transient cache for 4 transient cores
   [junit4]   2> 2431909 INFO  (zkCallback-3976-thread-1-processing-n:127.0.0.1:45907_) [n:127.0.0.1:45907_    ] o.a.s.c.c.ZkStateReader A cluster state change: [WatchedEvent state:SyncConnected type:NodeDataChanged path:/collections/collection1/state.json] for collection [collection1] has occurred - updating... (live nodes size: [2])
   [junit4]   2> 2432841 INFO  (qtp15114149-19512) [n:127.0.0.1:45907_ c:collection1 s:shard2  x:collection1_shard2_replica_t61] o.a.s.c.SolrConfig Using Lucene MatchVersion: 7.3.0
   [junit4]   2> 2432856 INFO  (qtp15114149-19512) [n:127.0.0.1:45907_ c:collection1 s:shard2  x:collection1_shard2_replica_t61] o.a.s.s.IndexSchema [collection1_shard2_replica_t61] Schema name=test
   [junit4]   2> 2432913 INFO  (qtp15114149-19512) [n:127.0.0.1:45907_ c:collection1 s:shard2  x:collection1_shard2_replica_t61] o.a.s.s.IndexSchema Loaded schema test/1.6 with uniqueid field id
   [junit4]   2> 2432919 INFO  (qtp15114149-19512) [n:127.0.0.1:45907_ c:collection1 s:shard2  x:collection1_shard2_replica_t61] o.a.s.c.CoreContainer Creating SolrCore 'collection1_shard2_replica_t61' using configuration from collection collection1, trusted=true
   [junit4]   2> 2432919 INFO  (qtp15114149-19512) [n:127.0.0.1:45907_ c:collection1 s:shard2  x:collection1_shard2_replica_t61] o.a.s.m.r.SolrJmxReporter JMX monitoring for 'solr.core.collection1.shard2.replica_t61' (registry 'solr.core.collection1.shard2.replica_t61') enabled at server: com.sun.jmx.mbeanserver.JmxMBeanServer@60496d76
   [junit4]   2> 2432919 INFO  (qtp15114149-19512) [n:127.0.0.1:45907_ c:collection1 s:shard2  x:collection1_shard2_replica_t61] o.a.s.c.SolrCore solr.RecoveryStrategy.Builder
   [junit4]   2> 2432919 INFO  (qtp15114149-19512) [n:127.0.0.1:45907_ c:collection1 s:shard2  x:collection1_shard2_replica_t61] o.a.s.c.SolrCore [[collection1_shard2_replica_t61] ] Opening new SolrCore at [/home/jenkins/workspace/Lucene-Solr-7.x-Linux/solr/build/solr-core/test/J0/temp/solr.cloud.ChaosMonkeyNothingIsSafeTest_AD5BDDE049B9EE7E-001/shard-1-001/cores/collection1_shard2_replica_t61], dataDir=[/home/jenkins/workspace/Lucene-Solr-7.x-Linux/solr/build/solr-core/test/J0/temp/solr.cloud.ChaosMonkeyNothingIsSafeTest_AD5BDDE049B9EE7E-001/shard-1-001/cores/collection1_shard2_replica_t61/data/]
   [junit4]   2> 2432921 INFO  (qtp15114149-19512) [n:127.0.0.1:45907_ c:collection1 s:shard2  x:collection1_shard2_replica_t61] o.a.s.u.RandomMergePolicy RandomMergePolicy wrapping class org.apache.lucene.index.LogByteSizeMergePolicy: [LogByteSizeMergePolicy: minMergeSize=1677721, mergeFactor=38, maxMergeSize=2147483648, maxMergeSizeForForcedMerge=9223372036854775807, calibrateSizeByDeletes=true, maxMergeDocs=2147483647, maxCFSSegmentSizeMB=8.796093022207999E12, noCFSRatio=1.0]
   [junit4]   2> 2432938 WARN  (qtp15114149-19512) [n:127.0.0.1:45907_ c:collection1 s:shard2  x:collection1_shard2_replica_t61] o.a.s.c.RequestHandlers INVALID paramSet a in requestHandler {type = requestHandler,name = /dump,class = DumpRequestHandler,attributes = {initParams=a, name=/dump, class=DumpRequestHandler},args = {defaults={a=A,b=B}}}
   [junit4]   2> 2432966 INFO  (qtp15114149-19512) [n:127.0.0.1:45907_ c:collection1 s:shard2  x:collection1_shard2_replica_t61] o.a.s.u.UpdateHandler Using UpdateLog implementation: org.apache.solr.update.UpdateLog
   [junit4]   2> 2432966 INFO  (qtp15114149-19512) [n:127.0.0.1:45907_ c:collection1 s:shard2  x:collection1_shard2_replica_t61] o.a.s.u.UpdateLog Initializing UpdateLog: dataDir= defaultSyncLevel=FLUSH numRecordsToKeep=100 maxNumLogsToKeep=10 numVersionBuckets=65536
   [junit4]   2> 2432967 INFO  (qtp15114149-19512) [n:127.0.0.1:45907_ c:collection1 s:shard2  x:collection1_shard2_replica_t61] o.a.s.u.CommitTracker Hard AutoCommit: if uncommited for 15000ms; 
   [junit4]   2> 2432967 INFO  (qtp15114149-19512) [n:127.0.0.1:45907_ c:collection1 s:shard2  x:collection1_shard2_replica_t61] o.a.s.u.CommitTracker Soft AutoCommit: disabled
   [junit4]   2> 2432968 INFO  (qtp15114149-19512) [n:127.0.0.1:45907_ c:collection1 s:shard2  x:collection1_shard2_replica_t61] o.a.s.u.RandomMergePolicy RandomMergePolicy wrapping class org.apache.lucene.index.TieredMergePolicy: [TieredMergePolicy: maxMergeAtOnce=34, maxMergeAtOnceExplicit=18, maxMergedSegmentMB=46.2998046875, floorSegmentMB=0.4140625, forceMergeDeletesPctAllowed=29.761873275649602, segmentsPerTier=50.0, maxCFSSegmentSizeMB=8.796093022207999E12, noCFSRatio=0.8207317434734356
   [junit4]   2> 2432968 INFO  (qtp15114149-19512) [n:127.0.0.1:45907_ c:collection1 s:shard2  x:collection1_shard2_replica_t61] o.a.s.s.SolrIndexSearcher Opening [Searcher@75b2f55c[collection1_shard2_replica_t61] main]
   [junit4]   2> 2432969 INFO  (qtp15114149-19512) [n:127.0.0.1:45907_ c:collection1 s:shard2  x:collection1_shard2_replica_t61] o.a.s.r.ManagedResourceStorage Configured ZooKeeperStorageIO with znodeBase: /configs/conf1
   [junit4]   2> 2432969 INFO  (qtp15114149-19512) [n:127.0.0.1:45907_ c:collection1 s:shard2  x:collection1_shard2_replica_t61] o.a.s.r.ManagedResourceStorage Loaded null at path _rest_managed.json using ZooKeeperStorageIO:path=/configs/conf1
   [junit4]   2> 2432969 INFO  (qtp15114149-19512) [n:127.0.0.1:45907_ c:collection1 s:shard2  x:collection1_shard2_replica_t61] o.a.s.h.ReplicationHandler Commits will be reserved for 10000ms.
   [junit4]   2> 2432969 INFO  (qtp15114149-19512) [n:127.0.0.1:45907_ c:collection1 s:shard2  x:collection1_shard2_replica_t61] o.a.s.u.UpdateLog Could not find max version in index or recent updates, using new clock 1590026975650512896
   [junit4]   2> 2432970 INFO  (searcherExecutor-3448-thread-1-processing-n:127.0.0.1:45907_ x:collection1_shard2_replica_t61 s:shard2 c:collection1) [n:127.0.0.1:45907_ c:collection1 s:shard2  x:collection1_shard2_replica_t61] o.a.s.c.SolrCore [collection1_shard2_replica_t61] Registered new searcher Searcher@75b2f55c[collection1_shard2_replica_t61] main{ExitableDirectoryReader(UninvertingDirectoryReader())}
   [junit4]   2> 2432972 INFO  (qtp15114149-19512) [n:127.0.0.1:45907_ c:collection1 s:shard2  x:collection1_shard2_replica_t61] o.a.s.c.ShardLeaderElectionContext Enough replicas found to continue.
   [junit4]   2> 2432972 INFO  (qtp15114149-19512) [n:127.0.0.1:45907_ c:collection1 s:shard2  x:collection1_shard2_replica_t61] o.a.s.c.ShardLeaderElectionContext I may be the new leader - try and sync
   [junit4]   2> 2432972 INFO  (qtp15114149-19512) [n:127.0.0.1:45907_ c:collection1 s:shard2  x:collection1_shard2_replica_t61] o.a.s.c.SyncStrategy Sync replicas to http://127.0.0.1:45907/collection1_shard2_replica_t61/
   [junit4]   2> 2432972 INFO  (qtp15114149-19512) [n:127.0.0.1:45907_ c:collection1 s:shard2  x:collection1_shard2_replica_t61] o.a.s.c.SyncStrategy Sync Success - now sync replicas to me
   [junit4]   2> 2432972 INFO  (qtp15114149-19512) [n:127.0.0.1:45907_ c:collection1 s:shard2  x:collection1_shard2_replica_t61] o.a.s.c.SyncStrategy http://127.0.0.1:45907/collection1_shard2_replica_t61/ has no replicas
   [junit4]   2> 2432972 INFO  (qtp15114149-19512) [n:127.0.0.1:45907_ c:collection1 s:shard2  x:collection1_shard2_replica_t61] o.a.s.c.ShardLeaderElectionContext Found all replicas participating in election, clear LIR
   [junit4]   2> 2432972 INFO  (qtp15114149-19512) [n:127.0.0.1:45907_ c:collection1 s:shard2  x:collection1_shard2_replica_t61] o.a.s.c.ZkController collection1_shard2_replica_t61 stopping background replication from leader
   [junit4]   2> 2432973 INFO  (qtp15114149-19512) [n:127.0.0.1:45907_ c:collection1 s:shard2  x:collection1_shard2_replica_t61] o.a.s.c.ShardLeaderElectionContext I am the new leader: http://127.0.0.1:45907/collection1_shard2_replica_t61/ shard2
   [junit4]   2> 2433074 INFO  (zkCallback-3976-thread-1-processing-n:127.0.0.1:45907_) [n:127.0.0.1:45907_    ] o.a.s.c.c.ZkStateReader A cluster state change: [WatchedEvent state:SyncConnected type:NodeDataChanged path:/collections/collection1/state.json] for collection [collection1] has occurred - updating... (live nodes size: [2])
   [junit4]   2> 2433124 INFO  (qtp15114149-19512) [n:127.0.0.1:45907_ c:collection1 s:shard2  x:collection1_shard2_replica_t61] o.a.s.c.ZkController I am the leader, no recovery necessary
   [junit4]   2> 2433125 INFO  (qtp15114149-19512) [n:127.0.0.1:45907_ c:collection1 s:shard2  x:collection1_shard2_replica_t61] o.a.s.s.HttpSolrCall [admin] webapp=null path=/admin/cores params={qt=/admin/cores&collection.configName=conf1&name=collection1_shard2_replica_t61&action=CREATE&collection=collection1&shard=shard2&wt=javabin&version=2&replicaType=TLOG} status=0 QTime=1318
   [junit4]   2> 2433126 INFO  (qtp1574877577-19465) [n:127.0.0.1:37011_    ] o.a.s.s.HttpSolrCall [admin] webapp=null path=/admin/collections params={node=127.0.0.1:45907_&action=ADDREPLICA&collection=collection1&shard=shard2&type=TLOG&wt=javabin&version=2} status=0 QTime=1322
   [junit4]   2> 2433201 INFO  (TEST-ChaosMonkeyNothingIsSafeTest.test-seed#[AD5BDDE049B9EE7E]) [    ] o.a.s.c.AbstractFullDistribZkTestBase create jetty 2 in directory /home/jenkins/workspace/Lucene-Solr-7.x-Linux/solr/build/solr-core/test/J0/temp/solr.cloud.ChaosMonkeyNothingIsSafeTest_AD5BDDE049B9EE7E-001/shard-2-001 of type TLOG
   [junit4]   2> 2433201 INFO  (TEST-ChaosMonkeyNothingIsSafeTest.test-seed#[AD5BDDE049B9EE7E]) [    ] o.e.j.s.Server jetty-9.4.8.v20171121, build timestamp: 2017-11-22T03:57:37+06:30, git hash: 82b8fb23f757335bb3329d540ce37a2a2615f0a8
   [junit4]   2> 2433202 INFO  (TEST-ChaosMonkeyNothingIsSafeTest.test-seed#[AD5BDDE049B9EE7E]) [    ] o.e.j.s.session DefaultSessionIdManager workerName=node0
   [junit4]   2> 2433202 INFO  (TEST-ChaosMonkeyNothingIsSafeTest.test-seed#[AD5BDDE049B9EE7E]) [    ] o.e.j.s.session No SessionScavenger set, using defaults
   [junit4]   2> 2433202 INFO  (TEST-ChaosMonkeyNothingIsSafeTest.test-seed#[AD5BDDE049B9EE7E]) [    ] o.e.j.s.session Scavenging every 660000ms
   [junit4]   2> 2433202 INFO  (TEST-ChaosMonkeyNothingIsSafeTest.test-seed#[AD5BDDE049B9EE7E]) [    ] o.e.j.s.h.ContextHandler Started o.e.j.s.ServletContextHandler@7f01f758{/,null,AVAILABLE}
   [junit4]   2> 2433202 INFO  (TEST-ChaosMonkeyNothingIsSafeTest.test-seed#[AD5BDDE049B9EE7E]) [    ] o.e.j.s.AbstractConnector Started ServerConnector@6879a9f9{HTTP/1.1,[http/1.1]}{127.0.0.1:34417}
   [junit4]   2> 2433202 INFO  (TEST-ChaosMonkeyNothingIsSafeTest.test-seed#[AD5BDDE049B9EE7E]) [    ] o.e.j.s.Server Started @2436443ms
   [junit4]   2> 2433202 INFO  (TEST-ChaosMonkeyNothingIsSafeTest.test-seed#[AD5BDDE049B9EE7E]) [    ] o.a.s.c.s.e.JettySolrRunner Jetty properties: {hostContext=/, solrconfig=solrconfig.xml, solr.data.dir=/home/jenkins/workspace/Lucene-Solr-7.x-Linux/solr/build/solr-core/test/J0/temp/solr.cloud.ChaosMonkeyNothingIsSafeTest_AD5BDDE049B9EE7E-001/tempDir-001/jetty2, hostPort=34417, coreRootDirectory=/home/jenkins/workspace/Lucene-Solr-7.x-Linux/solr/build/solr-core/test/J0/temp/solr.cloud.ChaosMonkeyNothingIsSafeTest_AD5BDDE049B9EE7E-001/shard-2-001/cores, replicaType=TLOG}
   [junit4]   2> 2433202 ERROR (TEST-ChaosMonkeyNothingIsSafeTest.test-seed#[AD5BDDE049B9EE7E]) [    ] o.a.s.u.StartupLoggingUtils Missing Java Option solr.log.dir. Logging may be missing or incomplete.
   [junit4]   2> 2433203 INFO  (TEST-ChaosMonkeyNothingIsSafeTest.test-seed#[AD5BDDE049B9EE7E]) [    ] o.a.s.s.SolrDispatchFilter  ___      _       Welcome to Apache Solr™ version 7.3.0
   [junit4]   2> 2433203 INFO  (TEST-ChaosMonkeyNothingIsSafeTest.test-seed#[AD5BDDE049B9EE7E]) [    ] o.a.s.s.SolrDispatchFilter / __| ___| |_ _   Starting in cloud mode on port null
   [junit4]   2> 2433203 INFO  (TEST-ChaosMonkeyNothingIsSafeTest.test-seed#[AD5BDDE049B9EE7E]) [    ] o.a.s.s.SolrDispatchFilter \__ \/ _ \ | '_|  Install dir: null
   [junit4]   2> 2433203 INFO  (TEST-ChaosMonkeyNothingIsSafeTest.test-seed#[AD5BDDE049B9EE7E]) [    ] o.a.s.s.SolrDispatchFilter |___/\___/_|_|    Start time: 2018-01-19T13:18:09.305266Z
   [junit4]   2> 2433204 INFO  (zkConnectionManagerCallback-3981-thread-1) [    ] o.a.s.c.c.ConnectionManager zkClient has connected
   [junit4]   2> 2433204 INFO  (TEST-ChaosMonkeyNothingIsSafeTest.test-seed#[AD5BDDE049B9EE7E]) [    ] o.a.s.s.SolrDispatchFilter Loading solr.xml from SolrHome (not found in ZooKeeper)
   [junit4]   2> 2433204 INFO  (TEST-ChaosMonkeyNothingIsSafeTest.test-seed#[AD5BDDE049B9EE7E]) [    ] o.a.s.c.SolrXmlConfig Loading container configuration from /home/jenkins/workspace/Lucene-Solr-7.x-Linux/solr/build/solr-core/test/J0/temp/solr.cloud.ChaosMonkeyNothingIsSafeTest_AD5BDDE049B9EE7E-001/shard-2-001/solr.xml
   [junit4]   2> 2433211 INFO  (TEST-ChaosMonkeyNothingIsSafeTest.test-seed#[AD5BDDE049B9EE7E]) [    ] o.a.s.c.SolrXmlConfig Configuration parameter autoReplicaFailoverWorkLoopDelay is ignored
   [junit4]   2> 2433211 INFO  (TEST-ChaosMonkeyNothingIsSafeTest.test-seed#[AD5BDDE049B9EE7E]) [    ] o.a.s.c.SolrXmlConfig Configuration parameter autoReplicaFailoverBadNodeExpiration is ignored
   [junit4]   2> 2433212 INFO  (TEST-ChaosMonkeyNothingIsSafeTest.test-seed#[AD5BDDE049B9EE7E]) [    ] o.a.s.c.SolrXmlConfig MBean server found: com.sun.jmx.mbeanserver.JmxMBeanServer@60496d76, but no JMX reporters were configured - adding default JMX reporter.
   [junit4]   2> 2433214 INFO  (TEST-ChaosMonkeyNothingIsSafeTest.test-seed#[AD5BDDE049B9EE7E]) [    ] o.a.s.c.ZkContainer Zookeeper client=127.0.0.1:41781/solr
   [junit4]   2> 2433214 INFO  (zkConnectionManagerCallback-3985-thread-1) [    ] o.a.s.c.c.ConnectionManager zkClient has connected
   [junit4]   2> 2433216 INFO  (zkConnectionManagerCallback-3987-thread-1-processing-n:127.0.0.1:34417_) [n:127.0.0.1:34417_    ] o.a.s.c.c.ConnectionManager zkClient has connected
   [junit4]   2> 2433218 INFO  (TEST-ChaosMonkeyNothingIsSafeTest.test-seed#[AD5BDDE049B9EE7E]) [n:127.0.0.1:34417_    ] o.a.s.c.c.ZkStateReader Updated live nodes from ZooKeeper... (0) -> (2)
   [junit4]   2> 2433218 INFO  (TEST-ChaosMonkeyNothingIsSafeTest.test-seed#[AD5BDDE049B9EE7E]) [n:127.0.0.1:34417_    ] o.a.s.c.Overseer Overseer (id=null) closing
   [junit4]   2> 2433219 INFO  (TEST-ChaosMonkeyNothingIsSafeTest.test-seed#[AD5BDDE049B9EE7E]) [n:127.0.0.1:34417_    ] o.a.s.c.ZkController Register node as live in ZooKeeper:/live_nodes/127.0.0.1:34417_
   [junit4]   2> 2433219 INFO  (zkCallback-3958-thread-2-processing-n:127.0.0.1:37011_) [n:127.0.0.1:37011_    ] o.a.s.c.c.ZkStateReader Updated live nodes from ZooKeeper... (2) -> (3)
   [junit4]   2> 2433219 INFO  (zkCallback-3968-thread-1) [    ] o.a.s.c.c.ZkStateReader Updated live nodes from ZooKeeper... (2) -> (3)
   [junit4]   2> 2433219 INFO  (zkCallback-3976-thread-1-processing-n:127.0.0.1:45907_) [n:127.0.0.1:45907_    ] o.a.s.c.c.ZkStateReader Updated live nodes from ZooKeeper... (2) -> (3)
   [junit4]   2> 2433220 INFO  (zkCallback-3986-thread-1-processing-n:127.0.0.1:34417_) [n:127.0.0.1:34417_    ] o.a.s.c.c.ZkStateReader Updated live nodes from ZooKeeper... (2) -> (3)
   [junit4]   2> 2433243 INFO  (TEST-ChaosMonkeyNothingIsSafeTest.test-seed#[AD5BDDE049B9EE7E]) [n:127.0.0.1:34417_    ] o.a.s.m.r.SolrJmxReporter JMX monitoring for 'solr.node' (registry 'solr.node') enabled at server: com.sun.jmx.mbeanserver.JmxMBeanServer@60496d76
   [junit4]   2> 2433249 INFO  (TEST-ChaosMonkeyNothingIsSafeTest.test-seed#[AD5BDDE049B9EE7E]) [n:127.0.0.1:34417_    ] o.a.s.m.r.SolrJmxReporter JMX monitoring for 'solr.jvm' (registry 'solr.jvm') enabled at server: com.sun.jmx.mbeanserver.JmxMBeanServer@60496d76
   [junit4]   2> 2433249 INFO  (TEST-ChaosMonkeyNothingIsSafeTest.test-seed#[AD5BDDE049B9EE7E]) [n:127.0.0.1:34417_    ] o.a.s.m.r.SolrJmxReporter JMX monitoring for 'solr.jetty' (registry 'solr.jetty') enabled at server: com.sun.jmx.mbeanserver.JmxMBeanServer@60496d76
   [junit4]   2> 2433250 INFO  (TEST-ChaosMonkeyNothingIsSafeTest.test-seed#[AD5BDDE049B9EE7E]) [n:127.0.0.1:34417_    ] o.a.s.c.CorePropertiesLocator Found 0 core definitions underneath /home/jenkins/workspace/Lucene-Solr-7.x-Linux/solr/build/solr-core/test/J0/temp/solr.cloud.ChaosMonkeyNothingIsSafeTest_AD5BDDE049B9EE7E-001/shard-2-001/cores
   [junit4]   2> 2433269 INFO  (qtp318083848-19544) [n:127.0.0.1:34417_    ] o.a.s.h.a.CollectionsHandler Invoked Collection Action :addreplica with params node=127.0.0.1:34417_&action=ADDREPLICA&collection=collection1&shard=shard3&type=TLOG&wt=javabin&version=2 and sendToOCPQueue=true
   [junit4]   2> 2433270 INFO  (OverseerCollectionConfigSetProcessor-99376685696942084-127.0.0.1:37011_-n_0000000000) [n:127.0.0.1:37011_    ] o.a.s.c.OverseerTaskQueue Response ZK path: /overseer/collection-queue-work/qnr-0000000004 doesn't exist.  Requestor may have disconnected from ZooKeeper
   [junit4]   2> 2433271 INFO  (OverseerThreadFactory-3434-thread-4-processing-n:127.0.0.1:37011_) [n:127.0.0.1:37011_    ] o.a.s.c.a.c.AddReplicaCmd Node Identified 127.0.0.1:34417_ for creating new replica
   [junit4]   2> 2433272 INFO  (qtp318083848-19570) [n:127.0.0.1:34417_    ] o.a.s.h.a.CoreAdminOperation core create command qt=/admin/cores&collection.configName=conf1&name=collection1_shard3_replica_t63&action=CREATE&collection=collection1&shard=shard3&wt=javabin&version=2&replicaType=TLOG
   [junit4]   2> 2433272 INFO  (qtp318083848-19570) [n:127.0.0.1:34417_    ] o.a.s.c.TransientSolrCoreCacheDefault Allocating transient cache for 4 transient cores
   [junit4]   2> 2433374 INFO  (zkCallback-3976-thread-1-processing-n:127.0.0.1:45907_) [n:127.0.0.1:45907_    ] o.a.s.c.c.ZkStateReader A cluster state change: [WatchedEvent state:SyncConnected type:NodeDataChanged path:/collections/collection1/state.json] for collection [collection1] has occurred - updating... (live nodes size: [3])
   [junit4]   2> 2433374 INFO  (zkCallback-3986-thread-1-processing-n:127.0.0.1:34417_) [n:127.0.0.1:34417_    ] o.a.s.c.c.ZkStateReader A cluster state change: [WatchedEvent state:SyncConnected type:NodeDataChanged path:/collections/collection1/state.json] for collection [collection1] has occurred - updating... (live nodes size: [3])
   [junit4]   2> 2434303 INFO  (qtp318083848-19570) [n:127.0.0.1:34417_ c:collection1 s:shard3  x:collection1_shard3_replica_t63] o.a.s.c.SolrConfig Using Lucene MatchVersion: 7.3.0
   [junit4]   2> 2434309 INFO  (qtp318083848-19570) [n:127.0.0.1:34417_ c:collection1 s:shard3  x:collection1_shard3_replica_t63] o.a.s.s.IndexSchema [collection1_shard3_replica_t63] Schema name=test
   [junit4]   2> 2434358 INFO  (qtp318083848-19570) [n:127.0.0.1:34417_ c:collection1 s:shard3  x:collection1_shard3_replica_t63] o.a.s.s.IndexSchema Loaded schema test/1.6 with uniqueid field id
   [junit4]   2> 2434364 INFO  (qtp318083848-19570) [n:127.0.0.1:34417_ c:collection1 s:shard3  x:collection1_shard3_replica_t63] o.a.s.c.CoreContainer Creating SolrCore 'collection1_shard3_replica_t63' using configuration from collection collection1, trusted=true
   [junit4]   2> 2434364 INFO  (qtp318083848-19570) [n:127.0.0.1:34417_ c:collection1 s:shard3  x:collection1_shard3_replica_t63] o.a.s.m.r.SolrJmxReporter JMX monitoring for 'solr.core.collection1.shard3.replica_t63' (registry 'solr.core.collection1.shard3.replica_t63') enabled at server: com.sun.jmx.mbeanserver.JmxMBeanServer@60496d76
   [junit4]   2> 2434364 INFO  (qtp318083848-19570) [n:127.0.0.1:34417_

[...truncated too long message...]

a.base@9.0.1/java.lang.Thread.run(Thread.java:844)
   [junit4]    >    8) Thread[id=19759, name=zkCallback-3968-thread-4, state=TIMED_WAITING, group=TGRP-ChaosMonkeyNothingIsSafeTest]
   [junit4]    >         at java.base@9.0.1/jdk.internal.misc.Unsafe.park(Native Method)
   [junit4]    >         at java.base@9.0.1/java.util.concurrent.locks.LockSupport.parkNanos(LockSupport.java:234)
   [junit4]    >         at java.base@9.0.1/java.util.concurrent.SynchronousQueue$TransferStack.awaitFulfill(SynchronousQueue.java:462)
   [junit4]    >         at java.base@9.0.1/java.util.concurrent.SynchronousQueue$TransferStack.transfer(SynchronousQueue.java:361)
   [junit4]    >         at java.base@9.0.1/java.util.concurrent.SynchronousQueue.poll(SynchronousQueue.java:937)
   [junit4]    >         at java.base@9.0.1/java.util.concurrent.ThreadPoolExecutor.getTask(ThreadPoolExecutor.java:1091)
   [junit4]    >         at java.base@9.0.1/java.util.concurrent.ThreadPoolExecutor.runWorker(ThreadPoolExecutor.java:1152)
   [junit4]    >         at java.base@9.0.1/java.util.concurrent.ThreadPoolExecutor$Worker.run(ThreadPoolExecutor.java:641)
   [junit4]    >         at java.base@9.0.1/java.lang.Thread.run(Thread.java:844)
   [junit4]    >    9) Thread[id=19509, name=zkConnectionManagerCallback-3969-thread-1, state=WAITING, group=TGRP-ChaosMonkeyNothingIsSafeTest]
   [junit4]    >         at java.base@9.0.1/jdk.internal.misc.Unsafe.park(Native Method)
   [junit4]    >         at java.base@9.0.1/java.util.concurrent.locks.LockSupport.park(LockSupport.java:194)
   [junit4]    >         at java.base@9.0.1/java.util.concurrent.locks.AbstractQueuedSynchronizer$ConditionObject.await(AbstractQueuedSynchronizer.java:2062)
   [junit4]    >         at java.base@9.0.1/java.util.concurrent.LinkedBlockingQueue.take(LinkedBlockingQueue.java:435)
   [junit4]    >         at java.base@9.0.1/java.util.concurrent.ThreadPoolExecutor.getTask(ThreadPoolExecutor.java:1092)
   [junit4]    >         at java.base@9.0.1/java.util.concurrent.ThreadPoolExecutor.runWorker(ThreadPoolExecutor.java:1152)
   [junit4]    >         at java.base@9.0.1/java.util.concurrent.ThreadPoolExecutor$Worker.run(ThreadPoolExecutor.java:641)
   [junit4]    >         at java.base@9.0.1/java.lang.Thread.run(Thread.java:844)
   [junit4]    > 	at __randomizedtesting.SeedInfo.seed([AD5BDDE049B9EE7E]:0)Throwable #2: com.carrotsearch.randomizedtesting.ThreadLeakError: There are still zombie threads that couldn't be terminated:
   [junit4]    >    1) Thread[id=19507, name=TEST-ChaosMonkeyNothingIsSafeTest.test-seed#[AD5BDDE049B9EE7E]-SendThread(127.0.0.1:41781), state=TIMED_WAITING, group=TGRP-ChaosMonkeyNothingIsSafeTest]
   [junit4]    >         at java.base@9.0.1/java.lang.Thread.sleep(Native Method)
   [junit4]    >         at app//org.apache.zookeeper.ClientCnxn$SendThread.run(ClientCnxn.java:1051)
   [junit4]    >    2) Thread[id=19531, name=zkCallback-3968-thread-1, state=TIMED_WAITING, group=TGRP-ChaosMonkeyNothingIsSafeTest]
   [junit4]    >         at java.base@9.0.1/jdk.internal.misc.Unsafe.park(Native Method)
   [junit4]    >         at java.base@9.0.1/java.util.concurrent.locks.LockSupport.parkNanos(LockSupport.java:234)
   [junit4]    >         at java.base@9.0.1/java.util.concurrent.SynchronousQueue$TransferStack.awaitFulfill(SynchronousQueue.java:462)
   [junit4]    >         at java.base@9.0.1/java.util.concurrent.SynchronousQueue$TransferStack.transfer(SynchronousQueue.java:361)
   [junit4]    >         at java.base@9.0.1/java.util.concurrent.SynchronousQueue.poll(SynchronousQueue.java:937)
   [junit4]    >         at java.base@9.0.1/java.util.concurrent.ThreadPoolExecutor.getTask(ThreadPoolExecutor.java:1091)
   [junit4]    >         at java.base@9.0.1/java.util.concurrent.ThreadPoolExecutor.runWorker(ThreadPoolExecutor.java:1152)
   [junit4]    >         at java.base@9.0.1/java.util.concurrent.ThreadPoolExecutor$Worker.run(ThreadPoolExecutor.java:641)
   [junit4]    >         at java.base@9.0.1/java.lang.Thread.run(Thread.java:844)
   [junit4]    >    3) Thread[id=19733, name=zkCallback-3968-thread-3, state=TIMED_WAITING, group=TGRP-ChaosMonkeyNothingIsSafeTest]
   [junit4]    >         at java.base@9.0.1/jdk.internal.misc.Unsafe.park(Native Method)
   [junit4]    >         at java.base@9.0.1/java.util.concurrent.locks.LockSupport.parkNanos(LockSupport.java:234)
   [junit4]    >         at java.base@9.0.1/java.util.concurrent.SynchronousQueue$TransferStack.awaitFulfill(SynchronousQueue.java:462)
   [junit4]    >         at java.base@9.0.1/java.util.concurrent.SynchronousQueue$TransferStack.transfer(SynchronousQueue.java:361)
   [junit4]    >         at java.base@9.0.1/java.util.concurrent.SynchronousQueue.poll(SynchronousQueue.java:937)
   [junit4]    >         at java.base@9.0.1/java.util.concurrent.ThreadPoolExecutor.getTask(ThreadPoolExecutor.java:1091)
   [junit4]    >         at java.base@9.0.1/java.util.concurrent.ThreadPoolExecutor.runWorker(ThreadPoolExecutor.java:1152)
   [junit4]    >         at java.base@9.0.1/java.util.concurrent.ThreadPoolExecutor$Worker.run(ThreadPoolExecutor.java:641)
   [junit4]    >         at java.base@9.0.1/java.lang.Thread.run(Thread.java:844)
   [junit4]    >    4) Thread[id=19729, name=zkCallback-3968-thread-2, state=TIMED_WAITING, group=TGRP-ChaosMonkeyNothingIsSafeTest]
   [junit4]    >         at java.base@9.0.1/jdk.internal.misc.Unsafe.park(Native Method)
   [junit4]    >         at java.base@9.0.1/java.util.concurrent.locks.LockSupport.parkNanos(LockSupport.java:234)
   [junit4]    >         at java.base@9.0.1/java.util.concurrent.SynchronousQueue$TransferStack.awaitFulfill(SynchronousQueue.java:462)
   [junit4]    >         at java.base@9.0.1/java.util.concurrent.SynchronousQueue$TransferStack.transfer(SynchronousQueue.java:361)
   [junit4]    >         at java.base@9.0.1/java.util.concurrent.SynchronousQueue.poll(SynchronousQueue.java:937)
   [junit4]    >         at java.base@9.0.1/java.util.concurrent.ThreadPoolExecutor.getTask(ThreadPoolExecutor.java:1091)
   [junit4]    >         at java.base@9.0.1/java.util.concurrent.ThreadPoolExecutor.runWorker(ThreadPoolExecutor.java:1152)
   [junit4]    >         at java.base@9.0.1/java.util.concurrent.ThreadPoolExecutor$Worker.run(ThreadPoolExecutor.java:641)
   [junit4]    >         at java.base@9.0.1/java.lang.Thread.run(Thread.java:844)
   [junit4]    >    5) Thread[id=19847, name=zkCallback-3968-thread-5, state=TIMED_WAITING, group=TGRP-ChaosMonkeyNothingIsSafeTest]
   [junit4]    >         at java.base@9.0.1/jdk.internal.misc.Unsafe.park(Native Method)
   [junit4]    >         at java.base@9.0.1/java.util.concurrent.locks.LockSupport.parkNanos(LockSupport.java:234)
   [junit4]    >         at java.base@9.0.1/java.util.concurrent.SynchronousQueue$TransferStack.awaitFulfill(SynchronousQueue.java:462)
   [junit4]    >         at java.base@9.0.1/java.util.concurrent.SynchronousQueue$TransferStack.transfer(SynchronousQueue.java:361)
   [junit4]    >         at java.base@9.0.1/java.util.concurrent.SynchronousQueue.poll(SynchronousQueue.java:937)
   [junit4]    >         at java.base@9.0.1/java.util.concurrent.ThreadPoolExecutor.getTask(ThreadPoolExecutor.java:1091)
   [junit4]    >         at java.base@9.0.1/java.util.concurrent.ThreadPoolExecutor.runWorker(ThreadPoolExecutor.java:1152)
   [junit4]    >         at java.base@9.0.1/java.util.concurrent.ThreadPoolExecutor$Worker.run(ThreadPoolExecutor.java:641)
   [junit4]    >         at java.base@9.0.1/java.lang.Thread.run(Thread.java:844)
   [junit4]    >    6) Thread[id=19759, name=zkCallback-3968-thread-4, state=TIMED_WAITING, group=TGRP-ChaosMonkeyNothingIsSafeTest]
   [junit4]    >         at java.base@9.0.1/jdk.internal.misc.Unsafe.park(Native Method)
   [junit4]    >         at java.base@9.0.1/java.util.concurrent.locks.LockSupport.parkNanos(LockSupport.java:234)
   [junit4]    >         at java.base@9.0.1/java.util.concurrent.SynchronousQueue$TransferStack.awaitFulfill(SynchronousQueue.java:462)
   [junit4]    >         at java.base@9.0.1/java.util.concurrent.SynchronousQueue$TransferStack.transfer(SynchronousQueue.java:361)
   [junit4]    >         at java.base@9.0.1/java.util.concurrent.SynchronousQueue.poll(SynchronousQueue.java:937)
   [junit4]    >         at java.base@9.0.1/java.util.concurrent.ThreadPoolExecutor.getTask(ThreadPoolExecutor.java:1091)
   [junit4]    >         at java.base@9.0.1/java.util.concurrent.ThreadPoolExecutor.runWorker(ThreadPoolExecutor.java:1152)
   [junit4]    >         at java.base@9.0.1/java.util.concurrent.ThreadPoolExecutor$Worker.run(ThreadPoolExecutor.java:641)
   [junit4]    >         at java.base@9.0.1/java.lang.Thread.run(Thread.java:844)
   [junit4]    >    7) Thread[id=19509, name=zkConnectionManagerCallback-3969-thread-1, state=WAITING, group=TGRP-ChaosMonkeyNothingIsSafeTest]
   [junit4]    >         at java.base@9.0.1/jdk.internal.misc.Unsafe.park(Native Method)
   [junit4]    >         at java.base@9.0.1/java.util.concurrent.locks.LockSupport.park(LockSupport.java:194)
   [junit4]    >         at java.base@9.0.1/java.util.concurrent.locks.AbstractQueuedSynchronizer$ConditionObject.await(AbstractQueuedSynchronizer.java:2062)
   [junit4]    >         at java.base@9.0.1/java.util.concurrent.LinkedBlockingQueue.take(LinkedBlockingQueue.java:435)
   [junit4]    >         at java.base@9.0.1/java.util.concurrent.ThreadPoolExecutor.getTask(ThreadPoolExecutor.java:1092)
   [junit4]    >         at java.base@9.0.1/java.util.concurrent.ThreadPoolExecutor.runWorker(ThreadPoolExecutor.java:1152)
   [junit4]    >         at java.base@9.0.1/java.util.concurrent.ThreadPoolExecutor$Worker.run(ThreadPoolExecutor.java:641)
   [junit4]    >         at java.base@9.0.1/java.lang.Thread.run(Thread.java:844)
   [junit4]    > 	at __randomizedtesting.SeedInfo.seed([AD5BDDE049B9EE7E]:0)
   [junit4] Completed [500/767 (1!)] on J0 in 85.51s, 1 test, 3 errors <<< FAILURES!

[...truncated 41779 lines...]

Mime
View raw message