lucene-dev mailing list archives

Site index · List index
Message view « Date » · « Thread »
Top « Date » · « Thread »
From Policeman Jenkins Server <jenk...@thetaphi.de>
Subject [JENKINS] Lucene-Solr-7.x-MacOSX (64bit/jdk-9) - Build # 388 - Still Unstable!
Date Mon, 08 Jan 2018 17:40:35 GMT
Build: https://jenkins.thetaphi.de/job/Lucene-Solr-7.x-MacOSX/388/
Java: 64bit/jdk-9 -XX:+UseCompressedOops -XX:+UseParallelGC

2 tests failed.
FAILED:  org.apache.solr.cloud.ReplaceNodeTest.test

Error Message:
Captured an uncaught exception in thread: Thread[id=24859, name=OverseerThreadFactory-10264-thread-2, state=RUNNABLE, group=Overseer collection creation process.]

Stack Trace:
com.carrotsearch.randomizedtesting.UncaughtExceptionError: Captured an uncaught exception in thread: Thread[id=24859, name=OverseerThreadFactory-10264-thread-2, state=RUNNABLE, group=Overseer collection creation process.]
Caused by: java.lang.NoClassDefFoundError: org/apache/solr/cloud/LeaderRecoveryWatcher
	at __randomizedtesting.SeedInfo.seed([44A30A1A0FBE88]:0)
	at org.apache.solr.cloud.ReplaceNodeCmd.call(ReplaceNodeCmd.java:138)
	at org.apache.solr.cloud.OverseerCollectionMessageHandler.processMessage(OverseerCollectionMessageHandler.java:243)
	at org.apache.solr.cloud.OverseerTaskProcessor$Runner.run(OverseerTaskProcessor.java:469)
	at org.apache.solr.common.util.ExecutorUtil$MDCAwareThreadPoolExecutor.lambda$execute$0(ExecutorUtil.java:188)
	at java.base/java.util.concurrent.ThreadPoolExecutor.runWorker(ThreadPoolExecutor.java:1167)
	at java.base/java.util.concurrent.ThreadPoolExecutor$Worker.run(ThreadPoolExecutor.java:641)
	at java.base/java.lang.Thread.run(Thread.java:844)
Caused by: java.lang.ClassNotFoundException: org.apache.solr.cloud.LeaderRecoveryWatcher
	at java.base/jdk.internal.loader.BuiltinClassLoader.loadClass(BuiltinClassLoader.java:582)
	at java.base/jdk.internal.loader.ClassLoaders$AppClassLoader.loadClass(ClassLoaders.java:185)
	at java.base/java.lang.ClassLoader.loadClass(ClassLoader.java:496)
	... 7 more


FAILED:  org.apache.solr.cloud.FullSolrCloudDistribCmdsTest.test

Error Message:
Could not find collection:collection2

Stack Trace:
java.lang.AssertionError: Could not find collection:collection2
	at __randomizedtesting.SeedInfo.seed([44A30A1A0FBE88:88109CD0B4F3D370]:0)
	at org.junit.Assert.fail(Assert.java:93)
	at org.junit.Assert.assertTrue(Assert.java:43)
	at org.junit.Assert.assertNotNull(Assert.java:526)
	at org.apache.solr.cloud.AbstractDistribZkTestBase.waitForRecoveriesToFinish(AbstractDistribZkTestBase.java:155)
	at org.apache.solr.cloud.AbstractDistribZkTestBase.waitForRecoveriesToFinish(AbstractDistribZkTestBase.java:140)
	at org.apache.solr.cloud.AbstractDistribZkTestBase.waitForRecoveriesToFinish(AbstractDistribZkTestBase.java:135)
	at org.apache.solr.cloud.AbstractFullDistribZkTestBase.waitForRecoveriesToFinish(AbstractFullDistribZkTestBase.java:913)
	at org.apache.solr.cloud.FullSolrCloudDistribCmdsTest.testIndexingBatchPerRequestWithHttpSolrClient(FullSolrCloudDistribCmdsTest.java:612)
	at org.apache.solr.cloud.FullSolrCloudDistribCmdsTest.test(FullSolrCloudDistribCmdsTest.java:152)
	at java.base/jdk.internal.reflect.NativeMethodAccessorImpl.invoke0(Native Method)
	at java.base/jdk.internal.reflect.NativeMethodAccessorImpl.invoke(NativeMethodAccessorImpl.java:62)
	at java.base/jdk.internal.reflect.DelegatingMethodAccessorImpl.invoke(DelegatingMethodAccessorImpl.java:43)
	at java.base/java.lang.reflect.Method.invoke(Method.java:564)
	at com.carrotsearch.randomizedtesting.RandomizedRunner.invoke(RandomizedRunner.java:1737)
	at com.carrotsearch.randomizedtesting.RandomizedRunner$8.evaluate(RandomizedRunner.java:934)
	at com.carrotsearch.randomizedtesting.RandomizedRunner$9.evaluate(RandomizedRunner.java:970)
	at com.carrotsearch.randomizedtesting.RandomizedRunner$10.evaluate(RandomizedRunner.java:984)
	at org.apache.solr.BaseDistributedSearchTestCase$ShardsRepeatRule$ShardsFixedStatement.callStatement(BaseDistributedSearchTestCase.java:993)
	at org.apache.solr.BaseDistributedSearchTestCase$ShardsRepeatRule$ShardsStatement.evaluate(BaseDistributedSearchTestCase.java:968)
	at com.carrotsearch.randomizedtesting.rules.SystemPropertiesRestoreRule$1.evaluate(SystemPropertiesRestoreRule.java:57)
	at org.apache.lucene.util.TestRuleSetupTeardownChained$1.evaluate(TestRuleSetupTeardownChained.java:49)
	at org.apache.lucene.util.AbstractBeforeAfterRule$1.evaluate(AbstractBeforeAfterRule.java:45)
	at org.apache.lucene.util.TestRuleThreadAndTestName$1.evaluate(TestRuleThreadAndTestName.java:48)
	at org.apache.lucene.util.TestRuleIgnoreAfterMaxFailures$1.evaluate(TestRuleIgnoreAfterMaxFailures.java:64)
	at org.apache.lucene.util.TestRuleMarkFailure$1.evaluate(TestRuleMarkFailure.java:47)
	at com.carrotsearch.randomizedtesting.rules.StatementAdapter.evaluate(StatementAdapter.java:36)
	at com.carrotsearch.randomizedtesting.ThreadLeakControl$StatementRunner.run(ThreadLeakControl.java:368)
	at com.carrotsearch.randomizedtesting.ThreadLeakControl.forkTimeoutingTask(ThreadLeakControl.java:817)
	at com.carrotsearch.randomizedtesting.ThreadLeakControl$3.evaluate(ThreadLeakControl.java:468)
	at com.carrotsearch.randomizedtesting.RandomizedRunner.runSingleTest(RandomizedRunner.java:943)
	at com.carrotsearch.randomizedtesting.RandomizedRunner$5.evaluate(RandomizedRunner.java:829)
	at com.carrotsearch.randomizedtesting.RandomizedRunner$6.evaluate(RandomizedRunner.java:879)
	at com.carrotsearch.randomizedtesting.RandomizedRunner$7.evaluate(RandomizedRunner.java:890)
	at com.carrotsearch.randomizedtesting.rules.StatementAdapter.evaluate(StatementAdapter.java:36)
	at com.carrotsearch.randomizedtesting.rules.SystemPropertiesRestoreRule$1.evaluate(SystemPropertiesRestoreRule.java:57)
	at org.apache.lucene.util.AbstractBeforeAfterRule$1.evaluate(AbstractBeforeAfterRule.java:45)
	at com.carrotsearch.randomizedtesting.rules.StatementAdapter.evaluate(StatementAdapter.java:36)
	at org.apache.lucene.util.TestRuleStoreClassName$1.evaluate(TestRuleStoreClassName.java:41)
	at com.carrotsearch.randomizedtesting.rules.NoShadowingOrOverridesOnMethodsRule$1.evaluate(NoShadowingOrOverridesOnMethodsRule.java:40)
	at com.carrotsearch.randomizedtesting.rules.NoShadowingOrOverridesOnMethodsRule$1.evaluate(NoShadowingOrOverridesOnMethodsRule.java:40)
	at com.carrotsearch.randomizedtesting.rules.StatementAdapter.evaluate(StatementAdapter.java:36)
	at com.carrotsearch.randomizedtesting.rules.StatementAdapter.evaluate(StatementAdapter.java:36)
	at org.apache.lucene.util.TestRuleAssertionsRequired$1.evaluate(TestRuleAssertionsRequired.java:53)
	at org.apache.lucene.util.TestRuleMarkFailure$1.evaluate(TestRuleMarkFailure.java:47)
	at org.apache.lucene.util.TestRuleIgnoreAfterMaxFailures$1.evaluate(TestRuleIgnoreAfterMaxFailures.java:64)
	at org.apache.lucene.util.TestRuleIgnoreTestSuites$1.evaluate(TestRuleIgnoreTestSuites.java:54)
	at com.carrotsearch.randomizedtesting.rules.StatementAdapter.evaluate(StatementAdapter.java:36)
	at com.carrotsearch.randomizedtesting.ThreadLeakControl$StatementRunner.run(ThreadLeakControl.java:368)
	at java.base/java.lang.Thread.run(Thread.java:844)




Build Log:
[...truncated 12953 lines...]
   [junit4] Suite: org.apache.solr.cloud.FullSolrCloudDistribCmdsTest
   [junit4]   2> 1855951 INFO  (SUITE-FullSolrCloudDistribCmdsTest-seed#[44A30A1A0FBE88]-worker) [    ] o.a.s.SolrTestCaseJ4 SecureRandom sanity checks: test.solr.allowed.securerandom=null & java.security.egd=file:/dev/./urandom
   [junit4]   2> Creating dataDir: /Users/jenkins/workspace/Lucene-Solr-7.x-MacOSX/solr/build/solr-core/test/J0/temp/solr.cloud.FullSolrCloudDistribCmdsTest_44A30A1A0FBE88-001/init-core-data-001
   [junit4]   2> 1855951 WARN  (SUITE-FullSolrCloudDistribCmdsTest-seed#[44A30A1A0FBE88]-worker) [    ] o.a.s.SolrTestCaseJ4 startTrackingSearchers: numOpens=7 numCloses=7
   [junit4]   2> 1855951 INFO  (SUITE-FullSolrCloudDistribCmdsTest-seed#[44A30A1A0FBE88]-worker) [    ] o.a.s.SolrTestCaseJ4 Using PointFields (NUMERIC_POINTS_SYSPROP=true) w/NUMERIC_DOCVALUES_SYSPROP=true
   [junit4]   2> 1855953 INFO  (SUITE-FullSolrCloudDistribCmdsTest-seed#[44A30A1A0FBE88]-worker) [    ] o.a.s.SolrTestCaseJ4 Randomized ssl (false) and clientAuth (false) via: @org.apache.solr.SolrTestCaseJ4$SuppressSSL(bugUrl="https://issues.apache.org/jira/browse/SOLR-5776") w/ MAC_OS_X supressed clientAuth
   [junit4]   2> 1855953 INFO  (SUITE-FullSolrCloudDistribCmdsTest-seed#[44A30A1A0FBE88]-worker) [    ] o.a.s.BaseDistributedSearchTestCase Setting hostContext system property: /arrl/
   [junit4]   2> 1855955 INFO  (TEST-FullSolrCloudDistribCmdsTest.test-seed#[44A30A1A0FBE88]) [    ] o.a.s.c.ZkTestServer STARTING ZK TEST SERVER
   [junit4]   2> 1855955 INFO  (Thread-3598) [    ] o.a.s.c.ZkTestServer client port:0.0.0.0/0.0.0.0:0
   [junit4]   2> 1855955 INFO  (Thread-3598) [    ] o.a.s.c.ZkTestServer Starting server
   [junit4]   2> 1855958 ERROR (Thread-3598) [    ] o.a.z.s.ZooKeeperServer ZKShutdownHandler is not registered, so ZooKeeper server won't take any action on ERROR or SHUTDOWN server state changes
   [junit4]   2> 1856065 INFO  (TEST-FullSolrCloudDistribCmdsTest.test-seed#[44A30A1A0FBE88]) [    ] o.a.s.c.ZkTestServer start zk server on port:49219
   [junit4]   2> 1856086 INFO  (zkConnectionManagerCallback-6328-thread-1) [    ] o.a.s.c.c.ConnectionManager zkClient has connected
   [junit4]   2> 1856091 INFO  (zkConnectionManagerCallback-6330-thread-1) [    ] o.a.s.c.c.ConnectionManager zkClient has connected
   [junit4]   2> 1856101 INFO  (TEST-FullSolrCloudDistribCmdsTest.test-seed#[44A30A1A0FBE88]) [    ] o.a.s.c.AbstractZkTestCase put /Users/jenkins/workspace/Lucene-Solr-7.x-MacOSX/solr/core/src/test-files/solr/collection1/conf/solrconfig-tlog.xml to /configs/conf1/solrconfig.xml
   [junit4]   2> 1856107 INFO  (TEST-FullSolrCloudDistribCmdsTest.test-seed#[44A30A1A0FBE88]) [    ] o.a.s.c.AbstractZkTestCase put /Users/jenkins/workspace/Lucene-Solr-7.x-MacOSX/solr/core/src/test-files/solr/collection1/conf/schema15.xml to /configs/conf1/schema.xml
   [junit4]   2> 1856112 INFO  (TEST-FullSolrCloudDistribCmdsTest.test-seed#[44A30A1A0FBE88]) [    ] o.a.s.c.AbstractZkTestCase put /Users/jenkins/workspace/Lucene-Solr-7.x-MacOSX/solr/core/src/test-files/solr/collection1/conf/solrconfig.snippet.randomindexconfig.xml to /configs/conf1/solrconfig.snippet.randomindexconfig.xml
   [junit4]   2> 1856115 INFO  (TEST-FullSolrCloudDistribCmdsTest.test-seed#[44A30A1A0FBE88]) [    ] o.a.s.c.AbstractZkTestCase put /Users/jenkins/workspace/Lucene-Solr-7.x-MacOSX/solr/core/src/test-files/solr/collection1/conf/stopwords.txt to /configs/conf1/stopwords.txt
   [junit4]   2> 1856119 INFO  (TEST-FullSolrCloudDistribCmdsTest.test-seed#[44A30A1A0FBE88]) [    ] o.a.s.c.AbstractZkTestCase put /Users/jenkins/workspace/Lucene-Solr-7.x-MacOSX/solr/core/src/test-files/solr/collection1/conf/protwords.txt to /configs/conf1/protwords.txt
   [junit4]   2> 1856123 INFO  (TEST-FullSolrCloudDistribCmdsTest.test-seed#[44A30A1A0FBE88]) [    ] o.a.s.c.AbstractZkTestCase put /Users/jenkins/workspace/Lucene-Solr-7.x-MacOSX/solr/core/src/test-files/solr/collection1/conf/currency.xml to /configs/conf1/currency.xml
   [junit4]   2> 1856127 INFO  (TEST-FullSolrCloudDistribCmdsTest.test-seed#[44A30A1A0FBE88]) [    ] o.a.s.c.AbstractZkTestCase put /Users/jenkins/workspace/Lucene-Solr-7.x-MacOSX/solr/core/src/test-files/solr/collection1/conf/enumsConfig.xml to /configs/conf1/enumsConfig.xml
   [junit4]   2> 1856130 INFO  (TEST-FullSolrCloudDistribCmdsTest.test-seed#[44A30A1A0FBE88]) [    ] o.a.s.c.AbstractZkTestCase put /Users/jenkins/workspace/Lucene-Solr-7.x-MacOSX/solr/core/src/test-files/solr/collection1/conf/open-exchange-rates.json to /configs/conf1/open-exchange-rates.json
   [junit4]   2> 1856133 INFO  (TEST-FullSolrCloudDistribCmdsTest.test-seed#[44A30A1A0FBE88]) [    ] o.a.s.c.AbstractZkTestCase put /Users/jenkins/workspace/Lucene-Solr-7.x-MacOSX/solr/core/src/test-files/solr/collection1/conf/mapping-ISOLatin1Accent.txt to /configs/conf1/mapping-ISOLatin1Accent.txt
   [junit4]   2> 1856136 INFO  (TEST-FullSolrCloudDistribCmdsTest.test-seed#[44A30A1A0FBE88]) [    ] o.a.s.c.AbstractZkTestCase put /Users/jenkins/workspace/Lucene-Solr-7.x-MacOSX/solr/core/src/test-files/solr/collection1/conf/old_synonyms.txt to /configs/conf1/old_synonyms.txt
   [junit4]   2> 1856139 INFO  (TEST-FullSolrCloudDistribCmdsTest.test-seed#[44A30A1A0FBE88]) [    ] o.a.s.c.AbstractZkTestCase put /Users/jenkins/workspace/Lucene-Solr-7.x-MacOSX/solr/core/src/test-files/solr/collection1/conf/synonyms.txt to /configs/conf1/synonyms.txt
   [junit4]   2> 1856144 INFO  (TEST-FullSolrCloudDistribCmdsTest.test-seed#[44A30A1A0FBE88]) [    ] o.a.s.c.AbstractFullDistribZkTestBase Will use NRT replicas unless explicitly asked otherwise
   [junit4]   2> 1857056 INFO  (TEST-FullSolrCloudDistribCmdsTest.test-seed#[44A30A1A0FBE88]) [    ] o.e.j.s.Server jetty-9.3.20.v20170531
   [junit4]   2> 1857060 INFO  (TEST-FullSolrCloudDistribCmdsTest.test-seed#[44A30A1A0FBE88]) [    ] o.e.j.s.h.ContextHandler Started o.e.j.s.ServletContextHandler@754ea8b4{/arrl,null,AVAILABLE}
   [junit4]   2> 1857063 INFO  (TEST-FullSolrCloudDistribCmdsTest.test-seed#[44A30A1A0FBE88]) [    ] o.e.j.s.AbstractConnector Started ServerConnector@7f705eb0{HTTP/1.1,[http/1.1]}{127.0.0.1:49224}
   [junit4]   2> 1857063 INFO  (TEST-FullSolrCloudDistribCmdsTest.test-seed#[44A30A1A0FBE88]) [    ] o.e.j.s.Server Started @1859041ms
   [junit4]   2> 1857063 INFO  (TEST-FullSolrCloudDistribCmdsTest.test-seed#[44A30A1A0FBE88]) [    ] o.a.s.c.s.e.JettySolrRunner Jetty properties: {hostContext=/arrl, solr.data.dir=/Users/jenkins/workspace/Lucene-Solr-7.x-MacOSX/solr/build/solr-core/test/J0/temp/solr.cloud.FullSolrCloudDistribCmdsTest_44A30A1A0FBE88-001/tempDir-001/control/data, hostPort=49224, coreRootDirectory=/Users/jenkins/workspace/Lucene-Solr-7.x-MacOSX/solr/build/solr-core/test/J0/temp/solr.cloud.FullSolrCloudDistribCmdsTest_44A30A1A0FBE88-001/control-001/cores}
   [junit4]   2> 1857063 ERROR (TEST-FullSolrCloudDistribCmdsTest.test-seed#[44A30A1A0FBE88]) [    ] o.a.s.u.StartupLoggingUtils Missing Java Option solr.log.dir. Logging may be missing or incomplete.
   [junit4]   2> 1857064 INFO  (TEST-FullSolrCloudDistribCmdsTest.test-seed#[44A30A1A0FBE88]) [    ] o.a.s.s.SolrDispatchFilter  ___      _       Welcome to Apache Solr? version 7.3.0
   [junit4]   2> 1857065 INFO  (TEST-FullSolrCloudDistribCmdsTest.test-seed#[44A30A1A0FBE88]) [    ] o.a.s.s.SolrDispatchFilter / __| ___| |_ _   Starting in cloud mode on port null
   [junit4]   2> 1857065 INFO  (TEST-FullSolrCloudDistribCmdsTest.test-seed#[44A30A1A0FBE88]) [    ] o.a.s.s.SolrDispatchFilter \__ \/ _ \ | '_|  Install dir: null
   [junit4]   2> 1857065 INFO  (TEST-FullSolrCloudDistribCmdsTest.test-seed#[44A30A1A0FBE88]) [    ] o.a.s.s.SolrDispatchFilter |___/\___/_|_|    Start time: 2018-01-08T17:02:19.073517Z
   [junit4]   2> 1857070 INFO  (zkConnectionManagerCallback-6332-thread-1) [    ] o.a.s.c.c.ConnectionManager zkClient has connected
   [junit4]   2> 1857078 INFO  (TEST-FullSolrCloudDistribCmdsTest.test-seed#[44A30A1A0FBE88]) [    ] o.a.s.s.SolrDispatchFilter Loading solr.xml from SolrHome (not found in ZooKeeper)
   [junit4]   2> 1857078 INFO  (TEST-FullSolrCloudDistribCmdsTest.test-seed#[44A30A1A0FBE88]) [    ] o.a.s.c.SolrXmlConfig Loading container configuration from /Users/jenkins/workspace/Lucene-Solr-7.x-MacOSX/solr/build/solr-core/test/J0/temp/solr.cloud.FullSolrCloudDistribCmdsTest_44A30A1A0FBE88-001/control-001/solr.xml
   [junit4]   2> 1857089 INFO  (TEST-FullSolrCloudDistribCmdsTest.test-seed#[44A30A1A0FBE88]) [    ] o.a.s.c.SolrXmlConfig Configuration parameter autoReplicaFailoverWorkLoopDelay is ignored
   [junit4]   2> 1857089 INFO  (TEST-FullSolrCloudDistribCmdsTest.test-seed#[44A30A1A0FBE88]) [    ] o.a.s.c.SolrXmlConfig Configuration parameter autoReplicaFailoverBadNodeExpiration is ignored
   [junit4]   2> 1857091 INFO  (TEST-FullSolrCloudDistribCmdsTest.test-seed#[44A30A1A0FBE88]) [    ] o.a.s.c.SolrXmlConfig MBean server found: com.sun.jmx.mbeanserver.JmxMBeanServer@166812e3, but no JMX reporters were configured - adding default JMX reporter.
   [junit4]   2> 1857099 INFO  (TEST-FullSolrCloudDistribCmdsTest.test-seed#[44A30A1A0FBE88]) [    ] o.a.s.c.ZkContainer Zookeeper client=127.0.0.1:49219/solr
   [junit4]   2> 1857102 INFO  (zkConnectionManagerCallback-6336-thread-1) [    ] o.a.s.c.c.ConnectionManager zkClient has connected
   [junit4]   2> 1857106 INFO  (zkConnectionManagerCallback-6338-thread-1-processing-n:127.0.0.1:49224_arrl) [n:127.0.0.1:49224_arrl    ] o.a.s.c.c.ConnectionManager zkClient has connected
   [junit4]   2> 1857308 INFO  (TEST-FullSolrCloudDistribCmdsTest.test-seed#[44A30A1A0FBE88]) [n:127.0.0.1:49224_arrl    ] o.a.s.c.Overseer Overseer (id=null) closing
   [junit4]   2> 1857309 INFO  (TEST-FullSolrCloudDistribCmdsTest.test-seed#[44A30A1A0FBE88]) [n:127.0.0.1:49224_arrl    ] o.a.s.c.OverseerElectionContext I am going to be the leader 127.0.0.1:49224_arrl
   [junit4]   2> 1857310 INFO  (TEST-FullSolrCloudDistribCmdsTest.test-seed#[44A30A1A0FBE88]) [n:127.0.0.1:49224_arrl    ] o.a.s.c.Overseer Overseer (id=99315281950474244-127.0.0.1:49224_arrl-n_0000000000) starting
   [junit4]   2> 1857323 INFO  (TEST-FullSolrCloudDistribCmdsTest.test-seed#[44A30A1A0FBE88]) [n:127.0.0.1:49224_arrl    ] o.a.s.c.ZkController Register node as live in ZooKeeper:/live_nodes/127.0.0.1:49224_arrl
   [junit4]   2> 1857326 INFO  (OverseerStateUpdate-99315281950474244-127.0.0.1:49224_arrl-n_0000000000) [n:127.0.0.1:49224_arrl    ] o.a.s.c.c.ZkStateReader Updated live nodes from ZooKeeper... (0) -> (1)
   [junit4]   2> 1857407 INFO  (TEST-FullSolrCloudDistribCmdsTest.test-seed#[44A30A1A0FBE88]) [n:127.0.0.1:49224_arrl    ] o.a.s.m.r.SolrJmxReporter JMX monitoring for 'solr.node' (registry 'solr.node') enabled at server: com.sun.jmx.mbeanserver.JmxMBeanServer@166812e3
   [junit4]   2> 1857435 INFO  (TEST-FullSolrCloudDistribCmdsTest.test-seed#[44A30A1A0FBE88]) [n:127.0.0.1:49224_arrl    ] o.a.s.m.r.SolrJmxReporter JMX monitoring for 'solr.jvm' (registry 'solr.jvm') enabled at server: com.sun.jmx.mbeanserver.JmxMBeanServer@166812e3
   [junit4]   2> 1857436 INFO  (TEST-FullSolrCloudDistribCmdsTest.test-seed#[44A30A1A0FBE88]) [n:127.0.0.1:49224_arrl    ] o.a.s.m.r.SolrJmxReporter JMX monitoring for 'solr.jetty' (registry 'solr.jetty') enabled at server: com.sun.jmx.mbeanserver.JmxMBeanServer@166812e3
   [junit4]   2> 1857437 INFO  (TEST-FullSolrCloudDistribCmdsTest.test-seed#[44A30A1A0FBE88]) [n:127.0.0.1:49224_arrl    ] o.a.s.c.CorePropertiesLocator Found 0 core definitions underneath /Users/jenkins/workspace/Lucene-Solr-7.x-MacOSX/solr/build/solr-core/test/J0/temp/solr.cloud.FullSolrCloudDistribCmdsTest_44A30A1A0FBE88-001/control-001/cores
   [junit4]   2> 1857466 INFO  (zkConnectionManagerCallback-6344-thread-1) [    ] o.a.s.c.c.ConnectionManager zkClient has connected
   [junit4]   2> 1857467 INFO  (TEST-FullSolrCloudDistribCmdsTest.test-seed#[44A30A1A0FBE88]) [    ] o.a.s.c.c.ZkStateReader Updated live nodes from ZooKeeper... (0) -> (1)
   [junit4]   2> 1857469 INFO  (TEST-FullSolrCloudDistribCmdsTest.test-seed#[44A30A1A0FBE88]) [    ] o.a.s.c.s.i.ZkClientClusterStateProvider Cluster at 127.0.0.1:49219/solr ready
   [junit4]   2> 1857472 INFO  (qtp1437786605-20278) [n:127.0.0.1:49224_arrl    ] o.a.s.h.a.CollectionsHandler Invoked Collection Action :create with params replicationFactor=1&collection.configName=conf1&name=control_collection&nrtReplicas=1&action=CREATE&numShards=1&createNodeSet=127.0.0.1:49224_arrl&wt=javabin&version=2 and sendToOCPQueue=true
   [junit4]   2> 1857475 INFO  (OverseerThreadFactory-7924-thread-1-processing-n:127.0.0.1:49224_arrl) [n:127.0.0.1:49224_arrl    ] o.a.s.c.CreateCollectionCmd Create collection control_collection
   [junit4]   2> 1857592 INFO  (qtp1437786605-20280) [n:127.0.0.1:49224_arrl    ] o.a.s.h.a.CoreAdminOperation core create command qt=/admin/cores&collection.configName=conf1&newCollection=true&name=control_collection_shard1_replica_n1&action=CREATE&numShards=1&collection=control_collection&shard=shard1&wt=javabin&version=2&replicaType=NRT
   [junit4]   2> 1857592 INFO  (qtp1437786605-20280) [n:127.0.0.1:49224_arrl    ] o.a.s.c.TransientSolrCoreCacheDefault Allocating transient cache for 4 transient cores
   [junit4]   2> 1857700 INFO  (zkCallback-6337-thread-1-processing-n:127.0.0.1:49224_arrl) [n:127.0.0.1:49224_arrl    ] o.a.s.c.c.ZkStateReader A cluster state change: [WatchedEvent state:SyncConnected type:NodeDataChanged path:/collections/control_collection/state.json] for collection [control_collection] has occurred - updating... (live nodes size: [1])
   [junit4]   2> 1858609 INFO  (qtp1437786605-20280) [n:127.0.0.1:49224_arrl c:control_collection s:shard1  x:control_collection_shard1_replica_n1] o.a.s.c.SolrConfig Using Lucene MatchVersion: 7.3.0
   [junit4]   2> 1858621 INFO  (qtp1437786605-20280) [n:127.0.0.1:49224_arrl c:control_collection s:shard1  x:control_collection_shard1_replica_n1] o.a.s.s.IndexSchema [control_collection_shard1_replica_n1] Schema name=test
   [junit4]   2> 1858701 INFO  (qtp1437786605-20280) [n:127.0.0.1:49224_arrl c:control_collection s:shard1  x:control_collection_shard1_replica_n1] o.a.s.s.IndexSchema Loaded schema test/1.6 with uniqueid field id
   [junit4]   2> 1858728 INFO  (qtp1437786605-20280) [n:127.0.0.1:49224_arrl c:control_collection s:shard1  x:control_collection_shard1_replica_n1] o.a.s.c.CoreContainer Creating SolrCore 'control_collection_shard1_replica_n1' using configuration from collection control_collection, trusted=true
   [junit4]   2> 1858729 INFO  (qtp1437786605-20280) [n:127.0.0.1:49224_arrl c:control_collection s:shard1  x:control_collection_shard1_replica_n1] o.a.s.m.r.SolrJmxReporter JMX monitoring for 'solr.core.control_collection.shard1.replica_n1' (registry 'solr.core.control_collection.shard1.replica_n1') enabled at server: com.sun.jmx.mbeanserver.JmxMBeanServer@166812e3
   [junit4]   2> 1858729 INFO  (qtp1437786605-20280) [n:127.0.0.1:49224_arrl c:control_collection s:shard1  x:control_collection_shard1_replica_n1] o.a.s.c.SolrCore solr.RecoveryStrategy.Builder
   [junit4]   2> 1858729 INFO  (qtp1437786605-20280) [n:127.0.0.1:49224_arrl c:control_collection s:shard1  x:control_collection_shard1_replica_n1] o.a.s.c.SolrCore [[control_collection_shard1_replica_n1] ] Opening new SolrCore at [/Users/jenkins/workspace/Lucene-Solr-7.x-MacOSX/solr/build/solr-core/test/J0/temp/solr.cloud.FullSolrCloudDistribCmdsTest_44A30A1A0FBE88-001/control-001/cores/control_collection_shard1_replica_n1], dataDir=[/Users/jenkins/workspace/Lucene-Solr-7.x-MacOSX/solr/build/solr-core/test/J0/temp/solr.cloud.FullSolrCloudDistribCmdsTest_44A30A1A0FBE88-001/control-001/cores/control_collection_shard1_replica_n1/data/]
   [junit4]   2> 1858732 INFO  (qtp1437786605-20280) [n:127.0.0.1:49224_arrl c:control_collection s:shard1  x:control_collection_shard1_replica_n1] o.a.s.u.RandomMergePolicy RandomMergePolicy wrapping class org.apache.lucene.index.TieredMergePolicy: [TieredMergePolicy: maxMergeAtOnce=19, maxMergeAtOnceExplicit=18, maxMergedSegmentMB=50.1904296875, floorSegmentMB=0.693359375, forceMergeDeletesPctAllowed=28.14862279657467, segmentsPerTier=39.0, maxCFSSegmentSizeMB=8.796093022207999E12, noCFSRatio=0.0
   [junit4]   2> 1858735 WARN  (qtp1437786605-20280) [n:127.0.0.1:49224_arrl c:control_collection s:shard1  x:control_collection_shard1_replica_n1] o.a.s.c.RequestHandlers INVALID paramSet a in requestHandler {type = requestHandler,name = /dump,class = DumpRequestHandler,attributes = {initParams=a, name=/dump, class=DumpRequestHandler},args = {defaults={a=A,b=B}}}
   [junit4]   2> 1858790 INFO  (qtp1437786605-20280) [n:127.0.0.1:49224_arrl c:control_collection s:shard1  x:control_collection_shard1_replica_n1] o.a.s.u.UpdateHandler Using UpdateLog implementation: org.apache.solr.update.UpdateLog
   [junit4]   2> 1858790 INFO  (qtp1437786605-20280) [n:127.0.0.1:49224_arrl c:control_collection s:shard1  x:control_collection_shard1_replica_n1] o.a.s.u.UpdateLog Initializing UpdateLog: dataDir= defaultSyncLevel=FLUSH numRecordsToKeep=100 maxNumLogsToKeep=10 numVersionBuckets=65536
   [junit4]   2> 1858792 INFO  (qtp1437786605-20280) [n:127.0.0.1:49224_arrl c:control_collection s:shard1  x:control_collection_shard1_replica_n1] o.a.s.u.CommitTracker Hard AutoCommit: disabled
   [junit4]   2> 1858792 INFO  (qtp1437786605-20280) [n:127.0.0.1:49224_arrl c:control_collection s:shard1  x:control_collection_shard1_replica_n1] o.a.s.u.CommitTracker Soft AutoCommit: disabled
   [junit4]   2> 1858793 INFO  (qtp1437786605-20280) [n:127.0.0.1:49224_arrl c:control_collection s:shard1  x:control_collection_shard1_replica_n1] o.a.s.u.RandomMergePolicy RandomMergePolicy wrapping class org.apache.lucene.index.TieredMergePolicy: [TieredMergePolicy: maxMergeAtOnce=38, maxMergeAtOnceExplicit=20, maxMergedSegmentMB=49.2138671875, floorSegmentMB=1.14453125, forceMergeDeletesPctAllowed=23.15721813037059, segmentsPerTier=48.0, maxCFSSegmentSizeMB=8.796093022207999E12, noCFSRatio=0.520254745997728
   [junit4]   2> 1858793 INFO  (qtp1437786605-20280) [n:127.0.0.1:49224_arrl c:control_collection s:shard1  x:control_collection_shard1_replica_n1] o.a.s.s.SolrIndexSearcher Opening [Searcher@5324e673[control_collection_shard1_replica_n1] main]
   [junit4]   2> 1858795 INFO  (qtp1437786605-20280) [n:127.0.0.1:49224_arrl c:control_collection s:shard1  x:control_collection_shard1_replica_n1] o.a.s.r.ManagedResourceStorage Configured ZooKeeperStorageIO with znodeBase: /configs/conf1
   [junit4]   2> 1858795 INFO  (qtp1437786605-20280) [n:127.0.0.1:49224_arrl c:control_collection s:shard1  x:control_collection_shard1_replica_n1] o.a.s.r.ManagedResourceStorage Loaded null at path _rest_managed.json using ZooKeeperStorageIO:path=/configs/conf1
   [junit4]   2> 1858796 INFO  (qtp1437786605-20280) [n:127.0.0.1:49224_arrl c:control_collection s:shard1  x:control_collection_shard1_replica_n1] o.a.s.h.ReplicationHandler Commits will be reserved for 10000ms.
   [junit4]   2> 1858796 INFO  (qtp1437786605-20280) [n:127.0.0.1:49224_arrl c:control_collection s:shard1  x:control_collection_shard1_replica_n1] o.a.s.u.UpdateLog Could not find max version in index or recent updates, using new clock 1589044514184495104
   [junit4]   2> 1858797 INFO  (searcherExecutor-7927-thread-1-processing-n:127.0.0.1:49224_arrl x:control_collection_shard1_replica_n1 s:shard1 c:control_collection) [n:127.0.0.1:49224_arrl c:control_collection s:shard1  x:control_collection_shard1_replica_n1] o.a.s.c.SolrCore [control_collection_shard1_replica_n1] Registered new searcher Searcher@5324e673[control_collection_shard1_replica_n1] main{ExitableDirectoryReader(UninvertingDirectoryReader())}
   [junit4]   2> 1858814 INFO  (qtp1437786605-20280) [n:127.0.0.1:49224_arrl c:control_collection s:shard1  x:control_collection_shard1_replica_n1] o.a.s.c.ShardLeaderElectionContext Enough replicas found to continue.
   [junit4]   2> 1858814 INFO  (qtp1437786605-20280) [n:127.0.0.1:49224_arrl c:control_collection s:shard1  x:control_collection_shard1_replica_n1] o.a.s.c.ShardLeaderElectionContext I may be the new leader - try and sync
   [junit4]   2> 1858814 INFO  (qtp1437786605-20280) [n:127.0.0.1:49224_arrl c:control_collection s:shard1  x:control_collection_shard1_replica_n1] o.a.s.c.SyncStrategy Sync replicas to http://127.0.0.1:49224/arrl/control_collection_shard1_replica_n1/
   [junit4]   2> 1858814 INFO  (qtp1437786605-20280) [n:127.0.0.1:49224_arrl c:control_collection s:shard1  x:control_collection_shard1_replica_n1] o.a.s.c.SyncStrategy Sync Success - now sync replicas to me
   [junit4]   2> 1858814 INFO  (qtp1437786605-20280) [n:127.0.0.1:49224_arrl c:control_collection s:shard1  x:control_collection_shard1_replica_n1] o.a.s.c.SyncStrategy http://127.0.0.1:49224/arrl/control_collection_shard1_replica_n1/ has no replicas
   [junit4]   2> 1858814 INFO  (qtp1437786605-20280) [n:127.0.0.1:49224_arrl c:control_collection s:shard1  x:control_collection_shard1_replica_n1] o.a.s.c.ShardLeaderElectionContext Found all replicas participating in election, clear LIR
   [junit4]   2> 1858820 INFO  (qtp1437786605-20280) [n:127.0.0.1:49224_arrl c:control_collection s:shard1  x:control_collection_shard1_replica_n1] o.a.s.c.ShardLeaderElectionContext I am the new leader: http://127.0.0.1:49224/arrl/control_collection_shard1_replica_n1/ shard1
   [junit4]   2> 1858931 INFO  (zkCallback-6337-thread-2-processing-n:127.0.0.1:49224_arrl) [n:127.0.0.1:49224_arrl    ] o.a.s.c.c.ZkStateReader A cluster state change: [WatchedEvent state:SyncConnected type:NodeDataChanged path:/collections/control_collection/state.json] for collection [control_collection] has occurred - updating... (live nodes size: [1])
   [junit4]   2> 1858987 INFO  (qtp1437786605-20280) [n:127.0.0.1:49224_arrl c:control_collection s:shard1  x:control_collection_shard1_replica_n1] o.a.s.c.ZkController I am the leader, no recovery necessary
   [junit4]   2> 1858990 INFO  (qtp1437786605-20280) [n:127.0.0.1:49224_arrl c:control_collection s:shard1  x:control_collection_shard1_replica_n1] o.a.s.s.HttpSolrCall [admin] webapp=null path=/admin/cores params={qt=/admin/cores&collection.configName=conf1&newCollection=true&name=control_collection_shard1_replica_n1&action=CREATE&numShards=1&collection=control_collection&shard=shard1&wt=javabin&version=2&replicaType=NRT} status=0 QTime=1398
   [junit4]   2> 1858994 INFO  (qtp1437786605-20278) [n:127.0.0.1:49224_arrl    ] o.a.s.h.a.CollectionsHandler Wait for new collection to be active for at most 30 seconds. Check all shard replicas
   [junit4]   2> 1859091 INFO  (zkCallback-6337-thread-2-processing-n:127.0.0.1:49224_arrl) [n:127.0.0.1:49224_arrl    ] o.a.s.c.c.ZkStateReader A cluster state change: [WatchedEvent state:SyncConnected type:NodeDataChanged path:/collections/control_collection/state.json] for collection [control_collection] has occurred - updating... (live nodes size: [1])
   [junit4]   2> 1859480 INFO  (OverseerCollectionConfigSetProcessor-99315281950474244-127.0.0.1:49224_arrl-n_0000000000) [n:127.0.0.1:49224_arrl    ] o.a.s.c.OverseerTaskQueue Response ZK path: /overseer/collection-queue-work/qnr-0000000000 doesn't exist.  Requestor may have disconnected from ZooKeeper
   [junit4]   2> 1860005 INFO  (qtp1437786605-20278) [n:127.0.0.1:49224_arrl    ] o.a.s.s.HttpSolrCall [admin] webapp=null path=/admin/collections params={replicationFactor=1&collection.configName=conf1&name=control_collection&nrtReplicas=1&action=CREATE&numShards=1&createNodeSet=127.0.0.1:49224_arrl&wt=javabin&version=2} status=0 QTime=2532
   [junit4]   2> 1860012 INFO  (zkConnectionManagerCallback-6348-thread-1) [    ] o.a.s.c.c.ConnectionManager zkClient has connected
   [junit4]   2> 1860014 INFO  (TEST-FullSolrCloudDistribCmdsTest.test-seed#[44A30A1A0FBE88]) [    ] o.a.s.c.c.ZkStateReader Updated live nodes from ZooKeeper... (0) -> (1)
   [junit4]   2> 1860016 INFO  (TEST-FullSolrCloudDistribCmdsTest.test-seed#[44A30A1A0FBE88]) [    ] o.a.s.c.s.i.ZkClientClusterStateProvider Cluster at 127.0.0.1:49219/solr ready
   [junit4]   2> 1860016 INFO  (TEST-FullSolrCloudDistribCmdsTest.test-seed#[44A30A1A0FBE88]) [    ] o.a.s.c.ChaosMonkey monkey: init - expire sessions:false cause connection loss:false
   [junit4]   2> 1860017 INFO  (qtp1437786605-20283) [n:127.0.0.1:49224_arrl    ] o.a.s.h.a.CollectionsHandler Invoked Collection Action :create with params replicationFactor=1&collection.configName=conf1&name=collection1&nrtReplicas=1&action=CREATE&numShards=3&createNodeSet=&stateFormat=1&wt=javabin&version=2 and sendToOCPQueue=true
   [junit4]   2> 1860024 INFO  (OverseerThreadFactory-7924-thread-2-processing-n:127.0.0.1:49224_arrl) [n:127.0.0.1:49224_arrl    ] o.a.s.c.CreateCollectionCmd Create collection collection1
   [junit4]   2> 1860026 WARN  (OverseerThreadFactory-7924-thread-2-processing-n:127.0.0.1:49224_arrl) [n:127.0.0.1:49224_arrl    ] o.a.s.c.CreateCollectionCmd It is unusual to create a collection (collection1) without cores.
   [junit4]   2> 1860241 INFO  (qtp1437786605-20283) [n:127.0.0.1:49224_arrl    ] o.a.s.h.a.CollectionsHandler Wait for new collection to be active for at most 30 seconds. Check all shard replicas
   [junit4]   2> 1860242 INFO  (qtp1437786605-20283) [n:127.0.0.1:49224_arrl    ] o.a.s.s.HttpSolrCall [admin] webapp=null path=/admin/collections params={replicationFactor=1&collection.configName=conf1&name=collection1&nrtReplicas=1&action=CREATE&numShards=3&createNodeSet=&stateFormat=1&wt=javabin&version=2} status=0 QTime=224
   [junit4]   2> 1860546 INFO  (TEST-FullSolrCloudDistribCmdsTest.test-seed#[44A30A1A0FBE88]) [    ] o.a.s.c.AbstractFullDistribZkTestBase create jetty 1 in directory /Users/jenkins/workspace/Lucene-Solr-7.x-MacOSX/solr/build/solr-core/test/J0/temp/solr.cloud.FullSolrCloudDistribCmdsTest_44A30A1A0FBE88-001/shard-1-001 of type NRT
   [junit4]   2> 1860547 INFO  (TEST-FullSolrCloudDistribCmdsTest.test-seed#[44A30A1A0FBE88]) [    ] o.e.j.s.Server jetty-9.3.20.v20170531
   [junit4]   2> 1860549 INFO  (TEST-FullSolrCloudDistribCmdsTest.test-seed#[44A30A1A0FBE88]) [    ] o.e.j.s.h.ContextHandler Started o.e.j.s.ServletContextHandler@41d04574{/arrl,null,AVAILABLE}
   [junit4]   2> 1860549 INFO  (TEST-FullSolrCloudDistribCmdsTest.test-seed#[44A30A1A0FBE88]) [    ] o.e.j.s.AbstractConnector Started ServerConnector@4dfd2080{HTTP/1.1,[http/1.1]}{127.0.0.1:49243}
   [junit4]   2> 1860549 INFO  (TEST-FullSolrCloudDistribCmdsTest.test-seed#[44A30A1A0FBE88]) [    ] o.e.j.s.Server Started @1862527ms
   [junit4]   2> 1860549 INFO  (TEST-FullSolrCloudDistribCmdsTest.test-seed#[44A30A1A0FBE88]) [    ] o.a.s.c.s.e.JettySolrRunner Jetty properties: {hostContext=/arrl, solrconfig=solrconfig.xml, solr.data.dir=/Users/jenkins/workspace/Lucene-Solr-7.x-MacOSX/solr/build/solr-core/test/J0/temp/solr.cloud.FullSolrCloudDistribCmdsTest_44A30A1A0FBE88-001/tempDir-001/jetty1, hostPort=49243, coreRootDirectory=/Users/jenkins/workspace/Lucene-Solr-7.x-MacOSX/solr/build/solr-core/test/J0/temp/solr.cloud.FullSolrCloudDistribCmdsTest_44A30A1A0FBE88-001/shard-1-001/cores}
   [junit4]   2> 1860549 ERROR (TEST-FullSolrCloudDistribCmdsTest.test-seed#[44A30A1A0FBE88]) [    ] o.a.s.u.StartupLoggingUtils Missing Java Option solr.log.dir. Logging may be missing or incomplete.
   [junit4]   2> 1860550 INFO  (TEST-FullSolrCloudDistribCmdsTest.test-seed#[44A30A1A0FBE88]) [    ] o.a.s.s.SolrDispatchFilter  ___      _       Welcome to Apache Solr? version 7.3.0
   [junit4]   2> 1860550 INFO  (TEST-FullSolrCloudDistribCmdsTest.test-seed#[44A30A1A0FBE88]) [    ] o.a.s.s.SolrDispatchFilter / __| ___| |_ _   Starting in cloud mode on port null
   [junit4]   2> 1860550 INFO  (TEST-FullSolrCloudDistribCmdsTest.test-seed#[44A30A1A0FBE88]) [    ] o.a.s.s.SolrDispatchFilter \__ \/ _ \ | '_|  Install dir: null
   [junit4]   2> 1860550 INFO  (TEST-FullSolrCloudDistribCmdsTest.test-seed#[44A30A1A0FBE88]) [    ] o.a.s.s.SolrDispatchFilter |___/\___/_|_|    Start time: 2018-01-08T17:02:22.558285Z
   [junit4]   2> 1860551 INFO  (zkConnectionManagerCallback-6350-thread-1) [    ] o.a.s.c.c.ConnectionManager zkClient has connected
   [junit4]   2> 1860553 INFO  (TEST-FullSolrCloudDistribCmdsTest.test-seed#[44A30A1A0FBE88]) [    ] o.a.s.s.SolrDispatchFilter Loading solr.xml from SolrHome (not found in ZooKeeper)
   [junit4]   2> 1860553 INFO  (TEST-FullSolrCloudDistribCmdsTest.test-seed#[44A30A1A0FBE88]) [    ] o.a.s.c.SolrXmlConfig Loading container configuration from /Users/jenkins/workspace/Lucene-Solr-7.x-MacOSX/solr/build/solr-core/test/J0/temp/solr.cloud.FullSolrCloudDistribCmdsTest_44A30A1A0FBE88-001/shard-1-001/solr.xml
   [junit4]   2> 1860555 INFO  (TEST-FullSolrCloudDistribCmdsTest.test-seed#[44A30A1A0FBE88]) [    ] o.a.s.c.SolrXmlConfig Configuration parameter autoReplicaFailoverWorkLoopDelay is ignored
   [junit4]   2> 1860555 INFO  (TEST-FullSolrCloudDistribCmdsTest.test-seed#[44A30A1A0FBE88]) [    ] o.a.s.c.SolrXmlConfig Configuration parameter autoReplicaFailoverBadNodeExpiration is ignored
   [junit4]   2> 1860556 INFO  (TEST-FullSolrCloudDistribCmdsTest.test-seed#[44A30A1A0FBE88]) [    ] o.a.s.c.SolrXmlConfig MBean server found: com.sun.jmx.mbeanserver.JmxMBeanServer@166812e3, but no JMX reporters were configured - adding default JMX reporter.
   [junit4]   2> 1860558 INFO  (TEST-FullSolrCloudDistribCmdsTest.test-seed#[44A30A1A0FBE88]) [    ] o.a.s.c.ZkContainer Zookeeper client=127.0.0.1:49219/solr
   [junit4]   2> 1860560 INFO  (zkConnectionManagerCallback-6354-thread-1) [    ] o.a.s.c.c.ConnectionManager zkClient has connected
   [junit4]   2> 1860563 INFO  (zkConnectionManagerCallback-6356-thread-1-processing-n:127.0.0.1:49243_arrl) [n:127.0.0.1:49243_arrl    ] o.a.s.c.c.ConnectionManager zkClient has connected
   [junit4]   2> 1860575 INFO  (TEST-FullSolrCloudDistribCmdsTest.test-seed#[44A30A1A0FBE88]) [n:127.0.0.1:49243_arrl    ] o.a.s.c.c.ZkStateReader Updated live nodes from ZooKeeper... (0) -> (1)
   [junit4]   2> 1860578 INFO  (TEST-FullSolrCloudDistribCmdsTest.test-seed#[44A30A1A0FBE88]) [n:127.0.0.1:49243_arrl    ] o.a.s.c.Overseer Overseer (id=null) closing
   [junit4]   2> 1860581 INFO  (TEST-FullSolrCloudDistribCmdsTest.test-seed#[44A30A1A0FBE88]) [n:127.0.0.1:49243_arrl    ] o.a.s.c.ZkController Register node as live in ZooKeeper:/live_nodes/127.0.0.1:49243_arrl
   [junit4]   2> 1860583 INFO  (zkCallback-6337-thread-2-processing-n:127.0.0.1:49224_arrl) [n:127.0.0.1:49224_arrl    ] o.a.s.c.c.ZkStateReader Updated live nodes from ZooKeeper... (1) -> (2)
   [junit4]   2> 1860583 INFO  (zkCallback-6347-thread-1) [    ] o.a.s.c.c.ZkStateReader Updated live nodes from ZooKeeper... (1) -> (2)
   [junit4]   2> 1860588 INFO  (zkCallback-6355-thread-1-processing-n:127.0.0.1:49243_arrl) [n:127.0.0.1:49243_arrl    ] o.a.s.c.c.ZkStateReader Updated live nodes from ZooKeeper... (1) -> (2)
   [junit4]   2> 1860665 INFO  (TEST-FullSolrCloudDistribCmdsTest.test-seed#[44A30A1A0FBE88]) [n:127.0.0.1:49243_arrl    ] o.a.s.m.r.SolrJmxReporter JMX monitoring for 'solr.node' (registry 'solr.node') enabled at server: com.sun.jmx.mbeanserver.JmxMBeanServer@166812e3
   [junit4]   2> 1860687 INFO  (TEST-FullSolrCloudDistribCmdsTest.test-seed#[44A30A1A0FBE88]) [n:127.0.0.1:49243_arrl    ] o.a.s.m.r.SolrJmxReporter JMX monitoring for 'solr.jvm' (registry 'solr.jvm') enabled at server: com.sun.jmx.mbeanserver.JmxMBeanServer@166812e3
   [junit4]   2> 1860688 INFO  (TEST-FullSolrCloudDistribCmdsTest.test-seed#[44A30A1A0FBE88]) [n:127.0.0.1:49243_arrl    ] o.a.s.m.r.SolrJmxReporter JMX monitoring for 'solr.jetty' (registry 'solr.jetty') enabled at server: com.sun.jmx.mbeanserver.JmxMBeanServer@166812e3
   [junit4]   2> 1860690 INFO  (TEST-FullSolrCloudDistribCmdsTest.test-seed#[44A30A1A0FBE88]) [n:127.0.0.1:49243_arrl    ] o.a.s.c.CorePropertiesLocator Found 0 core definitions underneath /Users/jenkins/workspace/Lucene-Solr-7.x-MacOSX/solr/build/solr-core/test/J0/temp/solr.cloud.FullSolrCloudDistribCmdsTest_44A30A1A0FBE88-001/shard-1-001/cores
   [junit4]   2> 1860729 INFO  (qtp1437786605-20276) [n:127.0.0.1:49224_arrl    ] o.a.s.h.a.CollectionsHandler Invoked Collection Action :addreplica with params node=127.0.0.1:49243_arrl&action=ADDREPLICA&collection=collection1&shard=shard2&type=NRT&wt=javabin&version=2 and sendToOCPQueue=true
   [junit4]   2> 1860734 INFO  (OverseerCollectionConfigSetProcessor-99315281950474244-127.0.0.1:49224_arrl-n_0000000000) [n:127.0.0.1:49224_arrl    ] o.a.s.c.OverseerTaskQueue Response ZK path: /overseer/collection-queue-work/qnr-0000000002 doesn't exist.  Requestor may have disconnected from ZooKeeper
   [junit4]   2> 1860734 INFO  (OverseerThreadFactory-7924-thread-3-processing-n:127.0.0.1:49224_arrl) [n:127.0.0.1:49224_arrl    ] o.a.s.c.AddReplicaCmd Node Identified 127.0.0.1:49243_arrl for creating new replica
   [junit4]   2> 1860741 INFO  (qtp137430205-20327) [n:127.0.0.1:49243_arrl    ] o.a.s.h.a.CoreAdminOperation core create command qt=/admin/cores&collection.configName=conf1&name=collection1_shard2_replica_n61&action=CREATE&collection=collection1&shard=shard2&wt=javabin&version=2&replicaType=NRT
   [junit4]   2> 1860741 INFO  (qtp137430205-20327) [n:127.0.0.1:49243_arrl    ] o.a.s.c.TransientSolrCoreCacheDefault Allocating transient cache for 4 transient cores
   [junit4]   2> 1861780 INFO  (qtp137430205-20327) [n:127.0.0.1:49243_arrl c:collection1 s:shard2  x:collection1_shard2_replica_n61] o.a.s.c.SolrConfig Using Lucene MatchVersion: 7.3.0
   [junit4]   2> 1861814 INFO  (qtp137430205-20327) [n:127.0.0.1:49243_arrl c:collection1 s:shard2  x:collection1_shard2_replica_n61] o.a.s.s.IndexSchema [collection1_shard2_replica_n61] Schema name=test
   [junit4]   2> 1861943 INFO  (qtp137430205-20327) [n:127.0.0.1:49243_arrl c:collection1 s:shard2  x:collection1_shard2_replica_n61] o.a.s.s.IndexSchema Loaded schema test/1.6 with uniqueid field id
   [junit4]   2> 1861967 INFO  (qtp137430205-20327) [n:127.0.0.1:49243_arrl c:collection1 s:shard2  x:collection1_shard2_replica_n61] o.a.s.c.CoreContainer Creating SolrCore 'collection1_shard2_replica_n61' using configuration from collection collection1, trusted=true
   [junit4]   2> 1861968 INFO  (qtp137430205-20327) [n:127.0.0.1:49243_arrl c:collection1 s:shard2  x:collection1_shard2_replica_n61] o.a.s.m.r.SolrJmxReporter JMX monitoring for 'solr.core.collection1.shard2.replica_n61' (registry 'solr.core.collection1.shard2.replica_n61') enabled at server: com.sun.jmx.mbeanserver.JmxMBeanServer@166812e3
   [junit4]   2> 1861968 INFO  (qtp137430205-20327) [n:127.0.0.1:49243_arrl c:collection1 s:shard2  x:collection1_shard2_replica_n61] o.a.s.c.SolrCore solr.RecoveryStrategy.Builder
   [junit4]   2> 1861968 INFO  (qtp137430205-20327) [n:127.0.0.1:49243_arrl c:collection1 s:shard2  x:collection1_shard2_replica_n61] o.a.s.c.SolrCore [[collection1_shard2_replica_n61] ] Opening new SolrCore at [/Users/jenkins/workspace/Lucene-Solr-7.x-MacOSX/solr/build/solr-core/test/J0/temp/solr.cloud.FullSolrCloudDistribCmdsTest_44A30A1A0FBE88-001/shard-1-001/cores/collection1_shard2_replica_n61], dataDir=[/Users/jenkins/workspace/Lucene-Solr-7.x-MacOSX/solr/build/solr-core/test/J0/temp/solr.cloud.FullSolrCloudDistribCmdsTest_44A30A1A0FBE88-001/shard-1-001/cores/collection1_shard2_replica_n61/data/]
   [junit4]   2> 1861983 INFO  (qtp137430205-20327) [n:127.0.0.1:49243_arrl c:collection1 s:shard2  x:collection1_shard2_replica_n61] o.a.s.u.RandomMergePolicy RandomMergePolicy wrapping class org.apache.lucene.index.TieredMergePolicy: [TieredMergePolicy: maxMergeAtOnce=19, maxMergeAtOnceExplicit=18, maxMergedSegmentMB=50.1904296875, floorSegmentMB=0.693359375, forceMergeDeletesPctAllowed=28.14862279657467, segmentsPerTier=39.0, maxCFSSegmentSizeMB=8.796093022207999E12, noCFSRatio=0.0
   [junit4]   2> 1862065 WARN  (qtp137430205-20327) [n:127.0.0.1:49243_arrl c:collection1 s:shard2  x:collection1_shard2_replica_n61] o.a.s.c.RequestHandlers INVALID paramSet a in requestHandler {type = requestHandler,name = /dump,class = DumpRequestHandler,attributes = {initParams=a, name=/dump, class=DumpRequestHandler},args = {defaults={a=A,b=B}}}
   [junit4]   2> 1862126 INFO  (qtp137430205-20327) [n:127.0.0.1:49243_arrl c:collection1 s:shard2  x:collection1_shard2_replica_n61] o.a.s.u.UpdateHandler Using UpdateLog implementation: org.apache.solr.update.UpdateLog
   [junit4]   2> 1862126 INFO  (qtp137430205-20327) [n:127.0.0.1:49243_arrl c:collection1 s:shard2  x:collection1_shard2_replica_n61] o.a.s.u.UpdateLog Initializing UpdateLog: dataDir= defaultSyncLevel=FLUSH numRecordsToKeep=100 maxNumLogsToKeep=10 numVersionBuckets=65536
   [junit4]   2> 1862152 INFO  (qtp137430205-20327) [n:127.0.0.1:49243_arrl c:collection1 s:shard2  x:collection1_shard2_replica_n61] o.a.s.u.CommitTracker Hard AutoCommit: disabled
   [junit4]   2> 1862152 INFO  (qtp137430205-20327) [n:127.0.0.1:49243_arrl c:collection1 s:shard2  x:collection1_shard2_replica_n61] o.a.s.u.CommitTracker Soft AutoCommit: disabled
   [junit4]   2> 1862154 INFO  (qtp137430205-20327) [n:127.0.0.1:49243_arrl c:collection1 s:shard2  x:collection1_shard2_replica_n61] o.a.s.u.RandomMergePolicy RandomMergePolicy wrapping class org.apache.lucene.index.TieredMergePolicy: [TieredMergePolicy: maxMergeAtOnce=38, maxMergeAtOnceExplicit=20, maxMergedSegmentMB=49.2138671875, floorSegmentMB=1.14453125, forceMergeDeletesPctAllowed=23.15721813037059, segmentsPerTier=48.0, maxCFSSegmentSizeMB=8.796093022207999E12, noCFSRatio=0.520254745997728
   [junit4]   2> 1862154 INFO  (qtp137430205-20327) [n:127.0.0.1:49243_arrl c:collection1 s:shard2  x:collection1_shard2_replica_n61] o.a.s.s.SolrIndexSearcher Opening [Searcher@346632b6[collection1_shard2_replica_n61] main]
   [junit4]   2> 1862156 INFO  (qtp137430205-20327) [n:127.0.0.1:49243_arrl c:collection1 s:shard2  x:collection1_shard2_replica_n61] o.a.s.r.ManagedResourceStorage Configured ZooKeeperStorageIO with znodeBase: /configs/conf1
   [junit4]   2> 1862157 INFO  (qtp137430205-20327) [n:127.0.0.1:49243_arrl c:collection1 s:shard2  x:collection1_shard2_replica_n61] o.a.s.r.ManagedResourceStorage Loaded null at path _rest_managed.json using ZooKeeperStorageIO:path=/configs/conf1
   [junit4]   2> 1862158 INFO  (qtp137430205-20327) [n:127.0.0.1:49243_arrl c:collection1 s:shard2  x:collection1_shard2_replica_n61] o.a.s.h.ReplicationHandler Commits will be reserved for 10000ms.
   [junit4]   2> 1862158 INFO  (qtp137430205-20327) [n:127.0.0.1:49243_arrl c:collection1 s:shard2  x:collection1_shard2_replica_n61] o.a.s.u.UpdateLog Could not find max version in index or recent updates, using new clock 1589044517709807616
   [junit4]   2> 1862159 INFO  (searcherExecutor-7938-thread-1-processing-n:127.0.0.1:49243_arrl x:collection1_shard2_replica_n61 s:shard2 c:collection1) [n:127.0.0.1:49243_arrl c:collection1 s:shard2  x:collection1_shard2_replica_n61] o.a.s.c.SolrCore [collection1_shard2_replica_n61] Registered new searcher Searcher@346632b6[collection1_shard2_replica_n61] main{ExitableDirectoryReader(UninvertingDirectoryReader())}
   [junit4]   2> 1862172 INFO  (qtp137430205-20327) [n:127.0.0.1:49243_arrl c:collection1 s:shard2  x:collection1_shard2_replica_n61] o.a.s.c.ShardLeaderElectionContext Enough replicas found to continue.
   [junit4]   2> 1862172 INFO  (qtp137430205-20327) [n:127.0.0.1:49243_arrl c:collection1 s:shard2  x:collection1_shard2_replica_n61] o.a.s.c.ShardLeaderElectionContext I may be the new leader - try and sync
   [junit4]   2> 1862172 INFO  (qtp137430205-20327) [n:127.0.0.1:49243_arrl c:collection1 s:shard2  x:collection1_shard2_replica_n61] o.a.s.c.SyncStrategy Sync replicas to http://127.0.0.1:49243/arrl/collection1_shard2_replica_n61/
   [junit4]   2> 1862172 INFO  (qtp137430205-20327) [n:127.0.0.1:49243_arrl c:collection1 s:shard2  x:collection1_shard2_replica_n61] o.a.s.c.SyncStrategy Sync Success - now sync replicas to me
   [junit4]   2> 1862172 INFO  (qtp137430205-20327) [n:127.0.0.1:49243_arrl c:collection1 s:shard2  x:collection1_shard2_replica_n61] o.a.s.c.SyncStrategy http://127.0.0.1:49243/arrl/collection1_shard2_replica_n61/ has no replicas
   [junit4]   2> 1862172 INFO  (qtp137430205-20327) [n:127.0.0.1:49243_arrl c:collection1 s:shard2  x:collection1_shard2_replica_n61] o.a.s.c.ShardLeaderElectionContext Found all replicas participating in election, clear LIR
   [junit4]   2> 1862178 INFO  (qtp137430205-20327) [n:127.0.0.1:49243_arrl c:collection1 s:shard2  x:collection1_shard2_replica_n61] o.a.s.c.ShardLeaderElectionContext I am the new leader: http://127.0.0.1:49243/arrl/collection1_shard2_replica_n61/ shard2
   [junit4]   2> 1862340 INFO  (qtp137430205-20327) [n:127.0.0.1:49243_arrl c:collection1 s:shard2  x:collection1_shard2_replica_n61] o.a.s.c.ZkController I am the leader, no recovery necessary
   [junit4]   2> 1862351 INFO  (qtp137430205-20327) [n:127.0.0.1:49243_arrl c:collection1 s:shard2  x:collection1_shard2_replica_n61] o.a.s.s.HttpSolrCall [admin] webapp=null path=/admin/cores params={qt=/admin/cores&collection.configName=conf1&name=collection1_shard2_replica_n61&action=CREATE&collection=collection1&shard=shard2&wt=javabin&version=2&replicaType=NRT} status=0 QTime=1609
   [junit4]   2> 1862360 INFO  (qtp1437786605-20276) [n:127.0.0.1:49224_arrl    ] o.a.s.s.HttpSolrCall [admin] webapp=null path=/admin/collections params={node=127.0.0.1:49243_arrl&action=ADDREPLICA&collection=collection1&shard=shard2&type=NRT&wt=javabin&version=2} status=0 QTime=1630
   [junit4]   2> 1862714 INFO  (TEST-FullSolrCloudDistribCmdsTest.test-seed#[44A30A1A0FBE88]) [    ] o.a.s.c.AbstractFullDistribZkTestBase create jetty 2 in directory /Users/jenkins/workspace/Lucene-Solr-7.x-MacOSX/solr/build/solr-core/test/J0/temp/solr.cloud.FullSolrCloudDistribCmdsTest_44A30A1A0FBE88-001/shard-2-001 of type NRT
   [junit4]   2> 1862715 INFO  (TEST-FullSolrCloudDistribCmdsTest.test-seed#[44A30A1A0FBE88]) [    ] o.e.j.s.Server jetty-9.3.20.v20170531
   [junit4]   2> 1862717 INFO  (TEST-FullSolrCloudDistribCmdsTest.test-seed#[44A30A1A0FBE88]) [    ] o.e.j.s.h.ContextHandler Started o.e.j.s.ServletContextHandler@7211029c{/arrl,null,AVAILABLE}
   [junit4]   2> 1862717 INFO  (TEST-FullSolrCloudDistribCmdsTest.test-seed#[44A30A1A0FBE88]) [    ] o.e.j.s.AbstractConnector Started ServerConnector@776a2029{HTTP/1.1,[http/1.1]}{127.0.0.1:49252}
   [junit4]   2> 1862717 INFO  (TEST-FullSolrCloudDistribCmdsTest.test-seed#[44A30A1A0FBE88]) [    ] o.e.j.s.Server Started @1864695ms
   [junit4]   2> 1862717 INFO  (TEST-FullSolrCloudDistribCmdsTest.test-seed#[44A30A1A0FBE88]) [    ] o.a.s.c.s.e.JettySolrRunner Jetty properties: {hostContext=/arrl, solrconfig=solrconfig.xml, solr.data.dir=/Users/jenkins/workspace/Lucene-Solr-7.x-MacOSX/solr/build/solr-core/test/J0/temp/solr.cloud.FullSolrCloudDistribCmdsTest_44A30A1A0FBE88-001/tempDir-001/jetty2, hostPort=49252, coreRootDirectory=/Users/jenkins/workspace/Lucene-Solr-7.x-MacOSX/solr/build/solr-core/test/J0/../../../../../../../../../Users/jenkins/workspace/Lucene-Solr-7.x-MacOSX/solr/build/solr-core/test/J0/temp/solr.cloud.FullSolrCloudDistribCmdsTest_44A30A1A0FBE88-001/shard-2-001/cores}
   [junit4]   2> 1862718 ERROR (TEST-FullSolrCloudDistribCmdsTest.test-seed#[44A30A1A0FBE88]) [    ] o.a.s.u.StartupLoggingUtils Missing Java Option solr.log.dir. Logging may be missing or incomplete.
   [junit4]   2> 1862718 INFO  (TEST-FullSolrCloudDistribCmdsTest.test-seed#[44A30A1A0FBE88]) [    ] o.a.s.s.SolrDispatchFilter  ___      _       Welcome to Apache Solr? version 7.3.0
   [junit4]   2> 1862718 INFO  (TEST-FullSolrCloudDistribCmdsTest.test-seed#[44A30A1A0FBE88]) [    ] o.a.s.s.SolrDispatchFilter / __| ___| |_ _   Starting in cloud mode on port null
   [junit4]   2> 1862718 INFO  (TEST-FullSolrCloudDistribCmdsTest.test-seed#[44A30A1A0FBE88]) [    ] o.a.s.s.SolrDispatchFilter \__ \/ _ \ | '_|  Install dir: null
   [junit4]   2> 1862718 INFO  (TEST-FullSolrCloudDistribCmdsTest.test-seed#[44A30A1A0FBE88]) [    ] o.a.s.s.SolrDispatchFilter |___/\___/_|_|    Start time: 2018-01-08T17:02:24.726675Z
   [junit4]   2> 1862720 INFO  (zkConnectionManagerCallback-6360-thread-1) [    ] o.a.s.c.c.ConnectionManager zkClient has connected
   [junit4]   2> 1862723 INFO  (TEST-FullSolrCloudDistribCmdsTest.test-seed#[44A30A1A0FBE88]) [    ] o.a.s.s.SolrDispatchFilter Loading solr.xml from SolrHome (not found in ZooKeeper)
   [junit4]   2> 1862723 INFO  (TEST-FullSolrCloudDistribCmdsTest.test-seed#[44A30A1A0FBE88]) [    ] o.a.s.c.SolrXmlConfig Loading container configuration from /Users/jenkins/workspace/Lucene-Solr-7.x-MacOSX/solr/build/solr-core/test/J0/temp/solr.cloud.FullSolrCloudDistribCmdsTest_44A30A1A0FBE88-001/shard-2-001/solr.xml
   [junit4]   2> 1862726 INFO  (TEST-FullSolrCloudDistribCmdsTest.test-seed#[44A30A1A0FBE88]) [    ] o.a.s.c.SolrXmlConfig Configuration parameter autoReplicaFailoverWorkLoopDelay is ignored
   [junit4]   2> 1862726 INFO  (TEST-FullSolrCloudDistribCmdsTest.test-seed#[44A30A1A0FBE88]) [    ] o.a.s.c.SolrXmlConfig Configuration parameter autoReplicaFailoverBadNodeExpiration is ignored
   [junit4]   2> 1862727 INFO  (TEST-FullSolrCloudDistribCmdsTest.test-seed#[44A30A1A0FBE88]) [    ] o.a.s.c.SolrXmlConfig MBean server found: com.sun.jmx.mbeanserver.JmxMBeanServer@166812e3, but no JMX reporters were configured - adding default JMX reporter.
   [junit4]   2> 1862730 INFO  (TEST-FullSolrCloudDistribCmdsTest.test-seed#[44A30A1A0FBE88]) [    ] o.a.s.c.ZkContainer Zookeeper client=127.0.0.1:49219/solr
   [junit4]   2> 1862737 INFO  (zkConnectionManagerCallback-6364-thread-1) [    ] o.a.s.c.c.ConnectionManager zkClient has connected
   [junit4]   2> 1862741 INFO  (zkConnectionManagerCallback-6366-thread-1-processing-n:127.0.0.1:49252_arrl) [n:127.0.0.1:49252_arrl    ] o.a.s.c.c.ConnectionManager zkClient has connected
   [junit4]   2> 1862743 INFO  (OverseerCollectionConfigSetProcessor-99315281950474244-127.0.0.1:49224_arrl-n_0000000000) [n:127.0.0.1:49224_arrl    ] o.a.s.c.OverseerTaskQueue Response ZK path: /overseer/collection-queue-work/qnr-0000000004 doesn't exist.  Requestor may have disconnected from ZooKeeper
   [junit4]   2> 1862752 INFO  (TEST-FullSolrCloudDistribCmdsTest.test-seed#[44A30A1A0FBE88]) [n:127.0.0.1:49252_arrl    ] o.a.s.c.c.ZkStateReader Updated live nodes from ZooKeeper... (0) -> (2)
   [junit4]   2> 1862756 INFO  (TEST-FullSolrCloudDistribCmdsTest.test-seed#[44A30A1A0FBE88]) [n:127.0.0.1:49252_arrl    ] o.a.s.c.Overseer Overseer (id=null) closing
   [junit4]   2> 1862761 INFO  (TEST-FullSolrCloudDistribCmdsTest.test-seed#[44A30A1A0FBE88]) [n:127.0.0.1:49252_arrl    ] o.a.s.c.ZkController Register node as live in ZooKeeper:/live_nodes/127.0.0.1:49252_arrl
   [junit4]   2> 1862763 INFO  (zkCallback-6347-thread-1) [    ] o.a.s.c.c.ZkStateReader Updated live nodes from ZooKeeper... (2) -> (3)
   [junit4]   2> 1862763 INFO  (zkCallback-6355-thread-1-processing-n:127.0.0.1:49243_arrl) [n:127.0.0.1:49243_arrl    ] o.a.s.c.c.ZkStateReader Updated live nodes from ZooKeeper... (2) -> (3)
   [junit4]   2> 1862763 INFO  (zkCallback-6337-thread-1-processing-n:127.0.0.1:49224_arrl) [n:127.0.0.1:49224_arrl    ] o.a.s.c.c.ZkStateReader Updated live nodes from ZooKeeper... (2) -> (3)
   [junit4]   2> 1862765 INFO  (zkCallback-6365-thread-1-processing-n:127.0.0.1:49252_arrl) [n:127.0.0.1:49252_arrl    ] o.a.s.c.c.ZkStateReader Updated live nodes from ZooKeeper... (2) -> (3)
   [junit4]   2> 1862829 INFO  (TEST-FullSolrCloudDistribCmdsTest.test-seed#[44A30A1A0FBE88]) [n:127.0.0.1:49252_arrl    ] o.a.s.m.r.SolrJmxReporter JMX monitoring for 'solr.node' (registry 'solr.node') enabled at server: com.sun.jmx.mbeanserver.JmxMBeanServer@166812e3
   [junit4]   2> 1862862 INFO  (TEST-FullSolrCloudDistribCmdsTest.test-seed#[44A30A1A0FBE88]) [n:127.0.0.1:49252_arrl    ] o.a.s.m.r.SolrJmxReporter JMX monitoring for 'solr.jvm' (registry 'solr.jvm') enabled at server: com.sun.jmx.mbeanserver.JmxMBeanServer@166812e3
   [junit4]   2> 1862864 INFO  (TEST-FullSolrCloudDistribCmdsTest.test-seed#[44A30A1A0FBE88]) [n:127.0.0.1:49252_arrl    ] o.a.s.m.r.SolrJmxReporter JMX monitoring for 'solr.jetty' (registry 'solr.jetty') enabled at server: com.sun.jmx.mbeanserver.JmxMBeanServer@166812e3
   [junit4]   2> 1862867 INFO  (TEST-FullSolrCloudDistribCmdsTest.test-seed#[44A30A1A0FBE88]) [n:127.0.0.1:49252_arrl    ] o.a.s.c.CorePropertiesLocator Found 0 core definitions underneath /Users/jenkins/workspace/Lucene-Solr-7.x-MacOSX/solr/build/solr-core/test/J0/../../../../../../../../../Users/jenkins/workspace/Lucene-Solr-7.x-MacOSX/solr/build/solr-core/test/J0/temp/solr.cloud.FullSolrCloudDistribCmdsTest_44A30A1A0FBE88-001/shard-2-001/cores
   [junit4]   2> 1862922 INFO  (qtp1437786605-20279) [n:127.0.0.1:49224_arrl    ] o.a.s.h.a.CollectionsHandler Invoked Collection Action :addreplica with params node=127.0.0.1:49252_arrl&action=ADDREPLICA&collection=collection1&shard=shard3&type=NRT&wt=javabin&version=2 and sendToOCPQueue=true
   [junit4]   2> 1862931 INFO  (OverseerThreadFactory-7924-thread-4-processing-n:127.0.0.1:49224_arrl) [n:127.0.0.1:49224_arrl    ] o.a.s.c.AddReplicaCmd Node Identified 127.0.0.1:49252_arrl for creating new replica
   [junit4]   2> 1862937 INFO  (qtp1569766093-20358) [n:127.0.0.1:49252_arrl    ] o.a.s.h.a.CoreAdminOperation core create command qt=/admin/cores&collection.configName=conf1&name=collection1_shard3_replica_n63&action=CREATE&collection=collection1&shard=shard3&wt=javabin&version=2&replicaType=NRT
   [junit4]   2> 1862938 INFO  (qtp1569766093-20358) [n:127.0.0.1:49252_arrl    ] o.a.s.c.TransientSolrCoreCacheDefault Allocating transient cache for 4 transient cores
   [junit4]   2> 1863956 INFO  (qtp1569766093-20358) [n:127.0.0.1:49252_arrl c:collection1 s:shard3  x:collection1_shard3_replica_n63] o.a.s.c.SolrConfig Using Lucene MatchVersion: 7.3.0
   [junit4]   2> 1863966 INFO  (qtp1569766093-20358) [n:127.0.0.1:49252_arrl c:collection1 s:shard3  x:collection1_shard3_replica_n63] o.a.s.s.IndexSchema [collection1_shard3_replica_n63] Schema name=test
   [junit4]   2> 1864064 INFO  (qtp1569766093-20358) [n:127.0.0.1:49252_arrl c:collection1 s:shard3  x:collection1_shard3_replica_n63] o.a.s.s.IndexSchema Loaded schema test/1.6 with uniqueid field id
   [junit4]   2> 1864094 INFO  (qtp1569766093-20358) [n:127.0.0.1:49252_arrl c:collection1 s:shard3  x:collection1_shard3_replica_n63] o.a.s.c.CoreContainer Creating SolrCore 'collection1_shard3_replica_n63' using configuration from collection collection1, trusted=true
   [junit4]   2> 1864094 INFO  (qtp1569766093-20358) [n:127.0.0.1:49252_arrl c:collection1 s:shard3  x:collection1_shard3_replica_n63] o.a.s.m.r.SolrJmxReporter JMX monitoring for 'solr.core.collection1.shard3.replica_n63' (registry 'solr.core.collection1.shard3.replica_n63') enabled at server: com.sun.jmx.mbeanserver.JmxMBeanServer@166812e3
   [junit4]   2> 1864094 INFO  (qtp1569766093-20358) [n:127.0.0.1:49252_arrl c:collection1 s:shard3  x:collection1_shard3_replica_n63] o.a.s.c.SolrCore solr.RecoveryStrategy.Builder
   [junit4]   2> 1864094 INFO  (qtp1569766093-20358) [n:127.0.0.1:49252_arrl c:collection1 s:shard3  x:collection1_shard3_replica_n63] o.a.s.c.SolrCore [[collection1_shard3_replica_n63] ] Opening new SolrCore at [/Users/jenkins/workspace/Lucene-Solr-7.x-MacOSX/solr/build/solr-core/test/J0/temp/solr.cloud.FullSolrCloudDistribCmdsTest_44A30A1A0FBE88-001/shard-2-001/cores/collection1_shard3_replica_n63], dataDir=[/Users/jenkins/workspace/Lucene-Solr-7.x-MacOSX/solr/build/solr-core/test/J0/../../../../../../../../../Users/jenkins/workspace/Lucene-Solr-7.x-MacOSX/solr/build/solr-core/test/J0/temp/solr.cloud.FullSolrCloudDistribCmdsTest_44A30A1A0FBE88-001/shard-2-001/cores/collection1_shard3_replica_n63/data/]
   [junit4]   2> 1864096 INFO  (qtp1569766093-20358) [n:127.0.0.1:49252_arrl c:collection1 s:shard3  x:collection1_shard3_replica_n63] o.a.s.u.RandomMergePolicy RandomMergePolicy wrapping class org.apache.lucene.index.TieredMergePolicy: [TieredMergePolicy: maxMergeAtOnce=19, maxMergeAtOnceExplicit=18, maxMergedSegmentMB=50.1904296875, floorSegmentMB=0.693359375, forceMergeDeletesPctAllowed=28.14862279657467, segmentsPerTier=39.0, maxCFSSegmentSizeMB=8.796093022207999E12, noCFSRatio=0.0
   [junit4]   2> 1864099 WARN  (qtp1569766093-20358) [n:127.0.0.1:49252_arrl c:collection1 s:shard3  x:collection1_shard3_replica_n63] o.a.s.c.RequestHandlers INVALID paramSet a in requestHandler {type = requestHandler,name = /dump,class = DumpRequestHandler,attributes = {initParams=a, name=/dump, class=DumpRequestHandler},args = {defaults={a=A,b=B}}}
   [junit4]   2> 1864141 INFO  (qtp1569766093-20358) [n:127.0.0.1:49252_arrl c:collection1 s:shard3  x:collection1_shard3_replica_n63] o.a.s.u.UpdateHandler Using UpdateLog implementation: org.apache.solr.update.UpdateLog
   [junit4]   2> 1864141 INFO  (qtp1569766093-20358) [n:127.0.0.1:49252_arrl c:collection1 s:shard3  x:collection1_shard3_replica_n63] o.a.s.u.UpdateLog Initializing UpdateLog: dataDir= defaultSyncLevel=FLUSH numRecordsToKeep=100 maxNumLogsToKeep=10 numVersionBuckets=65536
   [junit4]   2> 1864143 INFO  (qtp1569766093-20358) [n:127.0.0.1:49252_arrl c:collection1 s:shard3  x:collection1_shard3_replica_n63] o.a.s.u.CommitTracker Hard AutoCommit: disabled
   [junit4]   2> 1864143 INFO  (qtp1569766093-20358) [n:127.0.0.1:49252_arrl c:collection1 s:shard3  x:collection1_shard3_replica_n63] o.a.s.u.CommitTracker Soft AutoCommit: disabled
   [junit4]   2> 1864144 INFO  (qtp1569766093-20358) [n:127.0.0.1:49252_arrl c:collection1 s:shard3  x:collection1_shard3_replica_n63] o.a.s.u.RandomMergePolicy RandomMergePolicy wrapping class org.apache.lucene.index.TieredMergePolicy: [TieredMergePolicy: maxMergeAtOnce=38, maxMergeAtOnceExplicit=20, maxMergedSegmentMB=49.2138671875, floorSegmentMB=1.14453125, forceMergeDeletesPctAllowed=23.15721813037059, segmentsPerTier=48.0, maxCFSSegmentSizeMB=8.796093022207999E12, noCFSRatio=0.520254745997728
   [junit4]   2> 1864144 INFO  (qtp1569766093-20358) [n:127.0.0.1:49252_arrl c:collection1 s:shard3  x:collection1_shard3_replica_n63] o.a.s.s.SolrIndexSearcher Opening [Searcher@3a23603c[collection1_shard3_replica_n63] main]
   [junit4]   2> 1864146 INFO  (qtp1569766093-20358) [n:127.0.0.1:49252_arrl c:collection1 s:shard3  x:collection1_shard3_replica_n63] o.a.s.r.ManagedResourceStorage Configured ZooKeeperStorageIO with znodeBase: /configs/conf1
   [junit4]   2> 1864147 INFO  (qtp1569766093-20358) [n:127.0.0.1:49252_arrl c:collection1 s:shard3  x:collection1_shard3_replica_n63] o.a.s.r.ManagedResourceStorage Loaded null at path _rest_managed.json using ZooKeeperStorageIO:path=/configs/conf1
   [junit4]   2> 1864148 INFO  (qtp1569766093-20358) [n:127.0.0.1:49252_arrl c:collection1 s:shard3  x:collection1_shard3_replica_n63] o.a.s.h.ReplicationHandler Commits will be reserved for 10000ms.
   [junit4]   2> 1864148 INFO  (qtp1569766093-20358) [n:127.0.0.1:49252_arrl c:collection1 s:shard3  x:collection1_shard3_replica_n63] o.a.s.u.UpdateLog Could not find max version in index or recent updates, using new clock 1589044519796473856
   [junit4]   2> 1864149 INFO  (searcherExecutor-7949-thread-1-processing-n:127.0.0.1:49252_arrl x:collection1_shard3_replica_n63 s:shard3 c:collection1) [n:127.0.0.1:49252_arrl c:collection1 s:shard3  x:collection1_shard3_replica_n63] o.a.s.c.SolrCore [collection1_shard3_replica_n63] Registered new searcher Searcher@3a23603c[collection1_shard3_replica_n63] main{ExitableDirectoryReader(UninvertingDirectoryReader())}
   [junit4]   2> 1864154 INFO  (qtp1569766093-20358) [n:127.0.0.1:49252_arrl c:collection1 s:shard3  x:collection1_shard3_replica_n63] o.a.s.c.ShardLeaderElectionContext Enough replicas found to continue.
   [junit4]   2> 1864154 INFO  (qtp1569766093-20358) [n:127.0.0.1:49252_arrl c:collection1 s:shard3  x:collection1_shard3_replica_n63] o.a.s.c.ShardLeaderElectionContext I may be the new leader - try and sync
   [junit4]   2> 1864154 INFO  (qtp1569766093-20358) [n:127.0.0.1:49252_arrl c:collection1 s:shard3  x:collection1_shard3_replica_n63] o.a.s.c.SyncStrategy Sync replicas to http://127.0.0.1:49252/arrl/collection1_shard3_replica_n63/
   [junit4]   2> 1864154 INFO  (qtp1569766093-20358) [n:127.0.0.1:49252_arrl c:collection1 s:shard3  x:collection1_shard3_replica_n63] o.a.s.c.SyncStrategy Sync Success - now sync replicas to me
   [junit4]   2> 1864154 INFO  (qtp1569766093-20358) [n:127.0.0.1:49252_arrl c:collection1 s:shard3  x:collection1_shard3_replica_n63] o.a.s.c.SyncStrategy http://127.0.0.1:49252/arrl/collection1_shard3_replica_n63/ has no replicas
   [junit4]   2> 1864154 INFO  (qtp1569766093-20358) [n:127.0.0.1:49252_arrl c:collection1 s:shard3  x:collection1_shard3_replica_n63] o.a.s.c.ShardLeaderElectionContext Found all replicas participating in election, clear LIR
   [junit4]   2> 1864160 INFO  (qtp1569766093-20358) [n:127.0.0.1:49252_arrl c:collection1 s:shard3  x:collection1_shard3_replica_n63] o.a.s.c.ShardLeaderElectionContext I am the new leader: http://127.0.0.1:49252/arrl/collection1_shard3_replica_n63/ shard3
   [junit4]   2> 1864323 INFO  (qtp1569766093-20358) [n:127.0.0.1:49252_arrl c:collection1 s:shard3  x:collection1_shard3_replica_n63] o.a.s.c.ZkController I am the leader, no recovery necessary
   [junit4]   2> 1864326 INFO  (qtp1569766093-20358) [n:127.0.0.1:49252_arrl c:collection1 s:shard3  x:collection1_shard3_replica_n63] o.a.s.s.HttpSolrCall [admin] webapp=null path=/admin/cores params={qt=/admin/cores&collection.configName=conf1&name=collection1_shard3_replica_n63&action=CREATE&collection=collection1&shard=shard3&wt=javabin&version=2&replicaType=NRT} status=0 QTime=1388
   [junit4]   2> 1864329 INFO  (qtp1437786605-20279) [n:127.0.0.1:49224_arrl    ] o.a.s.s.HttpSolrCall [admin] webapp=null path=/admin/collections params={node=127.0.0.1:49252_arrl&action=ADDREPLICA&collection=collection1&shard=shard3&type=NRT&wt=javabin&version=2} status=0 QTime=1407
   [junit4]   2> 1864661 INFO  (TEST-FullSolrCloudDistribCmdsTest.test-seed#[44A30A1A0FBE88]) [    ] o.a.s.c.AbstractFullDistribZkTestBase create jetty 3 in directory /Users/jenkins/workspace/Lucene-Solr-7.x-MacOSX/solr/build/solr-core/test/J0/temp/solr.cloud.FullSolrCloudDistribCmdsTest_44A30A1A0FBE88-001/shard-3-001 of type NRT
   [junit4]   2> 1864662 INFO  (TEST-FullSolrCloudDistribCmdsTest.test-seed#[44A30A1A0FBE88]) [    ] o.e.j.s.Server jetty-9.3.20.v20170531
   [junit4]   2> 1864664 INFO  (TEST-FullSolrCloudDistribCmdsTest.test-seed#[44A30A1A0FBE88]) [    ] o.e.j.s.h.ContextHandler Started o.e.j.s.ServletContextHandler@6f23d55f{/arrl,null,AVAILABLE}
   [junit4]   2> 1864664 INFO  (TEST-FullSolrCloudDistribCmdsTest.test-seed#[44A30A1A0FBE88]) [    ] o.e.j.s.AbstractConnector Started ServerConnector@3ea48fa2{HTTP/1.1,[http/1.1]}{127.0.0.1:49259}
   [junit4]   2> 1864664 INFO  (TEST-FullSolrCloudDistribCmdsTest.test-seed#[44A30A1A0FBE88]) [    ] o.e.j.s.Server Started @1866642ms
   [junit4]   2> 1864665 INFO  (TEST-FullSolrCloudDistribCmdsTest.test-seed#[44A30A1A0FBE88]) [    ] o.a.s.c.s.e.JettySolrRunner Jetty properties: {hostContext=/arrl, solrconfig=solrconfig.xml, solr.data.dir=/Users/jenkins/workspace/Lucene-Solr-7.x-MacOSX/solr/build/solr-core/test/J0/temp/solr.cloud.FullSolrCloudDistribCmdsTest_44A30A1A0FBE88-001/tempDir-001/jetty3, hostPort=49259, coreRootDirectory=/Users/jenkins/workspace/Lucene-Solr-7.x-MacOSX/solr/build/solr-core/test/J0/../../../../../../../../../Users/jenkins/workspace/Lucene-Solr-7.x-MacOSX/solr/build/solr-core/test/J0/temp/solr.cloud.FullSolrCloudDistribCmdsTest_44A30A1A0FBE88-001/shard-3-001/cores, replicaType=NRT}
   [junit4]   2> 1864665 ERROR (TEST-FullSolrCloudDistribCmdsTest.test-seed#[44A30A1A0FBE88]) [    ] o.a.s.u.StartupLoggingUtils Missing Java Option solr.log.dir. Logging may be missing or incomplete.
   [junit4]   2> 1864665 INFO  (TEST-FullSolrCloudDistribCmdsTest.test-seed#[44A30A1A0FBE88]) [    ] o.a.s.s.SolrDispatchFilter  ___      _       Welcome to Apache Solr? version 7.3.0
   [junit4]   2> 1864665 INFO  (TEST-FullSolrCloudDistribCmdsTest.test-seed#[44A30A1A0FBE88]) [    ] o.a.s.s.SolrDispatchFilter / __| ___| |_ _   Starting in cloud mode on port null
   [junit4]   2> 1864665 INFO  (TEST-FullSolrCloudDistribCmdsTest.test-seed#[44A30A1A0FBE88]) [    ] o.a.s.s.SolrDispatchFilter \__ \/ _ \ | '_|  Install dir: null
   [junit4]   2> 1864665 INFO  (TEST-FullSolrCloudDistribCmdsTest.test-seed#[44A30A1A0FBE88]) [    ] o.a.s.s.SolrDispatchFilter |___/\___/_|_|    Start time: 2018-01-08T17:02:26.673893Z
   [junit4]   2> 1864667 INFO  (zkConnectionManagerCallback-6370-thread-1) [    ] o.a.s.c.c.ConnectionManager zkClient has connected
   [junit4]   2> 1864669 INFO  (TEST-FullSolrCloudDistribCmdsTest.test-seed#[44A30A1A0FBE88]) [    ] o.a.s.s.SolrDispatchFilter Loading solr.xml from SolrHome (not found in ZooKeeper)
   [junit4]   2> 1864669 INFO  (TEST-FullSolrCloudDistribCmdsTest.test-seed#[44A30A1A0FBE88]) [    ] o.a.s.c.SolrXmlConfig Loading container configuration from /Users/jenkins/workspace/Lucene-Solr-7.x-MacOSX/solr/build/solr-core/test/J0/temp/solr.cloud.FullSolrCloudDistribCmdsTest_44A30A1A0FBE88-001/shard-3-001/solr.xml
   [junit4]   2> 1864671 INFO  (TEST-FullSolrCloudDistribCmdsTest.test-seed#[44A30A1A0FBE88]) [    ] o.a.s.c.SolrXmlConfig Configuration parameter autoReplicaFailoverWorkLoopDelay is ignored
   [junit4]   2> 1864671 INFO  (TEST-FullSolrCloudDistribCmdsTest.test-seed#[44A30A1A0FBE88]) [    ] o.a.s.c.SolrXmlConfig Configuration parameter autoReplicaFailoverBadNodeExpiration is ignored
   [junit4]   2> 1864672 INFO  (TEST-FullSolrCloudDistribCmdsTest.test-seed#[44A30A1A0FBE88]) [    ] o.a.s.c.SolrXmlConfig MBean server found: com.sun.jmx.mbeanserver.JmxMBeanServer@166812e3, but no JMX reporters were configured - adding default JMX reporter.
   [junit4]   2> 1864674 INFO  (TEST-FullSolrCloudDistribCmdsTest.test-seed#[44A30A1A0FBE88]) [    ] o.a.s.c.ZkContainer Zookeeper client=127.0.0.1:49219/solr
   [junit4]   2> 1864676 INFO  (zkConnectionManagerCallback-6374-thread-1) [    ] o.a.s.c.c.ConnectionManager zkClient has connected
   [junit4]   2> 1864681 INFO  (zkConnectionManagerCallback-6376-thread-1-processing-n:127.0.0.1:49259_arrl) [n:127.0.0.1:49259_arrl    ] o.a.s.c.c.ConnectionManager zkClient has connected
   [junit4]   2> 1864692 INFO  (TEST-FullSolrCloudDistribCmdsTest.test-seed#[44A30A1A0FBE88]) [n:127.0.0.1:49259_arrl    ] o.a.s.c.c.ZkStateReader Updated live nodes from ZooKeeper... (0) -> (3)
   [junit4]   2> 1864696 INFO  (TEST-FullSolrCloudDistribCmdsTest.test-seed#[44A30A1A0FBE88]) [n:127.0.0.1:49259_arrl    ] o.a.s.c.Overseer Overseer (id=null) closing
   [junit4]   2> 1864700 INFO  (TEST-FullSolrCloudDistribCmdsTest.test-seed#[44A30A1A0FBE88]) [n:127.0.0.1:49259_arrl    ] o.a.s.c.ZkController Register node as live in ZooKeeper:/live_nodes/127.0.0.1:49259_arrl
   [junit4]   2> 1864702 INFO  (zkCallback-6337-thread-2-processing-n:127.0.0.1:49224_arrl) [n:127.0.0.1:49224_arrl    ] o.a.s.c.c.ZkStateReader Updated live nodes from ZooKeeper... (3) -> (4)
   [junit4]   2> 1864702 INFO  (zkCallback-6347-thread-1) [    ] o.a.s.c.c.ZkStateReader Updated live nodes from ZooKeeper... (3) -> (4)
   [junit4]   2> 1864702 INFO  (zkCallback-6365-thread-1-processing-n:127.0.0.1:49252_arrl) [n:127.0.0.1:49252_arrl    ] o.a.s.c.c.ZkStateReader Updated live nodes from ZooKeeper... (3) -> (4)
   [junit4]   2> 1864702 INFO  (zkCallback-6355-thread-1-processing-n:127.0.0.1:49243_arrl) [n:127.0.0.1:49243_arrl    ] o.a.s.c.c.ZkStateReader Updated live nodes from ZooKeeper... (3) -> (4)
   [junit4]   2> 1864703 INFO  (zkCallback-6375-thread-1-processing-n:127.0.0.1:49259_arrl) [n:127.0.0.1:49259_arrl    ] o.a.s.c.c.ZkStateReader Updated live nodes from ZooKeeper... (3) -> (4)
   [junit4]   2> 1864757 INFO  (TEST-FullSolrCloudDistribCmdsTest.test-seed#[44A30A1A0FBE88]) [n:127.0.0.1:49259_arrl    ] o.a.s.m.r.SolrJmxReporter JMX monitoring for 'solr.node' (registry 'solr.node') enabled at server: com.sun.jmx.mbeanserver.JmxMBeanServer@166812e3
   [junit4]   2> 1864773 INFO  (TEST-FullSolrCloudDistribCmdsTest.test-seed#[44A30A1A0FBE88]) [n:127.0.0.1:49259_arrl    ] o.a.s.m.r.SolrJmxReporter JMX monitoring for 'solr.jvm' (registry 'solr.jvm') enabled at server: com.sun.jmx.mbeanserver.JmxMBeanServer@166812e3
   [junit4]   2> 1864774 INFO  (TEST-FullSolrCloudDistribCmdsTest.test-seed#[44A30A1A0FBE88]) [n:127.0.0.1:49259_arrl    ] o.a.s.m.r.SolrJmxReporter JMX monitoring for 'solr.jetty' (registry 'solr.jetty') enabled at server: com.sun.jmx.mbeanserver.JmxMBeanServer@166812e3
   [junit4]   2> 1864777 INFO  (TEST-FullSolrCloudDistribCmdsTest.test-seed#[44A30A1A0FBE88]) [n:127.0.0.1:49259_arrl    ] o.a.s.c.CorePropertiesLocator Found 0 core definitions underneath /Users/jenkins/workspace/Lucene-Solr-7.x-MacOSX/solr/build/solr-core/test/J0/../../../../../../../../../Users/jenkins/workspace/Lucene-Solr-7.x-MacOSX/solr/build/solr-core/test/J0/temp/solr.cloud.FullSolrCloudDistribCmdsTest_44A30A1A0FBE88-001/shard-3-001/cores
   [junit4]   2> 1864838 INFO  (qtp1437786605-20280) [n:127.0.0.1:49224_arrl    ] o.a.s.h.a.CollectionsHandler Invoked Collection Action :addreplica with params node=127.0.0.1:49259_arrl&action=ADDREPLICA&collection=collection1&shard=shard1&type=NRT&wt=javabin&version=2 and sendToOCPQueue=true
   [junit4]   2> 1864842 INFO  (OverseerCollectionConfigSetProcessor-99315281950474244-127.0.0.1:49224_arrl-n_0000000000) [n:127.0.0.1:49224_arrl    ] o.a.s.c.OverseerTaskQueue Response ZK path: /overseer/collection-queue-work/qnr-0000000006 doesn't exist.  Requestor may have disconnected from ZooKeeper
   [junit4]   2> 1864842 INFO  (OverseerThreadFactory-7924-thread-5-processing-n:127.0.0.1:49224_arrl) [n:127.0.0.1:49224_arrl    ] o.a.s.c.AddReplicaCmd Node Identified 127.0.0.1:49259_arrl for creating new replica
   [junit4]   2> 1864847 INFO  (qtp1455267040-20389) [n:127.0.0.1:49259_arrl    ] o.a.s.h.a.CoreAdminOperation core create command qt=/admin/cores&collection.configName=conf1&name=collection1_shard1_replica_n65&action=CREATE&collection=collection1&shard=shard1&wt=javabin&version=2&replicaType=NRT
   [junit4]   2> 1864848 INFO  (qtp1455267040-20389) [n:127.0.0.1:49259_arrl    ] o.a.s.c.TransientSolrCoreCacheDefault Allocating transient cache for 4 transient cores
   [junit4]   2> 1865863 INFO  (qtp1455267040-20389) [n:127.0.0.1:49259_arrl c:collection1 s:shard1  x:collection1_shard1_replica_n65] o.a.s.c.SolrConfig Using Lucene MatchVersion: 7.3.0
   [junit4]   2> 1865878 INFO  (qtp1455267040-20389) [n:127.0.0.1:49259_arrl c:collection1 s:shard1  x:collection1_shard1_replica_n65] o.a.s.s.IndexSchema [collection1_shard1_replica_n65] Schema name=test
   [junit4]   2> 1865963 INFO  (qtp1455267040-20389) [n:127.0.0.1:49259_arrl c:collection1 s:shard1  x:collection1_shard1_replica_n65] o.a.s.s.IndexSchema Loaded schema test/1.6 with uniqueid field id
   [junit4]   2> 1865992 INFO  (qtp1455267040-20389) [n:127.0.0.1:49259_arrl c:collection1 s:shard1  x:collection1_shard1_replica_n65] o.a.s.c.CoreContainer Creating SolrCore 'collection1_shard1_replica_n65' using configuration from collection collection1, trusted=true
   [junit4]   2> 1865993 INFO  (qtp1455267040-20389) [n:127.0.0.1:49259_arrl c:collection1 s:shard1  x:collection1_shard1_replica_n65] o.a.s.m.r.SolrJmxReporter JMX monitoring for 'solr.core.collection1.shard1.replica_n65' (registry 'solr.core.collection1.shard1.replica_n65') enabled at server: com.sun.jmx.mbeanserver.JmxMBeanServer@166812e3
   [junit4]   2> 1865993 INFO  (qtp1455267040-20389) [n:127.0.0.1:49259_arrl c:collection1 s:shard1  x:collection1_shard1_replica_n65] o.a.s.c.SolrCore solr.RecoveryStrategy.Builder
   [junit4]   2> 1865993 INFO  (qtp1455267040-20389) [n:127.0.0.1:49259_arrl c:collection1 s:shard1  x:collection1_shard1_replica_n65] o.a.s.c.SolrCore [[collection1_shard1_replica_n65] ] Opening new SolrCore at [/Users/jenkins/workspace/Lucene-Solr-7.x-MacOSX/solr/build/solr-core/test/J0/temp/solr.cloud.FullSolrCloudDistribCmdsTest_44A30A1A0FBE88-001/shard-3-001/cores/collection1_shard1_replica_n65], dataDir=[/Users/jenkins/workspace/Lucene-Solr-7.x-MacOSX/solr/build/solr-core/test/J0/../../../../../../../../../Users/jenkins/workspace/Lucene-Solr-7.x-MacOSX/solr/build/solr-core/test/J0/temp/solr.cloud.FullSolrCloudDistribCmdsTest_44A30A1A0FBE88-001/shard-3-001/cores/collection1_shard1_replica_n65/data/]
   [junit4]   2> 1865997 INFO  (qtp1455267040-20389) [n:127.0.0.1:49259_arrl c:collection1 s:shard1  x:collection1_shard1_replica_n65] o.a.s.u.RandomMergePolicy RandomMergePolicy wrapping class org.apache.lucene.index.TieredMergePolicy: [TieredMergePolicy: maxMergeAtOnce=19, maxMergeAtOnceExplicit=18, maxMergedSegmentMB=50.1904296875, floorSegmentMB=0.693359375, forceMergeDeletesPctAllowed=28.14862279657467, segmentsPerTier=39.0, maxCFSSegmentSizeMB=8.796093022207999E12, noCFSRatio=0.0
   [junit4]   2> 1866000 WARN  (qtp1455267040-20389) [n:127.0.0.1:49259_arrl c:collection1 s:shard1  x:collection1_shard1_replica_n65] o.a.s.c.RequestHandlers INVALID paramSet a in requestHandler {type = requestHandler,name = /dump,class = DumpRequestHandler,attributes = {initParams=a, name=/dump, class=DumpRequestHandler},args = {defaults={a=A,b=B}}}
   [junit4]   2> 1866049 INFO  (qtp1455267040-20389) [n:127.0.0.1:49259_arrl c:collection1 s:shard1  x:collection1_shard1_replica_n65] o.a.s.u.UpdateHandler Using UpdateLog implementation: org.apache.solr.update.UpdateLog
   [junit4]   2> 1866049 INFO  (qtp1455267040-20389) [n:127.0.0.1:49259_arrl c:collection1 s:shard1  x:collection1_shard1_replica_n65] o.a.s.u.UpdateLog Initializing UpdateLog: dataDir= defaultSyncLevel=FLUSH numRecordsToKeep=100 maxNumLogsToKeep=10 numVersionBuckets=65536
   [junit4]   2> 1866050 INFO  (qtp1455267040-20389) [n:127.0.0.1:49259_arrl c:collection1 s:shard1  x:collection1_shard1_replica_n65] o.a.s.u.CommitTracker Hard AutoCommit: disabled
   [junit4]   2> 1866050 INFO  (qtp1455267040-20389) [n:127.0.0.1:49259_arrl c:collection1 s:shard1  x:collection1_shard1_replica_n65] o.a.s.u.CommitTracker Soft AutoCommit: disabled
   [junit4]   2> 1866052 INFO  (qtp1455267040-20389) [n:127.0.0.1:49259_arrl c:collection1 s:shard1  x:collection1_shard1_replica_n65] o.a.s.u.RandomMergePolicy RandomMergePolicy wrapping class org.apache.lucene.index.TieredMergePolicy: [TieredMergePolicy: maxMergeAtOnce=38, maxMergeAtOnceExplicit=20, maxMergedSegmentMB=49.2138671875, floorSegmentMB=1.14453125, forceMergeDeletesPctAllowed=23.15721813037059, segmentsPerTier=48.0, maxCFSSegmentSizeMB=8.796093022207999E12, noCFSRatio=0.520254745997728
   [junit4]   2> 1866053 INFO  (qtp1455267040-20389) [n:127.0.0.1:49259_arrl c:collection1 s:shard1  x:collection1_shard1_replica_n65] o.a.s.s.SolrIndexSearcher Opening [Searcher@5e5b6d6c[collection1_shard1_replica_n65] main]
   [junit4]   2> 1866054 INFO  (qtp1455267040-20389) [n:127.0.0.1:49259_arrl c:collection1 s:shard1  x:collection1_shard1_replica_n65] o.a.s.r.ManagedResourceStorage Configured ZooKeeperStorageIO with znodeBase: /configs/conf1
   [junit4]   2> 1866055 INFO  (qtp1455267040-20389) [n:127.0.0.1:49259_arrl c:collection1 s:shard1  x:collection1_shard1_replica_n65] o.a.s.r.ManagedResourceStorage Loaded null at path _rest_managed.json using ZooKeeperStorageIO:path=/configs/conf1
   [junit4]   2> 1866056 INFO  (qtp1455267040-20389) [n:127.0.0.1:49259_arrl c:collection1 s:shard1  x:collection1_shard1_replica_n65] o.a.s.h.ReplicationHandler Commits will be reserved for 10000ms.
   [junit4]   2> 1866056 INFO  (qtp1455267040-20389) [n:127.0.0.1:49259_arrl c:collection1 s:shard1  x:collection1_shard1_replica_n65] o.a.s.u.UpdateLog Could not find max version in index or recent updates, using new clock 1589044521797156864
   [junit4]   2> 1866057 INFO  (searcherExecutor-7960-thread-1-processing-n:127.0.0.1:49259_arrl x:collection1_shard1_replica_n65 s:shard1 c:collection1) [n:127.0.0.1:49259_arrl c:collection1 s:shard1  x:collection1_shard1_replica_n65] o.a.s.c.SolrCore [collection1_shard1_replica_n65] Registered new searcher Searcher@5e5b6d6c[collection1_shard1_replica_n65] main{ExitableDirectoryReader(UninvertingDirectoryReader())}
   [junit4]   2> 1866063 INFO  (qtp1455267040-20389) [n:127.0.0.1:49259_arrl c:collection1 s:shard1  x:collection1_shard1_replica_n65] o.a.s.c.ShardLeaderElectionContext Enough replicas found to continue.
   [junit4]   2> 1866063 INFO  (qtp1455267040-20389) [n:127.0.0.1:49259_arrl c:collection1 s:shard1  x:collection1_shard1_replica_n65] o.a.s.c.ShardLeaderElectionContext I may be the new leader - try and sync
   [junit4]   2> 1866063 INFO  (qtp1455267040-20389) [n:127.0.0.1:49259_arrl c:collection1 s:shard1  x:collection1_shard1_replica_n65] o.a.s.c.SyncStrategy Sync replicas to http://127.0.0.1:49259/arrl/collection1_shard1_replica_n65/
   [junit4]   2> 1866063 INFO  (qtp1455267040-20389) [n:127.0.0.1:49259_arrl c:collection1 s:shard1  x:collection1_shard1_replica_n65] o.a.s.c.SyncStrategy Sync Success - now sync replicas to me
   [junit4]   2> 1866063 INFO  (qtp1455267040-20389) [n:127.0.0.1:49259_arrl c:collection1 s:shard1  x:collection1_shard1_replica_n65] o.a.s.c.SyncStrategy http://127.0.0.1:49259/arrl/collection1_shard1_replica_n65/ has no replicas
   [junit4]   2> 1866063 INFO  (qtp1455267040-20389) [n:127.0.0.1:49259_arrl c:collection1 s:shard1  x:collection1_shard1_replica_n65] o.a.s.c.ShardLeaderElectionContext Found all replicas participating in election, clear LIR
   [junit4]   2> 1866068 INFO  (qtp1455267040-20389) [n:127.0.0.1:49259_arrl c:collection1 s:shard1  x:collection1_shard1_replica_n65] o.a.s.c.ShardLeaderElectionContext I am the new leader: http://127.0.0.1:49259/arrl/collection1_shard1_replica_n65/ shard1
   [junit4]   2> 1866221 INFO  (qtp1455267040-20389) [n:127.0.0.1:49259_arrl c:collection1 s:shard1  x:collection1_shard1_replica_n65] o.a.s.c.ZkController I am the leader, no recovery necessary
   [junit4]   2> 1866224 INFO  (qtp1455267040-20389) [n:127.0.0.1:49259_arrl c:collection1 s:shard1  x:collection1_shard1_replica_n65] o.a.s.s.HttpSolrCall [admin] webapp=null path=/admin/cores params={qt=/admin/cores&collection.configName=conf1&name=collection1_shard1_replica_n65&action=CREATE&collection=collection1&shard=shard1&wt=javabin&version=2&replicaType=NRT} status=0 QTime=1377
   [junit4]   2> 1866228 INFO  (qtp1437786605-20280) [n:127.0.0.1:49224_arrl    ] o.a.s.s.HttpSolrCall [admin] webapp=null path=/admin/collections params={node=127.0.0.1:49259_arrl&action=ADDREPLICA&collection=collection1&shard=shard1&type=NRT&wt=javabin&version=2} status=0 QTime=1389
   [junit4]   2> 1866582 INFO  (TEST-FullSolrCloudDistribCmdsTest.test-seed#[44A30A1A0FBE88]) [    ] o.a.s.c.AbstractFullDistribZkTestBase create jetty 4 in directory /Users/jenkins/workspace/Lucene-Solr-7.x-MacOSX/solr/build/solr-core/test/J0/temp/solr.cloud.FullSolrCloudDistribCmdsTest_44A30A1A0FBE88-001/shard-4-001 of type NRT
   [junit4]   2> 1866582 INFO  (TEST-FullSolrCloudDistribCmdsTest.test-seed#[44A30A1A0FBE88]) [    ] o.e.j.s.Server jetty-9.3.20.v20170531
   [junit4]   2> 1866584 INFO  (TEST-FullSolrCloudDistribCmdsTest.test-seed#[44A30A1A0FBE88]) [    ] o.e.j.s.h.ContextHandler Started o.e.j.s.ServletContextHandler@24803675{/arrl,null,AVAILABLE}
   [junit4]   2> 1866584 INFO  (TEST-FullSolrCloudDistribCmdsTest.test-seed#[44A30A1A0FBE88]) [    ] o.e.j.s.AbstractConnector Started ServerConnector@28ec44e2{HTTP/1.1,[http/1.1]}{127.0.0.1:49264}
   [junit4]   2> 1866584 INFO  (TEST-FullSolrCloudDistribCmdsTest.test-seed#[44A30A1A0FBE88]) [    ] o.e.j.s.Server Started @1868563ms
   [junit4]   2> 1866585 INFO  (TEST-FullSolrCloudDistribCmdsTest.test-seed#[44A30A1A0FBE88]) [    ] o.a.s.c.s.e.JettySolrRunner Jetty properties: {hostContext=/arrl, solrconfig=solrconfig.xml, solr.data.dir=/Users/jenkins/workspace/Lucene-Solr-7.x-MacOSX/solr/build/solr-core/test/J0/temp/solr.cloud.FullSolrCloudDistribCmdsTest_44A30A1A0FBE88-001/tempDir-001/jetty4, hostPort=49264, coreRootDirectory=/Users/jenkins/workspace/Lucene-Solr-7.x-MacOSX/solr/build/solr-core/test/J0/../../../../../../../../../Users/jenkins/workspace/Lucene-Solr-7.x-MacOSX/solr/build/solr-core/test/J0/temp/solr.cloud.FullSolrCloudDistribCmdsTest_44A30A1A0FBE88-001/shard-4-001/cores}
   [junit4]   2> 1866585 ERROR (TEST-FullSolrCloudDistribCmdsTest.test-seed#[44A30A1A0FBE88]) [    ] o.a.s.u.StartupLoggingUtils Missing Java Option solr.log.dir. Logging may be missing or incomplete.
   [junit4]   2> 1866586 INFO  (TEST-FullSolrCloudDistribCmdsTest.test-seed#[44A30A1A0FBE88]) [    ] o.a.s.s.SolrDispatchFilter  ___      _       Welcome to Apache Solr? version 7.3.0
   [junit4]   2> 1866586 INFO  (TEST-FullSolrCloudDistribCmdsTest.test-seed#[44A30A1A0FBE88]) [    ] o.a.s.s.SolrDispatchFilter / __| ___| |_ _   Starting in cloud mode on port null
   [junit4]   2> 1866586 INFO  (TEST-FullSolrCloudDistribCmdsTest.test-seed#[44A30A1A0FBE88]) [    ] o.a.s.s.SolrDispatchFilter \__ \/ _ \ | '_|  Install dir: null
   [junit4]   2> 1866586 INFO  (TEST-FullSolrCloudDistribCmdsTest.test-seed#[44A30A1A0FBE88]) [    ] o.a.s.s.SolrDispatchFilter |___/\___/_|_|    Start time: 2018-01-08T17:02:28.594217Z
   [junit4]   2> 1866588 INFO  (zkConnectionManagerCallback-6380-thread-1) [    ] o.a.s.c.c.ConnectionManager zkClient has connected
   [junit4]   2> 1866589 INFO  (TEST-FullSolrCloudDistribCmdsTest.test-seed#[44A30A1A0FBE88]) [    ] o.a.s.s.SolrDispatchFilter Loading solr.xml from SolrHome (not found in ZooKeeper)
   [junit4]   2> 1866590 INFO  (TEST-FullSolrCloudDistribCmdsTest.test-seed#[44A30A1A0FBE88]) [    ] o.a.s.c.SolrXmlConfig Loading container configuration from /Users/jenkins/workspace/Lucene-Solr-7.x-MacOSX/solr/build/solr-core/test/J0/temp/solr.cloud.FullSolrCloudDistribCmdsTest_44A30A1A0FBE88-001/shard-4-001/solr.xml
   [junit4]   2> 1866593 INFO  (TEST-FullSolrCloudDistribCmdsTest.test-seed#[44A30A1A0FBE88]) [    ] o.a.s.c.SolrXmlConfig Configuration parameter autoReplicaFailoverWorkLoopDelay is ignored
   [junit4]   2> 1866593 INFO  (TEST-FullSolrCloudDistribCmdsTest.test-seed#[44A30A1A0FBE88]) [    ] o.a.s.c.SolrXmlConfig Configuration parameter autoReplicaFailoverBadNodeExpiration is ignored
   [junit4]   2> 1866593 INFO  (TEST-FullSolrCloudDistribCmdsTest.test-seed#[44A30A1A0FBE88]) [    ] o.a.s.c.SolrXmlConfig MBean server found: com.sun.jmx.mbeanserver.JmxMBeanServer@166812e3, but no JMX reporters were configured - adding default JMX reporter.
   [junit4]   2> 1866596 INFO  (TEST-FullSolrCloudDistribCmdsTest.test-seed#[44A30A1A0FBE88]) [    ] o.a.s.c.ZkContainer Zookeeper client=127.0.0.1:49219/solr
   [junit4]   2> 1866598 INFO  (zkConnectionManagerCallback-6384-thread-1) [    ] o.a.s.c.c.ConnectionManager zkClient has connected
   [junit4]   2> 1866602 INFO  (zkConnectionManagerCallback-6386-thread-1-processing-n:127.0.0.1:49264_arrl) [n:127.0.0.1:49264_arrl    ] o.a.s.c.c.ConnectionManager zkClient has connected
   [junit4]   2> 1866615 INFO  (TEST-FullSolrCloudDistribCmdsTest.test-seed#[44A30A1A0FBE88]) [n:127.0.0.1:49264_arrl    ] o.a.s.c.c.ZkStateReader Updated live nodes from ZooKeeper... (0) -> (4)
   [junit4]   2> 1866620 INFO  (TEST-FullSolrCloudDistribCmdsTest.test-seed#[44A30A1A0FBE88]) [n:127.0.0.1:49264_arrl    ] o.a.s.c.Overseer Overseer (id=null) closing
   [junit4]   2> 1866624 INFO  (TEST-FullSolrCloudDistribCmdsTest.test-seed#[44A30A1A0FBE88]) [n:127.0.0.1:49264_arrl    ] o.a.s.c.ZkController Register node as live in ZooKeeper:/live_nodes/127.0.0.1:49264_arrl
   [junit4]   2> 1866627 INFO  (zkCallback-6365-thread-1-processing-n:127.0.0.1:49252_arrl) [n:127.0.0.1:49252_arrl    ] o.a.s.c.c.ZkStateReader Updated live nodes from ZooKeeper... (4) -> (5)
   [junit4]   2> 1866627 INFO  (zkCallback-6375-thread-1-processing-n:127.0.0.1:49259_arrl) [n:127.0.0.1:49259_arrl    ] o.a.s.c.c.ZkStateReader Updated live nodes from ZooKeeper... (4) -> (5)
   [junit4]   2> 1866628 INFO  (zkCallback-6337-thread-1-processing-n:127.0.0.1:49224_arrl) [n:127.0.0.1:49224_arrl    ] o.a.s.c.c.ZkStateReader Updated live nodes from ZooKeeper... (4) -> (5)
   [junit4]   2> 1866628 INFO  (zkCallback-6355-thread-1-processing-n:127.0.0.1:49243_arrl) [n:127.0.0.1:49243_arrl    ] o.a.s.c.c.ZkStateReader Updated live nodes from ZooKeeper... (4) -> (5)
   [junit4]   2> 1866628 INFO  (zkCallback-6347-thread-1) [    ] o.a.s.c.c.ZkStateReader Updated live nodes from ZooKeeper... (4) -> (5)
   [junit4]   2> 1866629 INFO  (zkCallback-6385-thread-1-processing-n:127.0.0.1:49264_arrl) [n:127.0.0.1:49264_arrl    ] o.a.s.c.c.ZkStateReader Updated live nodes from ZooKeeper... (4) -> (5)
   [junit4]   2> 1866676 INFO  (TEST-FullSolrCloudDistribCmdsTest.test-seed#[44A30A1A0FBE88]) [n:127.0.0.1:49264_arrl    ] o.a.s.m.r.SolrJmxReporter JMX monitoring for 'solr.node' (registry 'solr.node') enabled at server: com.sun.jmx.mbeanserver.JmxMBeanServer@166812e3
   [junit4]   2> 1866690 INFO  (TEST-FullSolrCloudDistribCmdsTest.test-seed#[44A30A1A0FBE88]) [n:127.0.0.1:49264_arrl    ] o.a.s.m.r.SolrJmxReporter JMX monitoring for 'solr.jvm' (registry 'solr.jvm') enabled at server: com.sun.jmx.mbeanserver.JmxMBeanServer@166812e3
   [junit4]   2> 1866690 INFO  (TEST-FullSolrCloudDistribCmdsTest.test-seed#[44A30A1A0FBE88]) [n:127.0.0.1:49264_arrl    ] o.a.s.m.r.SolrJmxReporter JMX monitoring for 'solr.jetty' (registry 'solr.jetty') enabled at server: com.sun.jmx.mbeanserver.JmxMBeanServer@166812e3
   [junit4]   2> 1866692 INFO  (TEST-FullSolrCloudDistribCmdsTest.test-seed#[44A30A1A0FBE88]) [n:127.0.0.1:49264_arrl    ] o.a.s.c.CorePropertiesLocator Found 0 core definitions underneath /Users/jenkins/workspace/Lucene-Solr-7.x-MacOSX/solr/build/solr-core/test/J0/../../../../../../../../../Users/jenkins/workspace/Lucene-Solr-7.x-MacOSX/solr/build/solr-core/test/J0/temp/solr.cloud.FullSolrCloudDistribCmdsTest_44A30A1A0FBE88-001/shard-4-001/cores
   [junit4]   2> 1866767 INFO  (qtp1437786605-20278) [n:127.0.0.1:49224_arrl    ] o.a.s.h.a.CollectionsHandler Invoked Collection Action :addreplica with params node=127.0.0.1:49264_arrl&action=ADDREPLICA&collection=collection1&shard=shard2&type=NRT&wt=javabin&version=2 and sendToOCPQueue=true
   [junit4]   2> 1866771 INFO  (OverseerCollectionConfigSetProcessor-99315281950474244-127.0.0.1:49224_arrl-n_0000000000) [n:127.0.0.1:49224_arrl    ] o.a.s.c.OverseerTaskQueue Response ZK path: /overseer/collection-queue-work/qnr-0000000008 doesn't exist.  Requestor may have disconnected from ZooKeeper
   [junit4]   2> 1866771 INFO  (OverseerThreadFactory-7924-thread-5-processing-n:127.0.0.1:49224_arrl) [n:127.0.0.1:49224_arrl    ] o.a.s.c.AddReplicaCmd Node Identified 127.0.0.1:49264_arrl for creating new replica
   [junit4]   2> 1866777 INFO  (qtp216638161-20420) [n:127.0.0.1:49264_arrl    ] o.a.s.h.a.CoreAdminOperation core create command qt=/admin/cores&collection.configName=conf1&name=collection1_shard2_replica_n67&action=CREATE&collection=collection1&shard=shard2&wt=javabin

[...truncated too long message...]

  [junit4]   2> 2415300 INFO  (coreCloseExecutor-10338-thread-1) [n:127.0.0.1:50944_solr c:replacenodetest_coll s:shard2 r:core_node9 x:replacenodetest_coll_shard2_replica_p6] o.a.s.m.SolrMetricManager Closing metric reporters for registry=solr.collection.replacenodetest_coll.shard2.leader, tag=357628645
   [junit4]   2> 2415306 INFO  (jetty-closer-7264-thread-1) [    ] o.e.j.s.h.ContextHandler Stopped o.e.j.s.ServletContextHandler@7d7fa394{/solr,null,UNAVAILABLE}
   [junit4]   2> 2415309 INFO  (jetty-closer-7264-thread-4) [    ] o.a.s.c.Overseer Overseer (id=99315317090680844-127.0.0.1:50944_solr-n_0000000000) closing
   [junit4]   2> 2415309 INFO  (OverseerStateUpdate-99315317090680844-127.0.0.1:50944_solr-n_0000000000) [n:127.0.0.1:50944_solr    ] o.a.s.c.Overseer Overseer Loop exiting : 127.0.0.1:50944_solr
   [junit4]   2> 2415310 WARN  (OverseerAutoScalingTriggerThread-99315317090680844-127.0.0.1:50944_solr-n_0000000000) [n:127.0.0.1:50944_solr    ] o.a.s.c.a.OverseerTriggerThread OverseerTriggerThread woken up but we are closed, exiting.
   [junit4]   2> 2415315 INFO  (jetty-closer-7264-thread-4) [    ] o.e.j.s.h.ContextHandler Stopped o.e.j.s.ServletContextHandler@7f17b13c{/solr,null,UNAVAILABLE}
   [junit4]   2> 2415315 INFO  (jetty-closer-7264-thread-6) [    ] o.e.j.s.h.ContextHandler Stopped o.e.j.s.ServletContextHandler@6774cb5d{/solr,null,UNAVAILABLE}
   [junit4]   2> 2415316 ERROR (SUITE-ReplaceNodeTest-seed#[44A30A1A0FBE88]-worker) [    ] o.a.z.s.ZooKeeperServer ZKShutdownHandler is not registered, so ZooKeeper server won't take any action on ERROR or SHUTDOWN server state changes
   [junit4]   2> 2415317 INFO  (SUITE-ReplaceNodeTest-seed#[44A30A1A0FBE88]-worker) [    ] o.a.s.c.ZkTestServer connecting to 127.0.0.1:50940 50940
   [junit4]   2> 2415351 INFO  (Thread-4428) [    ] o.a.s.c.ZkTestServer connecting to 127.0.0.1:50940 50940
   [junit4]   2> 2417339 WARN  (Thread-4428) [    ] o.a.s.c.ZkTestServer Watch limit violations: 
   [junit4]   2> Maximum concurrent create/delete watches above limit:
   [junit4]   2> 
   [junit4]   2> 	7	/solr/aliases.json
   [junit4]   2> 	7	/solr/clusterprops.json
   [junit4]   2> 	6	/solr/security.json
   [junit4]   2> 	6	/solr/configs/conf1
   [junit4]   2> 
   [junit4]   2> Maximum concurrent data watches above limit:
   [junit4]   2> 
   [junit4]   2> 	67	/solr/collections/replacenodetest_coll/state.json
   [junit4]   2> 	7	/solr/clusterstate.json
   [junit4]   2> 	2	/solr/overseer_elect/election/99315317090680844-127.0.0.1:50944_solr-n_0000000000
   [junit4]   2> 	2	/solr/overseer_elect/election/99315317090680850-127.0.0.1:50949_solr-n_0000000003
   [junit4]   2> 
   [junit4]   2> Maximum concurrent children watches above limit:
   [junit4]   2> 
   [junit4]   2> 	7	/solr/live_nodes
   [junit4]   2> 	7	/solr/collections
   [junit4]   2> 
   [junit4]   2> NOTE: leaving temporary files on disk at: /Users/jenkins/workspace/Lucene-Solr-7.x-MacOSX/solr/build/solr-core/test/J0/temp/solr.cloud.ReplaceNodeTest_44A30A1A0FBE88-001
   [junit4]   2> NOTE: test params are: codec=CheapBastard, sim=RandomSimilarity(queryNorm=true): {}, locale=en-LC, timezone=Pacific/Galapagos
   [junit4]   2> NOTE: Mac OS X 10.11.6 x86_64/Oracle Corporation 9 (64-bit)/cpus=3,threads=1,free=151104120,total=510132224
   [junit4]   2> NOTE: All tests run in this JVM: [TestReplicaProperties, SearchRateTriggerTest, TestReqParamsAPI, DistributedSuggestComponentTest, TestReplicationHandler, SolrTestCaseJ4Test, TestMultiValuedNumericRangeQuery, TlogReplayBufferedWhileIndexingTest, TestSchemaVersionResource, TestHdfsBackupRestoreCore, ConnectionReuseTest, IndexBasedSpellCheckerTest, TestFieldSortValues, HdfsDirectoryFactoryTest, CdcrUpdateLogTest, TestQuerySenderListener, TestDistributedStatsComponentCardinality, RequiredFieldsTest, DistributedFacetPivotLongTailTest, ClusterStateUpdateTest, BasicAuthIntegrationTest, TestHdfsCloudBackupRestore, TestFieldCache, TestDeleteCollectionOnDownNodes, PKIAuthenticationIntegrationTest, LeaderElectionTest, SecurityConfHandlerTest, TestClusterStateProvider, TestFuzzyAnalyzedSuggestions, HdfsCollectionsAPIDistributedZkTest, SuggestComponentContextFilterQueryTest, TestOmitPositions, TestSolrConfigHandlerCloud, ChaosMonkeySafeLeaderWithPullReplicasTest, TestImpersonationWithHadoopAuth, TestIndexingPerformance, TestPseudoReturnFields, GraphQueryTest, TestTrackingShardHandlerFactory, AutoScalingHandlerTest, TestEmbeddedSolrServerSchemaAPI, TestManagedSchema, BadCopyFieldTest, DocExpirationUpdateProcessorFactoryTest, RegexBytesRefFilterTest, ShowFileRequestHandlerTest, TestPrepRecovery, HdfsChaosMonkeyNothingIsSafeTest, TestStressInPlaceUpdates, TestSolrCoreSnapshots, SpellCheckCollatorTest, HdfsThreadLeakTest, TestUtils, TestConfigSetsAPI, ZkStateReaderTest, TestLFUCache, CircularListTest, RequestHandlersTest, TestSchemaResource, TestCoreAdminApis, CursorMarkTest, TestRandomCollapseQParserPlugin, NodeMutatorTest, CreateCollectionCleanupTest, TestSchemaManager, CSVRequestHandlerTest, CdcrReplicationDistributedZkTest, ResourceLoaderTest, TestAtomicUpdateErrorCases, DistributedSpellCheckComponentTest, DistributedVersionInfoTest, TestJsonFacets, TestInitQParser, TestSystemCollAutoCreate, VMParamsZkACLAndCredentialsProvidersTest, NumericFieldsTest, TestBlendedInfixSuggestions, PrimUtilsTest, TestBinaryField, TestReversedWildcardFilterFactory, TestScoreJoinQPScore, TestRequestStatusCollectionAPI, FieldAnalysisRequestHandlerTest, InfixSuggestersTest, TestDistribStateManager, TestConfigSetsAPIZkFailure, PreAnalyzedFieldManagedSchemaCloudTest, OverriddenZkACLAndCredentialsProvidersTest, CoreMergeIndexesAdminHandlerTest, TestSolrXml, AnalyticsMergeStrategyTest, SpellCheckCollatorWithCollapseTest, TestMultiWordSynonyms, SparseHLLTest, TestStressRecovery, TestLegacyFieldCache, TestFreeTextSuggestions, V2StandaloneTest, MultiTermTest, TestSimpleQParserPlugin, TestRandomDVFaceting, HLLSerializationTest, TestRawResponseWriter, BlockCacheTest, SpatialFilterTest, DateRangeFieldTest, TestJmxIntegration, TestUpdate, TestPullReplicaErrorHandling, HdfsRecoverLeaseTest, LeaderInitiatedRecoveryOnShardRestartTest, OverseerModifyCollectionTest, MoveReplicaHDFSFailoverTest, HttpTriggerListenerTest, TestFieldCacheVsDocValues, TestFieldResource, TestRealTimeGet, TestPayloadScoreQParserPlugin, TestCustomStream, BinaryUpdateRequestHandlerTest, CdcrBidirectionalTest, OutputWriterTest, TestUniqueKeyFieldResource, DistributedFacetExistsSmallTest, TestManagedSynonymFilterFactory, TestSolr4Spatial, TestImplicitCoreProperties, ShardRoutingTest, TestManagedSchemaThreadSafety, TestQuerySenderNoQuery, URLClassifyProcessorTest, TestExactStatsCache, TestNumericRangeQuery64, DistribCursorPagingTest, HdfsBasicDistributedZk2Test, MetricsConfigTest, TestCopyFieldCollectionResource, SolrXmlInZkTest, ImplicitSnitchTest, TestXIncludeConfig, DistributedQueryComponentCustomSortTest, HighlighterMaxOffsetTest, ReplicationFactorTest, SignatureUpdateProcessorFactoryTest, TestRecovery, TestJavabinTupleStreamParser, AssignBackwardCompatibilityTest, TestLMDirichletSimilarityFactory, TestFieldTypeResource, ExplicitHLLTest, TestTlogReplica, OverseerTest, HighlighterTest, SyncSliceTest, TestReloadAndDeleteDocs, TestBackupRepositoryFactory, CdcrRequestHandlerTest, TestLeaderElectionZkExpiry, AlternateDirectoryTest, UniqFieldsUpdateProcessorFactoryTest, BJQParserTest, MigrateRouteKeyTest, LeaderElectionContextKeyTest, StressHdfsTest, TestCollectionAPI, TestSegmentSorting, MetricsHandlerTest, TestOverriddenPrefixQueryForCustomFieldType, ResponseHeaderTest, RulesTest, MoveReplicaTest, FastVectorHighlighterTest, TestSQLHandler, CollectionsAPISolrJTest, PathHierarchyTokenizerFactoryTest, StatsComponentTest, IndexSchemaTest, CollectionTooManyReplicasTest, TestCursorMarkWithoutUniqueKey, ZkCLITest, AddBlockUpdateTest, ClassificationUpdateProcessorTest, TestFieldCacheSort, DistributedFacetSimpleRefinementLongTailTest, TestSolrDeletionPolicy2, BasicDistributedZkTest, ChaosMonkeySafeLeaderTest, BasicZkTest, RecoveryZkTest, FullSolrCloudDistribCmdsTest, TestFaceting, TestHashPartitioner, ZkControllerTest, TestJoin, TestReload, DistributedTermsComponentTest, SimpleFacetsTest, SolrCmdDistributorTest, BadIndexSchemaTest, ConvertedLegacyTest, TestSort, TestFiltering, TestFunctionQuery, DirectUpdateHandlerTest, TestBadConfig, DistributedQueryElevationComponentTest, AnalysisAfterCoreReloadTest, SuggesterFSTTest, CoreAdminHandlerTest, SuggesterTSTTest, SuggesterTest, TestTrie, SuggesterWFSTTest, TestCSVLoader, PolyFieldTest, NoCacheHeaderTest, SolrCoreCheckLockOnStartupTest, DirectUpdateHandlerOptimizeTest, StatelessScriptUpdateProcessorFactoryTest, DistanceFunctionTest, SolrInfoBeanTest, TestSurroundQueryParser, DisMaxRequestHandlerTest, TestQueryUtils, TestWriterPerf, PrimitiveFieldTypeTest, XmlUpdateRequestHandlerTest, TestSolrQueryParser, LoggingHandlerTest, TestCollationField, TestCSVResponseWriter, QueryParsingTest, JsonLoaderTest, TestPartialUpdateDeduplication, TestPHPSerializedResponseWriter, PingRequestHandlerTest, TestComponentsName, HighlighterConfigTest, SOLR749Test, ResponseLogComponentTest, SolrIndexConfigTest, SampleTest, TestSearchPerf, MinimalSchemaTest, ExternalFileFieldSortTest, TestSolrCoreProperties, TestPostingsSolrHighlighter, DirectSolrConnectionTest, NotRequiredUniqueKeyTest, TestPhraseSuggestions, TestCharFilters, TestCodecSupport, SynonymTokenizerTest, TestSweetSpotSimilarityFactory, TestDFRSimilarityFactory, TestIBSimilarityFactory, TimeZoneUtilsTest, TestFastOutputStream, ScriptEngineTest, DateMathParserTest, ChaosMonkeyNothingIsSafeTest, ChaosMonkeyNothingIsSafeWithPullReplicasTest, DistribJoinFromCollectionTest, LeaderFailureAfterFreshStartTest, LeaderInitiatedRecoveryOnCommitTest, LegacyCloudClusterPropTest, MultiThreadedOCPTest, RecoveryAfterSoftCommitTest, RemoteQueryErrorTest, ReplaceNodeTest]
   [junit4] Completed [539/765 (2!)] on J0 in 25.24s, 1 test, 1 error <<< FAILURES!

[...truncated 41614 lines...]

Mime
View raw message