lucene-dev mailing list archives

Site index · List index
Message view « Date » · « Thread »
Top « Date » · « Thread »
From Policeman Jenkins Server <jenk...@thetaphi.de>
Subject [JENKINS] Lucene-Solr-7.x-Linux (64bit/jdk1.8.0_144) - Build # 1165 - Still Unstable!
Date Thu, 11 Jan 2018 21:51:42 GMT
Build: https://jenkins.thetaphi.de/job/Lucene-Solr-7.x-Linux/1165/
Java: 64bit/jdk1.8.0_144 -XX:-UseCompressedOops -XX:+UseSerialGC

1 tests failed.
FAILED:  org.apache.solr.update.processor.TimeRoutedAliasUpdateProcessorTest.testParse

Error Message:
Error from server at http://127.0.0.1:36575/solr: Collection : myalias_2017-10-24 is part of alias myalias remove or modify the alias before removing this collection.

Stack Trace:
org.apache.solr.client.solrj.impl.HttpSolrClient$RemoteSolrException: Error from server at http://127.0.0.1:36575/solr: Collection : myalias_2017-10-24 is part of alias myalias remove or modify the alias before removing this collection.
	at __randomizedtesting.SeedInfo.seed([AE0FE5D612D70283:C18AAE8EAEA1316C]:0)
	at org.apache.solr.client.solrj.impl.HttpSolrClient.executeMethod(HttpSolrClient.java:643)
	at org.apache.solr.client.solrj.impl.HttpSolrClient.request(HttpSolrClient.java:255)
	at org.apache.solr.client.solrj.impl.HttpSolrClient.request(HttpSolrClient.java:244)
	at org.apache.solr.client.solrj.impl.LBHttpSolrClient.doRequest(LBHttpSolrClient.java:483)
	at org.apache.solr.client.solrj.impl.LBHttpSolrClient.request(LBHttpSolrClient.java:413)
	at org.apache.solr.client.solrj.impl.CloudSolrClient.sendRequest(CloudSolrClient.java:1104)
	at org.apache.solr.client.solrj.impl.CloudSolrClient.requestWithRetryOnStaleState(CloudSolrClient.java:884)
	at org.apache.solr.client.solrj.impl.CloudSolrClient.request(CloudSolrClient.java:817)
	at org.apache.solr.client.solrj.SolrRequest.process(SolrRequest.java:194)
	at org.apache.solr.client.solrj.SolrRequest.process(SolrRequest.java:211)
	at org.apache.solr.update.processor.TimeRoutedAliasUpdateProcessorTest.doBefore(TimeRoutedAliasUpdateProcessorTest.java:84)
	at sun.reflect.NativeMethodAccessorImpl.invoke0(Native Method)
	at sun.reflect.NativeMethodAccessorImpl.invoke(NativeMethodAccessorImpl.java:62)
	at sun.reflect.DelegatingMethodAccessorImpl.invoke(DelegatingMethodAccessorImpl.java:43)
	at java.lang.reflect.Method.invoke(Method.java:498)
	at com.carrotsearch.randomizedtesting.RandomizedRunner.invoke(RandomizedRunner.java:1737)
	at com.carrotsearch.randomizedtesting.RandomizedRunner$9.evaluate(RandomizedRunner.java:968)
	at com.carrotsearch.randomizedtesting.RandomizedRunner$10.evaluate(RandomizedRunner.java:984)
	at com.carrotsearch.randomizedtesting.rules.SystemPropertiesRestoreRule$1.evaluate(SystemPropertiesRestoreRule.java:57)
	at org.apache.lucene.util.TestRuleSetupTeardownChained$1.evaluate(TestRuleSetupTeardownChained.java:49)
	at org.apache.lucene.util.AbstractBeforeAfterRule$1.evaluate(AbstractBeforeAfterRule.java:45)
	at org.apache.lucene.util.TestRuleThreadAndTestName$1.evaluate(TestRuleThreadAndTestName.java:48)
	at org.apache.lucene.util.TestRuleIgnoreAfterMaxFailures$1.evaluate(TestRuleIgnoreAfterMaxFailures.java:64)
	at org.apache.lucene.util.TestRuleMarkFailure$1.evaluate(TestRuleMarkFailure.java:47)
	at com.carrotsearch.randomizedtesting.rules.StatementAdapter.evaluate(StatementAdapter.java:36)
	at com.carrotsearch.randomizedtesting.ThreadLeakControl$StatementRunner.run(ThreadLeakControl.java:368)
	at com.carrotsearch.randomizedtesting.ThreadLeakControl.forkTimeoutingTask(ThreadLeakControl.java:817)
	at com.carrotsearch.randomizedtesting.ThreadLeakControl$3.evaluate(ThreadLeakControl.java:468)
	at com.carrotsearch.randomizedtesting.RandomizedRunner.runSingleTest(RandomizedRunner.java:943)
	at com.carrotsearch.randomizedtesting.RandomizedRunner$5.evaluate(RandomizedRunner.java:829)
	at com.carrotsearch.randomizedtesting.RandomizedRunner$6.evaluate(RandomizedRunner.java:879)
	at com.carrotsearch.randomizedtesting.RandomizedRunner$7.evaluate(RandomizedRunner.java:890)
	at com.carrotsearch.randomizedtesting.rules.StatementAdapter.evaluate(StatementAdapter.java:36)
	at com.carrotsearch.randomizedtesting.rules.SystemPropertiesRestoreRule$1.evaluate(SystemPropertiesRestoreRule.java:57)
	at org.apache.lucene.util.AbstractBeforeAfterRule$1.evaluate(AbstractBeforeAfterRule.java:45)
	at com.carrotsearch.randomizedtesting.rules.StatementAdapter.evaluate(StatementAdapter.java:36)
	at org.apache.lucene.util.TestRuleStoreClassName$1.evaluate(TestRuleStoreClassName.java:41)
	at com.carrotsearch.randomizedtesting.rules.NoShadowingOrOverridesOnMethodsRule$1.evaluate(NoShadowingOrOverridesOnMethodsRule.java:40)
	at com.carrotsearch.randomizedtesting.rules.NoShadowingOrOverridesOnMethodsRule$1.evaluate(NoShadowingOrOverridesOnMethodsRule.java:40)
	at com.carrotsearch.randomizedtesting.rules.StatementAdapter.evaluate(StatementAdapter.java:36)
	at com.carrotsearch.randomizedtesting.rules.StatementAdapter.evaluate(StatementAdapter.java:36)
	at com.carrotsearch.randomizedtesting.rules.StatementAdapter.evaluate(StatementAdapter.java:36)
	at org.apache.lucene.util.TestRuleAssertionsRequired$1.evaluate(TestRuleAssertionsRequired.java:53)
	at org.apache.lucene.util.TestRuleMarkFailure$1.evaluate(TestRuleMarkFailure.java:47)
	at org.apache.lucene.util.TestRuleIgnoreAfterMaxFailures$1.evaluate(TestRuleIgnoreAfterMaxFailures.java:64)
	at org.apache.lucene.util.TestRuleIgnoreTestSuites$1.evaluate(TestRuleIgnoreTestSuites.java:54)
	at com.carrotsearch.randomizedtesting.rules.StatementAdapter.evaluate(StatementAdapter.java:36)
	at com.carrotsearch.randomizedtesting.ThreadLeakControl$StatementRunner.run(ThreadLeakControl.java:368)
	at java.lang.Thread.run(Thread.java:748)




Build Log:
[...truncated 14268 lines...]
   [junit4] Suite: org.apache.solr.update.processor.TimeRoutedAliasUpdateProcessorTest
   [junit4]   2> Creating dataDir: /home/jenkins/workspace/Lucene-Solr-7.x-Linux/solr/build/solr-core/test/J2/temp/solr.update.processor.TimeRoutedAliasUpdateProcessorTest_AE0FE5D612D70283-001/init-core-data-001
   [junit4]   2> 3086288 WARN  (SUITE-TimeRoutedAliasUpdateProcessorTest-seed#[AE0FE5D612D70283]-worker) [    ] o.a.s.SolrTestCaseJ4 startTrackingSearchers: numOpens=1 numCloses=1
   [junit4]   2> 3086288 INFO  (SUITE-TimeRoutedAliasUpdateProcessorTest-seed#[AE0FE5D612D70283]-worker) [    ] o.a.s.SolrTestCaseJ4 Using TrieFields (NUMERIC_POINTS_SYSPROP=false) w/NUMERIC_DOCVALUES_SYSPROP=true
   [junit4]   2> 3086289 INFO  (SUITE-TimeRoutedAliasUpdateProcessorTest-seed#[AE0FE5D612D70283]-worker) [    ] o.a.s.SolrTestCaseJ4 Randomized ssl (false) and clientAuth (true) via: @org.apache.solr.util.RandomizeSSL(reason=, ssl=NaN, value=NaN, clientAuth=NaN)
   [junit4]   2> 3086290 INFO  (SUITE-TimeRoutedAliasUpdateProcessorTest-seed#[AE0FE5D612D70283]-worker) [    ] o.a.s.SolrTestCaseJ4 SecureRandom sanity checks: test.solr.allowed.securerandom=null & java.security.egd=file:/dev/./urandom
   [junit4]   2> 3086290 INFO  (SUITE-TimeRoutedAliasUpdateProcessorTest-seed#[AE0FE5D612D70283]-worker) [    ] o.a.s.c.MiniSolrCloudCluster Starting cluster of 2 servers in /home/jenkins/workspace/Lucene-Solr-7.x-Linux/solr/build/solr-core/test/J2/temp/solr.update.processor.TimeRoutedAliasUpdateProcessorTest_AE0FE5D612D70283-001/tempDir-001
   [junit4]   2> 3086290 INFO  (SUITE-TimeRoutedAliasUpdateProcessorTest-seed#[AE0FE5D612D70283]-worker) [    ] o.a.s.c.ZkTestServer STARTING ZK TEST SERVER
   [junit4]   2> 3086290 INFO  (Thread-9700) [    ] o.a.s.c.ZkTestServer client port:0.0.0.0/0.0.0.0:0
   [junit4]   2> 3086290 INFO  (Thread-9700) [    ] o.a.s.c.ZkTestServer Starting server
   [junit4]   2> 3086292 ERROR (Thread-9700) [    ] o.a.z.s.ZooKeeperServer ZKShutdownHandler is not registered, so ZooKeeper server won't take any action on ERROR or SHUTDOWN server state changes
   [junit4]   2> 3086390 INFO  (SUITE-TimeRoutedAliasUpdateProcessorTest-seed#[AE0FE5D612D70283]-worker) [    ] o.a.s.c.ZkTestServer start zk server on port:41703
   [junit4]   2> 3086396 INFO  (zkConnectionManagerCallback-8482-thread-1) [    ] o.a.s.c.c.ConnectionManager zkClient has connected
   [junit4]   2> 3086398 INFO  (jetty-launcher-8479-thread-1) [    ] o.e.j.s.Server jetty-9.3.20.v20170531
   [junit4]   2> 3086398 INFO  (jetty-launcher-8479-thread-2) [    ] o.e.j.s.Server jetty-9.3.20.v20170531
   [junit4]   2> 3086406 INFO  (jetty-launcher-8479-thread-2) [    ] o.e.j.s.h.ContextHandler Started o.e.j.s.ServletContextHandler@301d631a{/solr,null,AVAILABLE}
   [junit4]   2> 3086406 INFO  (jetty-launcher-8479-thread-1) [    ] o.e.j.s.h.ContextHandler Started o.e.j.s.ServletContextHandler@72ca761e{/solr,null,AVAILABLE}
   [junit4]   2> 3086408 INFO  (jetty-launcher-8479-thread-1) [    ] o.e.j.s.AbstractConnector Started ServerConnector@38475e77{HTTP/1.1,[http/1.1]}{127.0.0.1:43781}
   [junit4]   2> 3086408 INFO  (jetty-launcher-8479-thread-2) [    ] o.e.j.s.AbstractConnector Started ServerConnector@6481f15e{HTTP/1.1,[http/1.1]}{127.0.0.1:36575}
   [junit4]   2> 3086408 INFO  (jetty-launcher-8479-thread-1) [    ] o.e.j.s.Server Started @3088205ms
   [junit4]   2> 3086408 INFO  (jetty-launcher-8479-thread-2) [    ] o.e.j.s.Server Started @3088206ms
   [junit4]   2> 3086408 INFO  (jetty-launcher-8479-thread-1) [    ] o.a.s.c.s.e.JettySolrRunner Jetty properties: {hostContext=/solr, hostPort=43781}
   [junit4]   2> 3086408 INFO  (jetty-launcher-8479-thread-2) [    ] o.a.s.c.s.e.JettySolrRunner Jetty properties: {hostContext=/solr, hostPort=36575}
   [junit4]   2> 3086408 ERROR (jetty-launcher-8479-thread-1) [    ] o.a.s.u.StartupLoggingUtils Missing Java Option solr.log.dir. Logging may be missing or incomplete.
   [junit4]   2> 3086408 ERROR (jetty-launcher-8479-thread-2) [    ] o.a.s.u.StartupLoggingUtils Missing Java Option solr.log.dir. Logging may be missing or incomplete.
   [junit4]   2> 3086408 INFO  (jetty-launcher-8479-thread-1) [    ] o.a.s.s.SolrDispatchFilter  ___      _       Welcome to Apache Solr? version 7.3.0
   [junit4]   2> 3086408 INFO  (jetty-launcher-8479-thread-2) [    ] o.a.s.s.SolrDispatchFilter  ___      _       Welcome to Apache Solr? version 7.3.0
   [junit4]   2> 3086408 INFO  (jetty-launcher-8479-thread-1) [    ] o.a.s.s.SolrDispatchFilter / __| ___| |_ _   Starting in cloud mode on port null
   [junit4]   2> 3086408 INFO  (jetty-launcher-8479-thread-2) [    ] o.a.s.s.SolrDispatchFilter / __| ___| |_ _   Starting in cloud mode on port null
   [junit4]   2> 3086408 INFO  (jetty-launcher-8479-thread-1) [    ] o.a.s.s.SolrDispatchFilter \__ \/ _ \ | '_|  Install dir: null
   [junit4]   2> 3086408 INFO  (jetty-launcher-8479-thread-2) [    ] o.a.s.s.SolrDispatchFilter \__ \/ _ \ | '_|  Install dir: null
   [junit4]   2> 3086408 INFO  (jetty-launcher-8479-thread-1) [    ] o.a.s.s.SolrDispatchFilter |___/\___/_|_|    Start time: 2018-01-11T21:31:02.363Z
   [junit4]   2> 3086408 INFO  (jetty-launcher-8479-thread-2) [    ] o.a.s.s.SolrDispatchFilter |___/\___/_|_|    Start time: 2018-01-11T21:31:02.363Z
   [junit4]   2> 3086409 INFO  (zkConnectionManagerCallback-8485-thread-1) [    ] o.a.s.c.c.ConnectionManager zkClient has connected
   [junit4]   2> 3086409 INFO  (zkConnectionManagerCallback-8486-thread-1) [    ] o.a.s.c.c.ConnectionManager zkClient has connected
   [junit4]   2> 3086410 INFO  (jetty-launcher-8479-thread-1) [    ] o.a.s.s.SolrDispatchFilter solr.xml found in ZooKeeper. Loading...
   [junit4]   2> 3086410 INFO  (jetty-launcher-8479-thread-2) [    ] o.a.s.s.SolrDispatchFilter solr.xml found in ZooKeeper. Loading...
   [junit4]   2> 3086416 INFO  (jetty-launcher-8479-thread-2) [    ] o.a.s.c.ZkContainer Zookeeper client=127.0.0.1:41703/solr
   [junit4]   2> 3086416 INFO  (zkConnectionManagerCallback-8491-thread-1) [    ] o.a.s.c.c.ConnectionManager zkClient has connected
   [junit4]   2> 3086416 INFO  (jetty-launcher-8479-thread-1) [    ] o.a.s.c.ZkContainer Zookeeper client=127.0.0.1:41703/solr
   [junit4]   2> 3086417 INFO  (zkConnectionManagerCallback-8494-thread-1) [    ] o.a.s.c.c.ConnectionManager zkClient has connected
   [junit4]   2> 3086417 INFO  (zkConnectionManagerCallback-8496-thread-1-processing-n:127.0.0.1:36575_solr) [n:127.0.0.1:36575_solr    ] o.a.s.c.c.ConnectionManager zkClient has connected
   [junit4]   2> 3086418 INFO  (zkConnectionManagerCallback-8498-thread-1-processing-n:127.0.0.1:43781_solr) [n:127.0.0.1:43781_solr    ] o.a.s.c.c.ConnectionManager zkClient has connected
   [junit4]   2> 3086446 INFO  (jetty-launcher-8479-thread-2) [n:127.0.0.1:36575_solr    ] o.a.s.c.Overseer Overseer (id=null) closing
   [junit4]   2> 3086446 INFO  (jetty-launcher-8479-thread-2) [n:127.0.0.1:36575_solr    ] o.a.s.c.OverseerElectionContext I am going to be the leader 127.0.0.1:36575_solr
   [junit4]   2> 3086446 INFO  (jetty-launcher-8479-thread-1) [n:127.0.0.1:43781_solr    ] o.a.s.c.Overseer Overseer (id=null) closing
   [junit4]   2> 3086446 INFO  (jetty-launcher-8479-thread-2) [n:127.0.0.1:36575_solr    ] o.a.s.c.Overseer Overseer (id=99333325602553861-127.0.0.1:36575_solr-n_0000000000) starting
   [junit4]   2> 3086447 INFO  (jetty-launcher-8479-thread-1) [n:127.0.0.1:43781_solr    ] o.a.s.c.ZkController Register node as live in ZooKeeper:/live_nodes/127.0.0.1:43781_solr
   [junit4]   2> 3086447 INFO  (zkCallback-8495-thread-1-processing-n:127.0.0.1:36575_solr) [n:127.0.0.1:36575_solr    ] o.a.s.c.c.ZkStateReader Updated live nodes from ZooKeeper... (0) -> (1)
   [junit4]   2> 3086447 INFO  (zkCallback-8497-thread-1-processing-n:127.0.0.1:43781_solr) [n:127.0.0.1:43781_solr    ] o.a.s.c.c.ZkStateReader Updated live nodes from ZooKeeper... (0) -> (1)
   [junit4]   2> 3086453 INFO  (jetty-launcher-8479-thread-2) [n:127.0.0.1:36575_solr    ] o.a.s.c.ZkController Register node as live in ZooKeeper:/live_nodes/127.0.0.1:36575_solr
   [junit4]   2> 3086453 INFO  (zkCallback-8495-thread-1-processing-n:127.0.0.1:36575_solr) [n:127.0.0.1:36575_solr    ] o.a.s.c.c.ZkStateReader Updated live nodes from ZooKeeper... (1) -> (2)
   [junit4]   2> 3086456 INFO  (zkCallback-8497-thread-1-processing-n:127.0.0.1:43781_solr) [n:127.0.0.1:43781_solr    ] o.a.s.c.c.ZkStateReader Updated live nodes from ZooKeeper... (1) -> (2)
   [junit4]   2> 3086506 INFO  (jetty-launcher-8479-thread-1) [n:127.0.0.1:43781_solr    ] o.a.s.m.r.SolrJmxReporter JMX monitoring for 'solr_43781.solr.node' (registry 'solr.node') enabled at server: com.sun.jmx.mbeanserver.JmxMBeanServer@65d43211
   [junit4]   2> 3086511 INFO  (jetty-launcher-8479-thread-1) [n:127.0.0.1:43781_solr    ] o.a.s.m.r.SolrJmxReporter JMX monitoring for 'solr_43781.solr.jvm' (registry 'solr.jvm') enabled at server: com.sun.jmx.mbeanserver.JmxMBeanServer@65d43211
   [junit4]   2> 3086511 INFO  (jetty-launcher-8479-thread-1) [n:127.0.0.1:43781_solr    ] o.a.s.m.r.SolrJmxReporter JMX monitoring for 'solr_43781.solr.jetty' (registry 'solr.jetty') enabled at server: com.sun.jmx.mbeanserver.JmxMBeanServer@65d43211
   [junit4]   2> 3086511 INFO  (jetty-launcher-8479-thread-1) [n:127.0.0.1:43781_solr    ] o.a.s.c.CorePropertiesLocator Found 0 core definitions underneath /home/jenkins/workspace/Lucene-Solr-7.x-Linux/solr/build/solr-core/test/J2/temp/solr.update.processor.TimeRoutedAliasUpdateProcessorTest_AE0FE5D612D70283-001/tempDir-001/node1/.
   [junit4]   2> 3086533 INFO  (jetty-launcher-8479-thread-2) [n:127.0.0.1:36575_solr    ] o.a.s.m.r.SolrJmxReporter JMX monitoring for 'solr_36575.solr.node' (registry 'solr.node') enabled at server: com.sun.jmx.mbeanserver.JmxMBeanServer@65d43211
   [junit4]   2> 3086540 INFO  (jetty-launcher-8479-thread-2) [n:127.0.0.1:36575_solr    ] o.a.s.m.r.SolrJmxReporter JMX monitoring for 'solr_36575.solr.jvm' (registry 'solr.jvm') enabled at server: com.sun.jmx.mbeanserver.JmxMBeanServer@65d43211
   [junit4]   2> 3086540 INFO  (jetty-launcher-8479-thread-2) [n:127.0.0.1:36575_solr    ] o.a.s.m.r.SolrJmxReporter JMX monitoring for 'solr_36575.solr.jetty' (registry 'solr.jetty') enabled at server: com.sun.jmx.mbeanserver.JmxMBeanServer@65d43211
   [junit4]   2> 3086541 INFO  (jetty-launcher-8479-thread-2) [n:127.0.0.1:36575_solr    ] o.a.s.c.CorePropertiesLocator Found 0 core definitions underneath /home/jenkins/workspace/Lucene-Solr-7.x-Linux/solr/build/solr-core/test/J2/temp/solr.update.processor.TimeRoutedAliasUpdateProcessorTest_AE0FE5D612D70283-001/tempDir-001/node2/.
   [junit4]   2> 3086569 INFO  (zkConnectionManagerCallback-8504-thread-1) [    ] o.a.s.c.c.ConnectionManager zkClient has connected
   [junit4]   2> 3086573 INFO  (qtp2045110732-34509) [n:127.0.0.1:36575_solr    ] o.a.s.h.a.CollectionsHandler Invoked Collection Action :clusterstatus with params action=CLUSTERSTATUS&wt=javabin&version=2 and sendToOCPQueue=true
   [junit4]   2> 3086574 INFO  (qtp2045110732-34509) [n:127.0.0.1:36575_solr    ] o.a.s.s.HttpSolrCall [admin] webapp=null path=/admin/collections params={action=CLUSTERSTATUS&wt=javabin&version=2} status=0 QTime=0
   [junit4]   2> 3086581 INFO  (TEST-TimeRoutedAliasUpdateProcessorTest.test-seed#[AE0FE5D612D70283]) [    ] o.a.s.SolrTestCaseJ4 ###Starting test
   [junit4]   2> 3086582 INFO  (qtp2045110732-34509) [n:127.0.0.1:36575_solr    ] o.a.s.h.a.CollectionsHandler Invoked Collection Action :clusterstatus with params action=CLUSTERSTATUS&wt=javabin&version=2 and sendToOCPQueue=true
   [junit4]   2> 3086582 INFO  (qtp2045110732-34509) [n:127.0.0.1:36575_solr    ] o.a.s.s.HttpSolrCall [admin] webapp=null path=/admin/collections params={action=CLUSTERSTATUS&wt=javabin&version=2} status=0 QTime=0
   [junit4]   2> 3086583 INFO  (qtp2045110732-34510) [n:127.0.0.1:36575_solr    ] o.a.s.h.a.CollectionsHandler Invoked Collection Action :clusterstatus with params action=CLUSTERSTATUS&wt=javabin&version=2 and sendToOCPQueue=true
   [junit4]   2> 3086583 INFO  (qtp2045110732-34510) [n:127.0.0.1:36575_solr    ] o.a.s.s.HttpSolrCall [admin] webapp=null path=/admin/collections params={action=CLUSTERSTATUS&wt=javabin&version=2} status=0 QTime=0
   [junit4]   2> 3086584 INFO  (qtp2045110732-34501) [n:127.0.0.1:36575_solr    ] o.a.s.h.a.CollectionsHandler Invoked Collection Action :list with params action=LIST&wt=javabin&version=2 and sendToOCPQueue=true
   [junit4]   2> 3086584 INFO  (qtp2045110732-34501) [n:127.0.0.1:36575_solr    ] o.a.s.s.HttpSolrCall [admin] webapp=null path=/admin/collections params={action=LIST&wt=javabin&version=2} status=0 QTime=0
   [junit4]   2> 3086584 INFO  (qtp2045110732-34511) [n:127.0.0.1:36575_solr    ] o.a.s.h.a.CollectionsHandler Invoked Collection Action :clusterstatus with params action=CLUSTERSTATUS&wt=javabin&version=2 and sendToOCPQueue=true
   [junit4]   2> 3086584 INFO  (qtp2045110732-34511) [n:127.0.0.1:36575_solr    ] o.a.s.s.HttpSolrCall [admin] webapp=null path=/admin/collections params={action=CLUSTERSTATUS&wt=javabin&version=2} status=0 QTime=0
   [junit4]   2> 3086585 INFO  (qtp2045110732-34510) [n:127.0.0.1:36575_solr    ] o.a.s.h.a.CollectionsHandler Invoked Collection Action :clusterstatus with params action=CLUSTERSTATUS&wt=javabin&version=2 and sendToOCPQueue=true
   [junit4]   2> 3086585 INFO  (qtp2045110732-34510) [n:127.0.0.1:36575_solr    ] o.a.s.s.HttpSolrCall [admin] webapp=null path=/admin/collections params={action=CLUSTERSTATUS&wt=javabin&version=2} status=0 QTime=0
   [junit4]   2> 3086585 INFO  (qtp2045110732-34509) [n:127.0.0.1:36575_solr    ] o.a.s.h.a.CollectionsHandler Invoked Collection Action :create with params pullReplicas=0&replicationFactor=1&name=timeConfig&nrtReplicas=1&action=CREATE&numShards=1&tlogReplicas=0&wt=javabin&version=2 and sendToOCPQueue=true
   [junit4]   2> 3086586 INFO  (OverseerThreadFactory-12219-thread-1-processing-n:127.0.0.1:36575_solr) [n:127.0.0.1:36575_solr    ] o.a.s.c.CreateCollectionCmd Create collection timeConfig
   [junit4]   2> 3086586 INFO  (OverseerThreadFactory-12219-thread-1-processing-n:127.0.0.1:36575_solr) [n:127.0.0.1:36575_solr    ] o.a.s.c.CreateCollectionCmd Only _default config set found, using it.
   [junit4]   2> 3086586 INFO  (OverseerThreadFactory-12219-thread-1-processing-n:127.0.0.1:36575_solr) [n:127.0.0.1:36575_solr    ] o.a.s.c.c.ZkConfigManager Copying zk node /configs/_default/protwords.txt to /configs/timeConfig/protwords.txt
   [junit4]   2> 3086587 INFO  (OverseerThreadFactory-12219-thread-1-processing-n:127.0.0.1:36575_solr) [n:127.0.0.1:36575_solr    ] o.a.s.c.c.ZkConfigManager Copying zk node /configs/_default/managed-schema to /configs/timeConfig/managed-schema
   [junit4]   2> 3086588 INFO  (OverseerThreadFactory-12219-thread-1-processing-n:127.0.0.1:36575_solr) [n:127.0.0.1:36575_solr    ] o.a.s.c.c.ZkConfigManager Copying zk node /configs/_default/solrconfig.xml to /configs/timeConfig/solrconfig.xml
   [junit4]   2> 3086588 INFO  (OverseerThreadFactory-12219-thread-1-processing-n:127.0.0.1:36575_solr) [n:127.0.0.1:36575_solr    ] o.a.s.c.c.ZkConfigManager Copying zk node /configs/_default/synonyms.txt to /configs/timeConfig/synonyms.txt
   [junit4]   2> 3086589 INFO  (OverseerThreadFactory-12219-thread-1-processing-n:127.0.0.1:36575_solr) [n:127.0.0.1:36575_solr    ] o.a.s.c.c.ZkConfigManager Copying zk node /configs/_default/stopwords.txt to /configs/timeConfig/stopwords.txt
   [junit4]   2> 3086589 INFO  (OverseerThreadFactory-12219-thread-1-processing-n:127.0.0.1:36575_solr) [n:127.0.0.1:36575_solr    ] o.a.s.c.c.ZkConfigManager Copying zk node /configs/_default/lang/contractions_it.txt to /configs/timeConfig/lang/contractions_it.txt
   [junit4]   2> 3086590 INFO  (OverseerThreadFactory-12219-thread-1-processing-n:127.0.0.1:36575_solr) [n:127.0.0.1:36575_solr    ] o.a.s.c.c.ZkConfigManager Copying zk node /configs/_default/lang/stemdict_nl.txt to /configs/timeConfig/lang/stemdict_nl.txt
   [junit4]   2> 3086590 INFO  (OverseerThreadFactory-12219-thread-1-processing-n:127.0.0.1:36575_solr) [n:127.0.0.1:36575_solr    ] o.a.s.c.c.ZkConfigManager Copying zk node /configs/_default/lang/stopwords_hy.txt to /configs/timeConfig/lang/stopwords_hy.txt
   [junit4]   2> 3086591 INFO  (OverseerThreadFactory-12219-thread-1-processing-n:127.0.0.1:36575_solr) [n:127.0.0.1:36575_solr    ] o.a.s.c.c.ZkConfigManager Copying zk node /configs/_default/lang/stopwords_no.txt to /configs/timeConfig/lang/stopwords_no.txt
   [junit4]   2> 3086591 INFO  (OverseerThreadFactory-12219-thread-1-processing-n:127.0.0.1:36575_solr) [n:127.0.0.1:36575_solr    ] o.a.s.c.c.ZkConfigManager Copying zk node /configs/_default/lang/contractions_ca.txt to /configs/timeConfig/lang/contractions_ca.txt
   [junit4]   2> 3086592 INFO  (OverseerThreadFactory-12219-thread-1-processing-n:127.0.0.1:36575_solr) [n:127.0.0.1:36575_solr    ] o.a.s.c.c.ZkConfigManager Copying zk node /configs/_default/lang/stopwords_id.txt to /configs/timeConfig/lang/stopwords_id.txt
   [junit4]   2> 3086592 INFO  (OverseerThreadFactory-12219-thread-1-processing-n:127.0.0.1:36575_solr) [n:127.0.0.1:36575_solr    ] o.a.s.c.c.ZkConfigManager Copying zk node /configs/_default/lang/stopwords_ga.txt to /configs/timeConfig/lang/stopwords_ga.txt
   [junit4]   2> 3086593 INFO  (OverseerThreadFactory-12219-thread-1-processing-n:127.0.0.1:36575_solr) [n:127.0.0.1:36575_solr    ] o.a.s.c.c.ZkConfigManager Copying zk node /configs/_default/lang/stopwords_hi.txt to /configs/timeConfig/lang/stopwords_hi.txt
   [junit4]   2> 3086593 INFO  (OverseerThreadFactory-12219-thread-1-processing-n:127.0.0.1:36575_solr) [n:127.0.0.1:36575_solr    ] o.a.s.c.c.ZkConfigManager Copying zk node /configs/_default/lang/stopwords_da.txt to /configs/timeConfig/lang/stopwords_da.txt
   [junit4]   2> 3086594 INFO  (OverseerThreadFactory-12219-thread-1-processing-n:127.0.0.1:36575_solr) [n:127.0.0.1:36575_solr    ] o.a.s.c.c.ZkConfigManager Copying zk node /configs/_default/lang/stopwords_ja.txt to /configs/timeConfig/lang/stopwords_ja.txt
   [junit4]   2> 3086594 INFO  (OverseerThreadFactory-12219-thread-1-processing-n:127.0.0.1:36575_solr) [n:127.0.0.1:36575_solr    ] o.a.s.c.c.ZkConfigManager Copying zk node /configs/_default/lang/stopwords_pt.txt to /configs/timeConfig/lang/stopwords_pt.txt
   [junit4]   2> 3086595 INFO  (OverseerThreadFactory-12219-thread-1-processing-n:127.0.0.1:36575_solr) [n:127.0.0.1:36575_solr    ] o.a.s.c.c.ZkConfigManager Copying zk node /configs/_default/lang/stopwords_hu.txt to /configs/timeConfig/lang/stopwords_hu.txt
   [junit4]   2> 3086595 INFO  (OverseerThreadFactory-12219-thread-1-processing-n:127.0.0.1:36575_solr) [n:127.0.0.1:36575_solr    ] o.a.s.c.c.ZkConfigManager Copying zk node /configs/_default/lang/stopwords_el.txt to /configs/timeConfig/lang/stopwords_el.txt
   [junit4]   2> 3086596 INFO  (OverseerThreadFactory-12219-thread-1-processing-n:127.0.0.1:36575_solr) [n:127.0.0.1:36575_solr    ] o.a.s.c.c.ZkConfigManager Copying zk node /configs/_default/lang/stopwords_ru.txt to /configs/timeConfig/lang/stopwords_ru.txt
   [junit4]   2> 3086597 INFO  (OverseerThreadFactory-12219-thread-1-processing-n:127.0.0.1:36575_solr) [n:127.0.0.1:36575_solr    ] o.a.s.c.c.ZkConfigManager Copying zk node /configs/_default/lang/stopwords_tr.txt to /configs/timeConfig/lang/stopwords_tr.txt
   [junit4]   2> 3086597 INFO  (OverseerThreadFactory-12219-thread-1-processing-n:127.0.0.1:36575_solr) [n:127.0.0.1:36575_solr    ] o.a.s.c.c.ZkConfigManager Copying zk node /configs/_default/lang/stopwords_ar.txt to /configs/timeConfig/lang/stopwords_ar.txt
   [junit4]   2> 3086598 INFO  (OverseerThreadFactory-12219-thread-1-processing-n:127.0.0.1:36575_solr) [n:127.0.0.1:36575_solr    ] o.a.s.c.c.ZkConfigManager Copying zk node /configs/_default/lang/userdict_ja.txt to /configs/timeConfig/lang/userdict_ja.txt
   [junit4]   2> 3086598 INFO  (OverseerThreadFactory-12219-thread-1-processing-n:127.0.0.1:36575_solr) [n:127.0.0.1:36575_solr    ] o.a.s.c.c.ZkConfigManager Copying zk node /configs/_default/lang/stopwords_eu.txt to /configs/timeConfig/lang/stopwords_eu.txt
   [junit4]   2> 3086599 INFO  (OverseerThreadFactory-12219-thread-1-processing-n:127.0.0.1:36575_solr) [n:127.0.0.1:36575_solr    ] o.a.s.c.c.ZkConfigManager Copying zk node /configs/_default/lang/stopwords_it.txt to /configs/timeConfig/lang/stopwords_it.txt
   [junit4]   2> 3086599 INFO  (OverseerThreadFactory-12219-thread-1-processing-n:127.0.0.1:36575_solr) [n:127.0.0.1:36575_solr    ] o.a.s.c.c.ZkConfigManager Copying zk node /configs/_default/lang/stopwords_cz.txt to /configs/timeConfig/lang/stopwords_cz.txt
   [junit4]   2> 3086600 INFO  (OverseerThreadFactory-12219-thread-1-processing-n:127.0.0.1:36575_solr) [n:127.0.0.1:36575_solr    ] o.a.s.c.c.ZkConfigManager Copying zk node /configs/_default/lang/stoptags_ja.txt to /configs/timeConfig/lang/stoptags_ja.txt
   [junit4]   2> 3086600 INFO  (OverseerThreadFactory-12219-thread-1-processing-n:127.0.0.1:36575_solr) [n:127.0.0.1:36575_solr    ] o.a.s.c.c.ZkConfigManager Copying zk node /configs/_default/lang/contractions_fr.txt to /configs/timeConfig/lang/contractions_fr.txt
   [junit4]   2> 3086601 INFO  (OverseerThreadFactory-12219-thread-1-processing-n:127.0.0.1:36575_solr) [n:127.0.0.1:36575_solr    ] o.a.s.c.c.ZkConfigManager Copying zk node /configs/_default/lang/stopwords_de.txt to /configs/timeConfig/lang/stopwords_de.txt
   [junit4]   2> 3086601 INFO  (OverseerThreadFactory-12219-thread-1-processing-n:127.0.0.1:36575_solr) [n:127.0.0.1:36575_solr    ] o.a.s.c.c.ZkConfigManager Copying zk node /configs/_default/lang/stopwords_fa.txt to /configs/timeConfig/lang/stopwords_fa.txt
   [junit4]   2> 3086602 INFO  (OverseerThreadFactory-12219-thread-1-processing-n:127.0.0.1:36575_solr) [n:127.0.0.1:36575_solr    ] o.a.s.c.c.ZkConfigManager Copying zk node /configs/_default/lang/contractions_ga.txt to /configs/timeConfig/lang/contractions_ga.txt
   [junit4]   2> 3086602 INFO  (OverseerThreadFactory-12219-thread-1-processing-n:127.0.0.1:36575_solr) [n:127.0.0.1:36575_solr    ] o.a.s.c.c.ZkConfigManager Copying zk node /configs/_default/lang/stopwords_ca.txt to /configs/timeConfig/lang/stopwords_ca.txt
   [junit4]   2> 3086603 INFO  (OverseerThreadFactory-12219-thread-1-processing-n:127.0.0.1:36575_solr) [n:127.0.0.1:36575_solr    ] o.a.s.c.c.ZkConfigManager Copying zk node /configs/_default/lang/stopwords_nl.txt to /configs/timeConfig/lang/stopwords_nl.txt
   [junit4]   2> 3086604 INFO  (OverseerThreadFactory-12219-thread-1-processing-n:127.0.0.1:36575_solr) [n:127.0.0.1:36575_solr    ] o.a.s.c.c.ZkConfigManager Copying zk node /configs/_default/lang/stopwords_bg.txt to /configs/timeConfig/lang/stopwords_bg.txt
   [junit4]   2> 3086605 INFO  (OverseerThreadFactory-12219-thread-1-processing-n:127.0.0.1:36575_solr) [n:127.0.0.1:36575_solr    ] o.a.s.c.c.ZkConfigManager Copying zk node /configs/_default/lang/stopwords_lv.txt to /configs/timeConfig/lang/stopwords_lv.txt
   [junit4]   2> 3086605 INFO  (OverseerThreadFactory-12219-thread-1-processing-n:127.0.0.1:36575_solr) [n:127.0.0.1:36575_solr    ] o.a.s.c.c.ZkConfigManager Copying zk node /configs/_default/lang/stopwords_en.txt to /configs/timeConfig/lang/stopwords_en.txt
   [junit4]   2> 3086606 INFO  (OverseerThreadFactory-12219-thread-1-processing-n:127.0.0.1:36575_solr) [n:127.0.0.1:36575_solr    ] o.a.s.c.c.ZkConfigManager Copying zk node /configs/_default/lang/stopwords_es.txt to /configs/timeConfig/lang/stopwords_es.txt
   [junit4]   2> 3086607 INFO  (OverseerThreadFactory-12219-thread-1-processing-n:127.0.0.1:36575_solr) [n:127.0.0.1:36575_solr    ] o.a.s.c.c.ZkConfigManager Copying zk node /configs/_default/lang/stopwords_th.txt to /configs/timeConfig/lang/stopwords_th.txt
   [junit4]   2> 3086607 INFO  (OverseerThreadFactory-12219-thread-1-processing-n:127.0.0.1:36575_solr) [n:127.0.0.1:36575_solr    ] o.a.s.c.c.ZkConfigManager Copying zk node /configs/_default/lang/stopwords_ro.txt to /configs/timeConfig/lang/stopwords_ro.txt
   [junit4]   2> 3086608 INFO  (OverseerThreadFactory-12219-thread-1-processing-n:127.0.0.1:36575_solr) [n:127.0.0.1:36575_solr    ] o.a.s.c.c.ZkConfigManager Copying zk node /configs/_default/lang/stopwords_fr.txt to /configs/timeConfig/lang/stopwords_fr.txt
   [junit4]   2> 3086609 INFO  (OverseerThreadFactory-12219-thread-1-processing-n:127.0.0.1:36575_solr) [n:127.0.0.1:36575_solr    ] o.a.s.c.c.ZkConfigManager Copying zk node /configs/_default/lang/stopwords_sv.txt to /configs/timeConfig/lang/stopwords_sv.txt
   [junit4]   2> 3086610 INFO  (OverseerThreadFactory-12219-thread-1-processing-n:127.0.0.1:36575_solr) [n:127.0.0.1:36575_solr    ] o.a.s.c.c.ZkConfigManager Copying zk node /configs/_default/lang/stopwords_fi.txt to /configs/timeConfig/lang/stopwords_fi.txt
   [junit4]   2> 3086610 INFO  (OverseerThreadFactory-12219-thread-1-processing-n:127.0.0.1:36575_solr) [n:127.0.0.1:36575_solr    ] o.a.s.c.c.ZkConfigManager Copying zk node /configs/_default/lang/hyphenations_ga.txt to /configs/timeConfig/lang/hyphenations_ga.txt
   [junit4]   2> 3086611 INFO  (OverseerThreadFactory-12219-thread-1-processing-n:127.0.0.1:36575_solr) [n:127.0.0.1:36575_solr    ] o.a.s.c.c.ZkConfigManager Copying zk node /configs/_default/lang/stopwords_gl.txt to /configs/timeConfig/lang/stopwords_gl.txt
   [junit4]   2> 3086612 INFO  (OverseerThreadFactory-12219-thread-1-processing-n:127.0.0.1:36575_solr) [n:127.0.0.1:36575_solr    ] o.a.s.c.c.ZkConfigManager Copying zk node /configs/_default/params.json to /configs/timeConfig/params.json
   [junit4]   2> 3086716 INFO  (OverseerStateUpdate-99333325602553861-127.0.0.1:36575_solr-n_0000000000) [n:127.0.0.1:36575_solr    ] o.a.s.c.o.SliceMutator createReplica() {
   [junit4]   2>   "operation":"ADDREPLICA",
   [junit4]   2>   "collection":"timeConfig",
   [junit4]   2>   "shard":"shard1",
   [junit4]   2>   "core":"timeConfig_shard1_replica_n1",
   [junit4]   2>   "state":"down",
   [junit4]   2>   "base_url":"http://127.0.0.1:43781/solr",
   [junit4]   2>   "type":"NRT",
   [junit4]   2>   "waitForFinalState":"false"} 
   [junit4]   2> 3086917 INFO  (qtp734475869-34504) [n:127.0.0.1:43781_solr    ] o.a.s.h.a.CoreAdminOperation core create command qt=/admin/cores&coreNodeName=core_node2&collection.configName=timeConfig&newCollection=true&name=timeConfig_shard1_replica_n1&action=CREATE&numShards=1&collection=timeConfig&shard=shard1&wt=javabin&version=2&replicaType=NRT
   [junit4]   2> 3086918 INFO  (qtp734475869-34504) [n:127.0.0.1:43781_solr    ] o.a.s.c.TransientSolrCoreCacheDefault Allocating transient cache for 2147483647 transient cores
   [junit4]   2> 3087020 INFO  (zkCallback-8497-thread-1-processing-n:127.0.0.1:43781_solr) [n:127.0.0.1:43781_solr    ] o.a.s.c.c.ZkStateReader A cluster state change: [WatchedEvent state:SyncConnected type:NodeDataChanged path:/collections/timeConfig/state.json] for collection [timeConfig] has occurred - updating... (live nodes size: [2])
   [junit4]   2> 3087020 INFO  (zkCallback-8497-thread-2-processing-n:127.0.0.1:43781_solr) [n:127.0.0.1:43781_solr    ] o.a.s.c.c.ZkStateReader A cluster state change: [WatchedEvent state:SyncConnected type:NodeDataChanged path:/collections/timeConfig/state.json] for collection [timeConfig] has occurred - updating... (live nodes size: [2])
   [junit4]   2> 3087924 INFO  (qtp734475869-34504) [n:127.0.0.1:43781_solr c:timeConfig s:shard1 r:core_node2 x:timeConfig_shard1_replica_n1] o.a.s.c.RequestParams conf resource params.json loaded . version : 0 
   [junit4]   2> 3087924 INFO  (qtp734475869-34504) [n:127.0.0.1:43781_solr c:timeConfig s:shard1 r:core_node2 x:timeConfig_shard1_replica_n1] o.a.s.c.RequestParams request params refreshed to version 0
   [junit4]   2> 3087925 WARN  (qtp734475869-34504) [n:127.0.0.1:43781_solr c:timeConfig s:shard1 r:core_node2 x:timeConfig_shard1_replica_n1] o.a.s.c.SolrConfig Couldn't add files from /home/jenkins/workspace/Lucene-Solr-7.x-Linux/solr/build/solr-core/test/J2/temp/solr.update.processor.TimeRoutedAliasUpdateProcessorTest_AE0FE5D612D70283-001/tempDir-001/node1/timeConfig_shard1_replica_n1/../../../../contrib/extraction/lib filtered by .*\.jar to classpath: /home/jenkins/workspace/Lucene-Solr-7.x-Linux/solr/build/solr-core/test/J2/temp/solr.update.processor.TimeRoutedAliasUpdateProcessorTest_AE0FE5D612D70283-001/tempDir-001/node1/timeConfig_shard1_replica_n1/../../../../contrib/extraction/lib
   [junit4]   2> 3087925 WARN  (qtp734475869-34504) [n:127.0.0.1:43781_solr c:timeConfig s:shard1 r:core_node2 x:timeConfig_shard1_replica_n1] o.a.s.c.SolrConfig Couldn't add files from /home/jenkins/workspace/Lucene-Solr-7.x-Linux/solr/build/solr-core/test/J2/temp/solr.update.processor.TimeRoutedAliasUpdateProcessorTest_AE0FE5D612D70283-001/tempDir-001/node1/timeConfig_shard1_replica_n1/../../../../dist filtered by solr-cell-\d.*\.jar to classpath: /home/jenkins/workspace/Lucene-Solr-7.x-Linux/solr/build/solr-core/test/J2/temp/solr.update.processor.TimeRoutedAliasUpdateProcessorTest_AE0FE5D612D70283-001/tempDir-001/node1/timeConfig_shard1_replica_n1/../../../../dist
   [junit4]   2> 3087926 WARN  (qtp734475869-34504) [n:127.0.0.1:43781_solr c:timeConfig s:shard1 r:core_node2 x:timeConfig_shard1_replica_n1] o.a.s.c.SolrConfig Couldn't add files from /home/jenkins/workspace/Lucene-Solr-7.x-Linux/solr/build/solr-core/test/J2/temp/solr.update.processor.TimeRoutedAliasUpdateProcessorTest_AE0FE5D612D70283-001/tempDir-001/node1/timeConfig_shard1_replica_n1/../../../../contrib/clustering/lib filtered by .*\.jar to classpath: /home/jenkins/workspace/Lucene-Solr-7.x-Linux/solr/build/solr-core/test/J2/temp/solr.update.processor.TimeRoutedAliasUpdateProcessorTest_AE0FE5D612D70283-001/tempDir-001/node1/timeConfig_shard1_replica_n1/../../../../contrib/clustering/lib
   [junit4]   2> 3087926 WARN  (qtp734475869-34504) [n:127.0.0.1:43781_solr c:timeConfig s:shard1 r:core_node2 x:timeConfig_shard1_replica_n1] o.a.s.c.SolrConfig Couldn't add files from /home/jenkins/workspace/Lucene-Solr-7.x-Linux/solr/build/solr-core/test/J2/temp/solr.update.processor.TimeRoutedAliasUpdateProcessorTest_AE0FE5D612D70283-001/tempDir-001/node1/timeConfig_shard1_replica_n1/../../../../dist filtered by solr-clustering-\d.*\.jar to classpath: /home/jenkins/workspace/Lucene-Solr-7.x-Linux/solr/build/solr-core/test/J2/temp/solr.update.processor.TimeRoutedAliasUpdateProcessorTest_AE0FE5D612D70283-001/tempDir-001/node1/timeConfig_shard1_replica_n1/../../../../dist
   [junit4]   2> 3087926 WARN  (qtp734475869-34504) [n:127.0.0.1:43781_solr c:timeConfig s:shard1 r:core_node2 x:timeConfig_shard1_replica_n1] o.a.s.c.SolrConfig Couldn't add files from /home/jenkins/workspace/Lucene-Solr-7.x-Linux/solr/build/solr-core/test/J2/temp/solr.update.processor.TimeRoutedAliasUpdateProcessorTest_AE0FE5D612D70283-001/tempDir-001/node1/timeConfig_shard1_replica_n1/../../../../contrib/langid/lib filtered by .*\.jar to classpath: /home/jenkins/workspace/Lucene-Solr-7.x-Linux/solr/build/solr-core/test/J2/temp/solr.update.processor.TimeRoutedAliasUpdateProcessorTest_AE0FE5D612D70283-001/tempDir-001/node1/timeConfig_shard1_replica_n1/../../../../contrib/langid/lib
   [junit4]   2> 3087926 WARN  (qtp734475869-34504) [n:127.0.0.1:43781_solr c:timeConfig s:shard1 r:core_node2 x:timeConfig_shard1_replica_n1] o.a.s.c.SolrConfig Couldn't add files from /home/jenkins/workspace/Lucene-Solr-7.x-Linux/solr/build/solr-core/test/J2/temp/solr.update.processor.TimeRoutedAliasUpdateProcessorTest_AE0FE5D612D70283-001/tempDir-001/node1/timeConfig_shard1_replica_n1/../../../../dist filtered by solr-langid-\d.*\.jar to classpath: /home/jenkins/workspace/Lucene-Solr-7.x-Linux/solr/build/solr-core/test/J2/temp/solr.update.processor.TimeRoutedAliasUpdateProcessorTest_AE0FE5D612D70283-001/tempDir-001/node1/timeConfig_shard1_replica_n1/../../../../dist
   [junit4]   2> 3087926 WARN  (qtp734475869-34504) [n:127.0.0.1:43781_solr c:timeConfig s:shard1 r:core_node2 x:timeConfig_shard1_replica_n1] o.a.s.c.SolrConfig Couldn't add files from /home/jenkins/workspace/Lucene-Solr-7.x-Linux/solr/build/solr-core/test/J2/temp/solr.update.processor.TimeRoutedAliasUpdateProcessorTest_AE0FE5D612D70283-001/tempDir-001/node1/timeConfig_shard1_replica_n1/../../../../contrib/velocity/lib filtered by .*\.jar to classpath: /home/jenkins/workspace/Lucene-Solr-7.x-Linux/solr/build/solr-core/test/J2/temp/solr.update.processor.TimeRoutedAliasUpdateProcessorTest_AE0FE5D612D70283-001/tempDir-001/node1/timeConfig_shard1_replica_n1/../../../../contrib/velocity/lib
   [junit4]   2> 3087926 WARN  (qtp734475869-34504) [n:127.0.0.1:43781_solr c:timeConfig s:shard1 r:core_node2 x:timeConfig_shard1_replica_n1] o.a.s.c.SolrConfig Couldn't add files from /home/jenkins/workspace/Lucene-Solr-7.x-Linux/solr/build/solr-core/test/J2/temp/solr.update.processor.TimeRoutedAliasUpdateProcessorTest_AE0FE5D612D70283-001/tempDir-001/node1/timeConfig_shard1_replica_n1/../../../../dist filtered by solr-velocity-\d.*\.jar to classpath: /home/jenkins/workspace/Lucene-Solr-7.x-Linux/solr/build/solr-core/test/J2/temp/solr.update.processor.TimeRoutedAliasUpdateProcessorTest_AE0FE5D612D70283-001/tempDir-001/node1/timeConfig_shard1_replica_n1/../../../../dist
   [junit4]   2> 3087931 INFO  (qtp734475869-34504) [n:127.0.0.1:43781_solr c:timeConfig s:shard1 r:core_node2 x:timeConfig_shard1_replica_n1] o.a.s.c.SolrConfig Using Lucene MatchVersion: 7.3.0
   [junit4]   2> 3087944 INFO  (qtp734475869-34504) [n:127.0.0.1:43781_solr c:timeConfig s:shard1 r:core_node2 x:timeConfig_shard1_replica_n1] o.a.s.s.IndexSchema [timeConfig_shard1_replica_n1] Schema name=default-config
   [junit4]   2> 3088057 INFO  (qtp734475869-34504) [n:127.0.0.1:43781_solr c:timeConfig s:shard1 r:core_node2 x:timeConfig_shard1_replica_n1] o.a.s.s.IndexSchema Loaded schema default-config/1.6 with uniqueid field id
   [junit4]   2> 3088071 INFO  (qtp734475869-34504) [n:127.0.0.1:43781_solr c:timeConfig s:shard1 r:core_node2 x:timeConfig_shard1_replica_n1] o.a.s.c.CoreContainer Creating SolrCore 'timeConfig_shard1_replica_n1' using configuration from collection timeConfig, trusted=true
   [junit4]   2> 3088071 INFO  (qtp734475869-34504) [n:127.0.0.1:43781_solr c:timeConfig s:shard1 r:core_node2 x:timeConfig_shard1_replica_n1] o.a.s.m.r.SolrJmxReporter JMX monitoring for 'solr_43781.solr.core.timeConfig.shard1.replica_n1' (registry 'solr.core.timeConfig.shard1.replica_n1') enabled at server: com.sun.jmx.mbeanserver.JmxMBeanServer@65d43211
   [junit4]   2> 3088072 INFO  (qtp734475869-34504) [n:127.0.0.1:43781_solr c:timeConfig s:shard1 r:core_node2 x:timeConfig_shard1_replica_n1] o.a.s.c.SolrCore solr.RecoveryStrategy.Builder
   [junit4]   2> 3088072 INFO  (qtp734475869-34504) [n:127.0.0.1:43781_solr c:timeConfig s:shard1 r:core_node2 x:timeConfig_shard1_replica_n1] o.a.s.c.SolrCore [[timeConfig_shard1_replica_n1] ] Opening new SolrCore at [/home/jenkins/workspace/Lucene-Solr-7.x-Linux/solr/build/solr-core/test/J2/temp/solr.update.processor.TimeRoutedAliasUpdateProcessorTest_AE0FE5D612D70283-001/tempDir-001/node1/timeConfig_shard1_replica_n1], dataDir=[/home/jenkins/workspace/Lucene-Solr-7.x-Linux/solr/build/solr-core/test/J2/temp/solr.update.processor.TimeRoutedAliasUpdateProcessorTest_AE0FE5D612D70283-001/tempDir-001/node1/./timeConfig_shard1_replica_n1/data/]
   [junit4]   2> 3088074 INFO  (qtp734475869-34504) [n:127.0.0.1:43781_solr c:timeConfig s:shard1 r:core_node2 x:timeConfig_shard1_replica_n1] o.a.s.r.XSLTResponseWriter xsltCacheLifetimeSeconds=5
   [junit4]   2> 3088101 INFO  (qtp734475869-34504) [n:127.0.0.1:43781_solr c:timeConfig s:shard1 r:core_node2 x:timeConfig_shard1_replica_n1] o.a.s.u.UpdateHandler Using UpdateLog implementation: org.apache.solr.update.UpdateLog
   [junit4]   2> 3088102 INFO  (qtp734475869-34504) [n:127.0.0.1:43781_solr c:timeConfig s:shard1 r:core_node2 x:timeConfig_shard1_replica_n1] o.a.s.u.UpdateLog Initializing UpdateLog: dataDir= defaultSyncLevel=FLUSH numRecordsToKeep=100 maxNumLogsToKeep=10 numVersionBuckets=65536
   [junit4]   2> 3088102 INFO  (qtp734475869-34504) [n:127.0.0.1:43781_solr c:timeConfig s:shard1 r:core_node2 x:timeConfig_shard1_replica_n1] o.a.s.u.CommitTracker Hard AutoCommit: if uncommited for 15000ms; 
   [junit4]   2> 3088102 INFO  (qtp734475869-34504) [n:127.0.0.1:43781_solr c:timeConfig s:shard1 r:core_node2 x:timeConfig_shard1_replica_n1] o.a.s.u.CommitTracker Soft AutoCommit: disabled
   [junit4]   2> 3088103 INFO  (qtp734475869-34504) [n:127.0.0.1:43781_solr c:timeConfig s:shard1 r:core_node2 x:timeConfig_shard1_replica_n1] o.a.s.s.SolrIndexSearcher Opening [Searcher@2ecdbdf8[timeConfig_shard1_replica_n1] main]
   [junit4]   2> 3088104 INFO  (qtp734475869-34504) [n:127.0.0.1:43781_solr c:timeConfig s:shard1 r:core_node2 x:timeConfig_shard1_replica_n1] o.a.s.r.ManagedResourceStorage Configured ZooKeeperStorageIO with znodeBase: /configs/timeConfig
   [junit4]   2> 3088104 INFO  (qtp734475869-34504) [n:127.0.0.1:43781_solr c:timeConfig s:shard1 r:core_node2 x:timeConfig_shard1_replica_n1] o.a.s.r.ManagedResourceStorage Loaded null at path _rest_managed.json using ZooKeeperStorageIO:path=/configs/timeConfig
   [junit4]   2> 3088104 INFO  (qtp734475869-34504) [n:127.0.0.1:43781_solr c:timeConfig s:shard1 r:core_node2 x:timeConfig_shard1_replica_n1] o.a.s.s.ZkIndexSchemaReader Creating ZooKeeper watch for the managed schema at /configs/timeConfig/managed-schema
   [junit4]   2> 3088104 INFO  (qtp734475869-34504) [n:127.0.0.1:43781_solr c:timeConfig s:shard1 r:core_node2 x:timeConfig_shard1_replica_n1] o.a.s.s.ZkIndexSchemaReader Current schema version 0 is already the latest
   [junit4]   2> 3088105 INFO  (qtp734475869-34504) [n:127.0.0.1:43781_solr c:timeConfig s:shard1 r:core_node2 x:timeConfig_shard1_replica_n1] o.a.s.h.c.SpellCheckComponent Initializing spell checkers
   [junit4]   2> 3088105 INFO  (qtp734475869-34504) [n:127.0.0.1:43781_solr c:timeConfig s:shard1 r:core_node2 x:timeConfig_shard1_replica_n1] o.a.s.s.DirectSolrSpellChecker init: {name=default,field=_text_,classname=solr.DirectSolrSpellChecker,distanceMeasure=internal,accuracy=0.5,maxEdits=2,minPrefix=1,maxInspections=5,minQueryLength=4,maxQueryFrequency=0.01}
   [junit4]   2> 3088106 INFO  (qtp734475869-34504) [n:127.0.0.1:43781_solr c:timeConfig s:shard1 r:core_node2 x:timeConfig_shard1_replica_n1] o.a.s.h.ReplicationHandler Commits will be reserved for 10000ms.
   [junit4]   2> 3088106 INFO  (searcherExecutor-12224-thread-1-processing-n:127.0.0.1:43781_solr x:timeConfig_shard1_replica_n1 s:shard1 c:timeConfig r:core_node2) [n:127.0.0.1:43781_solr c:timeConfig s:shard1 r:core_node2 x:timeConfig_shard1_replica_n1] o.a.s.c.QuerySenderListener QuerySenderListener sending requests to Searcher@2ecdbdf8[timeConfig_shard1_replica_n1] main{ExitableDirectoryReader(UninvertingDirectoryReader())}
   [junit4]   2> 3088106 INFO  (qtp734475869-34504) [n:127.0.0.1:43781_solr c:timeConfig s:shard1 r:core_node2 x:timeConfig_shard1_replica_n1] o.a.s.u.UpdateLog Could not find max version in index or recent updates, using new clock 1589333211544027136
   [junit4]   2> 3088106 INFO  (searcherExecutor-12224-thread-1-processing-n:127.0.0.1:43781_solr x:timeConfig_shard1_replica_n1 s:shard1 c:timeConfig r:core_node2) [n:127.0.0.1:43781_solr c:timeConfig s:shard1 r:core_node2 x:timeConfig_shard1_replica_n1] o.a.s.c.QuerySenderListener QuerySenderListener done.
   [junit4]   2> 3088106 INFO  (searcherExecutor-12224-thread-1-processing-n:127.0.0.1:43781_solr x:timeConfig_shard1_replica_n1 s:shard1 c:timeConfig r:core_node2) [n:127.0.0.1:43781_solr c:timeConfig s:shard1 r:core_node2 x:timeConfig_shard1_replica_n1] o.a.s.h.c.SpellCheckComponent Loading spell index for spellchecker: default
   [junit4]   2> 3088107 INFO  (searcherExecutor-12224-thread-1-processing-n:127.0.0.1:43781_solr x:timeConfig_shard1_replica_n1 s:shard1 c:timeConfig r:core_node2) [n:127.0.0.1:43781_solr c:timeConfig s:shard1 r:core_node2 x:timeConfig_shard1_replica_n1] o.a.s.c.SolrCore [timeConfig_shard1_replica_n1] Registered new searcher Searcher@2ecdbdf8[timeConfig_shard1_replica_n1] main{ExitableDirectoryReader(UninvertingDirectoryReader())}
   [junit4]   2> 3088109 INFO  (qtp734475869-34504) [n:127.0.0.1:43781_solr c:timeConfig s:shard1 r:core_node2 x:timeConfig_shard1_replica_n1] o.a.s.c.ShardLeaderElectionContext Enough replicas found to continue.
   [junit4]   2> 3088109 INFO  (qtp734475869-34504) [n:127.0.0.1:43781_solr c:timeConfig s:shard1 r:core_node2 x:timeConfig_shard1_replica_n1] o.a.s.c.ShardLeaderElectionContext I may be the new leader - try and sync
   [junit4]   2> 3088109 INFO  (qtp734475869-34504) [n:127.0.0.1:43781_solr c:timeConfig s:shard1 r:core_node2 x:timeConfig_shard1_replica_n1] o.a.s.c.SyncStrategy Sync replicas to http://127.0.0.1:43781/solr/timeConfig_shard1_replica_n1/
   [junit4]   2> 3088109 INFO  (qtp734475869-34504) [n:127.0.0.1:43781_solr c:timeConfig s:shard1 r:core_node2 x:timeConfig_shard1_replica_n1] o.a.s.c.SyncStrategy Sync Success - now sync replicas to me
   [junit4]   2> 3088109 INFO  (qtp734475869-34504) [n:127.0.0.1:43781_solr c:timeConfig s:shard1 r:core_node2 x:timeConfig_shard1_replica_n1] o.a.s.c.SyncStrategy http://127.0.0.1:43781/solr/timeConfig_shard1_replica_n1/ has no replicas
   [junit4]   2> 3088109 INFO  (qtp734475869-34504) [n:127.0.0.1:43781_solr c:timeConfig s:shard1 r:core_node2 x:timeConfig_shard1_replica_n1] o.a.s.c.ShardLeaderElectionContext Found all replicas participating in election, clear LIR
   [junit4]   2> 3088110 INFO  (qtp734475869-34504) [n:127.0.0.1:43781_solr c:timeConfig s:shard1 r:core_node2 x:timeConfig_shard1_replica_n1] o.a.s.c.ShardLeaderElectionContext I am the new leader: http://127.0.0.1:43781/solr/timeConfig_shard1_replica_n1/ shard1
   [junit4]   2> 3088211 INFO  (zkCallback-8497-thread-2-processing-n:127.0.0.1:43781_solr) [n:127.0.0.1:43781_solr    ] o.a.s.c.c.ZkStateReader A cluster state change: [WatchedEvent state:SyncConnected type:NodeDataChanged path:/collections/timeConfig/state.json] for collection [timeConfig] has occurred - updating... (live nodes size: [2])
   [junit4]   2> 3088211 INFO  (zkCallback-8497-thread-1-processing-n:127.0.0.1:43781_solr) [n:127.0.0.1:43781_solr    ] o.a.s.c.c.ZkStateReader A cluster state change: [WatchedEvent state:SyncConnected type:NodeDataChanged path:/collections/timeConfig/state.json] for collection [timeConfig] has occurred - updating... (live nodes size: [2])
   [junit4]   2> 3088260 INFO  (qtp734475869-34504) [n:127.0.0.1:43781_solr c:timeConfig s:shard1 r:core_node2 x:timeConfig_shard1_replica_n1] o.a.s.c.ZkController I am the leader, no recovery necessary
   [junit4]   2> 3088262 INFO  (qtp734475869-34504) [n:127.0.0.1:43781_solr c:timeConfig s:shard1 r:core_node2 x:timeConfig_shard1_replica_n1] o.a.s.s.HttpSolrCall [admin] webapp=null path=/admin/cores params={qt=/admin/cores&coreNodeName=core_node2&collection.configName=timeConfig&newCollection=true&name=timeConfig_shard1_replica_n1&action=CREATE&numShards=1&collection=timeConfig&shard=shard1&wt=javabin&version=2&replicaType=NRT} status=0 QTime=1344
   [junit4]   2> 3088264 INFO  (qtp2045110732-34509) [n:127.0.0.1:36575_solr    ] o.a.s.h.a.CollectionsHandler Wait for new collection to be active for at most 30 seconds. Check all shard replicas
   [junit4]   2> 3088362 INFO  (zkCallback-8497-thread-1-processing-n:127.0.0.1:43781_solr) [n:127.0.0.1:43781_solr    ] o.a.s.c.c.ZkStateReader A cluster state change: [WatchedEvent state:SyncConnected type:NodeDataChanged path:/collections/timeConfig/state.json] for collection [timeConfig] has occurred - updating... (live nodes size: [2])
   [junit4]   2> 3088362 INFO  (zkCallback-8497-thread-2-processing-n:127.0.0.1:43781_solr) [n:127.0.0.1:43781_solr    ] o.a.s.c.c.ZkStateReader A cluster state change: [WatchedEvent state:SyncConnected type:NodeDataChanged path:/collections/timeConfig/state.json] for collection [timeConfig] has occurred - updating... (live nodes size: [2])
   [junit4]   2> 3088587 INFO  (OverseerCollectionConfigSetProcessor-99333325602553861-127.0.0.1:36575_solr-n_0000000000) [n:127.0.0.1:36575_solr    ] o.a.s.c.OverseerTaskQueue Response ZK path: /overseer/collection-queue-work/qnr-0000000000 doesn't exist.  Requestor may have disconnected from ZooKeeper
   [junit4]   2> 3089264 INFO  (qtp2045110732-34509) [n:127.0.0.1:36575_solr    ] o.a.s.s.HttpSolrCall [admin] webapp=null path=/admin/collections params={pullReplicas=0&replicationFactor=1&name=timeConfig&nrtReplicas=1&action=CREATE&numShards=1&tlogReplicas=0&wt=javabin&version=2} status=0 QTime=2678
   [junit4]   2> 3089265 INFO  (qtp2045110732-34503) [n:127.0.0.1:36575_solr    ] o.a.s.h.a.CollectionsHandler Invoked Collection Action :clusterstatus with params action=CLUSTERSTATUS&wt=javabin&version=2 and sendToOCPQueue=true
   [junit4]   2> 3089266 INFO  (qtp2045110732-34503) [n:127.0.0.1:36575_solr    ] o.a.s.s.HttpSolrCall [admin] webapp=null path=/admin/collections params={action=CLUSTERSTATUS&wt=javabin&version=2} status=0 QTime=0
   [junit4]   2> 3089269 INFO  (qtp734475869-34508) [n:127.0.0.1:43781_solr c:timeConfig s:shard1 r:core_node2 x:timeConfig_shard1_replica_n1] o.a.s.h.SolrConfigHandler Executed config commands successfully and persisted to ZK [{"set-user-property":{"timePartitionAliasName":"myalias"}}, {"set-user-property":{"update.autoCreateFields":false}}, {"add-updateprocessor":{
   [junit4]   2>     "name":"tolerant",
   [junit4]   2>     "class":"solr.TolerantUpdateProcessorFactory"}}, {"add-updateprocessor":{
   [junit4]   2>     "name":"inc",
   [junit4]   2>     "class":"org.apache.solr.update.processor.TimeRoutedAliasUpdateProcessorTest$IncrementURPFactory",
   [junit4]   2>     "fieldName":"integer_i"}}]
   [junit4]   2> 3089269 INFO  (qtp734475869-34508) [n:127.0.0.1:43781_solr c:timeConfig s:shard1 r:core_node2 x:timeConfig_shard1_replica_n1] o.a.s.h.SolrConfigHandler Waiting up to 30 secs for 1 replicas to set the property overlay to be of version 0 for collection timeConfig
   [junit4]   2> 3089269 INFO  (Thread-9719) [n:127.0.0.1:43781_solr    ] o.a.s.c.SolrCore config update listener called for core timeConfig_shard1_replica_n1
   [junit4]   2> 3089269 INFO  (Thread-9719) [n:127.0.0.1:43781_solr    ] o.a.s.c.SolrCore core reload timeConfig_shard1_replica_n1
   [junit4]   2> 3089270 INFO  (solrHandlerExecutor-12229-thread-1-processing-n:127.0.0.1:43781_solr x:timeConfig_shard1_replica_n1 s:shard1 c:timeConfig r:core_node2) [n:127.0.0.1:43781_solr c:timeConfig s:shard1 r:core_node2 x:timeConfig_shard1_replica_n1] o.a.s.h.SolrConfigHandler Time elapsed : 0 secs, maxWait 30
   [junit4]   2> 3089274 INFO  (Thread-9719) [n:127.0.0.1:43781_solr    ] o.a.s.c.RequestParams conf resource params.json loaded . version : 0 
   [junit4]   2> 3089274 INFO  (Thread-9719) [n:127.0.0.1:43781_solr    ] o.a.s.c.RequestParams request params refreshed to version 0
   [junit4]   2> 3089275 WARN  (Thread-9719) [n:127.0.0.1:43781_solr    ] o.a.s.c.SolrConfig Couldn't add files from /home/jenkins/workspace/Lucene-Solr-7.x-Linux/solr/build/solr-core/test/J2/temp/solr.update.processor.TimeRoutedAliasUpdateProcessorTest_AE0FE5D612D70283-001/tempDir-001/node1/timeConfig_shard1_replica_n1/../../../../contrib/extraction/lib filtered by .*\.jar to classpath: /home/jenkins/workspace/Lucene-Solr-7.x-Linux/solr/build/solr-core/test/J2/temp/solr.update.processor.TimeRoutedAliasUpdateProcessorTest_AE0FE5D612D70283-001/tempDir-001/node1/timeConfig_shard1_replica_n1/../../../../contrib/extraction/lib
   [junit4]   2> 3089275 WARN  (Thread-9719) [n:127.0.0.1:43781_solr    ] o.a.s.c.SolrConfig Couldn't add files from /home/jenkins/workspace/Lucene-Solr-7.x-Linux/solr/build/solr-core/test/J2/temp/solr.update.processor.TimeRoutedAliasUpdateProcessorTest_AE0FE5D612D70283-001/tempDir-001/node1/timeConfig_shard1_replica_n1/../../../../dist filtered by solr-cell-\d.*\.jar to classpath: /home/jenkins/workspace/Lucene-Solr-7.x-Linux/solr/build/solr-core/test/J2/temp/solr.update.processor.TimeRoutedAliasUpdateProcessorTest_AE0FE5D612D70283-001/tempDir-001/node1/timeConfig_shard1_replica_n1/../../../../dist
   [junit4]   2> 3089275 WARN  (Thread-9719) [n:127.0.0.1:43781_solr    ] o.a.s.c.SolrConfig Couldn't add files from /home/jenkins/workspace/Lucene-Solr-7.x-Linux/solr/build/solr-core/test/J2/temp/solr.update.processor.TimeRoutedAliasUpdateProcessorTest_AE0FE5D612D70283-001/tempDir-001/node1/timeConfig_shard1_replica_n1/../../../../contrib/clustering/lib filtered by .*\.jar to classpath: /home/jenkins/workspace/Lucene-Solr-7.x-Linux/solr/build/solr-core/test/J2/temp/solr.update.processor.TimeRoutedAliasUpdateProcessorTest_AE0FE5D612D70283-001/tempDir-001/node1/timeConfig_shard1_replica_n1/../../../../contrib/clustering/lib
   [junit4]   2> 3089275 WARN  (Thread-9719) [n:127.0.0.1:43781_solr    ] o.a.s.c.SolrConfig Couldn't add files from /home/jenkins/workspace/Lucene-Solr-7.x-Linux/solr/build/solr-core/test/J2/temp/solr.update.processor.TimeRoutedAliasUpdateProcessorTest_AE0FE5D612D70283-001/tempDir-001/node1/timeConfig_shard1_replica_n1/../../../../dist filtered by solr-clustering-\d.*\.jar to classpath: /home/jenkins/workspace/Lucene-Solr-7.x-Linux/solr/build/solr-core/test/J2/temp/solr.update.processor.TimeRoutedAliasUpdateProcessorTest_AE0FE5D612D70283-001/tempDir-001/node1/timeConfig_shard1_replica_n1/../../../../dist
   [junit4]   2> 3089275 WARN  (Thread-9719) [n:127.0.0.1:43781_solr    ] o.a.s.c.SolrConfig Couldn't add files from /home/jenkins/workspace/Lucene-Solr-7.x-Linux/solr/build/solr-core/test/J2/temp/solr.update.processor.TimeRoutedAliasUpdateProcessorTest_AE0FE5D612D70283-001/tempDir-001/node1/timeConfig_shard1_replica_n1/../../../../contrib/langid/lib filtered by .*\.jar to classpath: /home/jenkins/workspace/Lucene-Solr-7.x-Linux/solr/build/solr-core/test/J2/temp/solr.update.processor.TimeRoutedAliasUpdateProcessorTest_AE0FE5D612D70283-001/tempDir-001/node1/timeConfig_shard1_replica_n1/../../../../contrib/langid/lib
   [junit4]   2> 3089276 WARN  (Thread-9719) [n:127.0.0.1:43781_solr    ] o.a.s.c.SolrConfig Couldn't add files from /home/jenkins/workspace/Lucene-Solr-7.x-Linux/solr/build/solr-core/test/J2/temp/solr.update.processor.TimeRoutedAliasUpdateProcessorTest_AE0FE5D612D70283-001/tempDir-001/node1/timeConfig_shard1_replica_n1/../../../../dist filtered by solr-langid-\d.*\.jar to classpath: /home/jenkins/workspace/Lucene-Solr-7.x-Linux/solr/build/solr-core/test/J2/temp/solr.update.processor.TimeRoutedAliasUpdateProcessorTest_AE0FE5D612D70283-001/tempDir-001/node1/timeConfig_shard1_replica_n1/../../../../dist
   [junit4]   2> 3089276 WARN  (Thread-9719) [n:127.0.0.1:43781_solr    ] o.a.s.c.SolrConfig Couldn't add files from /home/jenkins/workspace/Lucene-Solr-7.x-Linux/solr/build/solr-core/test/J2/temp/solr.update.processor.TimeRoutedAliasUpdateProcessorTest_AE0FE5D612D70283-001/tempDir-001/node1/timeConfig_shard1_replica_n1/../../../../contrib/velocity/lib filtered by .*\.jar to classpath: /home/jenkins/workspace/Lucene-Solr-7.x-Linux/solr/build/solr-core/test/J2/temp/solr.update.processor.TimeRoutedAliasUpdateProcessorTest_AE0FE5D612D70283-001/tempDir-001/node1/timeConfig_shard1_replica_n1/../../../../contrib/velocity/lib
   [junit4]   2> 3089276 WARN  (Thread-9719) [n:127.0.0.1:43781_solr    ] o.a.s.c.SolrConfig Couldn't add files from /home/jenkins/workspace/Lucene-Solr-7.x-Linux/solr/build/solr-core/test/J2/temp/solr.update.processor.TimeRoutedAliasUpdateProcessorTest_AE0FE5D612D70283-001/tempDir-001/node1/timeConfig_shard1_replica_n1/../../../../dist filtered by solr-velocity-\d.*\.jar to classpath: /home/jenkins/workspace/Lucene-Solr-7.x-Linux/solr/build/solr-core/test/J2/temp/solr.update.processor.TimeRoutedAliasUpdateProcessorTest_AE0FE5D612D70283-001/tempDir-001/node1/timeConfig_shard1_replica_n1/../../../../dist
   [junit4]   2> 3089281 INFO  (Thread-9719) [n:127.0.0.1:43781_solr    ] o.a.s.c.SolrConfig Using Lucene MatchVersion: 7.3.0
   [junit4]   2> 3089296 INFO  (Thread-9719) [n:127.0.0.1:43781_solr    ] o.a.s.s.IndexSchema [timeConfig_shard1_replica_n1] Schema name=default-config
   [junit4]   2> 3089371 INFO  (qtp734475869-34504) [n:127.0.0.1:43781_solr c:timeConfig s:shard1 r:core_node2 x:timeConfig_shard1_replica_n1] o.a.s.h.SolrConfigHandler expecting overlay version 0 but my version is -1
   [junit4]   2> 3089371 INFO  (qtp734475869-34504) [n:127.0.0.1:43781_solr c:timeConfig s:shard1 r:core_node2 x:timeConfig_shard1_replica_n1] o.a.s.c.S.Request [timeConfig_shard1_replica_n1]  webapp=/solr path=/config/znodeVersion params={overlay=0&wt=javabin&version=2} status=0 QTime=0
   [junit4]   2> 3089371 INFO  (SolrConfigHandler-refreshconf) [n:127.0.0.1:43781_solr c:timeConfig s:shard1 r:core_node2 x:timeConfig_shard1_replica_n1] o.a.s.h.SolrConfigHandler Another reload is in progress . Not doing anything
   [junit4]   2> 3089371 INFO  (solrHandlerExecutor-12229-thread-1-processing-n:127.0.0.1:43781_solr x:timeConfig_shard1_replica_n1 s:shard1 c:timeConfig r:core_node2) [n:127.0.0.1:43781_solr c:timeConfig s:shard1 r:core_node2 x:timeConfig_shard1_replica_n1] o.a.s.h.SolrConfigHandler Could not get expectedVersion 0 from http://127.0.0.1:43781/solr/timeConfig_shard1_replica_n1/ for prop overlay   after 1 attempts
   [junit4]   2> 3089371 INFO  (solrHandlerExecutor-12229-thread-1-processing-n:127.0.0.1:43781_solr x:timeConfig_shard1_replica_n1 s:shard1 c:timeConfig r:core_node2) [n:127.0.0.1:43781_solr c:timeConfig s:shard1 r:core_node2 x:timeConfig_shard1_replica_n1] o.a.s.h.SolrConfigHandler Time elapsed : 0 secs, maxWait 30
   [junit4]   2> 3089438 INFO  (Thread-9719) [n:127.0.0.1:43781_solr    ] o.a.s.s.IndexSchema Loaded schema default-config/1.6 with uniqueid field id
   [junit4]   2> 3089449 INFO  (Thread-9719) [n:127.0.0.1:43781_solr    ] o.a.s.c.CoreContainer Reloading SolrCore 'timeConfig_shard1_replica_n1' using configuration from collection timeConfig
   [junit4]   2> 3089466 INFO  (Thread-9719) [n:127.0.0.1:43781_solr c:timeConfig s:shard1 r:core_node2 x:timeConfig_shard1_replica_n1] o.a.s.m.r.SolrJmxReporter JMX monitoring for 'solr_43781.solr.core.timeConfig.shard1.replica_n1' (registry 'solr.core.timeConfig.shard1.replica_n1') enabled at server: com.sun.jmx.mbeanserver.JmxMBeanServer@65d43211
   [junit4]   2> 3089466 INFO  (Thread-9719) [n:127.0.0.1:43781_solr c:timeConfig s:shard1 r:core_node2 x:timeConfig_shard1_replica_n1] o.a.s.c.SolrCore [[timeConfig_shard1_replica_n1] ] Opening new SolrCore at [/home/jenkins/workspace/Lucene-Solr-7.x-Linux/solr/build/solr-core/test/J2/temp/solr.update.processor.TimeRoutedAliasUpdateProcessorTest_AE0FE5D612D70283-001/tempDir-001/node1/timeConfig_shard1_replica_n1], dataDir=[/home/jenkins/workspace/Lucene-Solr-7.x-Linux/solr/build/solr-core/test/J2/temp/solr.update.processor.TimeRoutedAliasUpdateProcessorTest_AE0FE5D612D70283-001/tempDir-001/node1/./timeConfig_shard1_replica_n1/data/]
   [junit4]   2> 3089468 INFO  (Thread-9719) [n:127.0.0.1:43781_solr c:timeConfig s:shard1 r:core_node2 x:timeConfig_shard1_replica_n1] o.a.s.r.XSLTResponseWriter xsltCacheLifetimeSeconds=5
   [junit4]   2> 3089472 INFO  (qtp734475869-34497) [n:127.0.0.1:43781_solr c:timeConfig s:shard1 r:core_node2 x:timeConfig_shard1_replica_n1] o.a.s.h.SolrConfigHandler expecting overlay version 0 but my version is -1
   [junit4]   2> 3089472 INFO  (qtp734475869-34497) [n:127.0.0.1:43781_solr c:timeConfig s:shard1 r:core_node2 x:timeConfig_shard1_replica_n1] o.a.s.c.S.Request [timeConfig_shard1_replica_n1]  webapp=/solr path=/config/znodeVersion params={overlay=0&wt=javabin&version=2} status=0 QTime=0
   [junit4]   2> 3089472 INFO  (SolrConfigHandler-refreshconf) [n:127.0.0.1:43781_solr c:timeConfig s:shard1 r:core_node2 x:timeConfig_shard1_replica_n1] o.a.s.h.SolrConfigHandler Another reload is in progress . Not doing anything
   [junit4]   2> 3089472 INFO  (solrHandlerExecutor-12229-thread-1-processing-n:127.0.0.1:43781_solr x:timeConfig_shard1_replica_n1 s:shard1 c:timeConfig r:core_node2) [n:127.0.0.1:43781_solr c:timeConfig s:shard1 r:core_node2 x:timeConfig_shard1_replica_n1] o.a.s.h.SolrConfigHandler Could not get expectedVersion 0 from http://127.0.0.1:43781/solr/timeConfig_shard1_replica_n1/ for prop overlay   after 2 attempts
   [junit4]   2> 3089473 INFO  (solrHandlerExecutor-12229-thread-1-processing-n:127.0.0.1:43781_solr x:timeConfig_shard1_replica_n1 s:shard1 c:timeConfig r:core_node2) [n:127.0.0.1:43781_solr c:timeConfig s:shard1 r:core_node2 x:timeConfig_shard1_replica_n1] o.a.s.h.SolrConfigHandler Time elapsed : 0 secs, maxWait 30
   [junit4]   2> 3089490 INFO  (Thread-9719) [n:127.0.0.1:43781_solr c:timeConfig s:shard1 r:core_node2 x:timeConfig_shard1_replica_n1] o.a.s.u.CommitTracker Hard AutoCommit: if uncommited for 15000ms; 
   [junit4]   2> 3089490 INFO  (Thread-9719) [n:127.0.0.1:43781_solr c:timeConfig s:shard1 r:core_node2 x:timeConfig_shard1_replica_n1] o.a.s.u.CommitTracker Soft AutoCommit: disabled
   [junit4]   2> 3089492 INFO  (Thread-9719) [n:127.0.0.1:43781_solr c:timeConfig s:shard1 r:core_node2 x:timeConfig_shard1_replica_n1] o.a.s.s.SolrIndexSearcher Opening [Searcher@134c54fb[timeConfig_shard1_replica_n1] main]
   [junit4]   2> 3089492 INFO  (Thread-9719) [n:127.0.0.1:43781_solr c:timeConfig s:shard1 r:core_node2 x:timeConfig_shard1_replica_n1] o.a.s.r.ManagedResourceStorage Configured ZooKeeperStorageIO with znodeBase: /configs/timeConfig
   [junit4]   2> 3089493 INFO  (Thread-9719) [n:127.0.0.1:43781_solr c:timeConfig s:shard1 r:core_node2 x:timeConfig_shard1_replica_n1] o.a.s.r.ManagedResourceStorage Loaded null at path _rest_managed.json using ZooKeeperStorageIO:path=/configs/timeConfig
   [junit4]   2> 3089493 INFO  (Thread-9719) [n:127.0.0.1:43781_solr c:timeConfig s:shard1 r:core_node2 x:timeConfig_shard1_replica_n1] o.a.s.s.ZkIndexSchemaReader Creating ZooKeeper watch for the managed schema at /configs/timeConfig/managed-schema
   [junit4]   2> 3089493 INFO  (Thread-9719) [n:127.0.0.1:43781_solr c:timeConfig s:shard1 r:core_node2 x:timeConfig_shard1_replica_n1] o.a.s.s.ZkIndexSchemaReader Current schema version 0 is already the latest
   [junit4]   2> 3089493 INFO  (Thread-9719) [n:127.0.0.1:43781_solr c:timeConfig s:shard1 r:core_node2 x:timeConfig_shard1_replica_n1] o.a.s.h.c.SpellCheckComponent Initializing spell checkers
   [junit4]   2> 3089493 INFO  (Thread-9719) [n:127.0.0.1:43781_solr c:timeConfig s:shard1 r:core_node2 x:timeConfig_shard1_replica_n1] o.a.s.s.DirectSolrSpellChecker init: {name=default,field=_text_,classname=solr.DirectSolrSpellChecker,distanceMeasure=internal,accuracy=0.5,maxEdits=2,minPrefix=1,maxInspections=5,minQueryLength=4,maxQueryFrequency=0.01}
   [junit4]   2> 3089495 INFO  (Thread-9719) [n:127.0.0.1:43781_solr c:timeConfig s:shard1 r:core_node2 x:timeConfig_shard1_replica_n1] o.a.s.h.ReplicationHandler Commits will be reserved for 10000ms.
   [junit4]   2> 3089495 INFO  (searcherExecutor-12230-thread-1-processing-n:127.0.0.1:43781_solr x:timeConfig_shard1_replica_n1 s:shard1 c:timeConfig r:core_node2) [n:127.0.0.1:43781_solr c:timeConfig s:shard1 r:core_node2 x:timeConfig_shard1_replica_n1] o.a.s.c.QuerySenderListener QuerySenderListener sending requests to Searcher@134c54fb[timeConfig_shard1_replica_n1] main{ExitableDirectoryReader(UninvertingDirectoryReader())}
   [junit4]   2> 3089495 INFO  (Thread-9719) [n:127.0.0.1:43781_solr c:timeConfig s:shard1 r:core_node2 x:timeConfig_shard1_replica_n1] o.a.s.u.UpdateLog Could not find max version in index or recent updates, using new clock 1589333213000499200
   [junit4]   2> 3089495 INFO  (searcherExecutor-12230-thread-1-processing-n:127.0.0.1:43781_solr x:timeConfig_shard1_replica_n1 s:shard1 c:timeConfig r:core_node2) [n:127.0.0.1:43781_solr c:timeConfig s:shard1 r:core_node2 x:timeConfig_shard1_replica_n1] o.a.s.c.QuerySenderListener QuerySenderListener done.
   [junit4]   2> 3089495 INFO  (searcherExecutor-12230-thread-1-processing-n:127.0.0.1:43781_solr x:timeConfig_shard1_replica_n1 s:shard1 c:timeConfig r:core_node2) [n:127.0.0.1:43781_solr c:timeConfig s:shard1 r:core_node2 x:timeConfig_shard1_replica_n1] o.a.s.h.c.SpellCheckComponent Loading spell index for spellchecker: default
   [junit4]   2> 3089497 INFO  (Thread-9719) [n:127.0.0.1:43781_solr c:timeConfig s:shard1 r:core_node2 x:timeConfig_shard1_replica_n1] o.a.s.u.DefaultSolrCoreState New IndexWriter is ready to be used.
   [junit4]   2> 3089498 INFO  (searcherExecutor-12230-thread-1-processing-n:127.0.0.1:43781_solr x:timeConfig_shard1_replica_n1 s:shard1 c:timeConfig r:core_node2) [n:127.0.0.1:43781_solr c:timeConfig s:shard1 r:core_node2 x:timeConfig_shard1_replica_n1] o.a.s.c.SolrCore [timeConfig_shard1_replica_n1] Registered new searcher Searcher@134c54fb[timeConfig_shard1_replica_n1] main{ExitableDirectoryReader(UninvertingDirectoryReader())}
   [junit4]   2> 3089498 INFO  (Thread-9719) [n:127.0.0.1:43781_solr c:timeConfig s:shard1 r:core_node2 x:timeConfig_shard1_replica_n1] o.a.s.s.SolrIndexSearcher Opening [Searcher@23710a74[timeConfig_shard1_replica_n1] main]
   [junit4]   2> 3089498 INFO  (searcherExecutor-12230-thread-1-processing-n:127.0.0.1:43781_solr x:timeConfig_shard1_replica_n1 s:shard1 c:timeConfig r:core_node2) [n:127.0.0.1:43781_solr c:timeConfig s:shard1 r:core_node2 x:timeConfig_shard1_replica_n1] o.a.s.c.QuerySenderListener QuerySenderListener sending requests to Searcher@23710a74[timeConfig_shard1_replica_n1] main{ExitableDirectoryReader(UninvertingDirectoryReader())}
   [junit4]   2> 3089498 INFO  (searcherExecutor-12230-thread-1-processing-n:127.0.0.1:43781_solr x:timeConfig_shard1_replica_n1 s:shard1 c:timeConfig r:core_node2) [n:127.0.0.1:43781_solr c:timeConfig s:shard1 r:core_node2 x:timeConfig_shard1_replica_n1] o.a.s.c.QuerySenderListener QuerySenderListener done.
   [junit4]   2> 3089500 INFO  (searcherExecutor-12230-thread-1-processing-n:127.0.0.1:43781_solr x:timeConfig_shard1_replica_n1 s:shard1 c:timeConfig r:core_node2) [n:127.0.0.1:43781_solr c:timeConfig s:shard1 r:core_node2 x:timeConfig_shard1_replica_n1] o.a.s.c.SolrCore [timeConfig_shard1_replica_n1] Registered new searcher Searcher@23710a74[timeConfig_shard1_replica_n1] main{ExitableDirectoryReader(UninvertingDirectoryReader())}
   [junit4]   2> 3089573 INFO  (qtp734475869-34499) [n:127.0.0.1:43781_solr c:timeConfig s:shard1 r:core_node2 x:timeConfig_shard1_replica_n1] o.a.s.h.SolrConfigHandler I already have the expected version 0 of config
   [junit4]   2> 3089573 INFO  (qtp734475869-34499) [n:127.0.0.1:43781_solr c:timeConfig s:shard1 r:core_node2 x:timeConfig_shard1_replica_n1] o.a.s.h.SolrConfigHandler isStale false , resourceloader org.apache.solr.cloud.ZkSolrResourceLoader
   [junit4]   2> 3089573 INFO  (qtp734475869-34499) [n:127.0.0.1:43781_solr c:timeConfig s:shard1 r:core_node2 x:timeConfig_shard1_replica_n1] o.a.s.c.S.Request [timeConfig_shard1_replica_n1]  webapp=/solr path=/config/znodeVersion params={overlay=0&wt=javabin&version=2} status=0 QTime=0
   [junit4]   2> 3089574 INFO  (qtp734475869-34508) [n:127.0.0.1:43781_solr c:timeConfig s:shard1 r:core_node2 x:timeConfig_shard1_replica_n1] o.a.s.h.SolrConfigHandler Took 304.0ms to set the property overlay to be of version 0 for collection timeConfig
   [junit4]   2> 3089574 INFO  (qtp734475869-34508) [n:127.0.0.1:43781_solr c:timeConfig s:shard1 r:core_node2 x:timeConfig_shard1_replica_n1] o.a.s.c.S.Request [timeConfig_shard1_replica_n1]  webapp=/solr path=/config params={wt=javabin&version=2} status=0 QTime=306
   [junit4]   2> 3089574 INFO  (qtp734475869-34508) [n:127.0.0.1:43781_solr c:timeConfig s:shard1 r:core_node2 x:timeConfig_shard1_replica_n1] o.a.s.c.SolrCore [timeConfig_shard1_replica_n1]  CLOSING SolrCore org.apache.solr.core.SolrCore@465c709a
   [junit4]   2> 3089574 INFO  (qtp734475869-34508) [n:127.0.0.1:43781_solr c:timeConfig s:shard1 r:core_node2 x:timeConfig_shard1_replica_n1] o.a.s.m.SolrMetricManager Closing metric reporters for registry=solr.core.timeConfig.shard1.replica_n1, tag=1180463258
   [junit4]   2> 3089574 INFO  (qtp734475869-34508) [n:127.0.0.1:43781_solr c:timeConfig s:shard1 r:core_node2 x:timeConfig_shard1_replica_n1] o.a.s.m.r.SolrJmxReporter Closing reporter [org.apache.solr.metrics.reporters.SolrJmxReporter@469b2137: rootName = solr_43781, domain = solr.core.timeConfig.shard1.replica_n1, service url = null, agent id = null] for registry solr.core.timeConfig.shard1.replica_n1 / com.codahale.metrics.MetricRegistry@55f592b2
   [junit4]   2> 3089582 INFO  (qtp734475869-34508) [n:127.0.0.1:43781_solr c:timeConfig s:shard1 r:core_node2 x:timeConfig_shard1_replica_n1] o.a.s.m.SolrMetricManager Closing metric reporters for registry=solr.collection.timeConfig.shard1.leader, tag=1180463258
   [junit4]   2> 3089583 INFO  (qtp2045110732-34511) [n:127.0.0.1:36575_solr    ] o.a.s.h.a.CollectionsHandler Invoked Collection Action :clusterstatus with params action=CLUSTERSTATUS&wt=javabin&version=2 and sendToOCPQueue=true
   [junit4]   2> 3089584 INFO  (qtp2045110732-34511) [n:127.0.0.1:36575_solr    ] o.a.s.s.HttpSolrCall [admin] webapp=null path=/admin/collections params={action=CLUSTERSTATUS&wt=javabin&version=2} status=0 QTime=0
   [junit4]   2> 3089585 INFO  (qtp734475869-34496) [n:127.0.0.1:43781_solr c:timeConfig s:shard1 r:core_node2 x:timeConfig_shard1_replica_n1] o.a.s.c.ZkController Persisted config data to node /configs/timeConfig/params.json 
   [junit4]   2> 3089585 INFO  (qtp734475869-34496) [n:127.0.0.1:43781_solr c:timeConfig s:shard1 r:core_node2 x:timeConfig_shard1_replica_n1] o.a.s.h.SolrConfigHandler Waiting up to 30 secs for 1 replicas to set the property params to be of version 1 for collection timeConfig
   [junit4]   2> 3089586 INFO  (Thread-9720) [n:127.0.0.1:43781_solr    ] o.a.s.c.SolrCore config update listener called for core timeConfig_shard1_replica_n1
   [junit4]   2> 3089586 INFO  (Thread-9720) [n:127.0.0.1:43781_solr    ] o.a.s.c.RequestParams conf resource params.json loaded . version : 1 
   [junit4]   2> 3089586 INFO  (Thread-9720) [n:127.0.0.1:43781_solr    ] o.a.s.c.RequestParams request params refreshed to version 1
   [junit4]   2> 3089586 INFO  (solrHandlerExecutor-12234-thread-1-processing-n:127.0.0.1:43781_solr x:timeConfig_shard1_replica_n1 s:shard1 c:timeConfig r:core_node2) [n:127.0.0.1:43781_solr c:timeConfig s:shard1 r:core_node2 x:timeConfig_shard1_replica_n1] o.a.s.h.SolrConfigHandler Time elapsed : 0 secs, maxWait 30
   [junit4]   2> 3089687 INFO  (qtp734475869-34497) [n:127.0.0.1:43781_solr c:timeConfig s:shard1 r:core_node2 x:timeConfig_shard1_replica_n1] o.a.s.h.SolrConfigHandler I already have the expected version 1 of params
   [junit4]   2> 3089687 INFO  (qtp734475869-34497) [n:127.0.0.1:43781_solr c:timeConfig s:shard1 r:core_node2 x:timeConfig_shard1_replica_n1] o.a.s.h.SolrConfigHandler isStale false , resourceloader org.apache.solr.cloud.ZkSolrResourceLoader
   [junit4]   2> 3089687 INFO  (qtp734475869-34497) [n:127.0.0.1:43781_solr c:timeConfig s:shard1 r:core_node2 x:timeConfig_shard1_replica_n1] o.a.s.c.S.Request [timeConfig_shard1_replica_n1]  webapp=/solr path=/config/znodeVersion params={params=1&wt=javabin&version=2} status=0 QTime=0
   [junit4]   2> 3089688 INFO  (qtp734475869-34496) [n:127.0.0.1:43781_solr c:timeConfig s:shard1 r:core_node2 x:timeConfig_shard1_replica_n1] o.a.s.h.SolrConfigHandler Took 102.0ms to set the property params to be of version 1 for collection timeConfig
   [junit4]   2> 3089688 INFO  (qtp734475869-34496) [n:127.0.0.1:43781_solr c:timeConfig s:shard1 r:core_node2 x:timeConfig_shard1_replica_n1] o.a.s.c.S.Request [timeConfig_shard1_replica_n1]  webapp=/solr path=/config/params params={wt=javabin&version=2} status=0 QTime=102
   [junit4]   2> 3089688 INFO  (qtp2045110732-34509) [n:127.0.0.1:36575_solr    ] o.a.s.h.a.CollectionsHandler Invoked Collection Action :clusterstatus with params action=CLUSTERSTATUS&wt=javabin&version=2 and sendToOCPQueue=true
   [junit4]   2> 3089689 INFO  (qtp2045110732-34509) [n:127.0.0.1:36575_solr    ] o.a.s.s.HttpSolrCall [admin] webapp=null path=/admin/collections params={action=CLUSTERSTATUS&wt=javabin&version=2} status=0 QTime=0
   [junit4]   2> 3089689 INFO  (qtp2045110732-34501) [n:127.0.0.1:36575_solr    ] o.a.s.h.a.CollectionsHandler Invoked Collection Action :clusterstatus with params action=CLUSTERSTATUS&wt=javabin&version=2 and sendToOCPQueue=true
   [junit4]   2> 3089689 INFO  (qtp2045110732-34501) [n:127.0.0.1:36575_solr    ] o.a.s.s.HttpSolrCall [admin] webapp=null path=/admin/collections params={action=CLUSTERSTATUS&wt=javabin&version=2} status=0 QTime=0
   [junit4]   2> 3089690 INFO  (qtp2045110732-34503) [n:127.0.0.1:36575_solr    ] o.a.s.h.a.CollectionsHandler Invoked Collection Action :delete with params name=timeConfig&action=DELETE&wt=javabin&version=2 and sendToOCPQueue=true
   [junit4]   2> 3089691 INFO  (OverseerThreadFactory-12219-thread-2-processing-n:127.0.0.1:36575_solr) [n:127.0.0.1:36575_solr    ] o.a.s.c.OverseerCollectionMessageHandler Executing Collection Cmd : action=UNLOAD&deleteInstanceDir=true&deleteDataDir=true
   [junit4]   2> 3089691 INFO  (qtp734475869-34506) [n:127.0.0.1:43781_solr    ] o.a.s.m.SolrMetricManager Closing metric reporters for registry=solr.core.timeConfig.shard1.replica_n1, tag=null
   [junit4]   2> 3089691 INFO  (qtp734475869-34506) [n:127.0.0.1:43781_solr    ] o.a.s.m.r.SolrJmxReporter Closing reporter [org.apache.solr.metrics.reporters.SolrJmxReporter@20907b7e: rootName = solr_43781, domain = solr.core.timeConfig.shard1.replica_n1, service url = null, agent id = null] for registry solr.core.timeConfig.shard1.replica_n1 / com.codahale.metrics.MetricRegistry@55f592b2
   [junit4]   2> 3089699 INFO  (qtp734475869-34506) [n:127.0.0.1:43781_solr    ] o.a.s.c.SolrCore [timeConfig_shard1_replica_n1]  CLOSING SolrCore org.apache.solr.core.SolrCore@560523ba
   [junit4]   2> 3089699 INFO  (qtp734475869-34506) [n:127.0.0.1:43781_solr    ] o.a.s.m.SolrMetricManager Closing metric reporters for registry=solr.core.timeConfig.shard1.replica_n1, tag=1443177402
   [junit4]   2> 3089699 INFO  (qtp734475869-34506) [n:127.0.0.1:43781_solr    ] o.a.s.m.SolrMetricManager Closing metric reporters for registry=solr.collection.timeConfig.shard1.leader, tag=1443177402
   [junit4]   2> 3089701 INFO  (qtp734475869-34506) [n:127.0.0.1:43781_solr    ] o.a.s.s.HttpSolrCall [admin] webapp=null path=/admin/cores params={deleteInstanceDir=true&core=timeConfig_shard1_replica_n1&qt=/admin/cores&deleteDataDir=true&action=UNLOAD&wt=javabin&version=2} status=0 QTime=10
   [junit4]   2> 3090404 INFO  (qtp2045110732-34503) [n:127.0.0.1:36575_solr    ] o.a.s.s.HttpSolrCall [admin] webapp=null path=/admin/collections params={name=timeConfig&action=DELETE&wt=javabin&version=2} status=0 QTime=713
   [junit4]   2> 3090404 INFO  (qtp2045110732-34511) [n:127.0.0.1:36575_solr    ] o.a.s.h.a.CollectionsHandler Invoked Collection Action :clusterstatus with params action=CLUSTERSTATUS&wt=javabin&version=2 and sendToOCPQueue=true
   [junit4]   2> 3090405 INFO  (qtp2045110732-34511) [n:127.0.0.1:36575_solr    ] o.a.s.s.HttpSolrCall [admin] webapp=null path=/admin/collections params={action=CLUSTERSTATUS&wt=javabin&version=2} status=0 QTime=0
   [junit4]   2> 3090405 INFO  (qtp2045110732-34509) [n:127.0.0.1:36575_solr    ] o.a.s.h.a.CollectionsHandler Invoked Collection Action :clusterstatus with params action=CLUSTERSTATUS&wt=javabin&version=2 and sendToOCPQueue=true
   [junit4]   2> 3090405 INFO  (qtp2045110732-34509) [n:127.0.0.1:36575_solr    ] o.a.s.s.HttpSolrCall [admin] webapp=null path=/admin/collections params={action=CLUSTERSTATUS&wt=javabin&version=2} status=0 QTime=0
   [junit4]   2> 3090405 INFO  (qtp2045110732-34510) [n:127.0.0.1:36575_solr    ] o.a.s.h.a.CollectionsHandler Invoked Collection Action :create with params replicationFactor=2&property.timePartitionAliasName=myalias&collection.configName=timeConfig&maxShardsPerNode=2&name=myalias_2017-10-23&nrtReplicas=2&action=CREATE&numShards=2&wt=javabin&version=2 and sendToOCPQueue=true
   [junit4]   2> 3090407 INFO  (OverseerThreadFactory-12219-thread-3-processing-n:127.0.0.1:36575_solr) [n:127.0.0.1:36575_solr    ] o.a.s.c.CreateCollectionCmd Create collection myalias_2017-10-23
   [junit4]   2> 3090407 INFO  (OverseerCollectionConfigSetProcessor-99333325602553861-127.0.0.1:36575_solr-n_0000000000) [n:127.0.0.1:36575_solr    ] o.a.s.c.OverseerTaskQueue Response ZK path: /overseer/collection-queue-work/qnr-0000000002 doesn't exist.  Requestor may have disconnected from ZooKeeper
   [junit4]   2> 3090610 INFO  (OverseerStateUpdate-99333325602553861-127.0.0.1:36575_solr-n_0000000000) [n:127.0.0.1:36575_solr    ] o.a.s.c.o.SliceMutator createReplica() {
   [junit4]   2>   "operation":"ADDREPLICA",
   [junit4]   2>   "collection":"myalias_2017-10-23",
   [junit4]   2>   "shard":"shard1",
   [junit4]   2>   "core":"myalias_2017-10-23_shard1_replica_n1",
   [junit4]   2>   "state":"down",
   [junit4]   2>   "base_url":"http://127.0.0.1:36575/solr",
   [junit4]   2>   "type":"NRT",
   [junit4]   2>   "waitForFinalState":"false"} 
   [junit4]   2> 3090611 INFO  (OverseerStateUpdate-99333325602553861-127.0.0.1:36575_solr-n_0000000000) [n:127.0.0.1:36575_solr    ] o.a.s.c.o.SliceMutator createReplica() {
   [junit4]   2>   "operation":"ADDREPLICA",
   [junit4]   2>   "collection":"myalias_2017-10-23",
   [junit4]   2>   "shard":"shard1",
   [junit4]   2>   "core":"myalias_2017-10-23_shard1_replica_n2",
   [junit4]   2>   "state":"down",
   [junit4]   2>   "base_url":"http://127.0.0.1:43781/solr",
   [junit4]   2>   "type":"NRT",
   [junit4]   2>   "waitForFinalState":"false"} 
   [junit4]   2> 3090612 INFO  (OverseerStateUpdate-99333325602553861-127.0.0.1:36575_solr-n_0000000000) [n:127.0.0.1:36575_solr    ] o.a.s.c.o.SliceMutator createReplica() {
   [junit4]   2>   "operation":"ADDREPLICA",
   [junit4]   2>   "collection":"myalias_2017-10-23",
   [junit4]   2>   "shard":"shard2",
   [junit4]   2>   "core":"myalias_2017-10-23_shard2_replica_n4",
   [junit4]   2>   "state":"down",
   [junit4]   2>   "base_url":"http://127.0.0.1:36575/solr",
   [junit4]   2>   "type":"NRT",
   [junit4]   2>   "waitForFinalState":"false"} 
   [junit4]   2> 3090612 INFO  (OverseerStateUpdate-99333325602553861-127.0.0.1:36575_solr-n_0000000000) [n:127.0.0.1:36575_solr    ] o.a.s.c.o.SliceMutator createReplica() {
   [junit4]   2>   "operation":"ADDREPLICA",
   [junit4]   2>   "collection":"myalias_2017-10-23",
   [junit4]   2>   "shard":"shard2",
   [junit4]   2>   "core":"myalias_2017-10-23_shard2_replica_n6",
   [junit4]   2>   "state":"down",
   [junit4]   2>   "base_url":"http://127.0.0.1:43781/solr",
   [junit4]   2>   "type":"NRT",
   [junit4]   2>   "waitForFinalState":"false"} 
   [junit4]   2> 3090814 INFO  (qtp734475869-34508) [n:127.0.0.1:43781_solr    ] o.a.s.h.a.CoreAdminOperation core create command qt=/admin/cores&collection.configName=timeConfig&newCollection=true&collection=myalias_2017-10-23&version=2&replicaType=NRT&coreNodeName=core_node5&property.timePartitionAliasName=myalias&name=myalias_2017-10-23_shard1_replica_n2&action=CREATE&numShards=2&shard=shard1&wt=javabin
   [junit4]   2> 3090814 INFO  (qtp2045110732-34511) [n:127.0.0.1:36575_solr    ] o.a.s.h.a.CoreAdminOperation core create command qt=/admin/cores&collection.configName=timeConfig&newCollection=true&collection=myalias_2017-10-23&version=2&replicaType=NRT&coreNodeName=core_node3&property.timePartitionAliasName=myalias&name=myalias_2017-10-23_shard1_replica_n1&action=CREATE&numShards=2&shard=shard1&wt=javabin
   [junit4]   2> 3090814 INFO  (qtp2045110732-34498) [n:127.0.0.1:36575_solr    ] o.a.s.h.a.CoreAdminOperation core create command qt=/admin/cores&collection.configName=timeConfig&newCollection=true&collection=myalias_2017-10-23&version=2&replicaType=NRT&coreNodeName=core_node7&property.timePartitionAliasName=myalias&name=myalias_2017-10-23_shard2_replica_n4&action=CREATE&numShards=2&shard=shard2&wt=javabin
   [junit4]   2> 3090814 INFO  (qtp734475869-34496) [n:127.0.0.1:43781_solr    ] o.a.s.h.a.CoreAdminOperation core create command qt=/admin/cores&collection.configName=timeConfig&newCollection=true&collection=myalias_2017-10-23&version=2&replicaType=NRT&coreNodeName=core_node8&property.timePartitionAliasName=myalias&name=myalias_2017-10-23_shard2_replica_n6&action=CREATE&numShards=2&shard=shard2&wt=javabin
   [junit4]   2> 3090814 INFO  (qtp2045110732-34511) [n:127.0.0.1:36575_solr    ] o.a.s.c.TransientSolrCoreCacheDefault Allocating transient cache for 2147483647 transient cores
   [junit4]   2> 3090916 INFO  (zkCallback-8497-thread-1-processing-n:127.0.0.1:43781_solr) [n:127.0.0.1:43781_solr    ] o.a.s.c.c.ZkStateReader A cluster state change: [WatchedEvent state:SyncConnected type:NodeDataChanged path:/collections/myalias_2017-10-23/state.json] for collection [myalias_2017-10-23] has occurred - updating... (live nodes size: [2])
   [junit4]   2> 3090916 INFO  (zkCallback-8495-thread-1-processing-n:127.0.0.1:36575_solr) [n:127.0.0.1:36575_solr    ] o.a.s.c.c.ZkStateReader A cluster state change: [WatchedEvent state:SyncConnected type:NodeDataChanged path:/collections/myalias_2017-10-23/state.json] for collection [myalias_2017-10-23] has occurred - updating... (live nodes size: [2])
   [junit4]   2> 3090916 INFO  (zkCallback-8497-thread-2-processing-n:127.0.0.1:43781_solr) [n:127.0.0.1:43781_solr    ] o.a.s.c.c.ZkStateReader A cluster state change: [WatchedEvent state:SyncConnected type:NodeDataChanged path:/collections/myalias_2017-10-23/state.json] for collection [myalias_2017-10-23] has occurred - updating... (live nodes size: [2])
   [junit4]   2> 3090916 INFO  (zkCallback-8495-thread-2-processing-n:127.0.0.1:36575_solr) [n:127.0.0.1:36575_solr    ] o.a.s.c.c.ZkStateReader A cluster state change: [WatchedEvent state:SyncConnected type:NodeDataChanged path:/collections/myalias_2017-10-23/state.json] for collection [myalias_2017-10-23] has occurred - updating... (live nodes size: [2])
   [junit4]   2> 3091821 INFO  (qtp2045110732-34498) [n:127.0.0.1:36575_solr c:myalias_2017-10-23 s:shard2 r:core_node7 x:myalias_2017-10-23_shard2_replica_n4] o.a.s.c.RequestParams conf resource params.json loaded . version : 1 
   [junit4]   2> 3091821 INFO  (qtp2045110732-34498) [n:127.0.0.1:36575_solr c:myalias_2017-10-23 s:shard2 r:core_node7 x:myalias_2017-10-23_shard2_replica_n4] o.a.s.c.RequestParams request params refreshed to version 1
   [junit4]   2> 3091821 INFO  (qtp734475869-34496) [n:127.0.0.1:43781_solr c:myalias_2017-10-23 s:shard2 r:core_node8 x:myalias_2017-10-23_shard2_replica_n6] o.a.s.c.RequestParams conf resource params.json loaded . version : 1 
   [junit4]   2> 3091821 INFO  (qtp734475869-34496) [n:127.0.0.1:43781_solr c:myalias_2017-10-23 s:shard2 r:core_node8 x:myalias_2017-10-23_shard2_replica_n6] o.a.s.c.RequestParams request params refreshed to version 1
   [junit4]   2> 3091822 WARN  (qtp2045110732-34498) [n:127.0.0.1:36575_solr c:myalias_2017-10-23 s:shard2 r:core_node7 x:myalias_2017-10-23_shard2_replica_n4] o.a.s.c.SolrConfig Couldn't add files from /home/jenkins/workspace/Lucene-Solr-7.x-Linux/solr/build/solr-core/test/J2/temp/solr.update.processor.TimeRoutedAliasUpdateProcessorTest_AE0FE5D612D70283-001/tempDir-001/node2/myalias_2017-10-23_shard2_replica_n4/../../../../contrib/extraction/lib filtered by .*\.jar to classpath: /home/jenkins/workspace/Lucene-Solr-7.x-Linux/solr/build/solr-core/test/J2/temp/solr.update.processor.TimeRoutedAliasUpdateProcessorTest_AE0FE5D612D70283-001/tempDir-001/node2/myalias_2017-10-23_shard2_replica_n4/../../../../contrib/extraction/lib
   [junit4]   2> 3091822 WARN  (qtp734475869-34496) [n:127.0.0.1:43781_solr c:myalias_2017-10-23 s:shard2 r:core_node8 x:myalias_2017-10-23_shard2_replica_n6] o.a.s.c.SolrConfig Couldn't add files from /home/jenkins/workspace/Lucene-Solr-7.x-Linux/solr/build/solr-core/test/J2/temp/solr.update.processor.TimeRoutedAliasUpdateProcessorTest_AE0FE5D612D70283-001/tempDir-001/node1/myalias_2017-10-23_shard2_replica_n6/../../../../contrib/extraction/lib filtered by .*\.jar to classpath: /home/jenkins/workspace/Lucene-Solr-7.x-Linux/solr/build/solr-core/test/J2/temp/solr.update.processor.TimeRoutedAliasUpdateProcessorTest_AE0FE5D612D70283-001/tempDir-001/node1/myalias_2017-10-23_shard2_replica_n6/../../../../contrib/extraction/lib
   [junit4]   2> 3091822 INFO  (qtp734475869-34508) [n:127.0.0.1:43781_solr c:myalias_2017-10-23 s:shard1 r:core_node5 x:myalias_2017-10-23_shard1_replica_n2] o.a.s.c.RequestParams conf resource params.json loaded . version : 1 
   [junit4]   2> 3091822 INFO  (qtp734475869-34508) [n:127.0.0.1:43781_solr c:myalias_2017-10-23 s:shard1 r:core_node5 x:myalias_2017-10-23_shard1_replica_n2] o.a.s.c.RequestParams request params refreshed to version 1
   [junit4]   2> 3091822 WARN  (qtp734475869-34496) [n:127.0.0.1:43781_solr c:myalias_2017-10-23 s:shard2 r:core_node8 x:myalias_2017-10-23_shard2_replica_n6] o.a.s.c.SolrConfig Couldn't add files from /home/jenkins/workspace/Lucene-Solr-7.x-Linux/solr/build/solr-core/test/J2/temp/solr.update.processor.TimeRoutedAliasUpdateProcessorTest_AE0FE5D612D70283-001/tempDir-001/node1/myalias_2017-10-23_shard2_replica_n6/../../../../dist filtered by solr-cell-\d.*\.jar to classpath: /home/jenkins/workspace/Lucene-Solr-7.x-Linux/solr/build/solr-core/test/J2/temp/solr.update.processor.TimeRoutedAliasUpdateProcessorTest_AE0FE5D612D70283-001/tempDir-001/node1/myalias_2017-10-23_shard2_replica_n6/../../../../dist
   [junit4]   2> 3091822 WARN  (qtp734475869-34496) [n:127.0.0.1:43781_solr c:myalias_2017-10-23 s:shard2 r:core_node8 x:myalias_2017-10-23_shard2_replica_n6] o.a.s.c.SolrConfig Couldn't add files from /home/jenkins/workspace/Lucene-Solr-7.x-Linux/solr/build/solr-core/test/J2/temp/solr.update.processor.TimeRoutedAliasUpdateProcessorTest_AE0FE5D612D70283-001/tempDir-001/node1/myalias_2017-10-23_shard2_replica_n6/../../../../contrib/clustering/lib filtered by .*\.jar to classpath: /home/jenkins/workspace/Lucene-Solr-7.x-Linux/solr/build/solr-core/test/J2/temp/solr.update.processor.TimeRoutedAliasUpdateProcessorTest_AE0FE5D612D70283-001/tempDir-001/node1/myalias_2017-10-23_shard2_replica_n6/../../../../contrib/clustering/lib
   [junit4]   2> 3091823 WARN  (qtp734475869-34496) [n:127.0.0.1:43781_solr c:myalias_2017-10-23 s:shard2 r:core_node8 x:myalias_2017-10-23_shard2_replica_n6] o.a.s.c.SolrConfig Couldn't add files from /home/jenkins/workspace/Lucene-Solr-7.x-Linux/solr/build/solr-core/test/J2/temp/solr.update.processor.TimeRoutedAliasUpdateProcessorTest_AE0FE5D612D70283-001/tempDir-001/node1/myalias_2017-10-23_shard2_replica_n6/../../../../dist filtered by solr-clustering-\d.*\.jar to classpath: /home/jenkins/workspace/Lucene-Solr-7.x-Linux/solr/build/solr-core/test/J2/temp/solr.update.processor.TimeRoutedAliasUpdateProcessorTest_AE0FE5D612D70283-001/tempDir-001/node1/myalias_2017-10-23_shard2_replica_n6/../../../../dist
   [junit4]   2> 3091822 WARN  (qtp2045110732-34498) [n:127.0.0.1:36575_solr c:myalias_2017-10-23 s:shard2 r:core_node7 x:myalias_2017-10-23_shard2_replica_n4] o.a.s.c.SolrConfig Couldn't add files from /home/jenkins/workspace/Lucene-Solr-7.x-Linux/solr/build/solr-core/test/J2/temp/solr.update.processor.TimeRoutedAliasUpdateProcessorTest_AE0FE5D612D70283-001/tempDir-001/node2/myalias_2017-10-23_shard2_replica_n4/../../../../dist filtered by solr-cell-\d.*\.jar to classpath: /home/jenkins/workspace/Lucene-Solr-7.x-Linux/solr/build/solr-core/test/J2/temp/solr.update.processor.TimeRoutedAliasUpdateProcessorTest_AE0FE5D612D70283-001/tempDir-001/node2/myalias_2017-10-23_shard2_replica_n4/../../../../dist
   [junit4]   2> 3091823 WARN  (qtp734475869-34496) [n:127.0.0.1:43781_solr c:myalias_2017-10-23 s:shard2 r:core_node8 x:myalias_2017-10-23_shard2_replica_n6] o.a.s.c.SolrConfig Couldn't add files from /home/jenkins/workspace/Lucene-Solr-7.x-Linux/solr/build/solr-core/test/J2/temp/solr.update.processor.TimeRoutedAliasUpdateProcessorTest_AE0FE5D612D70283-001/tempDir-001/node1/myalias_2017-10-23_shard2_replica_n6/../../../../contrib/langid/lib filtered by .*\.jar to classpath: /home/jenkins/workspace/Lucene-Solr-7.x-Linux/solr/build/solr-core/test/J2/temp/solr.update.processor.TimeRoutedAliasUpdateProcessorTest_AE0FE5D612D70283-001/tempDir-0

[...truncated too long message...]

  2> 	2	/solr/security.json
   [junit4]   2> 
   [junit4]   2> Maximum concurrent data watches above limit:
   [junit4]   2> 
   [junit4]   2> 	12	/solr/collections/myalias_2017-10-23/state.json
   [junit4]   2> 	5	/solr/collections/myalias_2017-10-24/state.json
   [junit4]   2> 	5	/solr/collections/myalias_2017-10-25/state.json
   [junit4]   2> 	5	/solr/collections/myalias_2017-10-26/state.json
   [junit4]   2> 	5	/solr/collections/timeConfig/state.json
   [junit4]   2> 	4	/solr/clusterstate.json
   [junit4]   2> 
   [junit4]   2> Maximum concurrent children watches above limit:
   [junit4]   2> 
   [junit4]   2> 	4	/solr/live_nodes
   [junit4]   2> 	4	/solr/collections
   [junit4]   2> 
   [junit4]   2> NOTE: leaving temporary files on disk at: /home/jenkins/workspace/Lucene-Solr-7.x-Linux/solr/build/solr-core/test/J2/temp/solr.update.processor.TimeRoutedAliasUpdateProcessorTest_AE0FE5D612D70283-001
   [junit4]   2> NOTE: test params are: codec=Asserting(Lucene70): {}, docValues:{}, maxPointsInLeafNode=1006, maxMBSortInHeap=6.062190243862433, sim=RandomSimilarity(queryNorm=false): {}, locale=ja, timezone=Europe/Sofia
   [junit4]   2> NOTE: Linux 4.13.0-26-generic amd64/Oracle Corporation 1.8.0_144 (64-bit)/cpus=8,threads=1,free=131023392,total=518979584
   [junit4]   2> NOTE: All tests run in this JVM: [HdfsCollectionsAPIDistributedZkTest, PreAnalyzedFieldManagedSchemaCloudTest, TestAddFieldRealTimeGet, TestTestInjection, TestReload, BlockJoinFacetDistribTest, DirectSolrConnectionTest, SolrCloudExampleTest, SolrCoreMetricManagerTest, TestCloudSearcherWarming, DocValuesMissingTest, OverseerTest, TestCoreContainer, MoveReplicaHDFSTest, TestManagedSchema, TestConfigReload, TestDistribDocBasedVersion, OverseerStatusTest, AsyncCallRequestStatusResponseTest, LeaderElectionContextKeyTest, TestValueSourceCache, TestSlowCompositeReaderWrapper, MergeStrategyTest, ClusterStateTest, TestSchemaSimilarityResource, SystemInfoHandlerTest, TestXmlQParser, JSONWriterTest, TestSearcherReuse, TestTolerantSearch, ComputePlanActionTest, DistributedFacetPivotSmallAdvancedTest, RuleEngineTest, CheckHdfsIndexTest, JavabinLoaderTest, CSVRequestHandlerTest, FileBasedSpellCheckerTest, DistanceUnitsTest, RequestLoggingTest, ShufflingReplicaListTransformerTest, SSLMigrationTest, TestFiltering, BigEndianAscendingWordDeserializerTest, TestInitParams, ChaosMonkeyNothingIsSafeTest, TestSQLHandler, TestNumericRangeQuery32, DataDrivenBlockJoinTest, TestSolr4Spatial2, DistanceFunctionTest, HdfsLockFactoryTest, DistribJoinFromCollectionTest, HighlighterTest, UnloadDistributedZkTest, TestSolrConfigHandlerConcurrent, CollectionReloadTest, TestLegacyNumericUtils, TestSolrCloudWithHadoopAuthPlugin, TestStandardQParsers, TestSolrDeletionPolicy2, TestRawResponseWriter, TestLeaderInitiatedRecoveryThread, TestFieldCacheReopen, DistributedQueryComponentCustomSortTest, TestSha256AuthenticationProvider, AliasIntegrationTest, ChangedSchemaMergeTest, TestNodeLostTrigger, TestSkipOverseerOperations, TestFreeTextSuggestions, IndexBasedSpellCheckerTest, TestInitQParser, DistributedFacetExistsSmallTest, TestNumericTerms32, CopyFieldTest, TestCloudPivotFacet, TestFunctionQuery, HdfsWriteToMultipleCollectionsTest, TestComplexPhraseQParserPlugin, CoreAdminHandlerTest, TestQueryWrapperFilter, IgnoreCommitOptimizeUpdateProcessorFactoryTest, TestReplicationHandlerBackup, TestRandomRequestDistribution, QueryElevationComponentTest, TestPartialUpdateDeduplication, LeaderElectionTest, TestIndexSearcher, BlockDirectoryTest, TestCopyFieldCollectionResource, TestFuzzyAnalyzedSuggestions, TestSegmentSorting, AnalyticsQueryTest, TestManagedSynonymGraphFilterFactory, DefaultValueUpdateProcessorTest, TestConfigSetsAPIZkFailure, TestQueryTypes, SuggestComponentTest, AddBlockUpdateTest, TestSystemIdResolver, ConnectionReuseTest, TestUseDocValuesAsStored, UUIDFieldTest, DeleteNodeTest, EchoParamsTest, NodeMutatorTest, ConfigSetsAPITest, TestShardHandlerFactory, CdcrBootstrapTest, TestComputePlanAction, TestExactSharedStatsCache, TestHashPartitioner, TestJsonFacetRefinement, SolrTestCaseJ4Test, TestSolrCloudWithSecureImpersonation, TestAuthorizationFramework, SolrMetricsIntegrationTest, TestFieldCollectionResource, DistributedSpellCheckComponentTest, AutoAddReplicasIntegrationTest, TestUniqueKeyFieldResource, ChaosMonkeySafeLeaderTest, BasicDistributedZk2Test, CollectionsAPIDistributedZkTest, ShardRoutingTest, FullSolrCloudDistribCmdsTest, ShardRoutingCustomTest, TestDistributedGrouping, TestFaceting, TermVectorComponentDistributedTest, TestRealTimeGet, TestStressReorder, TestJoin, TestStressVersions, StatsComponentTest, SpellCheckComponentTest, TestGroupingSearch, ShowFileRequestHandlerTest, SimplePostToolTest, TestCoreDiscovery, SignatureUpdateProcessorFactoryTest, TestExtendedDismaxParser, SpellCheckCollatorTest, DocValuesTest, SuggesterTest, TestStressLucene, TestTrie, SuggesterWFSTTest, TestCSVLoader, NoCacheHeaderTest, WordBreakSolrSpellCheckerTest, SolrCoreCheckLockOnStartupTest, TestPseudoReturnFields, FieldMutatingUpdateProcessorTest, SortByFunctionTest, TestRemoteStreaming, DocValuesMultiTest, TestSolrDeletionPolicy1, XsltUpdateRequestHandlerTest, DebugComponentTest, CacheHeaderTest, LukeRequestHandlerTest, DisMaxRequestHandlerTest, DirectSolrSpellCheckerTest, TestReversedWildcardFilterFactory, TestOmitPositions, TermsComponentTest, XmlUpdateRequestHandlerTest, PathHierarchyTokenizerFactoryTest, TestIndexingPerformance, RequiredFieldsTest, FieldAnalysisRequestHandlerTest, FastVectorHighlighterTest, RegexBoostProcessorTest, ReturnFieldsTest, MBeansHandlerTest, HighlighterConfigTest, SOLR749Test, TestQuerySenderListener, AlternateDirectoryTest, TestQuerySenderNoQuery, ResponseLogComponentTest, SolrIndexConfigTest, BadComponentTest, MultiTermTest, SampleTest, TestBinaryField, TestSearchPerf, NumericFieldsTest, MinimalSchemaTest, TestElisionMultitermQuery, TestConfig, TestSolrCoreProperties, NotRequiredUniqueKeyTest, TestLuceneMatchVersion, SpellPossibilityIteratorTest, TestCharFilters, SynonymTokenizerTest, TestXIncludeConfig, TestDFRSimilarityFactory, TestLMDirichletSimilarityFactory, TestLMJelinekMercerSimilarityFactory, TestIBSimilarityFactory, TimeZoneUtilsTest, ResourceLoaderTest, ScriptEngineTest, URLClassifyProcessorTest, PluginInfoTest, PreAnalyzedFieldTest, DateFieldTest, RAMDirectoryFactoryTest, TestSolrJ, TestLRUCache, ZkNodePropsTest, FileUtilsTest, CircularListTest, DistributedIntervalFacetingTest, TestHighlightDedupGrouping, TestEmbeddedSolrServerConstructors, TestEmbeddedSolrServerSchemaAPI, AddReplicaTest, CollectionStateFormat2Test, CollectionsAPIAsyncDistributedZkTest, DeleteInactiveReplicaTest, DeleteLastCustomShardedReplicaTest, DeleteShardTest, DistribDocExpirationUpdateProcessorTest, LeaderInitiatedRecoveryOnCommitTest, MigrateRouteKeyTest, MoveReplicaTest, OutOfBoxZkACLAndCredentialsProvidersTest, OverseerCollectionConfigSetProcessorTest, OverseerModifyCollectionTest, OverseerTaskQueueTest, ReplicationFactorTest, RestartWhileUpdatingTest, RollingRestartTest, SharedFSAutoReplicaFailoverTest, SolrCLIZkUtilsTest, TestCloudDeleteByQuery, TestExclusionRuleCollectionAccess, TestHdfsCloudBackupRestore, TestMiniSolrCloudClusterSSL, TestPullReplica, TestTolerantUpdateProcessorCloud, TestUtilizeNode, VMParamsZkACLAndCredentialsProvidersTest, AutoScalingHandlerTest, HdfsAutoAddReplicasIntegrationTest, TestDistribStateManager, TestGenericDistributedQueue, TestNodeAddedTrigger, TestPolicyCloud, TestTriggerIntegration, BaseCdcrDistributedZkTest, CdcrBidirectionalTest, HdfsRecoverLeaseTest, HdfsThreadLeakTest, TestClusterStateMutator, ZkStateReaderTest, RulesTest, TestDynamicLoading, SearchHandlerTest, TestBlobHandler, TestReqParamsAPI, TestRestoreCore, TestSQLHandlerNonCloud, TestSolrConfigHandlerCloud, V2ApiIntegrationTest, DistributedFacetPivotLargeTest, DistributedFacetPivotLongTailTest, DistributedFacetPivotSmallTest, DistributedFacetPivotWhiteBoxTest, SuggestComponentContextFilterQueryTest, TestExpandComponent, TestHttpShardHandlerFactory, TestUnifiedSolrHighlighter, UninvertDocValuesMergePolicyTest, WrapperMergePolicyFactoryTest, TestLegacyFieldReuse, TestLegacyTerms, TestMultiValuedNumericRangeQuery, TestNumericTokenStream, JvmMetricsTest, SolrMetricManagerTest, SolrMetricReporterTest, SolrGangliaReporterTest, SolrJmxReporterCloudTest, SolrJmxReporterTest, SolrCloudReportersTest, TestStreamBody, TestMacroExpander, TestMacros, SmileWriterTest, TestBinaryResponseWriter, TestCustomDocTransformer, TestGeoJSONResponseWriter, TestGraphMLResponseWriter, TestJavabinTupleStreamParser, TestRawTransformer, TestRetrieveFieldsOptimizer, TestSolrQueryResponse, TestChildDocTransformer, TestSubQueryTransformer, TestSubQueryTransformerCrossCore, TestSubQueryTransformerDistrib, TestManagedResource, TestManagedResourceStorage, TestBulkSchemaAPI, TestDynamicFieldResource, TestFieldTypeResource, TestManagedStopFilterFactory, BooleanFieldTest, CurrencyFieldTypeTest, SchemaApiFailureTest, TestManagedSchemaThreadSafety, TestPointFields, TestSchemaManager, TestUseDocValuesAsStored2, AnalyticsMergeStrategyTest, TestFieldSortValues, TestFilteredDocIdSet, TestGraphTermsQParserPlugin, TestMissingGroups, TestOverriddenPrefixQueryForCustomFieldType, TestRandomCollapseQParserPlugin, CloudMLTQParserTest, TestLRUStatsCache, BasicAuthIntegrationTest, PKIAuthenticationIntegrationTest, TestPKIAuthenticationPlugin, TestRuleBasedAuthorizationPlugin, TestDelegationWithHadoopAuth, TestZkAclsWithHadoopAuth, TestBlendedInfixSuggestions, TestFieldCacheSort, TestFieldCacheVsDocValues, TestNumericTerms64, TestExceedMaxTermLength, TestInPlaceUpdatesStandalone, UpdateLogTest, VersionInfoTest, AtomicUpdateProcessorFactoryTest, AtomicUpdatesTest, ClassificationUpdateProcessorFactoryTest, ClassificationUpdateProcessorTest, CloneFieldUpdateProcessorFactoryTest, TimeRoutedAliasUpdateProcessorTest]
   [junit4] Completed [754/766 (1!)] on J2 in 24.37s, 2 tests, 1 error <<< FAILURES!

[...truncated 48148 lines...]

Mime
View raw message