lucene-dev mailing list archives

Site index · List index
Message view « Date » · « Thread »
Top « Date » · « Thread »
From Policeman Jenkins Server <jenk...@thetaphi.de>
Subject [JENKINS] Lucene-Solr-master-Windows (32bit/jdk1.8.0_144) - Build # 7140 - Still Unstable!
Date Fri, 26 Jan 2018 10:54:53 GMT
Build: https://jenkins.thetaphi.de/job/Lucene-Solr-master-Windows/7140/
Java: 32bit/jdk1.8.0_144 -server -XX:+UseConcMarkSweepGC

9 tests failed.
FAILED:  junit.framework.TestSuite.org.apache.lucene.index.TestBackwardsCompatibility

Error Message:
Could not remove the following files (in the order of attempts):    C:\Users\jenkins\workspace\Lucene-Solr-master-Windows\lucene\build\backward-codecs\test\J1\temp\lucene.index.TestBackwardsCompatibility_2130331E460B6B4C-001\2.3.0-cfs-001: java.nio.file.DirectoryNotEmptyException: C:\Users\jenkins\workspace\Lucene-Solr-master-Windows\lucene\build\backward-codecs\test\J1\temp\lucene.index.TestBackwardsCompatibility_2130331E460B6B4C-001\2.3.0-cfs-001 

Stack Trace:
java.io.IOException: Could not remove the following files (in the order of attempts):
   C:\Users\jenkins\workspace\Lucene-Solr-master-Windows\lucene\build\backward-codecs\test\J1\temp\lucene.index.TestBackwardsCompatibility_2130331E460B6B4C-001\2.3.0-cfs-001: java.nio.file.DirectoryNotEmptyException: C:\Users\jenkins\workspace\Lucene-Solr-master-Windows\lucene\build\backward-codecs\test\J1\temp\lucene.index.TestBackwardsCompatibility_2130331E460B6B4C-001\2.3.0-cfs-001

	at __randomizedtesting.SeedInfo.seed([2130331E460B6B4C]:0)
	at org.apache.lucene.util.IOUtils.rm(IOUtils.java:329)
	at org.apache.lucene.util.TestRuleTemporaryFilesCleanup.afterAlways(TestRuleTemporaryFilesCleanup.java:216)
	at com.carrotsearch.randomizedtesting.rules.TestRuleAdapter$1.afterAlways(TestRuleAdapter.java:31)
	at com.carrotsearch.randomizedtesting.rules.StatementAdapter.evaluate(StatementAdapter.java:43)
	at com.carrotsearch.randomizedtesting.rules.StatementAdapter.evaluate(StatementAdapter.java:36)
	at org.apache.lucene.util.TestRuleAssertionsRequired$1.evaluate(TestRuleAssertionsRequired.java:53)
	at org.apache.lucene.util.TestRuleMarkFailure$1.evaluate(TestRuleMarkFailure.java:47)
	at org.apache.lucene.util.TestRuleIgnoreAfterMaxFailures$1.evaluate(TestRuleIgnoreAfterMaxFailures.java:64)
	at org.apache.lucene.util.TestRuleIgnoreTestSuites$1.evaluate(TestRuleIgnoreTestSuites.java:54)
	at com.carrotsearch.randomizedtesting.rules.StatementAdapter.evaluate(StatementAdapter.java:36)
	at com.carrotsearch.randomizedtesting.ThreadLeakControl$StatementRunner.run(ThreadLeakControl.java:368)
	at java.lang.Thread.run(Thread.java:748)


FAILED:  junit.framework.TestSuite.org.apache.solr.MinimalSchemaTest

Error Message:
Could not remove the following files (in the order of attempts):    C:\Users\jenkins\workspace\Lucene-Solr-master-Windows\solr\build\solr-core\test\J1\temp\solr.MinimalSchemaTest_57C3C4D211BD0C41-001\init-core-data-001: java.nio.file.DirectoryNotEmptyException: C:\Users\jenkins\workspace\Lucene-Solr-master-Windows\solr\build\solr-core\test\J1\temp\solr.MinimalSchemaTest_57C3C4D211BD0C41-001\init-core-data-001    C:\Users\jenkins\workspace\Lucene-Solr-master-Windows\solr\build\solr-core\test\J1\temp\solr.MinimalSchemaTest_57C3C4D211BD0C41-001\init-core-data-001\spellcheckerFQCN: java.nio.file.AccessDeniedException: C:\Users\jenkins\workspace\Lucene-Solr-master-Windows\solr\build\solr-core\test\J1\temp\solr.MinimalSchemaTest_57C3C4D211BD0C41-001\init-core-data-001\spellcheckerFQCN    C:\Users\jenkins\workspace\Lucene-Solr-master-Windows\solr\build\solr-core\test\J1\temp\solr.MinimalSchemaTest_57C3C4D211BD0C41-001: java.nio.file.DirectoryNotEmptyException: C:\Users\jenkins\workspace\Lucene-Solr-master-Windows\solr\build\solr-core\test\J1\temp\solr.MinimalSchemaTest_57C3C4D211BD0C41-001 

Stack Trace:
java.io.IOException: Could not remove the following files (in the order of attempts):
   C:\Users\jenkins\workspace\Lucene-Solr-master-Windows\solr\build\solr-core\test\J1\temp\solr.MinimalSchemaTest_57C3C4D211BD0C41-001\init-core-data-001: java.nio.file.DirectoryNotEmptyException: C:\Users\jenkins\workspace\Lucene-Solr-master-Windows\solr\build\solr-core\test\J1\temp\solr.MinimalSchemaTest_57C3C4D211BD0C41-001\init-core-data-001
   C:\Users\jenkins\workspace\Lucene-Solr-master-Windows\solr\build\solr-core\test\J1\temp\solr.MinimalSchemaTest_57C3C4D211BD0C41-001\init-core-data-001\spellcheckerFQCN: java.nio.file.AccessDeniedException: C:\Users\jenkins\workspace\Lucene-Solr-master-Windows\solr\build\solr-core\test\J1\temp\solr.MinimalSchemaTest_57C3C4D211BD0C41-001\init-core-data-001\spellcheckerFQCN
   C:\Users\jenkins\workspace\Lucene-Solr-master-Windows\solr\build\solr-core\test\J1\temp\solr.MinimalSchemaTest_57C3C4D211BD0C41-001: java.nio.file.DirectoryNotEmptyException: C:\Users\jenkins\workspace\Lucene-Solr-master-Windows\solr\build\solr-core\test\J1\temp\solr.MinimalSchemaTest_57C3C4D211BD0C41-001

	at __randomizedtesting.SeedInfo.seed([57C3C4D211BD0C41]:0)
	at org.apache.lucene.util.IOUtils.rm(IOUtils.java:329)
	at org.apache.lucene.util.TestRuleTemporaryFilesCleanup.afterAlways(TestRuleTemporaryFilesCleanup.java:216)
	at com.carrotsearch.randomizedtesting.rules.TestRuleAdapter$1.afterAlways(TestRuleAdapter.java:31)
	at com.carrotsearch.randomizedtesting.rules.StatementAdapter.evaluate(StatementAdapter.java:43)
	at com.carrotsearch.randomizedtesting.rules.StatementAdapter.evaluate(StatementAdapter.java:36)
	at org.apache.lucene.util.TestRuleAssertionsRequired$1.evaluate(TestRuleAssertionsRequired.java:53)
	at org.apache.lucene.util.TestRuleMarkFailure$1.evaluate(TestRuleMarkFailure.java:47)
	at org.apache.lucene.util.TestRuleIgnoreAfterMaxFailures$1.evaluate(TestRuleIgnoreAfterMaxFailures.java:64)
	at org.apache.lucene.util.TestRuleIgnoreTestSuites$1.evaluate(TestRuleIgnoreTestSuites.java:54)
	at com.carrotsearch.randomizedtesting.rules.StatementAdapter.evaluate(StatementAdapter.java:36)
	at com.carrotsearch.randomizedtesting.ThreadLeakControl$StatementRunner.run(ThreadLeakControl.java:368)
	at java.lang.Thread.run(Thread.java:748)


FAILED:  org.apache.solr.cloud.autoscaling.TriggerIntegrationTest.testListeners

Error Message:


Stack Trace:
java.lang.AssertionError
	at __randomizedtesting.SeedInfo.seed([57C3C4D211BD0C41:BA0353C2ACD19198]:0)
	at org.junit.Assert.fail(Assert.java:92)
	at org.junit.Assert.assertTrue(Assert.java:43)
	at org.junit.Assert.assertTrue(Assert.java:54)
	at org.apache.solr.cloud.autoscaling.TriggerIntegrationTest.testListeners(TriggerIntegrationTest.java:1053)
	at sun.reflect.NativeMethodAccessorImpl.invoke0(Native Method)
	at sun.reflect.NativeMethodAccessorImpl.invoke(NativeMethodAccessorImpl.java:62)
	at sun.reflect.DelegatingMethodAccessorImpl.invoke(DelegatingMethodAccessorImpl.java:43)
	at java.lang.reflect.Method.invoke(Method.java:498)
	at com.carrotsearch.randomizedtesting.RandomizedRunner.invoke(RandomizedRunner.java:1737)
	at com.carrotsearch.randomizedtesting.RandomizedRunner$8.evaluate(RandomizedRunner.java:934)
	at com.carrotsearch.randomizedtesting.RandomizedRunner$9.evaluate(RandomizedRunner.java:970)
	at com.carrotsearch.randomizedtesting.RandomizedRunner$10.evaluate(RandomizedRunner.java:984)
	at com.carrotsearch.randomizedtesting.rules.SystemPropertiesRestoreRule$1.evaluate(SystemPropertiesRestoreRule.java:57)
	at org.apache.lucene.util.TestRuleSetupTeardownChained$1.evaluate(TestRuleSetupTeardownChained.java:49)
	at org.apache.lucene.util.AbstractBeforeAfterRule$1.evaluate(AbstractBeforeAfterRule.java:45)
	at org.apache.lucene.util.TestRuleThreadAndTestName$1.evaluate(TestRuleThreadAndTestName.java:48)
	at org.apache.lucene.util.TestRuleIgnoreAfterMaxFailures$1.evaluate(TestRuleIgnoreAfterMaxFailures.java:64)
	at org.apache.lucene.util.TestRuleMarkFailure$1.evaluate(TestRuleMarkFailure.java:47)
	at com.carrotsearch.randomizedtesting.rules.StatementAdapter.evaluate(StatementAdapter.java:36)
	at com.carrotsearch.randomizedtesting.ThreadLeakControl$StatementRunner.run(ThreadLeakControl.java:368)
	at com.carrotsearch.randomizedtesting.ThreadLeakControl.forkTimeoutingTask(ThreadLeakControl.java:817)
	at com.carrotsearch.randomizedtesting.ThreadLeakControl$3.evaluate(ThreadLeakControl.java:468)
	at com.carrotsearch.randomizedtesting.RandomizedRunner.runSingleTest(RandomizedRunner.java:943)
	at com.carrotsearch.randomizedtesting.RandomizedRunner$5.evaluate(RandomizedRunner.java:829)
	at com.carrotsearch.randomizedtesting.RandomizedRunner$6.evaluate(RandomizedRunner.java:879)
	at com.carrotsearch.randomizedtesting.RandomizedRunner$7.evaluate(RandomizedRunner.java:890)
	at com.carrotsearch.randomizedtesting.rules.StatementAdapter.evaluate(StatementAdapter.java:36)
	at com.carrotsearch.randomizedtesting.rules.SystemPropertiesRestoreRule$1.evaluate(SystemPropertiesRestoreRule.java:57)
	at org.apache.lucene.util.AbstractBeforeAfterRule$1.evaluate(AbstractBeforeAfterRule.java:45)
	at com.carrotsearch.randomizedtesting.rules.StatementAdapter.evaluate(StatementAdapter.java:36)
	at org.apache.lucene.util.TestRuleStoreClassName$1.evaluate(TestRuleStoreClassName.java:41)
	at com.carrotsearch.randomizedtesting.rules.NoShadowingOrOverridesOnMethodsRule$1.evaluate(NoShadowingOrOverridesOnMethodsRule.java:40)
	at com.carrotsearch.randomizedtesting.rules.NoShadowingOrOverridesOnMethodsRule$1.evaluate(NoShadowingOrOverridesOnMethodsRule.java:40)
	at com.carrotsearch.randomizedtesting.rules.StatementAdapter.evaluate(StatementAdapter.java:36)
	at com.carrotsearch.randomizedtesting.rules.StatementAdapter.evaluate(StatementAdapter.java:36)
	at com.carrotsearch.randomizedtesting.rules.StatementAdapter.evaluate(StatementAdapter.java:36)
	at org.apache.lucene.util.TestRuleAssertionsRequired$1.evaluate(TestRuleAssertionsRequired.java:53)
	at org.apache.lucene.util.TestRuleMarkFailure$1.evaluate(TestRuleMarkFailure.java:47)
	at org.apache.lucene.util.TestRuleIgnoreAfterMaxFailures$1.evaluate(TestRuleIgnoreAfterMaxFailures.java:64)
	at org.apache.lucene.util.TestRuleIgnoreTestSuites$1.evaluate(TestRuleIgnoreTestSuites.java:54)
	at com.carrotsearch.randomizedtesting.rules.StatementAdapter.evaluate(StatementAdapter.java:36)
	at com.carrotsearch.randomizedtesting.ThreadLeakControl$StatementRunner.run(ThreadLeakControl.java:368)
	at java.lang.Thread.run(Thread.java:748)


FAILED:  org.apache.solr.cloud.autoscaling.sim.TestGenericDistributedQueue.testDistributedQueueBlocking

Error Message:


Stack Trace:
java.util.concurrent.TimeoutException
	at __randomizedtesting.SeedInfo.seed([57C3C4D211BD0C41:1269B6AB55EFB035]:0)
	at java.util.concurrent.FutureTask.get(FutureTask.java:205)
	at org.apache.solr.cloud.autoscaling.sim.TestSimDistributedQueue.testDistributedQueueBlocking(TestSimDistributedQueue.java:101)
	at sun.reflect.NativeMethodAccessorImpl.invoke0(Native Method)
	at sun.reflect.NativeMethodAccessorImpl.invoke(NativeMethodAccessorImpl.java:62)
	at sun.reflect.DelegatingMethodAccessorImpl.invoke(DelegatingMethodAccessorImpl.java:43)
	at java.lang.reflect.Method.invoke(Method.java:498)
	at com.carrotsearch.randomizedtesting.RandomizedRunner.invoke(RandomizedRunner.java:1737)
	at com.carrotsearch.randomizedtesting.RandomizedRunner$8.evaluate(RandomizedRunner.java:934)
	at com.carrotsearch.randomizedtesting.RandomizedRunner$9.evaluate(RandomizedRunner.java:970)
	at com.carrotsearch.randomizedtesting.RandomizedRunner$10.evaluate(RandomizedRunner.java:984)
	at com.carrotsearch.randomizedtesting.rules.SystemPropertiesRestoreRule$1.evaluate(SystemPropertiesRestoreRule.java:57)
	at org.apache.lucene.util.TestRuleSetupTeardownChained$1.evaluate(TestRuleSetupTeardownChained.java:49)
	at org.apache.lucene.util.AbstractBeforeAfterRule$1.evaluate(AbstractBeforeAfterRule.java:45)
	at org.apache.lucene.util.TestRuleThreadAndTestName$1.evaluate(TestRuleThreadAndTestName.java:48)
	at org.apache.lucene.util.TestRuleIgnoreAfterMaxFailures$1.evaluate(TestRuleIgnoreAfterMaxFailures.java:64)
	at org.apache.lucene.util.TestRuleMarkFailure$1.evaluate(TestRuleMarkFailure.java:47)
	at com.carrotsearch.randomizedtesting.rules.StatementAdapter.evaluate(StatementAdapter.java:36)
	at com.carrotsearch.randomizedtesting.ThreadLeakControl$StatementRunner.run(ThreadLeakControl.java:368)
	at com.carrotsearch.randomizedtesting.ThreadLeakControl.forkTimeoutingTask(ThreadLeakControl.java:817)
	at com.carrotsearch.randomizedtesting.ThreadLeakControl$3.evaluate(ThreadLeakControl.java:468)
	at com.carrotsearch.randomizedtesting.RandomizedRunner.runSingleTest(RandomizedRunner.java:943)
	at com.carrotsearch.randomizedtesting.RandomizedRunner$5.evaluate(RandomizedRunner.java:829)
	at com.carrotsearch.randomizedtesting.RandomizedRunner$6.evaluate(RandomizedRunner.java:879)
	at com.carrotsearch.randomizedtesting.RandomizedRunner$7.evaluate(RandomizedRunner.java:890)
	at com.carrotsearch.randomizedtesting.rules.StatementAdapter.evaluate(StatementAdapter.java:36)
	at com.carrotsearch.randomizedtesting.rules.SystemPropertiesRestoreRule$1.evaluate(SystemPropertiesRestoreRule.java:57)
	at org.apache.lucene.util.AbstractBeforeAfterRule$1.evaluate(AbstractBeforeAfterRule.java:45)
	at com.carrotsearch.randomizedtesting.rules.StatementAdapter.evaluate(StatementAdapter.java:36)
	at org.apache.lucene.util.TestRuleStoreClassName$1.evaluate(TestRuleStoreClassName.java:41)
	at com.carrotsearch.randomizedtesting.rules.NoShadowingOrOverridesOnMethodsRule$1.evaluate(NoShadowingOrOverridesOnMethodsRule.java:40)
	at com.carrotsearch.randomizedtesting.rules.NoShadowingOrOverridesOnMethodsRule$1.evaluate(NoShadowingOrOverridesOnMethodsRule.java:40)
	at com.carrotsearch.randomizedtesting.rules.StatementAdapter.evaluate(StatementAdapter.java:36)
	at com.carrotsearch.randomizedtesting.rules.StatementAdapter.evaluate(StatementAdapter.java:36)
	at com.carrotsearch.randomizedtesting.rules.StatementAdapter.evaluate(StatementAdapter.java:36)
	at org.apache.lucene.util.TestRuleAssertionsRequired$1.evaluate(TestRuleAssertionsRequired.java:53)
	at org.apache.lucene.util.TestRuleMarkFailure$1.evaluate(TestRuleMarkFailure.java:47)
	at org.apache.lucene.util.TestRuleIgnoreAfterMaxFailures$1.evaluate(TestRuleIgnoreAfterMaxFailures.java:64)
	at org.apache.lucene.util.TestRuleIgnoreTestSuites$1.evaluate(TestRuleIgnoreTestSuites.java:54)
	at com.carrotsearch.randomizedtesting.rules.StatementAdapter.evaluate(StatementAdapter.java:36)
	at com.carrotsearch.randomizedtesting.ThreadLeakControl$StatementRunner.run(ThreadLeakControl.java:368)
	at java.lang.Thread.run(Thread.java:748)


FAILED:  junit.framework.TestSuite.org.apache.solr.cloud.autoscaling.sim.TestGenericDistributedQueue

Error Message:
1 thread leaked from SUITE scope at org.apache.solr.cloud.autoscaling.sim.TestGenericDistributedQueue:     1) Thread[id=32782, name=sdqtest--7536-thread-1, state=TIMED_WAITING, group=TGRP-TestGenericDistributedQueue]         at sun.misc.Unsafe.park(Native Method)         at java.util.concurrent.locks.LockSupport.parkNanos(LockSupport.java:215)         at java.util.concurrent.locks.AbstractQueuedSynchronizer$ConditionObject.awaitNanos(AbstractQueuedSynchronizer.java:2078)         at org.apache.solr.cloud.autoscaling.sim.GenericDistributedQueue.peek(GenericDistributedQueue.java:194)         at org.apache.solr.cloud.autoscaling.sim.GenericDistributedQueue.peek(GenericDistributedQueue.java:167)         at org.apache.solr.cloud.autoscaling.sim.TestSimDistributedQueue.lambda$testDistributedQueueBlocking$0(TestSimDistributedQueue.java:92)         at org.apache.solr.cloud.autoscaling.sim.TestSimDistributedQueue$$Lambda$1055/13664876.call(Unknown Source)         at java.util.concurrent.FutureTask.run(FutureTask.java:266)         at org.apache.solr.common.util.ExecutorUtil$MDCAwareThreadPoolExecutor.lambda$execute$0(ExecutorUtil.java:188)         at org.apache.solr.common.util.ExecutorUtil$MDCAwareThreadPoolExecutor$$Lambda$117/29508855.run(Unknown Source)         at java.util.concurrent.ThreadPoolExecutor.runWorker(ThreadPoolExecutor.java:1149)         at java.util.concurrent.ThreadPoolExecutor$Worker.run(ThreadPoolExecutor.java:624)         at java.lang.Thread.run(Thread.java:748)

Stack Trace:
com.carrotsearch.randomizedtesting.ThreadLeakError: 1 thread leaked from SUITE scope at org.apache.solr.cloud.autoscaling.sim.TestGenericDistributedQueue: 
   1) Thread[id=32782, name=sdqtest--7536-thread-1, state=TIMED_WAITING, group=TGRP-TestGenericDistributedQueue]
        at sun.misc.Unsafe.park(Native Method)
        at java.util.concurrent.locks.LockSupport.parkNanos(LockSupport.java:215)
        at java.util.concurrent.locks.AbstractQueuedSynchronizer$ConditionObject.awaitNanos(AbstractQueuedSynchronizer.java:2078)
        at org.apache.solr.cloud.autoscaling.sim.GenericDistributedQueue.peek(GenericDistributedQueue.java:194)
        at org.apache.solr.cloud.autoscaling.sim.GenericDistributedQueue.peek(GenericDistributedQueue.java:167)
        at org.apache.solr.cloud.autoscaling.sim.TestSimDistributedQueue.lambda$testDistributedQueueBlocking$0(TestSimDistributedQueue.java:92)
        at org.apache.solr.cloud.autoscaling.sim.TestSimDistributedQueue$$Lambda$1055/13664876.call(Unknown Source)
        at java.util.concurrent.FutureTask.run(FutureTask.java:266)
        at org.apache.solr.common.util.ExecutorUtil$MDCAwareThreadPoolExecutor.lambda$execute$0(ExecutorUtil.java:188)
        at org.apache.solr.common.util.ExecutorUtil$MDCAwareThreadPoolExecutor$$Lambda$117/29508855.run(Unknown Source)
        at java.util.concurrent.ThreadPoolExecutor.runWorker(ThreadPoolExecutor.java:1149)
        at java.util.concurrent.ThreadPoolExecutor$Worker.run(ThreadPoolExecutor.java:624)
        at java.lang.Thread.run(Thread.java:748)
	at __randomizedtesting.SeedInfo.seed([57C3C4D211BD0C41]:0)


FAILED:  org.apache.solr.cloud.autoscaling.sim.TestLargeCluster.testSearchRate

Error Message:
The trigger did not fire at all

Stack Trace:
java.lang.AssertionError: The trigger did not fire at all
	at __randomizedtesting.SeedInfo.seed([57C3C4D211BD0C41:A8BDA5BDE7BAA0E]:0)
	at org.junit.Assert.fail(Assert.java:93)
	at org.junit.Assert.assertTrue(Assert.java:43)
	at org.apache.solr.cloud.autoscaling.sim.TestLargeCluster.testSearchRate(TestLargeCluster.java:547)
	at sun.reflect.NativeMethodAccessorImpl.invoke0(Native Method)
	at sun.reflect.NativeMethodAccessorImpl.invoke(NativeMethodAccessorImpl.java:62)
	at sun.reflect.DelegatingMethodAccessorImpl.invoke(DelegatingMethodAccessorImpl.java:43)
	at java.lang.reflect.Method.invoke(Method.java:498)
	at com.carrotsearch.randomizedtesting.RandomizedRunner.invoke(RandomizedRunner.java:1737)
	at com.carrotsearch.randomizedtesting.RandomizedRunner$8.evaluate(RandomizedRunner.java:934)
	at com.carrotsearch.randomizedtesting.RandomizedRunner$9.evaluate(RandomizedRunner.java:970)
	at com.carrotsearch.randomizedtesting.RandomizedRunner$10.evaluate(RandomizedRunner.java:984)
	at com.carrotsearch.randomizedtesting.rules.SystemPropertiesRestoreRule$1.evaluate(SystemPropertiesRestoreRule.java:57)
	at org.apache.lucene.util.TestRuleSetupTeardownChained$1.evaluate(TestRuleSetupTeardownChained.java:49)
	at org.apache.lucene.util.AbstractBeforeAfterRule$1.evaluate(AbstractBeforeAfterRule.java:45)
	at org.apache.lucene.util.TestRuleThreadAndTestName$1.evaluate(TestRuleThreadAndTestName.java:48)
	at org.apache.lucene.util.TestRuleIgnoreAfterMaxFailures$1.evaluate(TestRuleIgnoreAfterMaxFailures.java:64)
	at org.apache.lucene.util.TestRuleMarkFailure$1.evaluate(TestRuleMarkFailure.java:47)
	at com.carrotsearch.randomizedtesting.rules.StatementAdapter.evaluate(StatementAdapter.java:36)
	at com.carrotsearch.randomizedtesting.ThreadLeakControl$StatementRunner.run(ThreadLeakControl.java:368)
	at com.carrotsearch.randomizedtesting.ThreadLeakControl.forkTimeoutingTask(ThreadLeakControl.java:817)
	at com.carrotsearch.randomizedtesting.ThreadLeakControl$3.evaluate(ThreadLeakControl.java:468)
	at com.carrotsearch.randomizedtesting.RandomizedRunner.runSingleTest(RandomizedRunner.java:943)
	at com.carrotsearch.randomizedtesting.RandomizedRunner$5.evaluate(RandomizedRunner.java:829)
	at com.carrotsearch.randomizedtesting.RandomizedRunner$6.evaluate(RandomizedRunner.java:879)
	at com.carrotsearch.randomizedtesting.RandomizedRunner$7.evaluate(RandomizedRunner.java:890)
	at com.carrotsearch.randomizedtesting.rules.StatementAdapter.evaluate(StatementAdapter.java:36)
	at com.carrotsearch.randomizedtesting.rules.SystemPropertiesRestoreRule$1.evaluate(SystemPropertiesRestoreRule.java:57)
	at org.apache.lucene.util.AbstractBeforeAfterRule$1.evaluate(AbstractBeforeAfterRule.java:45)
	at com.carrotsearch.randomizedtesting.rules.StatementAdapter.evaluate(StatementAdapter.java:36)
	at org.apache.lucene.util.TestRuleStoreClassName$1.evaluate(TestRuleStoreClassName.java:41)
	at com.carrotsearch.randomizedtesting.rules.NoShadowingOrOverridesOnMethodsRule$1.evaluate(NoShadowingOrOverridesOnMethodsRule.java:40)
	at com.carrotsearch.randomizedtesting.rules.NoShadowingOrOverridesOnMethodsRule$1.evaluate(NoShadowingOrOverridesOnMethodsRule.java:40)
	at com.carrotsearch.randomizedtesting.rules.StatementAdapter.evaluate(StatementAdapter.java:36)
	at com.carrotsearch.randomizedtesting.rules.StatementAdapter.evaluate(StatementAdapter.java:36)
	at com.carrotsearch.randomizedtesting.rules.StatementAdapter.evaluate(StatementAdapter.java:36)
	at org.apache.lucene.util.TestRuleAssertionsRequired$1.evaluate(TestRuleAssertionsRequired.java:53)
	at org.apache.lucene.util.TestRuleMarkFailure$1.evaluate(TestRuleMarkFailure.java:47)
	at org.apache.lucene.util.TestRuleIgnoreAfterMaxFailures$1.evaluate(TestRuleIgnoreAfterMaxFailures.java:64)
	at org.apache.lucene.util.TestRuleIgnoreTestSuites$1.evaluate(TestRuleIgnoreTestSuites.java:54)
	at com.carrotsearch.randomizedtesting.rules.StatementAdapter.evaluate(StatementAdapter.java:36)
	at com.carrotsearch.randomizedtesting.ThreadLeakControl$StatementRunner.run(ThreadLeakControl.java:368)
	at java.lang.Thread.run(Thread.java:748)


FAILED:  junit.framework.TestSuite.org.apache.solr.handler.component.DistributedFacetPivotLargeTest

Error Message:
Could not remove the following files (in the order of attempts):    C:\Users\jenkins\workspace\Lucene-Solr-master-Windows\solr\build\solr-core\test\J1\temp\solr.handler.component.DistributedFacetPivotLargeTest_57C3C4D211BD0C41-001\tempDir-001: java.nio.file.DirectoryNotEmptyException: C:\Users\jenkins\workspace\Lucene-Solr-master-Windows\solr\build\solr-core\test\J1\temp\solr.handler.component.DistributedFacetPivotLargeTest_57C3C4D211BD0C41-001\tempDir-001    C:\Users\jenkins\workspace\Lucene-Solr-master-Windows\solr\build\solr-core\test\J1\temp\solr.handler.component.DistributedFacetPivotLargeTest_57C3C4D211BD0C41-001\tempDir-001\shard1: java.nio.file.AccessDeniedException: C:\Users\jenkins\workspace\Lucene-Solr-master-Windows\solr\build\solr-core\test\J1\temp\solr.handler.component.DistributedFacetPivotLargeTest_57C3C4D211BD0C41-001\tempDir-001\shard1    C:\Users\jenkins\workspace\Lucene-Solr-master-Windows\solr\build\solr-core\test\J1\temp\solr.handler.component.DistributedFacetPivotLargeTest_57C3C4D211BD0C41-001: java.nio.file.DirectoryNotEmptyException: C:\Users\jenkins\workspace\Lucene-Solr-master-Windows\solr\build\solr-core\test\J1\temp\solr.handler.component.DistributedFacetPivotLargeTest_57C3C4D211BD0C41-001 

Stack Trace:
java.io.IOException: Could not remove the following files (in the order of attempts):
   C:\Users\jenkins\workspace\Lucene-Solr-master-Windows\solr\build\solr-core\test\J1\temp\solr.handler.component.DistributedFacetPivotLargeTest_57C3C4D211BD0C41-001\tempDir-001: java.nio.file.DirectoryNotEmptyException: C:\Users\jenkins\workspace\Lucene-Solr-master-Windows\solr\build\solr-core\test\J1\temp\solr.handler.component.DistributedFacetPivotLargeTest_57C3C4D211BD0C41-001\tempDir-001
   C:\Users\jenkins\workspace\Lucene-Solr-master-Windows\solr\build\solr-core\test\J1\temp\solr.handler.component.DistributedFacetPivotLargeTest_57C3C4D211BD0C41-001\tempDir-001\shard1: java.nio.file.AccessDeniedException: C:\Users\jenkins\workspace\Lucene-Solr-master-Windows\solr\build\solr-core\test\J1\temp\solr.handler.component.DistributedFacetPivotLargeTest_57C3C4D211BD0C41-001\tempDir-001\shard1
   C:\Users\jenkins\workspace\Lucene-Solr-master-Windows\solr\build\solr-core\test\J1\temp\solr.handler.component.DistributedFacetPivotLargeTest_57C3C4D211BD0C41-001: java.nio.file.DirectoryNotEmptyException: C:\Users\jenkins\workspace\Lucene-Solr-master-Windows\solr\build\solr-core\test\J1\temp\solr.handler.component.DistributedFacetPivotLargeTest_57C3C4D211BD0C41-001

	at __randomizedtesting.SeedInfo.seed([57C3C4D211BD0C41]:0)
	at org.apache.lucene.util.IOUtils.rm(IOUtils.java:329)
	at org.apache.lucene.util.TestRuleTemporaryFilesCleanup.afterAlways(TestRuleTemporaryFilesCleanup.java:216)
	at com.carrotsearch.randomizedtesting.rules.TestRuleAdapter$1.afterAlways(TestRuleAdapter.java:31)
	at com.carrotsearch.randomizedtesting.rules.StatementAdapter.evaluate(StatementAdapter.java:43)
	at com.carrotsearch.randomizedtesting.rules.StatementAdapter.evaluate(StatementAdapter.java:36)
	at org.apache.lucene.util.TestRuleAssertionsRequired$1.evaluate(TestRuleAssertionsRequired.java:53)
	at org.apache.lucene.util.TestRuleMarkFailure$1.evaluate(TestRuleMarkFailure.java:47)
	at org.apache.lucene.util.TestRuleIgnoreAfterMaxFailures$1.evaluate(TestRuleIgnoreAfterMaxFailures.java:64)
	at org.apache.lucene.util.TestRuleIgnoreTestSuites$1.evaluate(TestRuleIgnoreTestSuites.java:54)
	at com.carrotsearch.randomizedtesting.rules.StatementAdapter.evaluate(StatementAdapter.java:36)
	at com.carrotsearch.randomizedtesting.ThreadLeakControl$StatementRunner.run(ThreadLeakControl.java:368)
	at java.lang.Thread.run(Thread.java:748)


FAILED:  org.apache.solr.update.processor.TimeRoutedAliasUpdateProcessorTest.test

Error Message:
expected:<4> but was:<3>

Stack Trace:
java.lang.AssertionError: expected:<4> but was:<3>
	at __randomizedtesting.SeedInfo.seed([57C3C4D211BD0C41:DF97FB08BF4161B9]:0)
	at org.junit.Assert.fail(Assert.java:93)
	at org.junit.Assert.failNotEquals(Assert.java:647)
	at org.junit.Assert.assertEquals(Assert.java:128)
	at org.junit.Assert.assertEquals(Assert.java:472)
	at org.junit.Assert.assertEquals(Assert.java:456)
	at org.apache.solr.update.processor.TimeRoutedAliasUpdateProcessorTest.assertInvariants(TimeRoutedAliasUpdateProcessorTest.java:326)
	at org.apache.solr.update.processor.TimeRoutedAliasUpdateProcessorTest.test(TimeRoutedAliasUpdateProcessorTest.java:174)
	at sun.reflect.NativeMethodAccessorImpl.invoke0(Native Method)
	at sun.reflect.NativeMethodAccessorImpl.invoke(NativeMethodAccessorImpl.java:62)
	at sun.reflect.DelegatingMethodAccessorImpl.invoke(DelegatingMethodAccessorImpl.java:43)
	at java.lang.reflect.Method.invoke(Method.java:498)
	at com.carrotsearch.randomizedtesting.RandomizedRunner.invoke(RandomizedRunner.java:1737)
	at com.carrotsearch.randomizedtesting.RandomizedRunner$8.evaluate(RandomizedRunner.java:934)
	at com.carrotsearch.randomizedtesting.RandomizedRunner$9.evaluate(RandomizedRunner.java:970)
	at com.carrotsearch.randomizedtesting.RandomizedRunner$10.evaluate(RandomizedRunner.java:984)
	at com.carrotsearch.randomizedtesting.rules.SystemPropertiesRestoreRule$1.evaluate(SystemPropertiesRestoreRule.java:57)
	at org.apache.lucene.util.TestRuleSetupTeardownChained$1.evaluate(TestRuleSetupTeardownChained.java:49)
	at org.apache.lucene.util.AbstractBeforeAfterRule$1.evaluate(AbstractBeforeAfterRule.java:45)
	at org.apache.lucene.util.TestRuleThreadAndTestName$1.evaluate(TestRuleThreadAndTestName.java:48)
	at org.apache.lucene.util.TestRuleIgnoreAfterMaxFailures$1.evaluate(TestRuleIgnoreAfterMaxFailures.java:64)
	at org.apache.lucene.util.TestRuleMarkFailure$1.evaluate(TestRuleMarkFailure.java:47)
	at com.carrotsearch.randomizedtesting.rules.StatementAdapter.evaluate(StatementAdapter.java:36)
	at com.carrotsearch.randomizedtesting.ThreadLeakControl$StatementRunner.run(ThreadLeakControl.java:368)
	at com.carrotsearch.randomizedtesting.ThreadLeakControl.forkTimeoutingTask(ThreadLeakControl.java:817)
	at com.carrotsearch.randomizedtesting.ThreadLeakControl$3.evaluate(ThreadLeakControl.java:468)
	at com.carrotsearch.randomizedtesting.RandomizedRunner.runSingleTest(RandomizedRunner.java:943)
	at com.carrotsearch.randomizedtesting.RandomizedRunner$5.evaluate(RandomizedRunner.java:829)
	at com.carrotsearch.randomizedtesting.RandomizedRunner$6.evaluate(RandomizedRunner.java:879)
	at com.carrotsearch.randomizedtesting.RandomizedRunner$7.evaluate(RandomizedRunner.java:890)
	at com.carrotsearch.randomizedtesting.rules.StatementAdapter.evaluate(StatementAdapter.java:36)
	at com.carrotsearch.randomizedtesting.rules.SystemPropertiesRestoreRule$1.evaluate(SystemPropertiesRestoreRule.java:57)
	at org.apache.lucene.util.AbstractBeforeAfterRule$1.evaluate(AbstractBeforeAfterRule.java:45)
	at com.carrotsearch.randomizedtesting.rules.StatementAdapter.evaluate(StatementAdapter.java:36)
	at org.apache.lucene.util.TestRuleStoreClassName$1.evaluate(TestRuleStoreClassName.java:41)
	at com.carrotsearch.randomizedtesting.rules.NoShadowingOrOverridesOnMethodsRule$1.evaluate(NoShadowingOrOverridesOnMethodsRule.java:40)
	at com.carrotsearch.randomizedtesting.rules.NoShadowingOrOverridesOnMethodsRule$1.evaluate(NoShadowingOrOverridesOnMethodsRule.java:40)
	at com.carrotsearch.randomizedtesting.rules.StatementAdapter.evaluate(StatementAdapter.java:36)
	at com.carrotsearch.randomizedtesting.rules.StatementAdapter.evaluate(StatementAdapter.java:36)
	at com.carrotsearch.randomizedtesting.rules.StatementAdapter.evaluate(StatementAdapter.java:36)
	at org.apache.lucene.util.TestRuleAssertionsRequired$1.evaluate(TestRuleAssertionsRequired.java:53)
	at org.apache.lucene.util.TestRuleMarkFailure$1.evaluate(TestRuleMarkFailure.java:47)
	at org.apache.lucene.util.TestRuleIgnoreAfterMaxFailures$1.evaluate(TestRuleIgnoreAfterMaxFailures.java:64)
	at org.apache.lucene.util.TestRuleIgnoreTestSuites$1.evaluate(TestRuleIgnoreTestSuites.java:54)
	at com.carrotsearch.randomizedtesting.rules.StatementAdapter.evaluate(StatementAdapter.java:36)
	at com.carrotsearch.randomizedtesting.ThreadLeakControl$StatementRunner.run(ThreadLeakControl.java:368)
	at java.lang.Thread.run(Thread.java:748)


FAILED:  junit.framework.TestSuite.org.apache.solr.update.processor.TestOpenNLPExtractNamedEntitiesUpdateProcessorFactory

Error Message:
Could not remove the following files (in the order of attempts):    C:\Users\jenkins\workspace\Lucene-Solr-master-Windows\solr\build\contrib\solr-analysis-extras\test\J1\temp\solr.update.processor.TestOpenNLPExtractNamedEntitiesUpdateProcessorFactory_859511E06EDD0AA4-001\tempDir-001\collection1\conf: java.nio.file.DirectoryNotEmptyException: C:\Users\jenkins\workspace\Lucene-Solr-master-Windows\solr\build\contrib\solr-analysis-extras\test\J1\temp\solr.update.processor.TestOpenNLPExtractNamedEntitiesUpdateProcessorFactory_859511E06EDD0AA4-001\tempDir-001\collection1\conf    C:\Users\jenkins\workspace\Lucene-Solr-master-Windows\solr\build\contrib\solr-analysis-extras\test\J1\temp\solr.update.processor.TestOpenNLPExtractNamedEntitiesUpdateProcessorFactory_859511E06EDD0AA4-001\tempDir-001\collection1: java.nio.file.DirectoryNotEmptyException: C:\Users\jenkins\workspace\Lucene-Solr-master-Windows\solr\build\contrib\solr-analysis-extras\test\J1\temp\solr.update.processor.TestOpenNLPExtractNamedEntitiesUpdateProcessorFactory_859511E06EDD0AA4-001\tempDir-001\collection1    C:\Users\jenkins\workspace\Lucene-Solr-master-Windows\solr\build\contrib\solr-analysis-extras\test\J1\temp\solr.update.processor.TestOpenNLPExtractNamedEntitiesUpdateProcessorFactory_859511E06EDD0AA4-001\tempDir-001: java.nio.file.DirectoryNotEmptyException: C:\Users\jenkins\workspace\Lucene-Solr-master-Windows\solr\build\contrib\solr-analysis-extras\test\J1\temp\solr.update.processor.TestOpenNLPExtractNamedEntitiesUpdateProcessorFactory_859511E06EDD0AA4-001\tempDir-001    C:\Users\jenkins\workspace\Lucene-Solr-master-Windows\solr\build\contrib\solr-analysis-extras\test\J1\temp\solr.update.processor.TestOpenNLPExtractNamedEntitiesUpdateProcessorFactory_859511E06EDD0AA4-001\tempDir-001\collection1\conf\en-test-sent.bin: java.nio.file.AccessDeniedException: C:\Users\jenkins\workspace\Lucene-Solr-master-Windows\solr\build\contrib\solr-analysis-extras\test\J1\temp\solr.update.processor.TestOpenNLPExtractNamedEntitiesUpdateProcessorFactory_859511E06EDD0AA4-001\tempDir-001\collection1\conf\en-test-sent.bin    C:\Users\jenkins\workspace\Lucene-Solr-master-Windows\solr\build\contrib\solr-analysis-extras\test\J1\temp\solr.update.processor.TestOpenNLPExtractNamedEntitiesUpdateProcessorFactory_859511E06EDD0AA4-001\tempDir-001\collection1\conf\en-test-ner-person.bin: java.nio.file.AccessDeniedException: C:\Users\jenkins\workspace\Lucene-Solr-master-Windows\solr\build\contrib\solr-analysis-extras\test\J1\temp\solr.update.processor.TestOpenNLPExtractNamedEntitiesUpdateProcessorFactory_859511E06EDD0AA4-001\tempDir-001\collection1\conf\en-test-ner-person.bin    C:\Users\jenkins\workspace\Lucene-Solr-master-Windows\solr\build\contrib\solr-analysis-extras\test\J1\temp\solr.update.processor.TestOpenNLPExtractNamedEntitiesUpdateProcessorFactory_859511E06EDD0AA4-001\tempDir-001\collection1\conf\en-test-tokenizer.bin: java.nio.file.AccessDeniedException: C:\Users\jenkins\workspace\Lucene-Solr-master-Windows\solr\build\contrib\solr-analysis-extras\test\J1\temp\solr.update.processor.TestOpenNLPExtractNamedEntitiesUpdateProcessorFactory_859511E06EDD0AA4-001\tempDir-001\collection1\conf\en-test-tokenizer.bin    C:\Users\jenkins\workspace\Lucene-Solr-master-Windows\solr\build\contrib\solr-analysis-extras\test\J1\temp\solr.update.processor.TestOpenNLPExtractNamedEntitiesUpdateProcessorFactory_859511E06EDD0AA4-001: java.nio.file.DirectoryNotEmptyException: C:\Users\jenkins\workspace\Lucene-Solr-master-Windows\solr\build\contrib\solr-analysis-extras\test\J1\temp\solr.update.processor.TestOpenNLPExtractNamedEntitiesUpdateProcessorFactory_859511E06EDD0AA4-001 

Stack Trace:
java.io.IOException: Could not remove the following files (in the order of attempts):
   C:\Users\jenkins\workspace\Lucene-Solr-master-Windows\solr\build\contrib\solr-analysis-extras\test\J1\temp\solr.update.processor.TestOpenNLPExtractNamedEntitiesUpdateProcessorFactory_859511E06EDD0AA4-001\tempDir-001\collection1\conf: java.nio.file.DirectoryNotEmptyException: C:\Users\jenkins\workspace\Lucene-Solr-master-Windows\solr\build\contrib\solr-analysis-extras\test\J1\temp\solr.update.processor.TestOpenNLPExtractNamedEntitiesUpdateProcessorFactory_859511E06EDD0AA4-001\tempDir-001\collection1\conf
   C:\Users\jenkins\workspace\Lucene-Solr-master-Windows\solr\build\contrib\solr-analysis-extras\test\J1\temp\solr.update.processor.TestOpenNLPExtractNamedEntitiesUpdateProcessorFactory_859511E06EDD0AA4-001\tempDir-001\collection1: java.nio.file.DirectoryNotEmptyException: C:\Users\jenkins\workspace\Lucene-Solr-master-Windows\solr\build\contrib\solr-analysis-extras\test\J1\temp\solr.update.processor.TestOpenNLPExtractNamedEntitiesUpdateProcessorFactory_859511E06EDD0AA4-001\tempDir-001\collection1
   C:\Users\jenkins\workspace\Lucene-Solr-master-Windows\solr\build\contrib\solr-analysis-extras\test\J1\temp\solr.update.processor.TestOpenNLPExtractNamedEntitiesUpdateProcessorFactory_859511E06EDD0AA4-001\tempDir-001: java.nio.file.DirectoryNotEmptyException: C:\Users\jenkins\workspace\Lucene-Solr-master-Windows\solr\build\contrib\solr-analysis-extras\test\J1\temp\solr.update.processor.TestOpenNLPExtractNamedEntitiesUpdateProcessorFactory_859511E06EDD0AA4-001\tempDir-001
   C:\Users\jenkins\workspace\Lucene-Solr-master-Windows\solr\build\contrib\solr-analysis-extras\test\J1\temp\solr.update.processor.TestOpenNLPExtractNamedEntitiesUpdateProcessorFactory_859511E06EDD0AA4-001\tempDir-001\collection1\conf\en-test-sent.bin: java.nio.file.AccessDeniedException: C:\Users\jenkins\workspace\Lucene-Solr-master-Windows\solr\build\contrib\solr-analysis-extras\test\J1\temp\solr.update.processor.TestOpenNLPExtractNamedEntitiesUpdateProcessorFactory_859511E06EDD0AA4-001\tempDir-001\collection1\conf\en-test-sent.bin
   C:\Users\jenkins\workspace\Lucene-Solr-master-Windows\solr\build\contrib\solr-analysis-extras\test\J1\temp\solr.update.processor.TestOpenNLPExtractNamedEntitiesUpdateProcessorFactory_859511E06EDD0AA4-001\tempDir-001\collection1\conf\en-test-ner-person.bin: java.nio.file.AccessDeniedException: C:\Users\jenkins\workspace\Lucene-Solr-master-Windows\solr\build\contrib\solr-analysis-extras\test\J1\temp\solr.update.processor.TestOpenNLPExtractNamedEntitiesUpdateProcessorFactory_859511E06EDD0AA4-001\tempDir-001\collection1\conf\en-test-ner-person.bin
   C:\Users\jenkins\workspace\Lucene-Solr-master-Windows\solr\build\contrib\solr-analysis-extras\test\J1\temp\solr.update.processor.TestOpenNLPExtractNamedEntitiesUpdateProcessorFactory_859511E06EDD0AA4-001\tempDir-001\collection1\conf\en-test-tokenizer.bin: java.nio.file.AccessDeniedException: C:\Users\jenkins\workspace\Lucene-Solr-master-Windows\solr\build\contrib\solr-analysis-extras\test\J1\temp\solr.update.processor.TestOpenNLPExtractNamedEntitiesUpdateProcessorFactory_859511E06EDD0AA4-001\tempDir-001\collection1\conf\en-test-tokenizer.bin
   C:\Users\jenkins\workspace\Lucene-Solr-master-Windows\solr\build\contrib\solr-analysis-extras\test\J1\temp\solr.update.processor.TestOpenNLPExtractNamedEntitiesUpdateProcessorFactory_859511E06EDD0AA4-001: java.nio.file.DirectoryNotEmptyException: C:\Users\jenkins\workspace\Lucene-Solr-master-Windows\solr\build\contrib\solr-analysis-extras\test\J1\temp\solr.update.processor.TestOpenNLPExtractNamedEntitiesUpdateProcessorFactory_859511E06EDD0AA4-001

	at __randomizedtesting.SeedInfo.seed([859511E06EDD0AA4]:0)
	at org.apache.lucene.util.IOUtils.rm(IOUtils.java:329)
	at org.apache.lucene.util.TestRuleTemporaryFilesCleanup.afterAlways(TestRuleTemporaryFilesCleanup.java:216)
	at com.carrotsearch.randomizedtesting.rules.TestRuleAdapter$1.afterAlways(TestRuleAdapter.java:31)
	at com.carrotsearch.randomizedtesting.rules.StatementAdapter.evaluate(StatementAdapter.java:43)
	at com.carrotsearch.randomizedtesting.rules.StatementAdapter.evaluate(StatementAdapter.java:36)
	at org.apache.lucene.util.TestRuleAssertionsRequired$1.evaluate(TestRuleAssertionsRequired.java:53)
	at org.apache.lucene.util.TestRuleMarkFailure$1.evaluate(TestRuleMarkFailure.java:47)
	at org.apache.lucene.util.TestRuleIgnoreAfterMaxFailures$1.evaluate(TestRuleIgnoreAfterMaxFailures.java:64)
	at org.apache.lucene.util.TestRuleIgnoreTestSuites$1.evaluate(TestRuleIgnoreTestSuites.java:54)
	at com.carrotsearch.randomizedtesting.rules.StatementAdapter.evaluate(StatementAdapter.java:36)
	at com.carrotsearch.randomizedtesting.ThreadLeakControl$StatementRunner.run(ThreadLeakControl.java:368)
	at java.lang.Thread.run(Thread.java:748)




Build Log:
[...truncated 4777 lines...]
   [junit4] Suite: org.apache.lucene.index.TestBackwardsCompatibility
   [junit4] IGNOR/A 0.00s J1 | TestBackwardsCompatibility.testCreateNoCFS
   [junit4]    > Assumption #1: backcompat creation tests must be run with -Dtests.bwcdir=/path/to/write/indexes
   [junit4] IGNOR/A 0.00s J1 | TestBackwardsCompatibility.testCreateSingleSegmentNoCFS
   [junit4]    > Assumption #1: backcompat creation tests must be run with -Dtests.bwcdir=/path/to/write/indexes
   [junit4] IGNOR/A 0.00s J1 | TestBackwardsCompatibility.testCreateSortedIndex
   [junit4]    > Assumption #1: backcompat creation tests must be run with -Dtests.bwcdir=/path/to/write/indexes
   [junit4] IGNOR/A 0.00s J1 | TestBackwardsCompatibility.testCreateMoreTermsIndex
   [junit4]    > Assumption #1: backcompat creation tests must be run with -Dtests.bwcdir=/path/to/write/indexes
   [junit4] IGNOR/A 0.00s J1 | TestBackwardsCompatibility.testCreateSingleSegmentCFS
   [junit4]    > Assumption #1: backcompat creation tests must be run with -Dtests.bwcdir=/path/to/write/indexes
   [junit4] IGNOR/A 0.00s J1 | TestBackwardsCompatibility.testCreateIndexWithDocValuesUpdates
   [junit4]    > Assumption #1: backcompat creation tests must be run with -Dtests.bwcdir=/path/to/write/indexes
   [junit4] IGNOR/A 0.00s J1 | TestBackwardsCompatibility.testCreateCFS
   [junit4]    > Assumption #1: backcompat creation tests must be run with -Dtests.bwcdir=/path/to/write/indexes
   [junit4] IGNOR/A 0.00s J1 | TestBackwardsCompatibility.testCreateEmptyIndex
   [junit4]    > Assumption #1: backcompat creation tests must be run with -Dtests.bwcdir=/path/to/write/indexes
   [junit4]   2> NOTE: test params are: codec=Asserting(Lucene70): {content6=PostingsFormat(name=LuceneVarGapFixedInterval), content5=PostingsFormat(name=MockRandom), content4=Lucene50(blocksize=128), content3=PostingsFormat(name=LuceneFixedGap), content2=PostingsFormat(name=LuceneVarGapFixedInterval), fie?ld=PostingsFormat(name=LuceneVarGapFixedInterval), utf8=PostingsFormat(name=LuceneVarGapFixedInterval), id=Lucene50(blocksize=128), content=PostingsFormat(name=LuceneVarGapFixedInterval), autf8=PostingsFormat(name=MockRandom)}, docValues:{ndv2=DocValuesFormat(name=Memory), ndv1=DocValuesFormat(name=Lucene70), utf8=DocValuesFormat(name=Lucene70), fie?ld=DocValuesFormat(name=Lucene70), dvShort=DocValuesFormat(name=Memory), dvInt=DocValuesFormat(name=Lucene70), longPoint2d=DocValuesFormat(name=Asserting), dvBytesSortedVar=DocValuesFormat(name=Lucene70), dvSortedSet=DocValuesFormat(name=Lucene70), content=DocValuesFormat(name=Lucene70), floatPoint1d=DocValuesFormat(name=Lucene70), bdv2=DocValuesFormat(name=Memory), bdv2_c=DocValuesFormat(name=Asserting), intPoint1d=DocValuesFormat(name=Asserting), bdv1=DocValuesFormat(name=Lucene70), bdv1_c=DocValuesFormat(name=Lucene70), doublePoint2d=DocValuesFormat(name=Lucene70), dvBytesDerefVar=DocValuesFormat(name=Memory), id=DocValuesFormat(name=Lucene70), binaryPoint2d=DocValuesFormat(name=Lucene70), dvSortedNumeric=DocValuesFormat(name=Asserting), dvBytesDerefFixed=DocValuesFormat(name=Lucene70), autf8=DocValuesFormat(name=Memory), dvBytesSortedFixed=DocValuesFormat(name=Memory), dvBytesStraightVar=DocValuesFormat(name=Asserting), dvBytesStraightFixed=DocValuesFormat(name=Lucene70), dvLong=DocValuesFormat(name=Asserting), longPoint1d=DocValuesFormat(name=Lucene70), floatPoint2d=DocValuesFormat(name=Memory), dvDouble=DocValuesFormat(name=Lucene70), dvFloat=DocValuesFormat(name=Memory), content6=DocValuesFormat(name=Lucene70), content5=DocValuesFormat(name=Memory), dvPacked=DocValuesFormat(name=Asserting), intPoint2d=DocValuesFormat(name=Lucene70), content4=DocValuesFormat(name=Lucene70), content3=DocValuesFormat(name=Asserting), content2=DocValuesFormat(name=Lucene70), doublePoint1d=DocValuesFormat(name=Asserting), dvByte=DocValuesFormat(name=Asserting), ndv1_c=DocValuesFormat(name=Lucene70), ndv2_c=DocValuesFormat(name=Asserting), binaryPoint1d=DocValuesFormat(name=Memory)}, maxPointsInLeafNode=247, maxMBSortInHeap=5.500054830970821, sim=Asserting(org.apache.lucene.search.similarities.AssertingSimilarity@87a645), locale=he-IL, timezone=Asia/Nicosia
   [junit4]   2> NOTE: Windows 10 10.0 x86/Oracle Corporation 1.8.0_144 (32-bit)/cpus=3,threads=1,free=39211896,total=64880640
   [junit4]   2> NOTE: All tests run in this JVM: [TestManyPointsInOldIndex, TestBackwardsCompatibility]
   [junit4]   2> NOTE: reproduce with: ant test  -Dtestcase=TestBackwardsCompatibility -Dtests.seed=2130331E460B6B4C -Dtests.slow=true -Dtests.locale=he-IL -Dtests.timezone=Asia/Nicosia -Dtests.asserts=true -Dtests.file.encoding=US-ASCII
   [junit4] ERROR   0.00s J1 | TestBackwardsCompatibility (suite) <<<
   [junit4]    > Throwable #1: java.io.IOException: Could not remove the following files (in the order of attempts):
   [junit4]    >    C:\Users\jenkins\workspace\Lucene-Solr-master-Windows\lucene\build\backward-codecs\test\J1\temp\lucene.index.TestBackwardsCompatibility_2130331E460B6B4C-001\2.3.0-cfs-001: java.nio.file.DirectoryNotEmptyException: C:\Users\jenkins\workspace\Lucene-Solr-master-Windows\lucene\build\backward-codecs\test\J1\temp\lucene.index.TestBackwardsCompatibility_2130331E460B6B4C-001\2.3.0-cfs-001
   [junit4]    > 	at __randomizedtesting.SeedInfo.seed([2130331E460B6B4C]:0)
   [junit4]    > 	at org.apache.lucene.util.IOUtils.rm(IOUtils.java:329)
   [junit4]    > 	at java.lang.Thread.run(Thread.java:748)
   [junit4] Completed [3/3 (1!)] on J1 in 14.92s, 30 tests, 1 error, 8 skipped <<< FAILURES!

[...truncated 6934 lines...]
   [junit4] Suite: org.apache.solr.MinimalSchemaTest
   [junit4]   2> 202836 INFO  (SUITE-MinimalSchemaTest-seed#[57C3C4D211BD0C41]-worker) [    ] o.a.s.SolrTestCaseJ4 SecureRandom sanity checks: test.solr.allowed.securerandom=null & java.security.egd=file:/dev/./urandom
   [junit4]   2> Creating dataDir: C:\Users\jenkins\workspace\Lucene-Solr-master-Windows\solr\build\solr-core\test\J1\temp\solr.MinimalSchemaTest_57C3C4D211BD0C41-001\init-core-data-001
   [junit4]   2> 202838 INFO  (SUITE-MinimalSchemaTest-seed#[57C3C4D211BD0C41]-worker) [    ] o.a.s.SolrTestCaseJ4 Using PointFields (NUMERIC_POINTS_SYSPROP=true) w/NUMERIC_DOCVALUES_SYSPROP=false
   [junit4]   2> 202839 INFO  (SUITE-MinimalSchemaTest-seed#[57C3C4D211BD0C41]-worker) [    ] o.a.s.SolrTestCaseJ4 Randomized ssl (false) and clientAuth (false) via: @org.apache.solr.util.RandomizeSSL(reason=, value=NaN, ssl=NaN, clientAuth=NaN)
   [junit4]   2> 202841 INFO  (SUITE-MinimalSchemaTest-seed#[57C3C4D211BD0C41]-worker) [    ] o.a.s.SolrTestCaseJ4 ####initCore
   [junit4]   2> 202843 INFO  (SUITE-MinimalSchemaTest-seed#[57C3C4D211BD0C41]-worker) [    ] o.a.s.c.SolrResourceLoader [null] Added 2 libs to classloader, from paths: [/C:/Users/jenkins/workspace/Lucene-Solr-master-Windows/solr/core/src/test-files/solr/collection1/lib, /C:/Users/jenkins/workspace/Lucene-Solr-master-Windows/solr/core/src/test-files/solr/collection1/lib/classes]
   [junit4]   2> 202940 INFO  (SUITE-MinimalSchemaTest-seed#[57C3C4D211BD0C41]-worker) [    ] o.a.s.c.SolrConfig Using Lucene MatchVersion: 8.0.0
   [junit4]   2> 202982 INFO  (SUITE-MinimalSchemaTest-seed#[57C3C4D211BD0C41]-worker) [    ] o.a.s.s.IndexSchema [null] Schema name=minimal
   [junit4]   2> 202985 WARN  (SUITE-MinimalSchemaTest-seed#[57C3C4D211BD0C41]-worker) [    ] o.a.s.s.IndexSchema no uniqueKey specified in schema.
   [junit4]   2> 202985 INFO  (SUITE-MinimalSchemaTest-seed#[57C3C4D211BD0C41]-worker) [    ] o.a.s.s.IndexSchema Loaded schema minimal/1.1 with uniqueid field null
   [junit4]   2> 203060 INFO  (SUITE-MinimalSchemaTest-seed#[57C3C4D211BD0C41]-worker) [    ] o.a.s.m.r.SolrJmxReporter JMX monitoring for 'solr.node' (registry 'solr.node') enabled at server: com.sun.jmx.mbeanserver.JmxMBeanServer@18b0a9a
   [junit4]   2> 203064 INFO  (SUITE-MinimalSchemaTest-seed#[57C3C4D211BD0C41]-worker) [    ] o.a.s.m.r.SolrJmxReporter JMX monitoring for 'solr.jvm' (registry 'solr.jvm') enabled at server: com.sun.jmx.mbeanserver.JmxMBeanServer@18b0a9a
   [junit4]   2> 203065 INFO  (SUITE-MinimalSchemaTest-seed#[57C3C4D211BD0C41]-worker) [    ] o.a.s.m.r.SolrJmxReporter JMX monitoring for 'solr.jetty' (registry 'solr.jetty') enabled at server: com.sun.jmx.mbeanserver.JmxMBeanServer@18b0a9a
   [junit4]   2> 203067 INFO  (coreLoadExecutor-955-thread-1) [    ] o.a.s.c.TransientSolrCoreCacheDefault Allocating transient cache for 2147483647 transient cores
   [junit4]   2> 203068 INFO  (coreLoadExecutor-955-thread-1) [    x:collection1] o.a.s.c.SolrResourceLoader [null] Added 2 libs to classloader, from paths: [/C:/Users/jenkins/workspace/Lucene-Solr-master-Windows/solr/core/src/test-files/solr/collection1/lib, /C:/Users/jenkins/workspace/Lucene-Solr-master-Windows/solr/core/src/test-files/solr/collection1/lib/classes]
   [junit4]   2> 203138 INFO  (coreLoadExecutor-955-thread-1) [    x:collection1] o.a.s.c.SolrConfig Using Lucene MatchVersion: 8.0.0
   [junit4]   2> 203157 INFO  (coreLoadExecutor-955-thread-1) [    x:collection1] o.a.s.s.IndexSchema [collection1] Schema name=minimal
   [junit4]   2> 203164 WARN  (coreLoadExecutor-955-thread-1) [    x:collection1] o.a.s.s.IndexSchema no uniqueKey specified in schema.
   [junit4]   2> 203164 INFO  (coreLoadExecutor-955-thread-1) [    x:collection1] o.a.s.s.IndexSchema Loaded schema minimal/1.1 with uniqueid field null
   [junit4]   2> 203164 INFO  (coreLoadExecutor-955-thread-1) [    x:collection1] o.a.s.c.CoreContainer Creating SolrCore 'collection1' using configuration from instancedir C:\Users\jenkins\workspace\Lucene-Solr-master-Windows\solr\core\src\test-files\solr\collection1, trusted=true
   [junit4]   2> 203164 INFO  (coreLoadExecutor-955-thread-1) [    x:collection1] o.a.s.m.r.SolrJmxReporter JMX monitoring for 'solr.core.collection1' (registry 'solr.core.collection1') enabled at server: com.sun.jmx.mbeanserver.JmxMBeanServer@18b0a9a
   [junit4]   2> 203165 INFO  (coreLoadExecutor-955-thread-1) [    x:collection1] o.a.s.c.SolrCore solr.RecoveryStrategy.Builder
   [junit4]   2> 203165 INFO  (coreLoadExecutor-955-thread-1) [    x:collection1] o.a.s.c.SolrCore [[collection1] ] Opening new SolrCore at [C:\Users\jenkins\workspace\Lucene-Solr-master-Windows\solr\core\src\test-files\solr\collection1], dataDir=[C:\Users\jenkins\workspace\Lucene-Solr-master-Windows\solr\build\solr-core\test\J1\temp\solr.MinimalSchemaTest_57C3C4D211BD0C41-001\init-core-data-001\]
   [junit4]   2> 203166 INFO  (coreLoadExecutor-955-thread-1) [    x:collection1] o.a.s.u.RandomMergePolicy RandomMergePolicy wrapping class org.apache.lucene.index.TieredMergePolicy: [TieredMergePolicy: maxMergeAtOnce=13, maxMergeAtOnceExplicit=14, maxMergedSegmentMB=82.013671875, floorSegmentMB=1.8115234375, forceMergeDeletesPctAllowed=16.108524682940985, segmentsPerTier=12.0, maxCFSSegmentSizeMB=8.796093022207999E12, noCFSRatio=0.8399691203330267
   [junit4]   2> 203709 INFO  (coreLoadExecutor-955-thread-1) [    x:collection1] o.a.s.u.UpdateHandler Using UpdateLog implementation: org.apache.solr.update.UpdateLog
   [junit4]   2> 203709 INFO  (coreLoadExecutor-955-thread-1) [    x:collection1] o.a.s.u.UpdateLog Initializing UpdateLog: dataDir= defaultSyncLevel=FLUSH numRecordsToKeep=100 maxNumLogsToKeep=10 numVersionBuckets=65536
   [junit4]   2> 203720 INFO  (coreLoadExecutor-955-thread-1) [    x:collection1] o.a.s.u.CommitTracker Hard AutoCommit: disabled
   [junit4]   2> 203722 INFO  (coreLoadExecutor-955-thread-1) [    x:collection1] o.a.s.u.CommitTracker Soft AutoCommit: disabled
   [junit4]   2> 203740 INFO  (coreLoadExecutor-955-thread-1) [    x:collection1] o.a.s.u.RandomMergePolicy RandomMergePolicy wrapping class org.apache.lucene.index.TieredMergePolicy: [TieredMergePolicy: maxMergeAtOnce=48, maxMergeAtOnceExplicit=12, maxMergedSegmentMB=68.68359375, floorSegmentMB=0.42578125, forceMergeDeletesPctAllowed=17.74294994902055, segmentsPerTier=47.0, maxCFSSegmentSizeMB=8.796093022207999E12, noCFSRatio=0.26702331470639806
   [junit4]   2> 203744 INFO  (coreLoadExecutor-955-thread-1) [    x:collection1] o.a.s.s.SolrIndexSearcher Opening [Searcher@1b992e8[collection1] main]
   [junit4]   2> 203749 INFO  (coreLoadExecutor-955-thread-1) [    x:collection1] o.a.s.h.c.SpellCheckComponent Initializing spell checkers
   [junit4]   2> 203874 INFO  (coreLoadExecutor-955-thread-1) [    x:collection1] o.a.s.s.DirectSolrSpellChecker init: {name=direct,classname=DirectSolrSpellChecker,field=lowerfilt,minQueryLength=3}
   [junit4]   2> 204107 INFO  (coreLoadExecutor-955-thread-1) [    x:collection1] o.a.s.h.ReplicationHandler Commits will be reserved for 10000ms.
   [junit4]   2> 204108 INFO  (coreLoadExecutor-955-thread-1) [    x:collection1] o.a.s.u.UpdateLog Could not find max version in index or recent updates, using new clock 1590646911053856768
   [junit4]   2> 204117 INFO  (searcherExecutor-956-thread-1-processing-x:collection1) [    x:collection1] o.a.s.h.c.SpellCheckComponent Loading spell index for spellchecker: default
   [junit4]   2> 204118 INFO  (searcherExecutor-956-thread-1-processing-x:collection1) [    x:collection1] o.a.s.h.c.SpellCheckComponent Loading spell index for spellchecker: direct
   [junit4]   2> 204118 INFO  (searcherExecutor-956-thread-1-processing-x:collection1) [    x:collection1] o.a.s.h.c.SpellCheckComponent Loading spell index for spellchecker: wordbreak
   [junit4]   2> 204118 INFO  (searcherExecutor-956-thread-1-processing-x:collection1) [    x:collection1] o.a.s.h.c.SpellCheckComponent Loading spell index for spellchecker: multipleFields
   [junit4]   2> 204125 INFO  (searcherExecutor-956-thread-1-processing-x:collection1) [    x:collection1] o.a.s.h.c.SpellCheckComponent Loading spell index for spellchecker: jarowinkler
   [junit4]   2> 204131 INFO  (searcherExecutor-956-thread-1-processing-x:collection1) [    x:collection1] o.a.s.h.c.SpellCheckComponent Loading spell index for spellchecker: external
   [junit4]   2> 204131 INFO  (searcherExecutor-956-thread-1-processing-x:collection1) [    x:collection1] o.a.s.h.c.SpellCheckComponent Loading spell index for spellchecker: freq
   [junit4]   2> 204140 INFO  (SUITE-MinimalSchemaTest-seed#[57C3C4D211BD0C41]-worker) [    ] o.a.s.SolrTestCaseJ4 ####initCore end
   [junit4]   2> 204147 INFO  (searcherExecutor-956-thread-1-processing-x:collection1) [    x:collection1] o.a.s.h.c.SpellCheckComponent Loading spell index for spellchecker: fqcn
   [junit4]   2> 204147 INFO  (searcherExecutor-956-thread-1-processing-x:collection1) [    x:collection1] o.a.s.h.c.SpellCheckComponent Loading spell index for spellchecker: perDict
   [junit4]   2> 204156 INFO  (searcherExecutor-956-thread-1-processing-x:collection1) [    x:collection1] o.a.s.c.SolrCore [collection1] Registered new searcher Searcher@1b992e8[collection1] main{ExitableDirectoryReader(UninvertingDirectoryReader())}
   [junit4]   2> 204180 INFO  (SUITE-MinimalSchemaTest-seed#[57C3C4D211BD0C41]-worker) [    ] o.a.s.u.p.LogUpdateProcessorFactory [collection1]  webapp=null path=null params={}{add=[(null)]} 0 38
   [junit4]   2> 204190 INFO  (SUITE-MinimalSchemaTest-seed#[57C3C4D211BD0C41]-worker) [    ] o.a.s.u.p.LogUpdateProcessorFactory [collection1]  webapp=null path=null params={}{add=[(null)]} 0 1
   [junit4]   2> 204191 INFO  (SUITE-MinimalSchemaTest-seed#[57C3C4D211BD0C41]-worker) [    ] o.a.s.u.DirectUpdateHandler2 start commit{_version_=1590646911140888576,optimize=false,openSearcher=true,waitSearcher=true,expungeDeletes=false,softCommit=false,prepareCommit=false}
   [junit4]   2> 204191 INFO  (SUITE-MinimalSchemaTest-seed#[57C3C4D211BD0C41]-worker) [    ] o.a.s.u.SolrIndexWriter Calling setCommitData with IW:org.apache.solr.update.SolrIndexWriter@f8475b commitCommandVersion:1590646911140888576
   [junit4]   2> 204710 INFO  (SUITE-MinimalSchemaTest-seed#[57C3C4D211BD0C41]-worker) [    ] o.a.s.s.SolrIndexSearcher Opening [Searcher@102d43b[collection1] main]
   [junit4]   2> 204712 INFO  (SUITE-MinimalSchemaTest-seed#[57C3C4D211BD0C41]-worker) [    ] o.a.s.u.DirectUpdateHandler2 end_commit_flush
   [junit4]   2> 204713 INFO  (searcherExecutor-956-thread-1) [    ] o.a.s.c.SolrCore [collection1] Registered new searcher Searcher@102d43b[collection1] main{ExitableDirectoryReader(UninvertingDirectoryReader(Uninverting(_0(8.0.0):c2)))}
   [junit4]   2> 204713 INFO  (SUITE-MinimalSchemaTest-seed#[57C3C4D211BD0C41]-worker) [    ] o.a.s.u.p.LogUpdateProcessorFactory [collection1]  webapp=null path=null params={}{commit=} 0 523
   [junit4]   2> 204714 INFO  (SUITE-MinimalSchemaTest-seed#[57C3C4D211BD0C41]-worker) [    ] o.a.s.u.DirectUpdateHandler2 start commit{_version_=1590646911689293824,optimize=true,openSearcher=true,waitSearcher=true,expungeDeletes=false,softCommit=false,prepareCommit=false}
   [junit4]   2> 204714 WARN  (SUITE-MinimalSchemaTest-seed#[57C3C4D211BD0C41]-worker) [    ] o.a.s.u.DirectUpdateHandler2 Starting optimize... Reading and rewriting the entire index! Use with care.
   [junit4]   2> 204873 INFO  (SUITE-MinimalSchemaTest-seed#[57C3C4D211BD0C41]-worker) [    ] o.a.s.u.SolrIndexWriter Calling setCommitData with IW:org.apache.solr.update.SolrIndexWriter@f8475b commitCommandVersion:1590646911689293824
   [junit4]   2> 204954 INFO  (SUITE-MinimalSchemaTest-seed#[57C3C4D211BD0C41]-worker) [    ] o.a.s.s.SolrIndexSearcher Opening [Searcher@6b3ec4[collection1] main]
   [junit4]   2> 204955 INFO  (searcherExecutor-956-thread-1) [    ] o.a.s.c.SolrCore [collection1] Registered new searcher Searcher@6b3ec4[collection1] main{ExitableDirectoryReader(UninvertingDirectoryReader(Uninverting(_1(8.0.0):C2)))}
   [junit4]   2> 204955 INFO  (SUITE-MinimalSchemaTest-seed#[57C3C4D211BD0C41]-worker) [    ] o.a.s.u.DirectUpdateHandler2 end_commit_flush
   [junit4]   2> 204956 INFO  (SUITE-MinimalSchemaTest-seed#[57C3C4D211BD0C41]-worker) [    ] o.a.s.u.p.LogUpdateProcessorFactory [collection1]  webapp=null path=null params={}{optimize=} 0 242
   [junit4]   2> 204965 INFO  (TEST-MinimalSchemaTest.testSimpleQueries-seed#[57C3C4D211BD0C41]) [    ] o.a.s.SolrTestCaseJ4 ###Starting testSimpleQueries
   [junit4]   2> 204966 INFO  (TEST-MinimalSchemaTest.testSimpleQueries-seed#[57C3C4D211BD0C41]) [    ] o.a.s.c.S.Request [collection1]  webapp=null path=null params={q=subject:Hoss&qt=&start=0&rows=20&version=2.2} hits=1 status=0 QTime=0
   [junit4]   2> 204968 INFO  (TEST-MinimalSchemaTest.testSimpleQueries-seed#[57C3C4D211BD0C41]) [    ] o.a.s.c.S.Request [collection1]  webapp=null path=null params={q=subject:Yonik&qt=&start=0&rows=20&version=2.2} hits=1 status=0 QTime=0
   [junit4]   2> 204969 INFO  (TEST-MinimalSchemaTest.testSimpleQueries-seed#[57C3C4D211BD0C41]) [    ] o.a.s.SolrTestCaseJ4 ###Ending testSimpleQueries
   [junit4]   2> 204972 INFO  (TEST-MinimalSchemaTest.testLuke-seed#[57C3C4D211BD0C41]) [    ] o.a.s.SolrTestCaseJ4 ###Starting testLuke
   [junit4]   2> 204993 INFO  (TEST-MinimalSchemaTest.testLuke-seed#[57C3C4D211BD0C41]) [    ] o.a.s.c.S.Request [collection1]  webapp=null path=null params={qt=/admin/luke&wt=xml} status=0 QTime=19
   [junit4]   2> 205010 INFO  (TEST-MinimalSchemaTest.testLuke-seed#[57C3C4D211BD0C41]) [    ] o.a.s.c.S.Request [collection1]  webapp=null path=null params={qt=/admin/luke&show=schema&wt=xml} status=0 QTime=12
   [junit4]   2> 205011 INFO  (TEST-MinimalSchemaTest.testLuke-seed#[57C3C4D211BD0C41]) [    ] o.a.s.SolrTestCaseJ4 ###Ending testLuke
   [junit4]   2> 205015 INFO  (TEST-MinimalSchemaTest.testAllConfiguredHandlers-seed#[57C3C4D211BD0C41]) [    ] o.a.s.SolrTestCaseJ4 ###Starting testAllConfiguredHandlers
   [junit4]   2> 205016 INFO  (TEST-MinimalSchemaTest.testAllConfiguredHandlers-seed#[57C3C4D211BD0C41]) [    ] o.a.s.c.S.Request [collection1]  webapp=null path=null params={q=foo:bar&qt=&omitHeader=false&wt=xml} hits=0 status=0 QTime=0
   [junit4]   2> 205016 INFO  (TEST-MinimalSchemaTest.testAllConfiguredHandlers-seed#[57C3C4D211BD0C41]) [    ] o.a.s.c.S.Request [collection1]  webapp=null path=null params={q=foo:bar&qt=/spellCheckWithWordbreak&omitHeader=false&wt=xml} hits=0 status=0 QTime=0
   [junit4]   2> 205017 INFO  (TEST-MinimalSchemaTest.testAllConfiguredHandlers-seed#[57C3C4D211BD0C41]) [    ] o.a.s.c.S.Request [collection1]  webapp=null path=null params={q=foo:bar&qt=/spellCheckCompRH&omitHeader=false&wt=xml} hits=0 status=0 QTime=0
   [junit4]   2> 205020 INFO  (TEST-MinimalSchemaTest.testAllConfiguredHandlers-seed#[57C3C4D211BD0C41]) [    ] o.a.s.c.S.Request [collection1]  webapp=null path=null params={q=foo:bar&qt=/get&omitHeader=false&wt=xml} status=0 QTime=0
   [junit4]   2> 205021 INFO  (TEST-MinimalSchemaTest.testAllConfiguredHandlers-seed#[57C3C4D211BD0C41]) [    ] o.a.s.c.S.Request [collection1]  webapp=null path=null params={q=foo:bar&qt=/spellCheckWithWordbreak_Direct&omitHeader=false&wt=xml} hits=0 status=0 QTime=0
   [junit4]   2> 205078 INFO  (TEST-MinimalSchemaTest.testAllConfiguredHandlers-seed#[57C3C4D211BD0C41]) [    ] o.a.s.c.S.Request [collection1]  webapp=null path=null params={q=foo:bar&qt=/dismax&omitHeader=false&wt=xml} hits=0 status=0 QTime=57
   [junit4]   2> 205079 INFO  (TEST-MinimalSchemaTest.testAllConfiguredHandlers-seed#[57C3C4D211BD0C41]) [    ] o.a.s.c.S.Request [collection1]  webapp=null path=null params={q=foo:bar&qt=/search-facet-def&omitHeader=false&wt=xml} hits=0 status=0 QTime=0
   [junit4]   2> 205081 INFO  (TEST-MinimalSchemaTest.testAllConfiguredHandlers-seed#[57C3C4D211BD0C41]) [    ] o.a.s.c.PluginBag Going to create a new requestHandler with {type = requestHandler,name = /lazy,class = solr.SearchHandler,attributes = {startup=lazy, name=/lazy, class=solr.SearchHandler},args = {defaults={rows=4,hl=true,hl.fl=text,name,subject,title,whitetok,df=text}}} 
   [junit4]   2> 205086 INFO  (TEST-MinimalSchemaTest.testAllConfiguredHandlers-seed#[57C3C4D211BD0C41]) [    ] o.a.s.c.S.Request [collection1]  webapp=null path=null params={q=foo:bar&qt=/lazy&omitHeader=false&wt=xml} hits=0 status=0 QTime=5
   [junit4]   2> 205087 INFO  (TEST-MinimalSchemaTest.testAllConfiguredHandlers-seed#[57C3C4D211BD0C41]) [    ] o.a.s.c.S.Request [collection1]  webapp=null path=null params={q=foo:bar&qt=/tvrh&omitHeader=false&wt=xml} hits=0 status=0 QTime=0
   [junit4]   2> 205087 INFO  (TEST-MinimalSchemaTest.testAllConfiguredHandlers-seed#[57C3C4D211BD0C41]) [    ] o.a.s.c.S.Request [collection1]  webapp=null path=null params={q=foo:bar&qt=/search-facet-invariants&omitHeader=false&wt=xml} hits=0 status=0 QTime=0
   [junit4]   2> 205088 INFO  (TEST-MinimalSchemaTest.testAllConfiguredHandlers-seed#[57C3C4D211BD0C41]) [    ] o.a.s.c.S.Request [collection1]  webapp=null path=null params={q=foo:bar&qt=/select&omitHeader=false&wt=xml} hits=0 status=0 QTime=0
   [junit4]   2> 205088 INFO  (TEST-MinimalSchemaTest.testAllConfiguredHandlers-seed#[57C3C4D211BD0C41]) [    ] o.a.s.c.S.Request [collection1]  webapp=null path=null params={q=foo:bar&qt=/mock&omitHeader=false&wt=xml} status=0 QTime=0
   [junit4]   2> 205104 INFO  (TEST-MinimalSchemaTest.testAllConfiguredHandlers-seed#[57C3C4D211BD0C41]) [    ] o.a.s.c.S.Request [collection1]  webapp=null path=null params={q=foo:bar&qt=/spellCheckCompRH_Direct&omitHeader=false&wt=xml} hits=0 status=0 QTime=0
   [junit4]   2> 205104 INFO  (TEST-MinimalSchemaTest.testAllConfiguredHandlers-seed#[57C3C4D211BD0C41]) [    ] o.a.s.c.S.Request [collection1]  webapp=null path=null params={q=foo:bar&qt=/replication&omitHeader=false&wt=xml} status=0 QTime=0
   [junit4]   2> 205105 INFO  (TEST-MinimalSchemaTest.testAllConfiguredHandlers-seed#[57C3C4D211BD0C41]) [    ] o.a.s.c.S.Request [collection1]  webapp=null path=null params={q=foo:bar&qt=/defaults&omitHeader=false&wt=xml} hits=0 status=0 QTime=0
   [junit4]   2> 205113 INFO  (TEST-MinimalSchemaTest.testAllConfiguredHandlers-seed#[57C3C4D211BD0C41]) [    ] o.a.s.c.S.Request [collection1]  webapp=null path=null params={q=foo:bar&qt=/spellCheckCompRH1&omitHeader=false&wt=xml} hits=0 status=0 QTime=6
   [junit4]   2> 205114 INFO  (TEST-MinimalSchemaTest.testAllConfiguredHandlers-seed#[57C3C4D211BD0C41]) [    ] o.a.s.SolrTestCaseJ4 ###Ending testAllConfiguredHandlers
   [junit4]   2> 205114 INFO  (SUITE-MinimalSchemaTest-seed#[57C3C4D211BD0C41]-worker) [    ] o.a.s.SolrTestCaseJ4 ###deleteCore
   [junit4]   2> 205114 INFO  (SUITE-MinimalSchemaTest-seed#[57C3C4D211BD0C41]-worker) [    ] o.a.s.c.CoreContainer Shutting down CoreContainer instance=10819789
   [junit4]   2> 205114 INFO  (SUITE-MinimalSchemaTest-seed#[57C3C4D211BD0C41]-worker) [    ] o.a.s.m.SolrMetricManager Closing metric reporters for registry=solr.node, tag=null
   [junit4]   2> 205114 INFO  (SUITE-MinimalSchemaTest-seed#[57C3C4D211BD0C41]-worker) [    ] o.a.s.m.r.SolrJmxReporter Closing reporter [org.apache.solr.metrics.reporters.SolrJmxReporter@1c6fc18: rootName = null, domain = solr.node, service url = null, agent id = null] for registry solr.node / com.codahale.metrics.MetricRegistry@14a1be3
   [junit4]   2> 205118 INFO  (SUITE-MinimalSchemaTest-seed#[57C3C4D211BD0C41]-worker) [    ] o.a.s.m.SolrMetricManager Closing metric reporters for registry=solr.jvm, tag=null
   [junit4]   2> 205118 INFO  (SUITE-MinimalSchemaTest-seed#[57C3C4D211BD0C41]-worker) [    ] o.a.s.m.r.SolrJmxReporter Closing reporter [org.apache.solr.metrics.reporters.SolrJmxReporter@512630: rootName = null, domain = solr.jvm, service url = null, agent id = null] for registry solr.jvm / com.codahale.metrics.MetricRegistry@1ef8f6f
   [junit4]   2> 205121 INFO  (SUITE-MinimalSchemaTest-seed#[57C3C4D211BD0C41]-worker) [    ] o.a.s.m.SolrMetricManager Closing metric reporters for registry=solr.jetty, tag=null
   [junit4]   2> 205121 INFO  (SUITE-MinimalSchemaTest-seed#[57C3C4D211BD0C41]-worker) [    ] o.a.s.m.r.SolrJmxReporter Closing reporter [org.apache.solr.metrics.reporters.SolrJmxReporter@1788f67: rootName = null, domain = solr.jetty, service url = null, agent id = null] for registry solr.jetty / com.codahale.metrics.MetricRegistry@1dd83b3
   [junit4]   2> 205153 INFO  (coreCloseExecutor-961-thread-1) [    x:collection1] o.a.s.c.SolrCore [collection1]  CLOSING SolrCore org.apache.solr.core.SolrCore@21f791
   [junit4]   2> 205153 INFO  (coreCloseExecutor-961-thread-1) [    x:collection1] o.a.s.m.SolrMetricManager Closing metric reporters for registry=solr.core.collection1, tag=2226065
   [junit4]   2> 205153 INFO  (coreCloseExecutor-961-thread-1) [    x:collection1] o.a.s.m.r.SolrJmxReporter Closing reporter [org.apache.solr.metrics.reporters.SolrJmxReporter@18307c9: rootName = null, domain = solr.core.collection1, service url = null, agent id = null] for registry solr.core.collection1 / com.codahale.metrics.MetricRegistry@ab257e
   [junit4]   2> 205201 INFO  (SUITE-MinimalSchemaTest-seed#[57C3C4D211BD0C41]-worker) [    ] o.a.s.SolrTestCaseJ4 ------------------------------------------------------- Done waiting for tracked resources to be released
   [junit4]   2> NOTE: test params are: codec=Asserting(Lucene70): {subject=BlockTreeOrds(blocksize=128), project=TestBloomFilteredLucenePostings(BloomFilteringPostingsFormat(Lucene50(blocksize=128))), id=TestBloomFilteredLucenePostings(BloomFilteringPostingsFormat(Lucene50(blocksize=128)))}, docValues:{}, maxPointsInLeafNode=1423, maxMBSortInHeap=6.766477792013862, sim=Asserting(org.apache.lucene.search.similarities.AssertingSimilarity@1592c23), locale=ca-ES, timezone=Indian/Comoro
   [junit4]   2> NOTE: Windows 10 10.0 x86/Oracle Corporation 1.8.0_144 (32-bit)/cpus=3,threads=1,free=18684056,total=131629056
   [junit4]   2> NOTE: All tests run in this JVM: [TestUpdate, ManagedSchemaRoundRobinCloudTest, TestTlogReplica, ShardRoutingTest, TestTriggerIntegration, TestFilteredDocIdSet, SolrShardReporterTest, TestConfigSetsAPIZkFailure, TestConfigSetProperties, MinimalSchemaTest]
   [junit4]   2> NOTE: reproduce with: ant test  -Dtestcase=MinimalSchemaTest -Dtests.seed=57C3C4D211BD0C41 -Dtests.slow=true -Dtests.locale=ca-ES -Dtests.timezone=Indian/Comoro -Dtests.asserts=true -Dtests.file.encoding=UTF-8
   [junit4] ERROR   0.00s J1 | MinimalSchemaTest (suite) <<<
   [junit4]    > Throwable #1: java.io.IOException: Could not remove the following files (in the order of attempts):
   [junit4]    >    C:\Users\jenkins\workspace\Lucene-Solr-master-Windows\solr\build\solr-core\test\J1\temp\solr.MinimalSchemaTest_57C3C4D211BD0C41-001\init-core-data-001: java.nio.file.DirectoryNotEmptyException: C:\Users\jenkins\workspace\Lucene-Solr-master-Windows\solr\build\solr-core\test\J1\temp\solr.MinimalSchemaTest_57C3C4D211BD0C41-001\init-core-data-001
   [junit4]    >    C:\Users\jenkins\workspace\Lucene-Solr-master-Windows\solr\build\solr-core\test\J1\temp\solr.MinimalSchemaTest_57C3C4D211BD0C41-001\init-core-data-001\spellcheckerFQCN: java.nio.file.AccessDeniedException: C:\Users\jenkins\workspace\Lucene-Solr-master-Windows\solr\build\solr-core\test\J1\temp\solr.MinimalSchemaTest_57C3C4D211BD0C41-001\init-core-data-001\spellcheckerFQCN
   [junit4]    >    C:\Users\jenkins\workspace\Lucene-Solr-master-Windows\solr\build\solr-core\test\J1\temp\solr.MinimalSchemaTest_57C3C4D211BD0C41-001: java.nio.file.DirectoryNotEmptyException: C:\Users\jenkins\workspace\Lucene-Solr-master-Windows\solr\build\solr-core\test\J1\temp\solr.MinimalSchemaTest_57C3C4D211BD0C41-001
   [junit4]    > 	at __randomizedtesting.SeedInfo.seed([57C3C4D211BD0C41]:0)
   [junit4]    > 	at org.apache.lucene.util.IOUtils.rm(IOUtils.java:329)
   [junit4]    > 	at java.lang.Thread.run(Thread.java:748)
   [junit4] Completed [27/768 (1!)] on J1 in 2.54s, 3 tests, 1 error <<< FAILURES!

[...truncated 449 lines...]
   [junit4] Suite: org.apache.solr.update.processor.TimeRoutedAliasUpdateProcessorTest
   [junit4]   2> 639515 INFO  (SUITE-TimeRoutedAliasUpdateProcessorTest-seed#[57C3C4D211BD0C41]-worker) [    ] o.a.s.SolrTestCaseJ4 SecureRandom sanity checks: test.solr.allowed.securerandom=null & java.security.egd=file:/dev/./urandom
   [junit4]   2> Creating dataDir: C:\Users\jenkins\workspace\Lucene-Solr-master-Windows\solr\build\solr-core\test\J1\temp\solr.update.processor.TimeRoutedAliasUpdateProcessorTest_57C3C4D211BD0C41-001\init-core-data-001
   [junit4]   2> 639518 WARN  (SUITE-TimeRoutedAliasUpdateProcessorTest-seed#[57C3C4D211BD0C41]-worker) [    ] o.a.s.SolrTestCaseJ4 startTrackingSearchers: numOpens=2 numCloses=2
   [junit4]   2> 639518 INFO  (SUITE-TimeRoutedAliasUpdateProcessorTest-seed#[57C3C4D211BD0C41]-worker) [    ] o.a.s.SolrTestCaseJ4 Using PointFields (NUMERIC_POINTS_SYSPROP=true) w/NUMERIC_DOCVALUES_SYSPROP=false
   [junit4]   2> 639522 INFO  (SUITE-TimeRoutedAliasUpdateProcessorTest-seed#[57C3C4D211BD0C41]-worker) [    ] o.a.s.SolrTestCaseJ4 Randomized ssl (false) and clientAuth (false) via: @org.apache.solr.util.RandomizeSSL(reason=, value=NaN, ssl=NaN, clientAuth=NaN)
   [junit4]   2> 639524 INFO  (SUITE-TimeRoutedAliasUpdateProcessorTest-seed#[57C3C4D211BD0C41]-worker) [    ] o.a.s.c.MiniSolrCloudCluster Starting cluster of 2 servers in C:\Users\jenkins\workspace\Lucene-Solr-master-Windows\solr\build\solr-core\test\J1\temp\solr.update.processor.TimeRoutedAliasUpdateProcessorTest_57C3C4D211BD0C41-001\tempDir-001
   [junit4]   2> 639524 INFO  (SUITE-TimeRoutedAliasUpdateProcessorTest-seed#[57C3C4D211BD0C41]-worker) [    ] o.a.s.c.ZkTestServer STARTING ZK TEST SERVER
   [junit4]   2> 639525 INFO  (Thread-1201) [    ] o.a.s.c.ZkTestServer client port:0.0.0.0/0.0.0.0:0
   [junit4]   2> 639525 INFO  (Thread-1201) [    ] o.a.s.c.ZkTestServer Starting server
   [junit4]   2> 639533 ERROR (Thread-1201) [    ] o.a.z.s.ZooKeeperServer ZKShutdownHandler is not registered, so ZooKeeper server won't take any action on ERROR or SHUTDOWN server state changes
   [junit4]   2> 639624 INFO  (SUITE-TimeRoutedAliasUpdateProcessorTest-seed#[57C3C4D211BD0C41]-worker) [    ] o.a.s.c.ZkTestServer start zk server on port:58310
   [junit4]   2> 639629 INFO  (zkConnectionManagerCallback-1269-thread-1) [    ] o.a.s.c.c.ConnectionManager zkClient has connected
   [junit4]   2> 639631 WARN  (NIOServerCxn.Factory:0.0.0.0/0.0.0.0:0) [    ] o.a.z.s.NIOServerCnxn caught end of stream exception
   [junit4]   2> EndOfStreamException: Unable to read additional data from client sessionid 0x16131d5a6e30000, likely client has closed socket
   [junit4]   2> 	at org.apache.zookeeper.server.NIOServerCnxn.doIO(NIOServerCnxn.java:239)
   [junit4]   2> 	at org.apache.zookeeper.server.NIOServerCnxnFactory.run(NIOServerCnxnFactory.java:203)
   [junit4]   2> 	at java.lang.Thread.run(Thread.java:748)
   [junit4]   2> 639633 INFO  (jetty-launcher-1266-thread-2) [    ] o.e.j.s.Server jetty-9.4.8.v20171121, build timestamp: 2017-11-22T09:27:37+12:00, git hash: 82b8fb23f757335bb3329d540ce37a2a2615f0a8
   [junit4]   2> 639633 INFO  (jetty-launcher-1266-thread-2) [    ] o.e.j.s.session DefaultSessionIdManager workerName=node0
   [junit4]   2> 639633 INFO  (jetty-launcher-1266-thread-2) [    ] o.e.j.s.session No SessionScavenger set, using defaults
   [junit4]   2> 639633 INFO  (jetty-launcher-1266-thread-2) [    ] o.e.j.s.session Scavenging every 660000ms
   [junit4]   2> 639633 INFO  (jetty-launcher-1266-thread-2) [    ] o.e.j.s.h.ContextHandler Started o.e.j.s.ServletContextHandler@1f1808a{/solr,null,AVAILABLE}
   [junit4]   2> 639633 INFO  (jetty-launcher-1266-thread-1) [    ] o.e.j.s.Server jetty-9.4.8.v20171121, build timestamp: 2017-11-22T09:27:37+12:00, git hash: 82b8fb23f757335bb3329d540ce37a2a2615f0a8
   [junit4]   2> 639634 INFO  (jetty-launcher-1266-thread-1) [    ] o.e.j.s.session DefaultSessionIdManager workerName=node0
   [junit4]   2> 639634 INFO  (jetty-launcher-1266-thread-1) [    ] o.e.j.s.session No SessionScavenger set, using defaults
   [junit4]   2> 639634 INFO  (jetty-launcher-1266-thread-1) [    ] o.e.j.s.session Scavenging every 600000ms
   [junit4]   2> 639634 INFO  (jetty-launcher-1266-thread-1) [    ] o.e.j.s.h.ContextHandler Started o.e.j.s.ServletContextHandler@19ac56c{/solr,null,AVAILABLE}
   [junit4]   2> 639636 INFO  (jetty-launcher-1266-thread-2) [    ] o.e.j.s.AbstractConnector Started ServerConnector@e2e1d8{HTTP/1.1,[http/1.1]}{127.0.0.1:58314}
   [junit4]   2> 639636 INFO  (jetty-launcher-1266-thread-2) [    ] o.e.j.s.Server Started @647253ms
   [junit4]   2> 639636 INFO  (jetty-launcher-1266-thread-2) [    ] o.a.s.c.s.e.JettySolrRunner Jetty properties: {hostContext=/solr, hostPort=58314}
   [junit4]   2> 639637 ERROR (jetty-launcher-1266-thread-2) [    ] o.a.s.u.StartupLoggingUtils Missing Java Option solr.log.dir. Logging may be missing or incomplete.
   [junit4]   2> 639637 INFO  (jetty-launcher-1266-thread-2) [    ] o.a.s.s.SolrDispatchFilter  ___      _       Welcome to Apache Solr™ version 8.0.0
   [junit4]   2> 639637 INFO  (jetty-launcher-1266-thread-2) [    ] o.a.s.s.SolrDispatchFilter / __| ___| |_ _   Starting in cloud mode on port null
   [junit4]   2> 639637 INFO  (jetty-launcher-1266-thread-2) [    ] o.a.s.s.SolrDispatchFilter \__ \/ _ \ | '_|  Install dir: null
   [junit4]   2> 639637 INFO  (jetty-launcher-1266-thread-2) [    ] o.a.s.s.SolrDispatchFilter |___/\___/_|_|    Start time: 2018-01-26T09:39:01.072Z
   [junit4]   2> 639638 INFO  (jetty-launcher-1266-thread-1) [    ] o.e.j.s.AbstractConnector Started ServerConnector@8110cc{HTTP/1.1,[http/1.1]}{127.0.0.1:58317}
   [junit4]   2> 639638 INFO  (jetty-launcher-1266-thread-1) [    ] o.e.j.s.Server Started @647255ms
   [junit4]   2> 639638 INFO  (jetty-launcher-1266-thread-1) [    ] o.a.s.c.s.e.JettySolrRunner Jetty properties: {hostContext=/solr, hostPort=58317}
   [junit4]   2> 639639 ERROR (jetty-launcher-1266-thread-1) [    ] o.a.s.u.StartupLoggingUtils Missing Java Option solr.log.dir. Logging may be missing or incomplete.
   [junit4]   2> 639639 INFO  (jetty-launcher-1266-thread-1) [    ] o.a.s.s.SolrDispatchFilter  ___      _       Welcome to Apache Solr™ version 8.0.0
   [junit4]   2> 639639 INFO  (jetty-launcher-1266-thread-1) [    ] o.a.s.s.SolrDispatchFilter / __| ___| |_ _   Starting in cloud mode on port null
   [junit4]   2> 639639 INFO  (jetty-launcher-1266-thread-1) [    ] o.a.s.s.SolrDispatchFilter \__ \/ _ \ | '_|  Install dir: null
   [junit4]   2> 639639 INFO  (jetty-launcher-1266-thread-1) [    ] o.a.s.s.SolrDispatchFilter |___/\___/_|_|    Start time: 2018-01-26T09:39:01.074Z
   [junit4]   2> 639644 INFO  (zkConnectionManagerCallback-1271-thread-1) [    ] o.a.s.c.c.ConnectionManager zkClient has connected
   [junit4]   2> 639645 INFO  (jetty-launcher-1266-thread-2) [    ] o.a.s.s.SolrDispatchFilter solr.xml found in ZooKeeper. Loading...
   [junit4]   2> 639645 INFO  (zkConnectionManagerCallback-1273-thread-1) [    ] o.a.s.c.c.ConnectionManager zkClient has connected
   [junit4]   2> 639646 INFO  (jetty-launcher-1266-thread-1) [    ] o.a.s.s.SolrDispatchFilter solr.xml found in ZooKeeper. Loading...
   [junit4]   2> 639657 WARN  (NIOServerCxn.Factory:0.0.0.0/0.0.0.0:0) [    ] o.a.z.s.NIOServerCnxn caught end of stream exception
   [junit4]   2> EndOfStreamException: Unable to read additional data from client sessionid 0x16131d5a6e30002, likely client has closed socket
   [junit4]   2> 	at org.apache.zookeeper.server.NIOServerCnxn.doIO(NIOServerCnxn.java:239)
   [junit4]   2> 	at org.apache.zookeeper.server.NIOServerCnxnFactory.run(NIOServerCnxnFactory.java:203)
   [junit4]   2> 	at java.lang.Thread.run(Thread.java:748)
   [junit4]   2> 639663 INFO  (jetty-launcher-1266-thread-2) [    ] o.a.s.c.ZkContainer Zookeeper client=127.0.0.1:58310/solr
   [junit4]   2> 639663 INFO  (jetty-launcher-1266-thread-1) [    ] o.a.s.c.ZkContainer Zookeeper client=127.0.0.1:58310/solr
   [junit4]   2> 639666 INFO  (zkConnectionManagerCallback-1279-thread-1) [    ] o.a.s.c.c.ConnectionManager zkClient has connected
   [junit4]   2> 639666 INFO  (zkConnectionManagerCallback-1281-thread-1) [    ] o.a.s.c.c.ConnectionManager zkClient has connected
   [junit4]   2> 639667 WARN  (NIOServerCxn.Factory:0.0.0.0/0.0.0.0:0) [    ] o.a.z.s.NIOServerCnxn caught end of stream exception
   [junit4]   2> EndOfStreamException: Unable to read additional data from client sessionid 0x16131d5a6e30003, likely client has closed socket
   [junit4]   2> 	at org.apache.zookeeper.server.NIOServerCnxn.doIO(NIOServerCnxn.java:239)
   [junit4]   2> 	at org.apache.zookeeper.server.NIOServerCnxnFactory.run(NIOServerCnxnFactory.java:203)
   [junit4]   2> 	at java.lang.Thread.run(Thread.java:748)
   [junit4]   2> 639669 INFO  (zkConnectionManagerCallback-1283-thread-1-processing-n:127.0.0.1:58314_solr) [n:127.0.0.1:58314_solr    ] o.a.s.c.c.ConnectionManager zkClient has connected
   [junit4]   2> 639670 INFO  (zkConnectionManagerCallback-1285-thread-1-processing-n:127.0.0.1:58317_solr) [n:127.0.0.1:58317_solr    ] o.a.s.c.c.ConnectionManager zkClient has connected
   [junit4]   2> 639789 INFO  (jetty-launcher-1266-thread-1) [n:127.0.0.1:58317_solr    ] o.a.s.c.Overseer Overseer (id=null) closing
   [junit4]   2> 639790 INFO  (jetty-launcher-1266-thread-2) [n:127.0.0.1:58314_solr    ] o.a.s.c.Overseer Overseer (id=null) closing
   [junit4]   2> 639790 INFO  (jetty-launcher-1266-thread-1) [n:127.0.0.1:58317_solr    ] o.a.s.c.OverseerElectionContext I am going to be the leader 127.0.0.1:58317_solr
   [junit4]   2> 639791 INFO  (jetty-launcher-1266-thread-2) [n:127.0.0.1:58314_solr    ] o.a.s.c.ZkController Register node as live in ZooKeeper:/live_nodes/127.0.0.1:58314_solr
   [junit4]   2> 639791 INFO  (jetty-launcher-1266-thread-1) [n:127.0.0.1:58317_solr    ] o.a.s.c.Overseer Overseer (id=99415460476551174-127.0.0.1:58317_solr-n_0000000000) starting
   [junit4]   2> 639798 INFO  (zkCallback-1284-thread-1-processing-n:127.0.0.1:58317_solr) [n:127.0.0.1:58317_solr    ] o.a.s.c.c.ZkStateReader Updated live nodes from ZooKeeper... (0) -> (1)
   [junit4]   2> 639800 INFO  (zkCallback-1282-thread-1-processing-n:127.0.0.1:58314_solr) [n:127.0.0.1:58314_solr    ] o.a.s.c.c.ZkStateReader Updated live nodes from ZooKeeper... (0) -> (1)
   [junit4]   2> 639810 INFO  (jetty-launcher-1266-thread-1) [n:127.0.0.1:58317_solr    ] o.a.s.c.ZkController Register node as live in ZooKeeper:/live_nodes/127.0.0.1:58317_solr
   [junit4]   2> 639819 INFO  (zkCallback-1284-thread-1-processing-n:127.0.0.1:58317_solr) [n:127.0.0.1:58317_solr    ] o.a.s.c.c.ZkStateReader Updated live nodes from ZooKeeper... (1) -> (2)
   [junit4]   2> 639820 INFO  (zkCallback-1282-thread-1-processing-n:127.0.0.1:58314_solr) [n:127.0.0.1:58314_solr    ] o.a.s.c.c.ZkStateReader Updated live nodes from ZooKeeper... (1) -> (2)
   [junit4]   2> 639964 INFO  (jetty-launcher-1266-thread-1) [n:127.0.0.1:58317_solr    ] o.a.s.m.r.SolrJmxReporter JMX monitoring for 'solr_58317.solr.node' (registry 'solr.node') enabled at server: com.sun.jmx.mbeanserver.JmxMBeanServer@18b0a9a
   [junit4]   2> 639972 INFO  (jetty-launcher-1266-thread-2) [n:127.0.0.1:58314_solr    ] o.a.s.m.r.SolrJmxReporter JMX monitoring for 'solr_58314.solr.node' (registry 'solr.node') enabled at server: com.sun.jmx.mbeanserver.JmxMBeanServer@18b0a9a
   [junit4]   2> 639975 INFO  (jetty-launcher-1266-thread-1) [n:127.0.0.1:58317_solr    ] o.a.s.m.r.SolrJmxReporter JMX monitoring for 'solr_58317.solr.jvm' (registry 'solr.jvm') enabled at server: com.sun.jmx.mbeanserver.JmxMBeanServer@18b0a9a
   [junit4]   2> 639975 INFO  (jetty-launcher-1266-thread-1) [n:127.0.0.1:58317_solr    ] o.a.s.m.r.SolrJmxReporter JMX monitoring for 'solr_58317.solr.jetty' (registry 'solr.jetty') enabled at server: com.sun.jmx.mbeanserver.JmxMBeanServer@18b0a9a
   [junit4]   2> 639976 INFO  (jetty-launcher-1266-thread-1) [n:127.0.0.1:58317_solr    ] o.a.s.c.CorePropertiesLocator Found 0 core definitions underneath C:\Users\jenkins\workspace\Lucene-Solr-master-Windows\solr\build\solr-core\test\J1\temp\solr.update.processor.TimeRoutedAliasUpdateProcessorTest_57C3C4D211BD0C41-001\tempDir-001\node2\.
   [junit4]   2> 639979 INFO  (jetty-launcher-1266-thread-2) [n:127.0.0.1:58314_solr    ] o.a.s.m.r.SolrJmxReporter JMX monitoring for 'solr_58314.solr.jvm' (registry 'solr.jvm') enabled at server: com.sun.jmx.mbeanserver.JmxMBeanServer@18b0a9a
   [junit4]   2> 639979 INFO  (jetty-launcher-1266-thread-2) [n:127.0.0.1:58314_solr    ] o.a.s.m.r.SolrJmxReporter JMX monitoring for 'solr_58314.solr.jetty' (registry 'solr.jetty') enabled at server: com.sun.jmx.mbeanserver.JmxMBeanServer@18b0a9a
   [junit4]   2> 639980 INFO  (jetty-launcher-1266-thread-2) [n:127.0.0.1:58314_solr    ] o.a.s.c.CorePropertiesLocator Found 0 core definitions underneath C:\Users\jenkins\workspace\Lucene-Solr-master-Windows\solr\build\solr-core\test\J1\temp\solr.update.processor.TimeRoutedAliasUpdateProcessorTest_57C3C4D211BD0C41-001\tempDir-001\node1\.
   [junit4]   2> 640031 INFO  (zkConnectionManagerCallback-1291-thread-1) [    ] o.a.s.c.c.ConnectionManager zkClient has connected
   [junit4]   2> 640048 INFO  (TEST-TimeRoutedAliasUpdateProcessorTest.testParse-seed#[57C3C4D211BD0C41]) [    ] o.a.s.SolrTestCaseJ4 ###Starting testParse
   [junit4]   2> 640050 INFO  (TEST-TimeRoutedAliasUpdateProcessorTest.testParse-seed#[57C3C4D211BD0C41]) [    ] o.a.s.SolrTestCaseJ4 ###Ending testParse
   [junit4]   2> 640063 INFO  (TEST-TimeRoutedAliasUpdateProcessorTest.test-seed#[57C3C4D211BD0C41]) [    ] o.a.s.SolrTestCaseJ4 ###Starting test
   [junit4]   2> 640066 INFO  (zkConnectionManagerCallback-1296-thread-1) [    ] o.a.s.c.c.ConnectionManager zkClient has connected
   [junit4]   2> 640068 INFO  (TEST-TimeRoutedAliasUpdateProcessorTest.test-seed#[57C3C4D211BD0C41]) [    ] o.a.s.c.c.ZkStateReader Updated live nodes from ZooKeeper... (0) -> (2)
   [junit4]   2> 640069 INFO  (TEST-TimeRoutedAliasUpdateProcessorTest.test-seed#[57C3C4D211BD0C41]) [    ] o.a.s.c.s.i.ZkClientClusterStateProvider Cluster at 127.0.0.1:58310/solr ready
   [junit4]   2> 640072 INFO  (qtp30951998-6225) [n:127.0.0.1:58317_solr    ] o.a.s.h.a.ConfigSetsHandler Invoked ConfigSet Action :create with params baseConfigSet=_default&name=timeConfig&action=CREATE&wt=javabin&version=2 
   [junit4]   2> 640075 INFO  (OverseerThreadFactory-2562-thread-1-processing-n:127.0.0.1:58317_solr) [n:127.0.0.1:58317_solr    ] o.a.s.c.OverseerConfigSetMessageHandler OverseerConfigSetMessageHandler.processMessage : create , {
   [junit4]   2>   "name":"timeConfig",
   [junit4]   2>   "baseConfigSet":"_default",
   [junit4]   2>   "immutable":"false",
   [junit4]   2>   "operation":"configsets:create"}
   [junit4]   2> 640077 INFO  (OverseerThreadFactory-2562-thread-1-processing-n:127.0.0.1:58317_solr) [n:127.0.0.1:58317_solr    ] o.a.s.c.c.ZkConfigManager Copying zk node /configs/_default/managed-schema to /configs/timeConfig/managed-schema
   [junit4]   2> 640080 INFO  (OverseerThreadFactory-2562-thread-1-processing-n:127.0.0.1:58317_solr) [n:127.0.0.1:58317_solr    ] o.a.s.c.c.ZkConfigManager Copying zk node /configs/_default/protwords.txt to /configs/timeConfig/protwords.txt
   [junit4]   2> 640081 INFO  (OverseerThreadFactory-2562-thread-1-processing-n:127.0.0.1:58317_solr) [n:127.0.0.1:58317_solr    ] o.a.s.c.c.ZkConfigManager Copying zk node /configs/_default/solrconfig.xml to /configs/timeConfig/solrconfig.xml
   [junit4]   2> 640088 INFO  (OverseerThreadFactory-2562-thread-1-processing-n:127.0.0.1:58317_solr) [n:127.0.0.1:58317_solr    ] o.a.s.c.c.ZkConfigManager Copying zk node /configs/_default/synonyms.txt to /configs/timeConfig/synonyms.txt
   [junit4]   2> 640090 INFO  (OverseerThreadFactory-2562-thread-1-processing-n:127.0.0.1:58317_solr) [n:127.0.0.1:58317_solr    ] o.a.s.c.c.ZkConfigManager Copying zk node /configs/_default/stopwords.txt to /configs/timeConfig/stopwords.txt
   [junit4]   2> 640091 INFO  (OverseerThreadFactory-2562-thread-1-processing-n:127.0.0.1:58317_solr) [n:127.0.0.1:58317_solr    ] o.a.s.c.c.ZkConfigManager Copying zk node /configs/_default/lang/contractions_it.txt to /configs/timeConfig/lang/contractions_it.txt
   [junit4]   2> 640093 INFO  (OverseerThreadFactory-2562-thread-1-processing-n:127.0.0.1:58317_solr) [n:127.0.0.1:58317_solr    ] o.a.s.c.c.ZkConfigManager Copying zk node /configs/_default/lang/contractions_ca.txt to /configs/timeConfig/lang/contractions_ca.txt
   [junit4]   2> 640095 INFO  (OverseerThreadFactory-2562-thread-1-processing-n:127.0.0.1:58317_solr) [n:127.0.0.1:58317_solr    ] o.a.s.c.c.ZkConfigManager Copying zk node /configs/_default/lang/stemdict_nl.txt to /configs/timeConfig/lang/stemdict_nl.txt
   [junit4]   2> 640096 INFO  (OverseerThreadFactory-2562-thread-1-processing-n:127.0.0.1:58317_solr) [n:127.0.0.1:58317_solr    ] o.a.s.c.c.ZkConfigManager Copying zk node /configs/_default/lang/stopwords_hy.txt to /configs/timeConfig/lang/stopwords_hy.txt
   [junit4]   2> 640098 INFO  (OverseerThreadFactory-2562-thread-1-processing-n:127.0.0.1:58317_solr) [n:127.0.0.1:58317_solr    ] o.a.s.c.c.ZkConfigManager Copying zk node /configs/_default/lang/stopwords_no.txt to /configs/timeConfig/lang/stopwords_no.txt
   [junit4]   2> 640100 INFO  (OverseerThreadFactory-2562-thread-1-processing-n:127.0.0.1:58317_solr) [n:127.0.0.1:58317_solr    ] o.a.s.c.c.ZkConfigManager Copying zk node /configs/_default/lang/stopwords_id.txt to /configs/timeConfig/lang/stopwords_id.txt
   [junit4]   2> 640102 INFO  (OverseerThreadFactory-2562-thread-1-processing-n:127.0.0.1:58317_solr) [n:127.0.0.1:58317_solr    ] o.a.s.c.c.ZkConfigManager Copying zk node /configs/_default/lang/stopwords_da.txt to /configs/timeConfig/lang/stopwords_da.txt
   [junit4]   2> 640103 INFO  (OverseerThreadFactory-2562-thread-1-processing-n:127.0.0.1:58317_solr) [n:127.0.0.1:58317_solr    ] o.a.s.c.c.ZkConfigManager Copying zk node /configs/_default/lang/stopwords_ga.txt to /configs/timeConfig/lang/stopwords_ga.txt
   [junit4]   2> 640105 INFO  (OverseerThreadFactory-2562-thread-1-processing-n:127.0.0.1:58317_solr) [n:127.0.0.1:58317_solr    ] o.a.s.c.c.ZkConfigManager Copying zk node /configs/_default/lang/stopwords_hi.txt to /configs/timeConfig/lang/stopwords_hi.txt
   [junit4]   2> 640107 INFO  (OverseerThreadFactory-2562-thread-1-processing-n:127.0.0.1:58317_solr) [n:127.0.0.1:58317_solr    ] o.a.s.c.c.ZkConfigManager Copying zk node /configs/_default/lang/stopwords_ja.txt to /configs/timeConfig/lang/stopwords_ja.txt
   [junit4]   2> 640109 INFO  (OverseerThreadFactory-2562-thread-1-processing-n:127.0.0.1:58317_solr) [n:127.0.0.1:58317_solr    ] o.a.s.c.c.ZkConfigManager Copying zk node /configs/_default/lang/stopwords_pt.txt to /configs/timeConfig/lang/stopwords_pt.txt
   [junit4]   2> 640110 INFO  (OverseerThreadFactory-2562-thread-1-processing-n:127.0.0.1:58317_solr) [n:127.0.0.1:58317_solr    ] o.a.s.c.c.ZkConfigManager Copying zk node /configs/_default/lang/stopwords_hu.txt to /configs/timeConfig/lang/stopwords_hu.txt
   [junit4]   2> 640112 INFO  (OverseerThreadFactory-2562-thread-1-processing-n:127.0.0.1:58317_solr) [n:127.0.0.1:58317_solr    ] o.a.s.c.c.ZkConfigManager Copying zk node /configs/_default/lang/stopwords_el.txt to /configs/timeConfig/lang/stopwords_el.txt
   [junit4]   2> 640113 INFO  (OverseerThreadFactory-2562-thread-1-processing-n:127.0.0.1:58317_solr) [n:127.0.0.1:58317_solr    ] o.a.s.c.c.ZkConfigManager Copying zk node /configs/_default/lang/stopwords_ru.txt to /configs/timeConfig/lang/stopwords_ru.txt
   [junit4]   2> 640115 INFO  (OverseerThreadFactory-2562-thread-1-processing-n:127.0.0.1:58317_solr) [n:127.0.0.1:58317_solr    ] o.a.s.c.c.ZkConfigManager Copying zk node /configs/_default/lang/stopwords_tr.txt to /configs/timeConfig/lang/stopwords_tr.txt
   [junit4]   2> 640116 INFO  (OverseerThreadFactory-2562-thread-1-processing-n:127.0.0.1:58317_solr) [n:127.0.0.1:58317_solr    ] o.a.s.c.c.ZkConfigManager Copying zk node /configs/_default/lang/stopwords_ar.txt to /configs/timeConfig/lang/stopwords_ar.txt
   [junit4]   2> 640118 INFO  (OverseerThreadFactory-2562-thread-1-processing-n:127.0.0.1:58317_solr) [n:127.0.0.1:58317_solr    ] o.a.s.c.c.ZkConfigManager Copying zk node /configs/_default/lang/userdict_ja.txt to /configs/timeConfig/lang/userdict_ja.txt
   [junit4]   2> 640120 INFO  (OverseerThreadFactory-2562-thread-1-processing-n:127.0.0.1:58317_solr) [n:127.0.0.1:58317_solr    ] o.a.s.c.c.ZkConfigManager Copying zk node /configs/_default/lang/stopwords_eu.txt to /configs/timeConfig/lang/stopwords_eu.txt
   [junit4]   2> 640122 INFO  (OverseerThreadFactory-2562-thread-1-processing-n:127.0.0.1:58317_solr) [n:127.0.0.1:58317_solr    ] o.a.s.c.c.ZkConfigManager Copying zk node /configs/_default/lang/stopwords_it.txt to /configs/timeConfig/lang/stopwords_it.txt
   [junit4]   2> 640123 INFO  (OverseerThreadFactory-2562-thread-1-processing-n:127.0.0.1:58317_solr) [n:127.0.0.1:58317_solr    ] o.a.s.c.c.ZkConfigManager Copying zk node /configs/_default/lang/stopwords_cz.txt to /configs/timeConfig/lang/stopwords_cz.txt
   [junit4]   2> 640125 INFO  (OverseerThreadFactory-2562-thread-1-processing-n:127.0.0.1:58317_solr) [n:127.0.0.1:58317_solr    ] o.a.s.c.c.ZkConfigManager Copying zk node /configs

[...truncated too long message...]

st, TestLazyCores, TestIndexSearcher, SolrIndexSplitterTest, SimplePostToolTest, TestCoreDiscovery, SuggesterTSTTest, TestWordDelimiterFilterFactory, QueryEqualityTest, SolrInfoBeanTest, DocumentAnalysisRequestHandlerTest, PrimitiveFieldTypeTest, TermsComponentTest, RequiredFieldsTest, SolrPluginUtilsTest, TestCSVResponseWriter, TestAnalyzedSuggestions, BinaryUpdateRequestHandlerTest, CSVRequestHandlerTest, TestLFUCache, SynonymTokenizerTest, TestSweetSpotSimilarityFactory, TestDFRSimilarityFactory, TestLMJelinekMercerSimilarityFactory, TimeZoneUtilsTest, TestFastOutputStream, OpenExchangeRatesOrgProviderTest, TestFastLRUCache, ChaosMonkeyNothingIsSafeTest, CloudExitableDirectoryReaderTest, CollectionStateFormat2Test, CollectionsAPISolrJTest, ConfigSetsAPITest, ConnectionManagerTest, DeleteLastCustomShardedReplicaTest, DeleteNodeTest, DeleteReplicaTest, DeleteShardTest, DeleteStatusTest, DistribCursorPagingTest, DistribDocExpirationUpdateProcessorTest, DistribJoinFromCollectionTest, DistributedQueueTest, HttpPartitionTest, LeaderFailureAfterFreshStartTest, LeaderInitiatedRecoveryOnShardRestartTest, MoveReplicaHDFSTest, OutOfBoxZkACLAndCredentialsProvidersTest, OverseerModifyCollectionTest, PeerSyncReplicationTest, TestAuthenticationFramework, TestCloudDeleteByQuery, TestCloudRecovery, TestCryptoKeys, TestDistribDocBasedVersion, TestDownShardTolerantSearch, TestLockTree, TestRandomRequestDistribution, TestRebalanceLeaders, TestRequestForwarding, TestSegmentSorting, TestStressCloudBlindAtomicUpdates, TestUtilizeNode, VMParamsZkACLAndCredentialsProvidersTest, CollectionsAPIAsyncDistributedZkTest, SimpleCollectionCreateDeleteTest, TestCollectionAPI, TestCollectionsAPIViaSolrCloudCluster, TestHdfsCloudBackupRestore, ComputePlanActionTest, ExecutePlanActionTest, HdfsAutoAddReplicasIntegrationTest, MetricTriggerTest, SearchRateTriggerTest, TestPolicyCloud, TestClusterStateProvider, TestComputePlanAction, TestDistribStateManager, TestGenericDistributedQueue]
   [junit4]   2> NOTE: reproduce with: ant test  -Dtestcase=TestGenericDistributedQueue -Dtests.seed=57C3C4D211BD0C41 -Dtests.slow=true -Dtests.locale=sr-RS -Dtests.timezone=NZ -Dtests.asserts=true -Dtests.file.encoding=UTF-8
   [junit4] ERROR   0.00s J0 | TestGenericDistributedQueue (suite) <<<
   [junit4]    > Throwable #1: com.carrotsearch.randomizedtesting.ThreadLeakError: 1 thread leaked from SUITE scope at org.apache.solr.cloud.autoscaling.sim.TestGenericDistributedQueue: 
   [junit4]    >    1) Thread[id=32782, name=sdqtest--7536-thread-1, state=TIMED_WAITING, group=TGRP-TestGenericDistributedQueue]
   [junit4]    >         at sun.misc.Unsafe.park(Native Method)
   [junit4]    >         at java.util.concurrent.locks.LockSupport.parkNanos(LockSupport.java:215)
   [junit4]    >         at java.util.concurrent.locks.AbstractQueuedSynchronizer$ConditionObject.awaitNanos(AbstractQueuedSynchronizer.java:2078)
   [junit4]    >         at org.apache.solr.cloud.autoscaling.sim.GenericDistributedQueue.peek(GenericDistributedQueue.java:194)
   [junit4]    >         at org.apache.solr.cloud.autoscaling.sim.GenericDistributedQueue.peek(GenericDistributedQueue.java:167)
   [junit4]    >         at org.apache.solr.cloud.autoscaling.sim.TestSimDistributedQueue.lambda$testDistributedQueueBlocking$0(TestSimDistributedQueue.java:92)
   [junit4]    >         at org.apache.solr.cloud.autoscaling.sim.TestSimDistributedQueue$$Lambda$1055/13664876.call(Unknown Source)
   [junit4]    >         at java.util.concurrent.FutureTask.run(FutureTask.java:266)
   [junit4]    >         at org.apache.solr.common.util.ExecutorUtil$MDCAwareThreadPoolExecutor.lambda$execute$0(ExecutorUtil.java:188)
   [junit4]    >         at org.apache.solr.common.util.ExecutorUtil$MDCAwareThreadPoolExecutor$$Lambda$117/29508855.run(Unknown Source)
   [junit4]    >         at java.util.concurrent.ThreadPoolExecutor.runWorker(ThreadPoolExecutor.java:1149)
   [junit4]    >         at java.util.concurrent.ThreadPoolExecutor$Worker.run(ThreadPoolExecutor.java:624)
   [junit4]    >         at java.lang.Thread.run(Thread.java:748)
   [junit4]    > 	at __randomizedtesting.SeedInfo.seed([57C3C4D211BD0C41]:0)
   [junit4] Completed [569/768 (6!)] on J0 in 26.19s, 4 tests, 2 errors <<< FAILURES!

[...truncated 3015 lines...]
   [junit4] Suite: org.apache.solr.update.processor.TestOpenNLPExtractNamedEntitiesUpdateProcessorFactory
   [junit4]   2> log4j:WARN No appenders could be found for logger (org.apache.solr.SolrTestCaseJ4).
   [junit4]   2> log4j:WARN Please initialize the log4j system properly.
   [junit4]   2> log4j:WARN See http://logging.apache.org/log4j/1.2/faq.html#noconfig for more info.
   [junit4]   2> Creating dataDir: C:\Users\jenkins\workspace\Lucene-Solr-master-Windows\solr\build\contrib\solr-analysis-extras\test\J1\temp\solr.update.processor.TestOpenNLPExtractNamedEntitiesUpdateProcessorFactory_859511E06EDD0AA4-001\init-core-data-001
   [junit4]   2> NOTE: test params are: codec=Asserting(Lucene70): {}, docValues:{}, maxPointsInLeafNode=1575, maxMBSortInHeap=6.875684902145371, sim=Asserting(org.apache.lucene.search.similarities.AssertingSimilarity@195b28a), locale=es-PY, timezone=America/Indiana/Winamac
   [junit4]   2> NOTE: Windows 10 10.0 x86/Oracle Corporation 1.8.0_144 (32-bit)/cpus=3,threads=1,free=34926008,total=64880640
   [junit4]   2> NOTE: All tests run in this JVM: [TestOpenNLPExtractNamedEntitiesUpdateProcessorFactory]
   [junit4]   2> NOTE: reproduce with: ant test  -Dtestcase=TestOpenNLPExtractNamedEntitiesUpdateProcessorFactory -Dtests.seed=859511E06EDD0AA4 -Dtests.slow=true -Dtests.locale=es-PY -Dtests.timezone=America/Indiana/Winamac -Dtests.asserts=true -Dtests.file.encoding=UTF-8
   [junit4] ERROR   0.00s J1 | TestOpenNLPExtractNamedEntitiesUpdateProcessorFactory (suite) <<<
   [junit4]    > Throwable #1: java.io.IOException: Could not remove the following files (in the order of attempts):
   [junit4]    >    C:\Users\jenkins\workspace\Lucene-Solr-master-Windows\solr\build\contrib\solr-analysis-extras\test\J1\temp\solr.update.processor.TestOpenNLPExtractNamedEntitiesUpdateProcessorFactory_859511E06EDD0AA4-001\tempDir-001\collection1\conf: java.nio.file.DirectoryNotEmptyException: C:\Users\jenkins\workspace\Lucene-Solr-master-Windows\solr\build\contrib\solr-analysis-extras\test\J1\temp\solr.update.processor.TestOpenNLPExtractNamedEntitiesUpdateProcessorFactory_859511E06EDD0AA4-001\tempDir-001\collection1\conf
   [junit4]    >    C:\Users\jenkins\workspace\Lucene-Solr-master-Windows\solr\build\contrib\solr-analysis-extras\test\J1\temp\solr.update.processor.TestOpenNLPExtractNamedEntitiesUpdateProcessorFactory_859511E06EDD0AA4-001\tempDir-001\collection1: java.nio.file.DirectoryNotEmptyException: C:\Users\jenkins\workspace\Lucene-Solr-master-Windows\solr\build\contrib\solr-analysis-extras\test\J1\temp\solr.update.processor.TestOpenNLPExtractNamedEntitiesUpdateProcessorFactory_859511E06EDD0AA4-001\tempDir-001\collection1
   [junit4]    >    C:\Users\jenkins\workspace\Lucene-Solr-master-Windows\solr\build\contrib\solr-analysis-extras\test\J1\temp\solr.update.processor.TestOpenNLPExtractNamedEntitiesUpdateProcessorFactory_859511E06EDD0AA4-001\tempDir-001: java.nio.file.DirectoryNotEmptyException: C:\Users\jenkins\workspace\Lucene-Solr-master-Windows\solr\build\contrib\solr-analysis-extras\test\J1\temp\solr.update.processor.TestOpenNLPExtractNamedEntitiesUpdateProcessorFactory_859511E06EDD0AA4-001\tempDir-001
   [junit4]    >    C:\Users\jenkins\workspace\Lucene-Solr-master-Windows\solr\build\contrib\solr-analysis-extras\test\J1\temp\solr.update.processor.TestOpenNLPExtractNamedEntitiesUpdateProcessorFactory_859511E06EDD0AA4-001\tempDir-001\collection1\conf\en-test-sent.bin: java.nio.file.AccessDeniedException: C:\Users\jenkins\workspace\Lucene-Solr-master-Windows\solr\build\contrib\solr-analysis-extras\test\J1\temp\solr.update.processor.TestOpenNLPExtractNamedEntitiesUpdateProcessorFactory_859511E06EDD0AA4-001\tempDir-001\collection1\conf\en-test-sent.bin
   [junit4]    >    C:\Users\jenkins\workspace\Lucene-Solr-master-Windows\solr\build\contrib\solr-analysis-extras\test\J1\temp\solr.update.processor.TestOpenNLPExtractNamedEntitiesUpdateProcessorFactory_859511E06EDD0AA4-001\tempDir-001\collection1\conf\en-test-ner-person.bin: java.nio.file.AccessDeniedException: C:\Users\jenkins\workspace\Lucene-Solr-master-Windows\solr\build\contrib\solr-analysis-extras\test\J1\temp\solr.update.processor.TestOpenNLPExtractNamedEntitiesUpdateProcessorFactory_859511E06EDD0AA4-001\tempDir-001\collection1\conf\en-test-ner-person.bin
   [junit4]    >    C:\Users\jenkins\workspace\Lucene-Solr-master-Windows\solr\build\contrib\solr-analysis-extras\test\J1\temp\solr.update.processor.TestOpenNLPExtractNamedEntitiesUpdateProcessorFactory_859511E06EDD0AA4-001\tempDir-001\collection1\conf\en-test-tokenizer.bin: java.nio.file.AccessDeniedException: C:\Users\jenkins\workspace\Lucene-Solr-master-Windows\solr\build\contrib\solr-analysis-extras\test\J1\temp\solr.update.processor.TestOpenNLPExtractNamedEntitiesUpdateProcessorFactory_859511E06EDD0AA4-001\tempDir-001\collection1\conf\en-test-tokenizer.bin
   [junit4]    >    C:\Users\jenkins\workspace\Lucene-Solr-master-Windows\solr\build\contrib\solr-analysis-extras\test\J1\temp\solr.update.processor.TestOpenNLPExtractNamedEntitiesUpdateProcessorFactory_859511E06EDD0AA4-001: java.nio.file.DirectoryNotEmptyException: C:\Users\jenkins\workspace\Lucene-Solr-master-Windows\solr\build\contrib\solr-analysis-extras\test\J1\temp\solr.update.processor.TestOpenNLPExtractNamedEntitiesUpdateProcessorFactory_859511E06EDD0AA4-001
   [junit4]    > 	at __randomizedtesting.SeedInfo.seed([859511E06EDD0AA4]:0)
   [junit4]    > 	at org.apache.lucene.util.IOUtils.rm(IOUtils.java:329)
   [junit4]    > 	at java.lang.Thread.run(Thread.java:748)
   [junit4] Completed [1/5 (1!)] on J1 in 14.22s, 8 tests, 1 error <<< FAILURES!

[...truncated 41494 lines...]

Mime
View raw message