lucene-dev mailing list archives

Site index · List index
Message view « Date » · « Thread »
Top « Date » · « Thread »
From Policeman Jenkins Server <jenk...@thetaphi.de>
Subject [JENKINS] Lucene-Solr-7.x-MacOSX (64bit/jdk-9) - Build # 410 - Still Unstable!
Date Sat, 20 Jan 2018 18:37:09 GMT
Build: https://jenkins.thetaphi.de/job/Lucene-Solr-7.x-MacOSX/410/
Java: 64bit/jdk-9 -XX:-UseCompressedOops -XX:+UseConcMarkSweepGC

1 tests failed.
FAILED:  org.apache.solr.cloud.autoscaling.AutoAddReplicasPlanActionTest.testSimple

Error Message:
No live SolrServers available to handle this request:[https://127.0.0.1:64516/solr]

Stack Trace:
org.apache.solr.client.solrj.SolrServerException: No live SolrServers available to handle this request:[https://127.0.0.1:64516/solr]
	at __randomizedtesting.SeedInfo.seed([82E471F7C112BF85:BA575509E6E16B54]:0)
	at org.apache.solr.client.solrj.impl.LBHttpSolrClient.request(LBHttpSolrClient.java:462)
	at org.apache.solr.client.solrj.impl.CloudSolrClient.sendRequest(CloudSolrClient.java:1104)
	at org.apache.solr.client.solrj.impl.CloudSolrClient.requestWithRetryOnStaleState(CloudSolrClient.java:884)
	at org.apache.solr.client.solrj.impl.CloudSolrClient.request(CloudSolrClient.java:817)
	at org.apache.solr.client.solrj.SolrClient.request(SolrClient.java:1219)
	at org.apache.solr.cloud.autoscaling.AutoAddReplicasPlanActionTest.testSimple(AutoAddReplicasPlanActionTest.java:110)
	at java.base/jdk.internal.reflect.NativeMethodAccessorImpl.invoke0(Native Method)
	at java.base/jdk.internal.reflect.NativeMethodAccessorImpl.invoke(NativeMethodAccessorImpl.java:62)
	at java.base/jdk.internal.reflect.DelegatingMethodAccessorImpl.invoke(DelegatingMethodAccessorImpl.java:43)
	at java.base/java.lang.reflect.Method.invoke(Method.java:564)
	at com.carrotsearch.randomizedtesting.RandomizedRunner.invoke(RandomizedRunner.java:1737)
	at com.carrotsearch.randomizedtesting.RandomizedRunner$8.evaluate(RandomizedRunner.java:934)
	at com.carrotsearch.randomizedtesting.RandomizedRunner$9.evaluate(RandomizedRunner.java:970)
	at com.carrotsearch.randomizedtesting.RandomizedRunner$10.evaluate(RandomizedRunner.java:984)
	at com.carrotsearch.randomizedtesting.rules.SystemPropertiesRestoreRule$1.evaluate(SystemPropertiesRestoreRule.java:57)
	at org.apache.lucene.util.TestRuleSetupTeardownChained$1.evaluate(TestRuleSetupTeardownChained.java:49)
	at org.apache.lucene.util.AbstractBeforeAfterRule$1.evaluate(AbstractBeforeAfterRule.java:45)
	at org.apache.lucene.util.TestRuleThreadAndTestName$1.evaluate(TestRuleThreadAndTestName.java:48)
	at org.apache.lucene.util.TestRuleIgnoreAfterMaxFailures$1.evaluate(TestRuleIgnoreAfterMaxFailures.java:64)
	at org.apache.lucene.util.TestRuleMarkFailure$1.evaluate(TestRuleMarkFailure.java:47)
	at com.carrotsearch.randomizedtesting.rules.StatementAdapter.evaluate(StatementAdapter.java:36)
	at com.carrotsearch.randomizedtesting.ThreadLeakControl$StatementRunner.run(ThreadLeakControl.java:368)
	at com.carrotsearch.randomizedtesting.ThreadLeakControl.forkTimeoutingTask(ThreadLeakControl.java:817)
	at com.carrotsearch.randomizedtesting.ThreadLeakControl$3.evaluate(ThreadLeakControl.java:468)
	at com.carrotsearch.randomizedtesting.RandomizedRunner.runSingleTest(RandomizedRunner.java:943)
	at com.carrotsearch.randomizedtesting.RandomizedRunner$5.evaluate(RandomizedRunner.java:829)
	at com.carrotsearch.randomizedtesting.RandomizedRunner$6.evaluate(RandomizedRunner.java:879)
	at com.carrotsearch.randomizedtesting.RandomizedRunner$7.evaluate(RandomizedRunner.java:890)
	at com.carrotsearch.randomizedtesting.rules.StatementAdapter.evaluate(StatementAdapter.java:36)
	at com.carrotsearch.randomizedtesting.rules.SystemPropertiesRestoreRule$1.evaluate(SystemPropertiesRestoreRule.java:57)
	at org.apache.lucene.util.AbstractBeforeAfterRule$1.evaluate(AbstractBeforeAfterRule.java:45)
	at com.carrotsearch.randomizedtesting.rules.StatementAdapter.evaluate(StatementAdapter.java:36)
	at org.apache.lucene.util.TestRuleStoreClassName$1.evaluate(TestRuleStoreClassName.java:41)
	at com.carrotsearch.randomizedtesting.rules.NoShadowingOrOverridesOnMethodsRule$1.evaluate(NoShadowingOrOverridesOnMethodsRule.java:40)
	at com.carrotsearch.randomizedtesting.rules.NoShadowingOrOverridesOnMethodsRule$1.evaluate(NoShadowingOrOverridesOnMethodsRule.java:40)
	at com.carrotsearch.randomizedtesting.rules.StatementAdapter.evaluate(StatementAdapter.java:36)
	at com.carrotsearch.randomizedtesting.rules.StatementAdapter.evaluate(StatementAdapter.java:36)
	at org.apache.lucene.util.TestRuleAssertionsRequired$1.evaluate(TestRuleAssertionsRequired.java:53)
	at org.apache.lucene.util.TestRuleMarkFailure$1.evaluate(TestRuleMarkFailure.java:47)
	at org.apache.lucene.util.TestRuleIgnoreAfterMaxFailures$1.evaluate(TestRuleIgnoreAfterMaxFailures.java:64)
	at org.apache.lucene.util.TestRuleIgnoreTestSuites$1.evaluate(TestRuleIgnoreTestSuites.java:54)
	at com.carrotsearch.randomizedtesting.rules.StatementAdapter.evaluate(StatementAdapter.java:36)
	at com.carrotsearch.randomizedtesting.ThreadLeakControl$StatementRunner.run(ThreadLeakControl.java:368)
	at java.base/java.lang.Thread.run(Thread.java:844)
Caused by: org.apache.solr.client.solrj.SolrServerException: IOException occured when talking to server at: https://127.0.0.1:64516/solr
	at org.apache.solr.client.solrj.impl.HttpSolrClient.executeMethod(HttpSolrClient.java:657)
	at org.apache.solr.client.solrj.impl.HttpSolrClient.request(HttpSolrClient.java:255)
	at org.apache.solr.client.solrj.impl.HttpSolrClient.request(HttpSolrClient.java:244)
	at org.apache.solr.client.solrj.impl.LBHttpSolrClient.doRequest(LBHttpSolrClient.java:483)
	at org.apache.solr.client.solrj.impl.LBHttpSolrClient.request(LBHttpSolrClient.java:413)
	... 43 more
Caused by: org.apache.http.NoHttpResponseException: 127.0.0.1:64516 failed to respond
	at org.apache.http.impl.conn.DefaultHttpResponseParser.parseHead(DefaultHttpResponseParser.java:141)
	at org.apache.http.impl.conn.DefaultHttpResponseParser.parseHead(DefaultHttpResponseParser.java:56)
	at org.apache.http.impl.io.AbstractMessageParser.parse(AbstractMessageParser.java:259)
	at org.apache.http.impl.DefaultBHttpClientConnection.receiveResponseHeader(DefaultBHttpClientConnection.java:163)
	at org.apache.http.impl.conn.CPoolProxy.receiveResponseHeader(CPoolProxy.java:165)
	at org.apache.http.protocol.HttpRequestExecutor.doReceiveResponse(HttpRequestExecutor.java:273)
	at org.apache.http.protocol.HttpRequestExecutor.execute(HttpRequestExecutor.java:125)
	at org.apache.http.impl.execchain.MainClientExec.execute(MainClientExec.java:272)
	at org.apache.http.impl.execchain.ProtocolExec.execute(ProtocolExec.java:185)
	at org.apache.http.impl.execchain.RetryExec.execute(RetryExec.java:89)
	at org.apache.http.impl.execchain.RedirectExec.execute(RedirectExec.java:111)
	at org.apache.http.impl.client.InternalHttpClient.doExecute(InternalHttpClient.java:185)
	at org.apache.http.impl.client.CloseableHttpClient.execute(CloseableHttpClient.java:83)
	at org.apache.http.impl.client.CloseableHttpClient.execute(CloseableHttpClient.java:56)
	at org.apache.solr.client.solrj.impl.HttpSolrClient.executeMethod(HttpSolrClient.java:542)
	... 47 more




Build Log:
[...truncated 1739 lines...]
   [junit4] JVM J0: stderr was not empty, see: /Users/jenkins/workspace/Lucene-Solr-7.x-MacOSX/lucene/build/core/test/temp/junit4-J0-20180120_170246_0321921762489229565549.syserr
   [junit4] >>> JVM J0 emitted unexpected output (verbatim) ----
   [junit4] Java HotSpot(TM) 64-Bit Server VM warning: Option UseConcMarkSweepGC was deprecated in version 9.0 and will likely be removed in a future release.
   [junit4] <<< JVM J0: EOF ----

   [junit4] JVM J1: stderr was not empty, see: /Users/jenkins/workspace/Lucene-Solr-7.x-MacOSX/lucene/build/core/test/temp/junit4-J1-20180120_170246_0324576222632657035637.syserr
   [junit4] >>> JVM J1 emitted unexpected output (verbatim) ----
   [junit4] Java HotSpot(TM) 64-Bit Server VM warning: Option UseConcMarkSweepGC was deprecated in version 9.0 and will likely be removed in a future release.
   [junit4] <<< JVM J1: EOF ----

[...truncated 291 lines...]
   [junit4] JVM J0: stderr was not empty, see: /Users/jenkins/workspace/Lucene-Solr-7.x-MacOSX/lucene/build/test-framework/test/temp/junit4-J0-20180120_170754_4299405178622990217095.syserr
   [junit4] >>> JVM J0 emitted unexpected output (verbatim) ----
   [junit4] Java HotSpot(TM) 64-Bit Server VM warning: Option UseConcMarkSweepGC was deprecated in version 9.0 and will likely be removed in a future release.
   [junit4] <<< JVM J0: EOF ----

   [junit4] JVM J1: stderr was not empty, see: /Users/jenkins/workspace/Lucene-Solr-7.x-MacOSX/lucene/build/test-framework/test/temp/junit4-J1-20180120_170754_4293244098743929257000.syserr
   [junit4] >>> JVM J1 emitted unexpected output (verbatim) ----
   [junit4] Java HotSpot(TM) 64-Bit Server VM warning: Option UseConcMarkSweepGC was deprecated in version 9.0 and will likely be removed in a future release.
   [junit4] <<< JVM J1: EOF ----

[...truncated 1057 lines...]
   [junit4] JVM J1: stderr was not empty, see: /Users/jenkins/workspace/Lucene-Solr-7.x-MacOSX/lucene/build/analysis/common/test/temp/junit4-J1-20180120_170914_9792917825688240201793.syserr
   [junit4] >>> JVM J1 emitted unexpected output (verbatim) ----
   [junit4] Java HotSpot(TM) 64-Bit Server VM warning: Option UseConcMarkSweepGC was deprecated in version 9.0 and will likely be removed in a future release.
   [junit4] <<< JVM J1: EOF ----

[...truncated 3 lines...]
   [junit4] JVM J0: stderr was not empty, see: /Users/jenkins/workspace/Lucene-Solr-7.x-MacOSX/lucene/build/analysis/common/test/temp/junit4-J0-20180120_170914_97910768023377662220546.syserr
   [junit4] >>> JVM J0 emitted unexpected output (verbatim) ----
   [junit4] Java HotSpot(TM) 64-Bit Server VM warning: Option UseConcMarkSweepGC was deprecated in version 9.0 and will likely be removed in a future release.
   [junit4] <<< JVM J0: EOF ----

[...truncated 224 lines...]
   [junit4] JVM J1: stderr was not empty, see: /Users/jenkins/workspace/Lucene-Solr-7.x-MacOSX/lucene/build/analysis/icu/test/temp/junit4-J1-20180120_171112_97418267845852430847177.syserr
   [junit4] >>> JVM J1 emitted unexpected output (verbatim) ----
   [junit4] Java HotSpot(TM) 64-Bit Server VM warning: Option UseConcMarkSweepGC was deprecated in version 9.0 and will likely be removed in a future release.
   [junit4] <<< JVM J1: EOF ----

[...truncated 5 lines...]
   [junit4] JVM J0: stderr was not empty, see: /Users/jenkins/workspace/Lucene-Solr-7.x-MacOSX/lucene/build/analysis/icu/test/temp/junit4-J0-20180120_171112_97414243363059228367897.syserr
   [junit4] >>> JVM J0 emitted unexpected output (verbatim) ----
   [junit4] Java HotSpot(TM) 64-Bit Server VM warning: Option UseConcMarkSweepGC was deprecated in version 9.0 and will likely be removed in a future release.
   [junit4] <<< JVM J0: EOF ----

[...truncated 240 lines...]
   [junit4] JVM J0: stderr was not empty, see: /Users/jenkins/workspace/Lucene-Solr-7.x-MacOSX/lucene/build/analysis/kuromoji/test/temp/junit4-J0-20180120_171122_27412457777597993303818.syserr
   [junit4] >>> JVM J0 emitted unexpected output (verbatim) ----
   [junit4] Java HotSpot(TM) 64-Bit Server VM warning: Option UseConcMarkSweepGC was deprecated in version 9.0 and will likely be removed in a future release.
   [junit4] <<< JVM J0: EOF ----

[...truncated 12 lines...]
   [junit4] JVM J1: stderr was not empty, see: /Users/jenkins/workspace/Lucene-Solr-7.x-MacOSX/lucene/build/analysis/kuromoji/test/temp/junit4-J1-20180120_171122_2748986984390903652201.syserr
   [junit4] >>> JVM J1 emitted unexpected output (verbatim) ----
   [junit4] Java HotSpot(TM) 64-Bit Server VM warning: Option UseConcMarkSweepGC was deprecated in version 9.0 and will likely be removed in a future release.
   [junit4] <<< JVM J1: EOF ----

[...truncated 154 lines...]
   [junit4] JVM J0: stderr was not empty, see: /Users/jenkins/workspace/Lucene-Solr-7.x-MacOSX/lucene/build/analysis/morfologik/test/temp/junit4-J0-20180120_171147_01117293637837573322540.syserr
   [junit4] >>> JVM J0 emitted unexpected output (verbatim) ----
   [junit4] Java HotSpot(TM) 64-Bit Server VM warning: Option UseConcMarkSweepGC was deprecated in version 9.0 and will likely be removed in a future release.
   [junit4] <<< JVM J0: EOF ----

[...truncated 3 lines...]
   [junit4] JVM J1: stderr was not empty, see: /Users/jenkins/workspace/Lucene-Solr-7.x-MacOSX/lucene/build/analysis/morfologik/test/temp/junit4-J1-20180120_171147_01111982366628557794284.syserr
   [junit4] >>> JVM J1 emitted unexpected output (verbatim) ----
   [junit4] Java HotSpot(TM) 64-Bit Server VM warning: Option UseConcMarkSweepGC was deprecated in version 9.0 and will likely be removed in a future release.
   [junit4] <<< JVM J1: EOF ----

[...truncated 161 lines...]
   [junit4] JVM J1: stderr was not empty, see: /Users/jenkins/workspace/Lucene-Solr-7.x-MacOSX/lucene/build/analysis/opennlp/test/temp/junit4-J1-20180120_171151_08915180670947948758978.syserr
   [junit4] JVM J0: stderr was not empty, see: /Users/jenkins/workspace/Lucene-Solr-7.x-MacOSX/lucene/build/analysis/opennlp/test/temp/junit4-J0-20180120_171151_0899785948054847262840.syserr
   [junit4] >>> JVM J1 emitted unexpected output (verbatim) ----
   [junit4] Java HotSpot(TM) 64-Bit Server VM warning: Option UseConcMarkSweepGC was deprecated in version 9.0 and will likely be removed in a future release.
   [junit4] <<< JVM J1: EOF ----

[...truncated 171 lines...]
   [junit4] JVM J0: stderr was not empty, see: /Users/jenkins/workspace/Lucene-Solr-7.x-MacOSX/lucene/build/analysis/phonetic/test/temp/junit4-J0-20180120_171154_3388403965333330615925.syserr
   [junit4] >>> JVM J0 emitted unexpected output (verbatim) ----
   [junit4] Java HotSpot(TM) 64-Bit Server VM warning: Option UseConcMarkSweepGC was deprecated in version 9.0 and will likely be removed in a future release.
   [junit4] <<< JVM J0: EOF ----

[...truncated 3 lines...]
   [junit4] JVM J1: stderr was not empty, see: /Users/jenkins/workspace/Lucene-Solr-7.x-MacOSX/lucene/build/analysis/phonetic/test/temp/junit4-J1-20180120_171154_33816576891282324315561.syserr
   [junit4] >>> JVM J1 emitted unexpected output (verbatim) ----
   [junit4] Java HotSpot(TM) 64-Bit Server VM warning: Option UseConcMarkSweepGC was deprecated in version 9.0 and will likely be removed in a future release.
   [junit4] <<< JVM J1: EOF ----

[...truncated 151 lines...]
   [junit4] JVM J0: stderr was not empty, see: /Users/jenkins/workspace/Lucene-Solr-7.x-MacOSX/lucene/build/analysis/smartcn/test/temp/junit4-J0-20180120_171201_6152418429881555900336.syserr
   [junit4] >>> JVM J0 emitted unexpected output (verbatim) ----
   [junit4] Java HotSpot(TM) 64-Bit Server VM warning: Option UseConcMarkSweepGC was deprecated in version 9.0 and will likely be removed in a future release.
   [junit4] <<< JVM J0: EOF ----

[...truncated 3 lines...]
   [junit4] JVM J1: stderr was not empty, see: /Users/jenkins/workspace/Lucene-Solr-7.x-MacOSX/lucene/build/analysis/smartcn/test/temp/junit4-J1-20180120_171201_61514559795386044323933.syserr
   [junit4] >>> JVM J1 emitted unexpected output (verbatim) ----
   [junit4] Java HotSpot(TM) 64-Bit Server VM warning: Option UseConcMarkSweepGC was deprecated in version 9.0 and will likely be removed in a future release.
   [junit4] <<< JVM J1: EOF ----

[...truncated 159 lines...]
   [junit4] JVM J1: stderr was not empty, see: /Users/jenkins/workspace/Lucene-Solr-7.x-MacOSX/lucene/build/analysis/stempel/test/temp/junit4-J1-20180120_171209_0103889831394826363385.syserr
   [junit4] >>> JVM J1 emitted unexpected output (verbatim) ----
   [junit4] Java HotSpot(TM) 64-Bit Server VM warning: Option UseConcMarkSweepGC was deprecated in version 9.0 and will likely be removed in a future release.
   [junit4] <<< JVM J1: EOF ----

   [junit4] JVM J0: stderr was not empty, see: /Users/jenkins/workspace/Lucene-Solr-7.x-MacOSX/lucene/build/analysis/stempel/test/temp/junit4-J0-20180120_171209_0102931475539695878361.syserr
   [junit4] >>> JVM J0 emitted unexpected output (verbatim) ----
   [junit4] Java HotSpot(TM) 64-Bit Server VM warning: Option UseConcMarkSweepGC was deprecated in version 9.0 and will likely be removed in a future release.
   [junit4] <<< JVM J0: EOF ----

[...truncated 167 lines...]
   [junit4] JVM J0: stderr was not empty, see: /Users/jenkins/workspace/Lucene-Solr-7.x-MacOSX/lucene/build/analysis/uima/test/temp/junit4-J0-20180120_171212_1886633966043844772673.syserr
   [junit4] >>> JVM J0 emitted unexpected output (verbatim) ----
   [junit4] Java HotSpot(TM) 64-Bit Server VM warning: Option UseConcMarkSweepGC was deprecated in version 9.0 and will likely be removed in a future release.
   [junit4] <<< JVM J0: EOF ----

[...truncated 213 lines...]
   [junit4] JVM J0: stderr was not empty, see: /Users/jenkins/workspace/Lucene-Solr-7.x-MacOSX/lucene/build/backward-codecs/test/temp/junit4-J0-20180120_171224_32915787756122382325174.syserr
   [junit4] >>> JVM J0 emitted unexpected output (verbatim) ----
   [junit4] Java HotSpot(TM) 64-Bit Server VM warning: Option UseConcMarkSweepGC was deprecated in version 9.0 and will likely be removed in a future release.
   [junit4] <<< JVM J0: EOF ----

[...truncated 9 lines...]
   [junit4] JVM J1: stderr was not empty, see: /Users/jenkins/workspace/Lucene-Solr-7.x-MacOSX/lucene/build/backward-codecs/test/temp/junit4-J1-20180120_171224_32912790265712500285568.syserr
   [junit4] >>> JVM J1 emitted unexpected output (verbatim) ----
   [junit4] Java HotSpot(TM) 64-Bit Server VM warning: Option UseConcMarkSweepGC was deprecated in version 9.0 and will likely be removed in a future release.
   [junit4] <<< JVM J1: EOF ----

[...truncated 1317 lines...]
   [junit4] JVM J1: stderr was not empty, see: /Users/jenkins/workspace/Lucene-Solr-7.x-MacOSX/lucene/build/benchmark/test/temp/junit4-J1-20180120_171332_9411157319472623832090.syserr
   [junit4] >>> JVM J1 emitted unexpected output (verbatim) ----
   [junit4] Java HotSpot(TM) 64-Bit Server VM warning: Option UseConcMarkSweepGC was deprecated in version 9.0 and will likely be removed in a future release.
   [junit4] <<< JVM J1: EOF ----

   [junit4] JVM J0: stderr was not empty, see: /Users/jenkins/workspace/Lucene-Solr-7.x-MacOSX/lucene/build/benchmark/test/temp/junit4-J0-20180120_171332_9418770938335436320653.syserr
   [junit4] >>> JVM J0 emitted unexpected output (verbatim) ----
   [junit4] Java HotSpot(TM) 64-Bit Server VM warning: Option UseConcMarkSweepGC was deprecated in version 9.0 and will likely be removed in a future release.
   [junit4] <<< JVM J0: EOF ----

[...truncated 231 lines...]
   [junit4] JVM J1: stderr was not empty, see: /Users/jenkins/workspace/Lucene-Solr-7.x-MacOSX/lucene/build/classification/test/temp/junit4-J1-20180120_171342_371277866882020338886.syserr
   [junit4] >>> JVM J1 emitted unexpected output (verbatim) ----
   [junit4] Java HotSpot(TM) 64-Bit Server VM warning: Option UseConcMarkSweepGC was deprecated in version 9.0 and will likely be removed in a future release.
   [junit4] <<< JVM J1: EOF ----

[...truncated 3 lines...]
   [junit4] JVM J0: stderr was not empty, see: /Users/jenkins/workspace/Lucene-Solr-7.x-MacOSX/lucene/build/classification/test/temp/junit4-J0-20180120_171342_37111835412238235229246.syserr
   [junit4] >>> JVM J0 emitted unexpected output (verbatim) ----
   [junit4] Java HotSpot(TM) 64-Bit Server VM warning: Option UseConcMarkSweepGC was deprecated in version 9.0 and will likely be removed in a future release.
   [junit4] <<< JVM J0: EOF ----

[...truncated 259 lines...]
   [junit4] JVM J1: stderr was not empty, see: /Users/jenkins/workspace/Lucene-Solr-7.x-MacOSX/lucene/build/codecs/test/temp/junit4-J1-20180120_171356_16518373088608275096108.syserr
   [junit4] >>> JVM J1 emitted unexpected output (verbatim) ----
   [junit4] Java HotSpot(TM) 64-Bit Server VM warning: Option UseConcMarkSweepGC was deprecated in version 9.0 and will likely be removed in a future release.
   [junit4] <<< JVM J1: EOF ----

[...truncated 3 lines...]
   [junit4] JVM J0: stderr was not empty, see: /Users/jenkins/workspace/Lucene-Solr-7.x-MacOSX/lucene/build/codecs/test/temp/junit4-J0-20180120_171356_1651100008904576764137.syserr
   [junit4] >>> JVM J0 emitted unexpected output (verbatim) ----
   [junit4] Java HotSpot(TM) 64-Bit Server VM warning: Option UseConcMarkSweepGC was deprecated in version 9.0 and will likely be removed in a future release.
   [junit4] <<< JVM J0: EOF ----

[...truncated 212 lines...]
   [junit4] JVM J0: stderr was not empty, see: /Users/jenkins/workspace/Lucene-Solr-7.x-MacOSX/lucene/build/demo/test/temp/junit4-J0-20180120_171540_21213999935280845670239.syserr
   [junit4] >>> JVM J0 emitted unexpected output (verbatim) ----
   [junit4] Java HotSpot(TM) 64-Bit Server VM warning: Option UseConcMarkSweepGC was deprecated in version 9.0 and will likely be removed in a future release.
   [junit4] <<< JVM J0: EOF ----

   [junit4] JVM J1: stderr was not empty, see: /Users/jenkins/workspace/Lucene-Solr-7.x-MacOSX/lucene/build/demo/test/temp/junit4-J1-20180120_171540_2128576846599289135075.syserr
   [junit4] >>> JVM J1 emitted unexpected output (verbatim) ----
   [junit4] Java HotSpot(TM) 64-Bit Server VM warning: Option UseConcMarkSweepGC was deprecated in version 9.0 and will likely be removed in a future release.
   [junit4] <<< JVM J1: EOF ----

[...truncated 164 lines...]
   [junit4] JVM J0: stderr was not empty, see: /Users/jenkins/workspace/Lucene-Solr-7.x-MacOSX/lucene/build/expressions/test/temp/junit4-J0-20180120_171543_9947801746311341321519.syserr
   [junit4] >>> JVM J0 emitted unexpected output (verbatim) ----
   [junit4] Java HotSpot(TM) 64-Bit Server VM warning: Option UseConcMarkSweepGC was deprecated in version 9.0 and will likely be removed in a future release.
   [junit4] <<< JVM J0: EOF ----

[...truncated 9 lines...]
   [junit4] JVM J1: stderr was not empty, see: /Users/jenkins/workspace/Lucene-Solr-7.x-MacOSX/lucene/build/expressions/test/temp/junit4-J1-20180120_171543_99410551699931307147534.syserr
   [junit4] >>> JVM J1 emitted unexpected output (verbatim) ----
   [junit4] Java HotSpot(TM) 64-Bit Server VM warning: Option UseConcMarkSweepGC was deprecated in version 9.0 and will likely be removed in a future release.
   [junit4] <<< JVM J1: EOF ----

[...truncated 226 lines...]
   [junit4] JVM J0: stderr was not empty, see: /Users/jenkins/workspace/Lucene-Solr-7.x-MacOSX/lucene/build/facet/test/temp/junit4-J0-20180120_171549_4047995649122051753990.syserr
   [junit4] >>> JVM J0 emitted unexpected output (verbatim) ----
   [junit4] Java HotSpot(TM) 64-Bit Server VM warning: Option UseConcMarkSweepGC was deprecated in version 9.0 and will likely be removed in a future release.
   [junit4] <<< JVM J0: EOF ----

[...truncated 3 lines...]
   [junit4] JVM J1: stderr was not empty, see: /Users/jenkins/workspace/Lucene-Solr-7.x-MacOSX/lucene/build/facet/test/temp/junit4-J1-20180120_171549_40413005219640675093857.syserr
   [junit4] >>> JVM J1 emitted unexpected output (verbatim) ----
   [junit4] Java HotSpot(TM) 64-Bit Server VM warning: Option UseConcMarkSweepGC was deprecated in version 9.0 and will likely be removed in a future release.
   [junit4] <<< JVM J1: EOF ----

[...truncated 179 lines...]
   [junit4] JVM J1: stderr was not empty, see: /Users/jenkins/workspace/Lucene-Solr-7.x-MacOSX/lucene/build/grouping/test/temp/junit4-J1-20180120_171617_48614013843509558538388.syserr
   [junit4] >>> JVM J1 emitted unexpected output (verbatim) ----
   [junit4] Java HotSpot(TM) 64-Bit Server VM warning: Option UseConcMarkSweepGC was deprecated in version 9.0 and will likely be removed in a future release.
   [junit4] <<< JVM J1: EOF ----

[...truncated 3 lines...]
   [junit4] JVM J0: stderr was not empty, see: /Users/jenkins/workspace/Lucene-Solr-7.x-MacOSX/lucene/build/grouping/test/temp/junit4-J0-20180120_171617_4868048546160798741986.syserr
   [junit4] >>> JVM J0 emitted unexpected output (verbatim) ----
   [junit4] Java HotSpot(TM) 64-Bit Server VM warning: Option UseConcMarkSweepGC was deprecated in version 9.0 and will likely be removed in a future release.
   [junit4] <<< JVM J0: EOF ----

[...truncated 246 lines...]
   [junit4] JVM J1: stderr was not empty, see: /Users/jenkins/workspace/Lucene-Solr-7.x-MacOSX/lucene/build/highlighter/test/temp/junit4-J1-20180120_171627_530404057585189628218.syserr
   [junit4] >>> JVM J1 emitted unexpected output (verbatim) ----
   [junit4] Java HotSpot(TM) 64-Bit Server VM warning: Option UseConcMarkSweepGC was deprecated in version 9.0 and will likely be removed in a future release.
   [junit4] <<< JVM J1: EOF ----

   [junit4] JVM J0: stderr was not empty, see: /Users/jenkins/workspace/Lucene-Solr-7.x-MacOSX/lucene/build/highlighter/test/temp/junit4-J0-20180120_171627_53017211205905681894753.syserr
   [junit4] >>> JVM J0 emitted unexpected output (verbatim) ----
   [junit4] Java HotSpot(TM) 64-Bit Server VM warning: Option UseConcMarkSweepGC was deprecated in version 9.0 and will likely be removed in a future release.
   [junit4] <<< JVM J0: EOF ----

[...truncated 163 lines...]
   [junit4] JVM J1: stderr was not empty, see: /Users/jenkins/workspace/Lucene-Solr-7.x-MacOSX/lucene/build/join/test/temp/junit4-J1-20180120_171641_9558872053065916989922.syserr
   [junit4] >>> JVM J1 emitted unexpected output (verbatim) ----
   [junit4] Java HotSpot(TM) 64-Bit Server VM warning: Option UseConcMarkSweepGC was deprecated in version 9.0 and will likely be removed in a future release.
   [junit4] <<< JVM J1: EOF ----

[...truncated 3 lines...]
   [junit4] JVM J0: stderr was not empty, see: /Users/jenkins/workspace/Lucene-Solr-7.x-MacOSX/lucene/build/join/test/temp/junit4-J0-20180120_171641_9556572890060195429311.syserr
   [junit4] >>> JVM J0 emitted unexpected output (verbatim) ----
   [junit4] Java HotSpot(TM) 64-Bit Server VM warning: Option UseConcMarkSweepGC was deprecated in version 9.0 and will likely be removed in a future release.
   [junit4] <<< JVM J0: EOF ----

[...truncated 147 lines...]
   [junit4] JVM J0: stderr was not empty, see: /Users/jenkins/workspace/Lucene-Solr-7.x-MacOSX/lucene/build/memory/test/temp/junit4-J0-20180120_171653_44813373073440957521939.syserr
   [junit4] >>> JVM J0 emitted unexpected output (verbatim) ----
   [junit4] Java HotSpot(TM) 64-Bit Server VM warning: Option UseConcMarkSweepGC was deprecated in version 9.0 and will likely be removed in a future release.
   [junit4] <<< JVM J0: EOF ----

[...truncated 3 lines...]
   [junit4] JVM J1: stderr was not empty, see: /Users/jenkins/workspace/Lucene-Solr-7.x-MacOSX/lucene/build/memory/test/temp/junit4-J1-20180120_171653_44916835080697944627091.syserr
   [junit4] >>> JVM J1 emitted unexpected output (verbatim) ----
   [junit4] Java HotSpot(TM) 64-Bit Server VM warning: Option UseConcMarkSweepGC was deprecated in version 9.0 and will likely be removed in a future release.
   [junit4] <<< JVM J1: EOF ----

[...truncated 182 lines...]
   [junit4] JVM J1: stderr was not empty, see: /Users/jenkins/workspace/Lucene-Solr-7.x-MacOSX/lucene/build/misc/test/temp/junit4-J1-20180120_171659_2394980548149139737974.syserr
   [junit4] >>> JVM J1 emitted unexpected output (verbatim) ----
   [junit4] Java HotSpot(TM) 64-Bit Server VM warning: Option UseConcMarkSweepGC was deprecated in version 9.0 and will likely be removed in a future release.
   [junit4] <<< JVM J1: EOF ----

[...truncated 5 lines...]
   [junit4] JVM J0: stderr was not empty, see: /Users/jenkins/workspace/Lucene-Solr-7.x-MacOSX/lucene/build/misc/test/temp/junit4-J0-20180120_171659_2397622486659245207869.syserr
   [junit4] >>> JVM J0 emitted unexpected output (verbatim) ----
   [junit4] Java HotSpot(TM) 64-Bit Server VM warning: Option UseConcMarkSweepGC was deprecated in version 9.0 and will likely be removed in a future release.
   [junit4] <<< JVM J0: EOF ----

[...truncated 332 lines...]
   [junit4] JVM J1: stderr was not empty, see: /Users/jenkins/workspace/Lucene-Solr-7.x-MacOSX/lucene/build/queries/test/temp/junit4-J1-20180120_171714_960467820228599618622.syserr
   [junit4] >>> JVM J1 emitted unexpected output (verbatim) ----
   [junit4] Java HotSpot(TM) 64-Bit Server VM warning: Option UseConcMarkSweepGC was deprecated in version 9.0 and will likely be removed in a future release.
   [junit4] <<< JVM J1: EOF ----

[...truncated 3 lines...]
   [junit4] JVM J0: stderr was not empty, see: /Users/jenkins/workspace/Lucene-Solr-7.x-MacOSX/lucene/build/queries/test/temp/junit4-J0-20180120_171714_96017650590738027498861.syserr
   [junit4] >>> JVM J0 emitted unexpected output (verbatim) ----
   [junit4] Java HotSpot(TM) 64-Bit Server VM warning: Option UseConcMarkSweepGC was deprecated in version 9.0 and will likely be removed in a future release.
   [junit4] <<< JVM J0: EOF ----

[...truncated 224 lines...]
   [junit4] JVM J0: stderr was not empty, see: /Users/jenkins/workspace/Lucene-Solr-7.x-MacOSX/lucene/build/queryparser/test/temp/junit4-J0-20180120_171724_1849733464826134276944.syserr
   [junit4] >>> JVM J0 emitted unexpected output (verbatim) ----
   [junit4] Java HotSpot(TM) 64-Bit Server VM warning: Option UseConcMarkSweepGC was deprecated in version 9.0 and will likely be removed in a future release.
   [junit4] <<< JVM J0: EOF ----

[...truncated 3 lines...]
   [junit4] JVM J1: stderr was not empty, see: /Users/jenkins/workspace/Lucene-Solr-7.x-MacOSX/lucene/build/queryparser/test/temp/junit4-J1-20180120_171724_1848985442004876548347.syserr
   [junit4] >>> JVM J1 emitted unexpected output (verbatim) ----
   [junit4] Java HotSpot(TM) 64-Bit Server VM warning: Option UseConcMarkSweepGC was deprecated in version 9.0 and will likely be removed in a future release.
   [junit4] <<< JVM J1: EOF ----

[...truncated 187 lines...]
   [junit4] JVM J1: stderr was not empty, see: /Users/jenkins/workspace/Lucene-Solr-7.x-MacOSX/lucene/build/replicator/test/temp/junit4-J1-20180120_171732_89917359452091370335589.syserr
   [junit4] >>> JVM J1 emitted unexpected output (verbatim) ----
   [junit4] Java HotSpot(TM) 64-Bit Server VM warning: Option UseConcMarkSweepGC was deprecated in version 9.0 and will likely be removed in a future release.
   [junit4] <<< JVM J1: EOF ----

[...truncated 23 lines...]
   [junit4] JVM J0: stderr was not empty, see: /Users/jenkins/workspace/Lucene-Solr-7.x-MacOSX/lucene/build/replicator/test/temp/junit4-J0-20180120_171732_89413281206717435881742.syserr
   [junit4] >>> JVM J0 emitted unexpected output (verbatim) ----
   [junit4] Java HotSpot(TM) 64-Bit Server VM warning: Option UseConcMarkSweepGC was deprecated in version 9.0 and will likely be removed in a future release.
   [junit4] <<< JVM J0: EOF ----

[...truncated 202 lines...]
   [junit4] JVM J1: stderr was not empty, see: /Users/jenkins/workspace/Lucene-Solr-7.x-MacOSX/lucene/build/sandbox/test/temp/junit4-J1-20180120_171746_5943800139419926191829.syserr
   [junit4] >>> JVM J1 emitted unexpected output (verbatim) ----
   [junit4] Java HotSpot(TM) 64-Bit Server VM warning: Option UseConcMarkSweepGC was deprecated in version 9.0 and will likely be removed in a future release.
   [junit4] <<< JVM J1: EOF ----

[...truncated 21 lines...]
   [junit4] JVM J0: stderr was not empty, see: /Users/jenkins/workspace/Lucene-Solr-7.x-MacOSX/lucene/build/sandbox/test/temp/junit4-J0-20180120_171746_59414847537158620720888.syserr
   [junit4] >>> JVM J0 emitted unexpected output (verbatim) ----
   [junit4] Java HotSpot(TM) 64-Bit Server VM warning: Option UseConcMarkSweepGC was deprecated in version 9.0 and will likely be removed in a future release.
   [junit4] <<< JVM J0: EOF ----

[...truncated 320 lines...]
   [junit4] JVM J1: stderr was not empty, see: /Users/jenkins/workspace/Lucene-Solr-7.x-MacOSX/lucene/build/spatial-extras/test/temp/junit4-J1-20180120_171819_6972918025831301593280.syserr
   [junit4] >>> JVM J1 emitted unexpected output (verbatim) ----
   [junit4] Java HotSpot(TM) 64-Bit Server VM warning: Option UseConcMarkSweepGC was deprecated in version 9.0 and will likely be removed in a future release.
   [junit4] <<< JVM J1: EOF ----

   [junit4] JVM J0: stderr was not empty, see: /Users/jenkins/workspace/Lucene-Solr-7.x-MacOSX/lucene/build/spatial-extras/test/temp/junit4-J0-20180120_171819_69710968202244759627350.syserr
   [junit4] >>> JVM J0 emitted unexpected output (verbatim) ----
   [junit4] Java HotSpot(TM) 64-Bit Server VM warning: Option UseConcMarkSweepGC was deprecated in version 9.0 and will likely be removed in a future release.
   [junit4] <<< JVM J0: EOF ----

[...truncated 146 lines...]
   [junit4] JVM J0: stderr was not empty, see: /Users/jenkins/workspace/Lucene-Solr-7.x-MacOSX/lucene/build/spatial/test/temp/junit4-J0-20180120_171834_1484303288443549136036.syserr
   [junit4] >>> JVM J0 emitted unexpected output (verbatim) ----
   [junit4] Java HotSpot(TM) 64-Bit Server VM warning: Option UseConcMarkSweepGC was deprecated in version 9.0 and will likely be removed in a future release.
   [junit4] <<< JVM J0: EOF ----

[...truncated 168 lines...]
   [junit4] JVM J0: stderr was not empty, see: /Users/jenkins/workspace/Lucene-Solr-7.x-MacOSX/lucene/build/spatial3d/test/temp/junit4-J0-20180120_171836_3617947434490347195073.syserr
   [junit4] >>> JVM J0 emitted unexpected output (verbatim) ----
   [junit4] Java HotSpot(TM) 64-Bit Server VM warning: Option UseConcMarkSweepGC was deprecated in version 9.0 and will likely be removed in a future release.
   [junit4] <<< JVM J0: EOF ----

[...truncated 14 lines...]
   [junit4] JVM J1: stderr was not empty, see: /Users/jenkins/workspace/Lucene-Solr-7.x-MacOSX/lucene/build/spatial3d/test/temp/junit4-J1-20180120_171836_3611478720305645871330.syserr
   [junit4] >>> JVM J1 emitted unexpected output (verbatim) ----
   [junit4] Java HotSpot(TM) 64-Bit Server VM warning: Option UseConcMarkSweepGC was deprecated in version 9.0 and will likely be removed in a future release.
   [junit4] <<< JVM J1: EOF ----

[...truncated 250 lines...]
   [junit4] JVM J1: stderr was not empty, see: /Users/jenkins/workspace/Lucene-Solr-7.x-MacOSX/lucene/build/suggest/test/temp/junit4-J1-20180120_171846_7896941504251537534402.syserr
   [junit4] >>> JVM J1 emitted unexpected output (verbatim) ----
   [junit4] Java HotSpot(TM) 64-Bit Server VM warning: Option UseConcMarkSweepGC was deprecated in version 9.0 and will likely be removed in a future release.
   [junit4] <<< JVM J1: EOF ----

[...truncated 3 lines...]
   [junit4] JVM J0: stderr was not empty, see: /Users/jenkins/workspace/Lucene-Solr-7.x-MacOSX/lucene/build/suggest/test/temp/junit4-J0-20180120_171846_78911978287900786542401.syserr
   [junit4] >>> JVM J0 emitted unexpected output (verbatim) ----
   [junit4] Java HotSpot(TM) 64-Bit Server VM warning: Option UseConcMarkSweepGC was deprecated in version 9.0 and will likely be removed in a future release.
   [junit4] <<< JVM J0: EOF ----

[...truncated 2667 lines...]
   [junit4] Suite: org.apache.solr.cloud.autoscaling.AutoAddReplicasPlanActionTest
   [junit4]   2> Creating dataDir: /Users/jenkins/workspace/Lucene-Solr-7.x-MacOSX/solr/build/solr-core/test/J1/temp/solr.cloud.autoscaling.AutoAddReplicasPlanActionTest_82E471F7C112BF85-001/init-core-data-001
   [junit4]   2> 1698863 WARN  (SUITE-AutoAddReplicasPlanActionTest-seed#[82E471F7C112BF85]-worker) [    ] o.a.s.SolrTestCaseJ4 startTrackingSearchers: numOpens=4 numCloses=4
   [junit4]   2> 1698864 INFO  (SUITE-AutoAddReplicasPlanActionTest-seed#[82E471F7C112BF85]-worker) [    ] o.a.s.SolrTestCaseJ4 Using PointFields (NUMERIC_POINTS_SYSPROP=true) w/NUMERIC_DOCVALUES_SYSPROP=true
   [junit4]   2> 1698864 INFO  (SUITE-AutoAddReplicasPlanActionTest-seed#[82E471F7C112BF85]-worker) [    ] o.a.s.SolrTestCaseJ4 Randomized ssl (true) and clientAuth (false) via: @org.apache.solr.util.RandomizeSSL(reason="", value=0.0/0.0, ssl=0.0/0.0, clientAuth=0.0/0.0) w/ MAC_OS_X supressed clientAuth
   [junit4]   2> 1698865 INFO  (SUITE-AutoAddReplicasPlanActionTest-seed#[82E471F7C112BF85]-worker) [    ] o.a.s.SolrTestCaseJ4 SecureRandom sanity checks: test.solr.allowed.securerandom=null & java.security.egd=file:/dev/./urandom
   [junit4]   2> 1698865 INFO  (SUITE-AutoAddReplicasPlanActionTest-seed#[82E471F7C112BF85]-worker) [    ] o.a.s.c.MiniSolrCloudCluster Starting cluster of 3 servers in /Users/jenkins/workspace/Lucene-Solr-7.x-MacOSX/solr/build/solr-core/test/J1/temp/solr.cloud.autoscaling.AutoAddReplicasPlanActionTest_82E471F7C112BF85-001/tempDir-001
   [junit4]   2> 1698865 INFO  (SUITE-AutoAddReplicasPlanActionTest-seed#[82E471F7C112BF85]-worker) [    ] o.a.s.c.ZkTestServer STARTING ZK TEST SERVER
   [junit4]   2> 1698866 INFO  (Thread-2694) [    ] o.a.s.c.ZkTestServer client port:0.0.0.0/0.0.0.0:0
   [junit4]   2> 1698866 INFO  (Thread-2694) [    ] o.a.s.c.ZkTestServer Starting server
   [junit4]   2> 1698868 ERROR (Thread-2694) [    ] o.a.z.s.ZooKeeperServer ZKShutdownHandler is not registered, so ZooKeeper server won't take any action on ERROR or SHUTDOWN server state changes
   [junit4]   2> 1698968 INFO  (SUITE-AutoAddReplicasPlanActionTest-seed#[82E471F7C112BF85]-worker) [    ] o.a.s.c.ZkTestServer start zk server on port:64514
   [junit4]   2> 1698978 INFO  (zkConnectionManagerCallback-5251-thread-1) [    ] o.a.s.c.c.ConnectionManager zkClient has connected
   [junit4]   2> 1698987 INFO  (jetty-launcher-5248-thread-3) [    ] o.e.j.s.Server jetty-9.4.8.v20171121, build timestamp: 2017-11-21T21:27:37Z, git hash: 82b8fb23f757335bb3329d540ce37a2a2615f0a8
   [junit4]   2> 1698987 INFO  (jetty-launcher-5248-thread-1) [    ] o.e.j.s.Server jetty-9.4.8.v20171121, build timestamp: 2017-11-21T21:27:37Z, git hash: 82b8fb23f757335bb3329d540ce37a2a2615f0a8
   [junit4]   2> 1698988 INFO  (jetty-launcher-5248-thread-2) [    ] o.e.j.s.Server jetty-9.4.8.v20171121, build timestamp: 2017-11-21T21:27:37Z, git hash: 82b8fb23f757335bb3329d540ce37a2a2615f0a8
   [junit4]   2> 1698990 INFO  (jetty-launcher-5248-thread-3) [    ] o.e.j.s.session DefaultSessionIdManager workerName=node0
   [junit4]   2> 1698990 INFO  (jetty-launcher-5248-thread-3) [    ] o.e.j.s.session No SessionScavenger set, using defaults
   [junit4]   2> 1698990 INFO  (jetty-launcher-5248-thread-3) [    ] o.e.j.s.session Scavenging every 660000ms
   [junit4]   2> 1698990 INFO  (jetty-launcher-5248-thread-1) [    ] o.e.j.s.session DefaultSessionIdManager workerName=node0
   [junit4]   2> 1698990 INFO  (jetty-launcher-5248-thread-1) [    ] o.e.j.s.session No SessionScavenger set, using defaults
   [junit4]   2> 1698990 INFO  (jetty-launcher-5248-thread-1) [    ] o.e.j.s.session Scavenging every 660000ms
   [junit4]   2> 1698990 INFO  (jetty-launcher-5248-thread-3) [    ] o.e.j.s.h.ContextHandler Started o.e.j.s.ServletContextHandler@6af75f9a{/solr,null,AVAILABLE}
   [junit4]   2> 1698991 INFO  (jetty-launcher-5248-thread-1) [    ] o.e.j.s.h.ContextHandler Started o.e.j.s.ServletContextHandler@2a786421{/solr,null,AVAILABLE}
   [junit4]   2> 1698991 INFO  (jetty-launcher-5248-thread-2) [    ] o.e.j.s.session DefaultSessionIdManager workerName=node0
   [junit4]   2> 1698991 INFO  (jetty-launcher-5248-thread-2) [    ] o.e.j.s.session No SessionScavenger set, using defaults
   [junit4]   2> 1698991 INFO  (jetty-launcher-5248-thread-2) [    ] o.e.j.s.session Scavenging every 600000ms
   [junit4]   2> 1698991 INFO  (jetty-launcher-5248-thread-2) [    ] o.e.j.s.h.ContextHandler Started o.e.j.s.ServletContextHandler@2ebe2099{/solr,null,AVAILABLE}
   [junit4]   2> 1698992 INFO  (jetty-launcher-5248-thread-1) [    ] o.e.j.s.AbstractConnector Started ServerConnector@6524d23b{SSL,[ssl, http/1.1]}{127.0.0.1:٦٤٥١٧}
   [junit4]   2> 1698992 INFO  (jetty-launcher-5248-thread-1) [    ] o.e.j.s.Server Started @١٧٠٨٥١٢ms
   [junit4]   2> 1698992 INFO  (jetty-launcher-5248-thread-1) [    ] o.a.s.c.s.e.JettySolrRunner Jetty properties: {hostContext=/solr, hostPort=64517}
   [junit4]   2> 1698992 INFO  (jetty-launcher-5248-thread-3) [    ] o.e.j.s.AbstractConnector Started ServerConnector@1bbacfbf{SSL,[ssl, http/1.1]}{127.0.0.1:٦٤٥١٦}
   [junit4]   2> 1698992 INFO  (jetty-launcher-5248-thread-3) [    ] o.e.j.s.Server Started @١٧٠٨٥١٣ms
   [junit4]   2> 1698992 ERROR (jetty-launcher-5248-thread-1) [    ] o.a.s.u.StartupLoggingUtils Missing Java Option solr.log.dir. Logging may be missing or incomplete.
   [junit4]   2> 1698992 INFO  (jetty-launcher-5248-thread-2) [    ] o.e.j.s.AbstractConnector Started ServerConnector@7161bc51{SSL,[ssl, http/1.1]}{127.0.0.1:٦٤٥١٨}
   [junit4]   2> 1698992 INFO  (jetty-launcher-5248-thread-3) [    ] o.a.s.c.s.e.JettySolrRunner Jetty properties: {hostContext=/solr, hostPort=64516}
   [junit4]   2> 1698992 INFO  (jetty-launcher-5248-thread-2) [    ] o.e.j.s.Server Started @١٧٠٨٥١٣ms
   [junit4]   2> 1698992 INFO  (jetty-launcher-5248-thread-1) [    ] o.a.s.s.SolrDispatchFilter  ___      _       Welcome to Apache Solr™ version 7.3.0
   [junit4]   2> 1698992 INFO  (jetty-launcher-5248-thread-2) [    ] o.a.s.c.s.e.JettySolrRunner Jetty properties: {hostContext=/solr, hostPort=64518}
   [junit4]   2> 1698992 ERROR (jetty-launcher-5248-thread-3) [    ] o.a.s.u.StartupLoggingUtils Missing Java Option solr.log.dir. Logging may be missing or incomplete.
   [junit4]   2> 1698992 ERROR (jetty-launcher-5248-thread-2) [    ] o.a.s.u.StartupLoggingUtils Missing Java Option solr.log.dir. Logging may be missing or incomplete.
   [junit4]   2> 1698993 INFO  (jetty-launcher-5248-thread-3) [    ] o.a.s.s.SolrDispatchFilter  ___      _       Welcome to Apache Solr™ version 7.3.0
   [junit4]   2> 1698992 INFO  (jetty-launcher-5248-thread-1) [    ] o.a.s.s.SolrDispatchFilter / __| ___| |_ _   Starting in cloud mode on port null
   [junit4]   2> 1698993 INFO  (jetty-launcher-5248-thread-3) [    ] o.a.s.s.SolrDispatchFilter / __| ___| |_ _   Starting in cloud mode on port null
   [junit4]   2> 1698993 INFO  (jetty-launcher-5248-thread-3) [    ] o.a.s.s.SolrDispatchFilter \__ \/ _ \ | '_|  Install dir: null
   [junit4]   2> 1698993 INFO  (jetty-launcher-5248-thread-3) [    ] o.a.s.s.SolrDispatchFilter |___/\___/_|_|    Start time: 2018-01-20T17:48:11.403302Z
   [junit4]   2> 1698993 INFO  (jetty-launcher-5248-thread-1) [    ] o.a.s.s.SolrDispatchFilter \__ \/ _ \ | '_|  Install dir: null
   [junit4]   2> 1698993 INFO  (jetty-launcher-5248-thread-1) [    ] o.a.s.s.SolrDispatchFilter |___/\___/_|_|    Start time: 2018-01-20T17:48:11.403430Z
   [junit4]   2> 1698993 INFO  (jetty-launcher-5248-thread-2) [    ] o.a.s.s.SolrDispatchFilter  ___      _       Welcome to Apache Solr™ version 7.3.0
   [junit4]   2> 1698993 INFO  (jetty-launcher-5248-thread-2) [    ] o.a.s.s.SolrDispatchFilter / __| ___| |_ _   Starting in cloud mode on port null
   [junit4]   2> 1698993 INFO  (jetty-launcher-5248-thread-2) [    ] o.a.s.s.SolrDispatchFilter \__ \/ _ \ | '_|  Install dir: null
   [junit4]   2> 1698993 INFO  (jetty-launcher-5248-thread-2) [    ] o.a.s.s.SolrDispatchFilter |___/\___/_|_|    Start time: 2018-01-20T17:48:11.403592Z
   [junit4]   2> 1698994 INFO  (zkConnectionManagerCallback-5253-thread-1) [    ] o.a.s.c.c.ConnectionManager zkClient has connected
   [junit4]   2> 1698994 INFO  (zkConnectionManagerCallback-5257-thread-1) [    ] o.a.s.c.c.ConnectionManager zkClient has connected
   [junit4]   2> 1698995 INFO  (zkConnectionManagerCallback-5255-thread-1) [    ] o.a.s.c.c.ConnectionManager zkClient has connected
   [junit4]   2> 1698995 INFO  (jetty-launcher-5248-thread-3) [    ] o.a.s.s.SolrDispatchFilter solr.xml found in ZooKeeper. Loading...
   [junit4]   2> 1698995 INFO  (jetty-launcher-5248-thread-2) [    ] o.a.s.s.SolrDispatchFilter solr.xml found in ZooKeeper. Loading...
   [junit4]   2> 1698995 INFO  (jetty-launcher-5248-thread-1) [    ] o.a.s.s.SolrDispatchFilter solr.xml found in ZooKeeper. Loading...
   [junit4]   2> 1699001 INFO  (jetty-launcher-5248-thread-1) [    ] o.a.s.c.ZkContainer Zookeeper client=127.0.0.1:64514/solr
   [junit4]   2> 1699001 INFO  (jetty-launcher-5248-thread-3) [    ] o.a.s.c.ZkContainer Zookeeper client=127.0.0.1:64514/solr
   [junit4]   2> 1699001 INFO  (jetty-launcher-5248-thread-2) [    ] o.a.s.c.ZkContainer Zookeeper client=127.0.0.1:64514/solr
   [junit4]   2> 1699002 INFO  (zkConnectionManagerCallback-5265-thread-1) [    ] o.a.s.c.c.ConnectionManager zkClient has connected
   [junit4]   2> 1699002 INFO  (zkConnectionManagerCallback-5267-thread-1) [    ] o.a.s.c.c.ConnectionManager zkClient has connected
   [junit4]   2> 1699003 INFO  (zkConnectionManagerCallback-5269-thread-1) [    ] o.a.s.c.c.ConnectionManager zkClient has connected
   [junit4]   2> 1699005 INFO  (zkConnectionManagerCallback-5272-thread-1-processing-n:127.0.0.1:64517_solr) [n:127.0.0.1:64517_solr    ] o.a.s.c.c.ConnectionManager zkClient has connected
   [junit4]   2> 1699005 INFO  (zkConnectionManagerCallback-5273-thread-1-processing-n:127.0.0.1:64516_solr) [n:127.0.0.1:64516_solr    ] o.a.s.c.c.ConnectionManager zkClient has connected
   [junit4]   2> 1699008 INFO  (zkConnectionManagerCallback-5275-thread-1-processing-n:127.0.0.1:64518_solr) [n:127.0.0.1:64518_solr    ] o.a.s.c.c.ConnectionManager zkClient has connected
   [junit4]   2> 1699158 INFO  (jetty-launcher-5248-thread-1) [n:127.0.0.1:64517_solr    ] o.a.s.c.Overseer Overseer (id=null) closing
   [junit4]   2> 1699158 INFO  (jetty-launcher-5248-thread-2) [n:127.0.0.1:64518_solr    ] o.a.s.c.Overseer Overseer (id=null) closing
   [junit4]   2> 1699158 INFO  (jetty-launcher-5248-thread-3) [n:127.0.0.1:64516_solr    ] o.a.s.c.Overseer Overseer (id=null) closing
   [junit4]   2> 1699158 INFO  (jetty-launcher-5248-thread-1) [n:127.0.0.1:64517_solr    ] o.a.s.c.OverseerElectionContext I am going to be the leader 127.0.0.1:64517_solr
   [junit4]   2> 1699159 INFO  (jetty-launcher-5248-thread-2) [n:127.0.0.1:64518_solr    ] o.a.s.c.ZkController Register node as live in ZooKeeper:/live_nodes/127.0.0.1:64518_solr
   [junit4]   2> 1699159 INFO  (jetty-launcher-5248-thread-3) [n:127.0.0.1:64516_solr    ] o.a.s.c.ZkController Register node as live in ZooKeeper:/live_nodes/127.0.0.1:64516_solr
   [junit4]   2> 1699159 INFO  (jetty-launcher-5248-thread-1) [n:127.0.0.1:64517_solr    ] o.a.s.c.Overseer Overseer (id=99383410116329479-127.0.0.1:64517_solr-n_0000000000) starting
   [junit4]   2> 1699161 INFO  (zkCallback-5274-thread-1-processing-n:127.0.0.1:64518_solr) [n:127.0.0.1:64518_solr    ] o.a.s.c.c.ZkStateReader Updated live nodes from ZooKeeper... (0) -> (2)
   [junit4]   2> 1699169 INFO  (zkCallback-5271-thread-1-processing-n:127.0.0.1:64516_solr) [n:127.0.0.1:64516_solr    ] o.a.s.c.c.ZkStateReader Updated live nodes from ZooKeeper... (0) -> (2)
   [junit4]   2> 1699170 INFO  (zkCallback-5270-thread-1-processing-n:127.0.0.1:64517_solr) [n:127.0.0.1:64517_solr    ] o.a.s.c.c.ZkStateReader Updated live nodes from ZooKeeper... (0) -> (2)
   [junit4]   2> 1699192 INFO  (jetty-launcher-5248-thread-1) [n:127.0.0.1:64517_solr    ] o.a.s.c.ZkController Register node as live in ZooKeeper:/live_nodes/127.0.0.1:64517_solr
   [junit4]   2> 1699194 INFO  (zkCallback-5271-thread-1-processing-n:127.0.0.1:64516_solr) [n:127.0.0.1:64516_solr    ] o.a.s.c.c.ZkStateReader Updated live nodes from ZooKeeper... (2) -> (3)
   [junit4]   2> 1699194 INFO  (zkCallback-5274-thread-1-processing-n:127.0.0.1:64518_solr) [n:127.0.0.1:64518_solr    ] o.a.s.c.c.ZkStateReader Updated live nodes from ZooKeeper... (2) -> (3)
   [junit4]   2> 1699194 INFO  (zkCallback-5270-thread-1-processing-n:127.0.0.1:64517_solr) [n:127.0.0.1:64517_solr    ] o.a.s.c.c.ZkStateReader Updated live nodes from ZooKeeper... (2) -> (3)
   [junit4]   2> 1699218 INFO  (jetty-launcher-5248-thread-2) [n:127.0.0.1:64518_solr    ] o.a.s.m.r.SolrJmxReporter JMX monitoring for 'solr_64518.solr.node' (registry 'solr.node') enabled at server: com.sun.jmx.mbeanserver.JmxMBeanServer@78763007
   [junit4]   2> 1699218 INFO  (jetty-launcher-5248-thread-3) [n:127.0.0.1:64516_solr    ] o.a.s.m.r.SolrJmxReporter JMX monitoring for 'solr_64516.solr.node' (registry 'solr.node') enabled at server: com.sun.jmx.mbeanserver.JmxMBeanServer@78763007
   [junit4]   2> 1699226 INFO  (jetty-launcher-5248-thread-3) [n:127.0.0.1:64516_solr    ] o.a.s.m.r.SolrJmxReporter JMX monitoring for 'solr_64516.solr.jvm' (registry 'solr.jvm') enabled at server: com.sun.jmx.mbeanserver.JmxMBeanServer@78763007
   [junit4]   2> 1699226 INFO  (jetty-launcher-5248-thread-3) [n:127.0.0.1:64516_solr    ] o.a.s.m.r.SolrJmxReporter JMX monitoring for 'solr_64516.solr.jetty' (registry 'solr.jetty') enabled at server: com.sun.jmx.mbeanserver.JmxMBeanServer@78763007
   [junit4]   2> 1699228 INFO  (jetty-launcher-5248-thread-3) [n:127.0.0.1:64516_solr    ] o.a.s.c.CorePropertiesLocator Found 0 core definitions underneath /Users/jenkins/workspace/Lucene-Solr-7.x-MacOSX/solr/build/solr-core/test/J1/temp/solr.cloud.autoscaling.AutoAddReplicasPlanActionTest_82E471F7C112BF85-001/tempDir-001/node3/.
   [junit4]   2> 1699257 INFO  (jetty-launcher-5248-thread-1) [n:127.0.0.1:64517_solr    ] o.a.s.m.r.SolrJmxReporter JMX monitoring for 'solr_64517.solr.node' (registry 'solr.node') enabled at server: com.sun.jmx.mbeanserver.JmxMBeanServer@78763007
   [junit4]   2> 1699271 INFO  (jetty-launcher-5248-thread-2) [n:127.0.0.1:64518_solr    ] o.a.s.m.r.SolrJmxReporter JMX monitoring for 'solr_64518.solr.jvm' (registry 'solr.jvm') enabled at server: com.sun.jmx.mbeanserver.JmxMBeanServer@78763007
   [junit4]   2> 1699271 INFO  (jetty-launcher-5248-thread-2) [n:127.0.0.1:64518_solr    ] o.a.s.m.r.SolrJmxReporter JMX monitoring for 'solr_64518.solr.jetty' (registry 'solr.jetty') enabled at server: com.sun.jmx.mbeanserver.JmxMBeanServer@78763007
   [junit4]   2> 1699275 INFO  (jetty-launcher-5248-thread-2) [n:127.0.0.1:64518_solr    ] o.a.s.c.CorePropertiesLocator Found 0 core definitions underneath /Users/jenkins/workspace/Lucene-Solr-7.x-MacOSX/solr/build/solr-core/test/J1/temp/solr.cloud.autoscaling.AutoAddReplicasPlanActionTest_82E471F7C112BF85-001/tempDir-001/node2/.
   [junit4]   2> 1699279 INFO  (jetty-launcher-5248-thread-1) [n:127.0.0.1:64517_solr    ] o.a.s.m.r.SolrJmxReporter JMX monitoring for 'solr_64517.solr.jvm' (registry 'solr.jvm') enabled at server: com.sun.jmx.mbeanserver.JmxMBeanServer@78763007
   [junit4]   2> 1699279 INFO  (jetty-launcher-5248-thread-1) [n:127.0.0.1:64517_solr    ] o.a.s.m.r.SolrJmxReporter JMX monitoring for 'solr_64517.solr.jetty' (registry 'solr.jetty') enabled at server: com.sun.jmx.mbeanserver.JmxMBeanServer@78763007
   [junit4]   2> 1699280 INFO  (jetty-launcher-5248-thread-1) [n:127.0.0.1:64517_solr    ] o.a.s.c.CorePropertiesLocator Found 0 core definitions underneath /Users/jenkins/workspace/Lucene-Solr-7.x-MacOSX/solr/build/solr-core/test/J1/temp/solr.cloud.autoscaling.AutoAddReplicasPlanActionTest_82E471F7C112BF85-001/tempDir-001/node1/.
   [junit4]   2> 1699337 INFO  (zkConnectionManagerCallback-5283-thread-1) [    ] o.a.s.c.c.ConnectionManager zkClient has connected
   [junit4]   2> 1699341 INFO  (zkConnectionManagerCallback-5287-thread-1) [    ] o.a.s.c.c.ConnectionManager zkClient has connected
   [junit4]   2> 1699342 INFO  (SUITE-AutoAddReplicasPlanActionTest-seed#[82E471F7C112BF85]-worker) [    ] o.a.s.c.c.ZkStateReader Updated live nodes from ZooKeeper... (0) -> (3)
   [junit4]   2> 1699344 INFO  (SUITE-AutoAddReplicasPlanActionTest-seed#[82E471F7C112BF85]-worker) [    ] o.a.s.c.s.i.ZkClientClusterStateProvider Cluster at 127.0.0.1:64514/solr ready
   [junit4]   2> 1699370 INFO  (TEST-AutoAddReplicasPlanActionTest.testSimple-seed#[82E471F7C112BF85]) [    ] o.a.s.SolrTestCaseJ4 ###Starting testSimple
   [junit4]   2> 1699382 INFO  (qtp1596802693-16748) [n:127.0.0.1:64516_solr    ] o.a.s.h.a.CollectionsHandler Invoked Collection Action :create with params replicationFactor=2&collection.configName=conf&maxShardsPerNode=2&autoAddReplicas=true&name=testSimple1&nrtReplicas=2&action=CREATE&numShards=2&createNodeSet=127.0.0.1:64516_solr,127.0.0.1:64517_solr&wt=javabin&version=2 and sendToOCPQueue=true
   [junit4]   2> 1699385 INFO  (OverseerThreadFactory-6047-thread-1-processing-n:127.0.0.1:64517_solr) [n:127.0.0.1:64517_solr    ] o.a.s.c.a.c.CreateCollectionCmd Create collection testSimple1
   [junit4]   2> 1699496 INFO  (OverseerStateUpdate-99383410116329479-127.0.0.1:64517_solr-n_0000000000) [n:127.0.0.1:64517_solr    ] o.a.s.c.o.SliceMutator createReplica() {
   [junit4]   2>   "operation":"ADDREPLICA",
   [junit4]   2>   "collection":"testSimple1",
   [junit4]   2>   "shard":"shard1",
   [junit4]   2>   "core":"testSimple1_shard1_replica_n1",
   [junit4]   2>   "state":"down",
   [junit4]   2>   "base_url":"https://127.0.0.1:64517/solr",
   [junit4]   2>   "type":"NRT",
   [junit4]   2>   "waitForFinalState":"false"} 
   [junit4]   2> 1699500 INFO  (OverseerStateUpdate-99383410116329479-127.0.0.1:64517_solr-n_0000000000) [n:127.0.0.1:64517_solr    ] o.a.s.c.o.SliceMutator createReplica() {
   [junit4]   2>   "operation":"ADDREPLICA",
   [junit4]   2>   "collection":"testSimple1",
   [junit4]   2>   "shard":"shard1",
   [junit4]   2>   "core":"testSimple1_shard1_replica_n2",
   [junit4]   2>   "state":"down",
   [junit4]   2>   "base_url":"https://127.0.0.1:64516/solr",
   [junit4]   2>   "type":"NRT",
   [junit4]   2>   "waitForFinalState":"false"} 
   [junit4]   2> 1699503 INFO  (OverseerStateUpdate-99383410116329479-127.0.0.1:64517_solr-n_0000000000) [n:127.0.0.1:64517_solr    ] o.a.s.c.o.SliceMutator createReplica() {
   [junit4]   2>   "operation":"ADDREPLICA",
   [junit4]   2>   "collection":"testSimple1",
   [junit4]   2>   "shard":"shard2",
   [junit4]   2>   "core":"testSimple1_shard2_replica_n4",
   [junit4]   2>   "state":"down",
   [junit4]   2>   "base_url":"https://127.0.0.1:64517/solr",
   [junit4]   2>   "type":"NRT",
   [junit4]   2>   "waitForFinalState":"false"} 
   [junit4]   2> 1699506 INFO  (OverseerStateUpdate-99383410116329479-127.0.0.1:64517_solr-n_0000000000) [n:127.0.0.1:64517_solr    ] o.a.s.c.o.SliceMutator createReplica() {
   [junit4]   2>   "operation":"ADDREPLICA",
   [junit4]   2>   "collection":"testSimple1",
   [junit4]   2>   "shard":"shard2",
   [junit4]   2>   "core":"testSimple1_shard2_replica_n6",
   [junit4]   2>   "state":"down",
   [junit4]   2>   "base_url":"https://127.0.0.1:64516/solr",
   [junit4]   2>   "type":"NRT",
   [junit4]   2>   "waitForFinalState":"false"} 
   [junit4]   2> 1699730 INFO  (qtp1596802693-16758) [n:127.0.0.1:64516_solr    ] o.a.s.h.a.CoreAdminOperation core create command qt=/admin/cores&coreNodeName=core_node5&collection.configName=conf&newCollection=true&name=testSimple1_shard1_replica_n2&action=CREATE&numShards=2&collection=testSimple1&shard=shard1&wt=javabin&version=2&replicaType=NRT
   [junit4]   2> 1699730 INFO  (qtp1596802693-16758) [n:127.0.0.1:64516_solr    ] o.a.s.c.TransientSolrCoreCacheDefault Allocating transient cache for 2147483647 transient cores
   [junit4]   2> 1699730 INFO  (qtp1596802693-16750) [n:127.0.0.1:64516_solr    ] o.a.s.h.a.CoreAdminOperation core create command qt=/admin/cores&coreNodeName=core_node8&collection.configName=conf&newCollection=true&name=testSimple1_shard2_replica_n6&action=CREATE&numShards=2&collection=testSimple1&shard=shard2&wt=javabin&version=2&replicaType=NRT
   [junit4]   2> 1699739 INFO  (qtp1468501467-16756) [n:127.0.0.1:64517_solr    ] o.a.s.h.a.CoreAdminOperation core create command qt=/admin/cores&coreNodeName=core_node3&collection.configName=conf&newCollection=true&name=testSimple1_shard1_replica_n1&action=CREATE&numShards=2&collection=testSimple1&shard=shard1&wt=javabin&version=2&replicaType=NRT
   [junit4]   2> 1699739 INFO  (qtp1468501467-16756) [n:127.0.0.1:64517_solr    ] o.a.s.c.TransientSolrCoreCacheDefault Allocating transient cache for 2147483647 transient cores
   [junit4]   2> 1699744 INFO  (qtp1468501467-16746) [n:127.0.0.1:64517_solr    ] o.a.s.h.a.CoreAdminOperation core create command qt=/admin/cores&coreNodeName=core_node7&collection.configName=conf&newCollection=true&name=testSimple1_shard2_replica_n4&action=CREATE&numShards=2&collection=testSimple1&shard=shard2&wt=javabin&version=2&replicaType=NRT
   [junit4]   2> 1699855 INFO  (zkCallback-5270-thread-1-processing-n:127.0.0.1:64517_solr) [n:127.0.0.1:64517_solr    ] o.a.s.c.c.ZkStateReader A cluster state change: [WatchedEvent state:SyncConnected type:NodeDataChanged path:/collections/testSimple1/state.json] for collection [testSimple1] has occurred - updating... (live nodes size: [3])
   [junit4]   2> 1699855 INFO  (zkCallback-5271-thread-1-processing-n:127.0.0.1:64516_solr) [n:127.0.0.1:64516_solr    ] o.a.s.c.c.ZkStateReader A cluster state change: [WatchedEvent state:SyncConnected type:NodeDataChanged path:/collections/testSimple1/state.json] for collection [testSimple1] has occurred - updating... (live nodes size: [3])
   [junit4]   2> 1699855 INFO  (zkCallback-5270-thread-2-processing-n:127.0.0.1:64517_solr) [n:127.0.0.1:64517_solr    ] o.a.s.c.c.ZkStateReader A cluster state change: [WatchedEvent state:SyncConnected type:NodeDataChanged path:/collections/testSimple1/state.json] for collection [testSimple1] has occurred - updating... (live nodes size: [3])
   [junit4]   2> 1699855 INFO  (zkCallback-5270-thread-3-processing-n:127.0.0.1:64517_solr) [n:127.0.0.1:64517_solr    ] o.a.s.c.c.ZkStateReader A cluster state change: [WatchedEvent state:SyncConnected type:NodeDataChanged path:/collections/testSimple1/state.json] for collection [testSimple1] has occurred - updating... (live nodes size: [3])
   [junit4]   2> 1699855 INFO  (zkCallback-5271-thread-2-processing-n:127.0.0.1:64516_solr) [n:127.0.0.1:64516_solr    ] o.a.s.c.c.ZkStateReader A cluster state change: [WatchedEvent state:SyncConnected type:NodeDataChanged path:/collections/testSimple1/state.json] for collection [testSimple1] has occurred - updating... (live nodes size: [3])
   [junit4]   2> 1700755 INFO  (qtp1596802693-16750) [n:127.0.0.1:64516_solr c:testSimple1 s:shard2 r:core_node8 x:testSimple1_shard2_replica_n6] o.a.s.c.SolrConfig Using Lucene MatchVersion: 7.3.0
   [junit4]   2> 1700755 INFO  (qtp1596802693-16758) [n:127.0.0.1:64516_solr c:testSimple1 s:shard1 r:core_node5 x:testSimple1_shard1_replica_n2] o.a.s.c.SolrConfig Using Lucene MatchVersion: 7.3.0
   [junit4]   2> 1700765 INFO  (qtp1468501467-16756) [n:127.0.0.1:64517_solr c:testSimple1 s:shard1 r:core_node3 x:testSimple1_shard1_replica_n1] o.a.s.c.SolrConfig Using Lucene MatchVersion: 7.3.0
   [junit4]   2> 1700767 INFO  (qtp1596802693-16758) [n:127.0.0.1:64516_solr c:testSimple1 s:shard1 r:core_node5 x:testSimple1_shard1_replica_n2] o.a.s.s.IndexSchema [testSimple1_shard1_replica_n2] Schema name=minimal
   [junit4]   2> 1700769 INFO  (qtp1596802693-16758) [n:127.0.0.1:64516_solr c:testSimple1 s:shard1 r:core_node5 x:testSimple1_shard1_replica_n2] o.a.s.s.IndexSchema Loaded schema minimal/1.1 with uniqueid field id
   [junit4]   2> 1700769 INFO  (qtp1596802693-16758) [n:127.0.0.1:64516_solr c:testSimple1 s:shard1 r:core_node5 x:testSimple1_shard1_replica_n2] o.a.s.c.CoreContainer Creating SolrCore 'testSimple1_shard1_replica_n2' using configuration from collection testSimple1, trusted=true
   [junit4]   2> 1700770 INFO  (qtp1596802693-16758) [n:127.0.0.1:64516_solr c:testSimple1 s:shard1 r:core_node5 x:testSimple1_shard1_replica_n2] o.a.s.m.r.SolrJmxReporter JMX monitoring for 'solr_64516.solr.core.testSimple1.shard1.replica_n2' (registry 'solr.core.testSimple1.shard1.replica_n2') enabled at server: com.sun.jmx.mbeanserver.JmxMBeanServer@78763007
   [junit4]   2> 1700770 INFO  (qtp1468501467-16746) [n:127.0.0.1:64517_solr c:testSimple1 s:shard2 r:core_node7 x:testSimple1_shard2_replica_n4] o.a.s.c.SolrConfig Using Lucene MatchVersion: 7.3.0
   [junit4]   2> 1700770 INFO  (qtp1596802693-16758) [n:127.0.0.1:64516_solr c:testSimple1 s:shard1 r:core_node5 x:testSimple1_shard1_replica_n2] o.a.s.c.SolrCore solr.RecoveryStrategy.Builder
   [junit4]   2> 1700770 INFO  (qtp1596802693-16758) [n:127.0.0.1:64516_solr c:testSimple1 s:shard1 r:core_node5 x:testSimple1_shard1_replica_n2] o.a.s.c.SolrCore [[testSimple1_shard1_replica_n2] ] Opening new SolrCore at [/Users/jenkins/workspace/Lucene-Solr-7.x-MacOSX/solr/build/solr-core/test/J1/temp/solr.cloud.autoscaling.AutoAddReplicasPlanActionTest_82E471F7C112BF85-001/tempDir-001/node3/testSimple1_shard1_replica_n2], dataDir=[/Users/jenkins/workspace/Lucene-Solr-7.x-MacOSX/solr/build/solr-core/test/J1/temp/solr.cloud.autoscaling.AutoAddReplicasPlanActionTest_82E471F7C112BF85-001/tempDir-001/node3/./testSimple1_shard1_replica_n2/data/]
   [junit4]   2> 1700770 INFO  (qtp1596802693-16750) [n:127.0.0.1:64516_solr c:testSimple1 s:shard2 r:core_node8 x:testSimple1_shard2_replica_n6] o.a.s.s.IndexSchema [testSimple1_shard2_replica_n6] Schema name=minimal
   [junit4]   2> 1700772 INFO  (qtp1596802693-16750) [n:127.0.0.1:64516_solr c:testSimple1 s:shard2 r:core_node8 x:testSimple1_shard2_replica_n6] o.a.s.s.IndexSchema Loaded schema minimal/1.1 with uniqueid field id
   [junit4]   2> 1700772 INFO  (qtp1596802693-16750) [n:127.0.0.1:64516_solr c:testSimple1 s:shard2 r:core_node8 x:testSimple1_shard2_replica_n6] o.a.s.c.CoreContainer Creating SolrCore 'testSimple1_shard2_replica_n6' using configuration from collection testSimple1, trusted=true
   [junit4]   2> 1700772 INFO  (qtp1596802693-16750) [n:127.0.0.1:64516_solr c:testSimple1 s:shard2 r:core_node8 x:testSimple1_shard2_replica_n6] o.a.s.m.r.SolrJmxReporter JMX monitoring for 'solr_64516.solr.core.testSimple1.shard2.replica_n6' (registry 'solr.core.testSimple1.shard2.replica_n6') enabled at server: com.sun.jmx.mbeanserver.JmxMBeanServer@78763007
   [junit4]   2> 1700773 INFO  (qtp1596802693-16750) [n:127.0.0.1:64516_solr c:testSimple1 s:shard2 r:core_node8 x:testSimple1_shard2_replica_n6] o.a.s.c.SolrCore solr.RecoveryStrategy.Builder
   [junit4]   2> 1700773 INFO  (qtp1596802693-16750) [n:127.0.0.1:64516_solr c:testSimple1 s:shard2 r:core_node8 x:testSimple1_shard2_replica_n6] o.a.s.c.SolrCore [[testSimple1_shard2_replica_n6] ] Opening new SolrCore at [/Users/jenkins/workspace/Lucene-Solr-7.x-MacOSX/solr/build/solr-core/test/J1/temp/solr.cloud.autoscaling.AutoAddReplicasPlanActionTest_82E471F7C112BF85-001/tempDir-001/node3/testSimple1_shard2_replica_n6], dataDir=[/Users/jenkins/workspace/Lucene-Solr-7.x-MacOSX/solr/build/solr-core/test/J1/temp/solr.cloud.autoscaling.AutoAddReplicasPlanActionTest_82E471F7C112BF85-001/tempDir-001/node3/./testSimple1_shard2_replica_n6/data/]
   [junit4]   2> 1700774 INFO  (qtp1468501467-16756) [n:127.0.0.1:64517_solr c:testSimple1 s:shard1 r:core_node3 x:testSimple1_shard1_replica_n1] o.a.s.s.IndexSchema [testSimple1_shard1_replica_n1] Schema name=minimal
   [junit4]   2> 1700787 INFO  (qtp1468501467-16756) [n:127.0.0.1:64517_solr c:testSimple1 s:shard1 r:core_node3 x:testSimple1_shard1_replica_n1] o.a.s.s.IndexSchema Loaded schema minimal/1.1 with uniqueid field id
   [junit4]   2> 1700787 INFO  (qtp1468501467-16756) [n:127.0.0.1:64517_solr c:testSimple1 s:shard1 r:core_node3 x:testSimple1_shard1_replica_n1] o.a.s.c.CoreContainer Creating SolrCore 'testSimple1_shard1_replica_n1' using configuration from collection testSimple1, trusted=true
   [junit4]   2> 1700788 INFO  (qtp1468501467-16746) [n:127.0.0.1:64517_solr c:testSimple1 s:shard2 r:core_node7 x:testSimple1_shard2_replica_n4] o.a.s.s.IndexSchema [testSimple1_shard2_replica_n4] Schema name=minimal
   [junit4]   2> 1700788 INFO  (qtp1468501467-16756) [n:127.0.0.1:64517_solr c:testSimple1 s:shard1 r:core_node3 x:testSimple1_shard1_replica_n1] o.a.s.m.r.SolrJmxReporter JMX monitoring for 'solr_64517.solr.core.testSimple1.shard1.replica_n1' (registry 'solr.core.testSimple1.shard1.replica_n1') enabled at server: com.sun.jmx.mbeanserver.JmxMBeanServer@78763007
   [junit4]   2> 1700788 INFO  (qtp1468501467-16756) [n:127.0.0.1:64517_solr c:testSimple1 s:shard1 r:core_node3 x:testSimple1_shard1_replica_n1] o.a.s.c.SolrCore solr.RecoveryStrategy.Builder
   [junit4]   2> 1700788 INFO  (qtp1468501467-16756) [n:127.0.0.1:64517_solr c:testSimple1 s:shard1 r:core_node3 x:testSimple1_shard1_replica_n1] o.a.s.c.SolrCore [[testSimple1_shard1_replica_n1] ] Opening new SolrCore at [/Users/jenkins/workspace/Lucene-Solr-7.x-MacOSX/solr/build/solr-core/test/J1/temp/solr.cloud.autoscaling.AutoAddReplicasPlanActionTest_82E471F7C112BF85-001/tempDir-001/node1/testSimple1_shard1_replica_n1], dataDir=[/Users/jenkins/workspace/Lucene-Solr-7.x-MacOSX/solr/build/solr-core/test/J1/temp/solr.cloud.autoscaling.AutoAddReplicasPlanActionTest_82E471F7C112BF85-001/tempDir-001/node1/./testSimple1_shard1_replica_n1/data/]
   [junit4]   2> 1700789 INFO  (qtp1468501467-16746) [n:127.0.0.1:64517_solr c:testSimple1 s:shard2 r:core_node7 x:testSimple1_shard2_replica_n4] o.a.s.s.IndexSchema Loaded schema minimal/1.1 with uniqueid field id
   [junit4]   2> 1700789 INFO  (qtp1468501467-16746) [n:127.0.0.1:64517_solr c:testSimple1 s:shard2 r:core_node7 x:testSimple1_shard2_replica_n4] o.a.s.c.CoreContainer Creating SolrCore 'testSimple1_shard2_replica_n4' using configuration from collection testSimple1, trusted=true
   [junit4]   2> 1700789 INFO  (qtp1468501467-16746) [n:127.0.0.1:64517_solr c:testSimple1 s:shard2 r:core_node7 x:testSimple1_shard2_replica_n4] o.a.s.m.r.SolrJmxReporter JMX monitoring for 'solr_64517.solr.core.testSimple1.shard2.replica_n4' (registry 'solr.core.testSimple1.shard2.replica_n4') enabled at server: com.sun.jmx.mbeanserver.JmxMBeanServer@78763007
   [junit4]   2> 1700790 INFO  (qtp1468501467-16746) [n:127.0.0.1:64517_solr c:testSimple1 s:shard2 r:core_node7 x:testSimple1_shard2_replica_n4] o.a.s.c.SolrCore solr.RecoveryStrategy.Builder
   [junit4]   2> 1700790 INFO  (qtp1468501467-16746) [n:127.0.0.1:64517_solr c:testSimple1 s:shard2 r:core_node7 x:testSimple1_shard2_replica_n4] o.a.s.c.SolrCore [[testSimple1_shard2_replica_n4] ] Opening new SolrCore at [/Users/jenkins/workspace/Lucene-Solr-7.x-MacOSX/solr/build/solr-core/test/J1/temp/solr.cloud.autoscaling.AutoAddReplicasPlanActionTest_82E471F7C112BF85-001/tempDir-001/node1/testSimple1_shard2_replica_n4], dataDir=[/Users/jenkins/workspace/Lucene-Solr-7.x-MacOSX/solr/build/solr-core/test/J1/temp/solr.cloud.autoscaling.AutoAddReplicasPlanActionTest_82E471F7C112BF85-001/tempDir-001/node1/./testSimple1_shard2_replica_n4/data/]
   [junit4]   2> 1700871 INFO  (qtp1468501467-16746) [n:127.0.0.1:64517_solr c:testSimple1 s:shard2 r:core_node7 x:testSimple1_shard2_replica_n4] o.a.s.u.UpdateHandler Using UpdateLog implementation: org.apache.solr.update.UpdateLog
   [junit4]   2> 1700871 INFO  (qtp1468501467-16746) [n:127.0.0.1:64517_solr c:testSimple1 s:shard2 r:core_node7 x:testSimple1_shard2_replica_n4] o.a.s.u.UpdateLog Initializing UpdateLog: dataDir=null defaultSyncLevel=FLUSH numRecordsToKeep=100 maxNumLogsToKeep=10 numVersionBuckets=65536
   [junit4]   2> 1700872 INFO  (qtp1468501467-16746) [n:127.0.0.1:64517_solr c:testSimple1 s:shard2 r:core_node7 x:testSimple1_shard2_replica_n4] o.a.s.u.CommitTracker Hard AutoCommit: disabled
   [junit4]   2> 1700873 INFO  (qtp1468501467-16746) [n:127.0.0.1:64517_solr c:testSimple1 s:shard2 r:core_node7 x:testSimple1_shard2_replica_n4] o.a.s.u.CommitTracker Soft AutoCommit: disabled
   [junit4]   2> 1700879 INFO  (qtp1468501467-16756) [n:127.0.0.1:64517_solr c:testSimple1 s:shard1 r:core_node3 x:testSimple1_shard1_replica_n1] o.a.s.u.UpdateHandler Using UpdateLog implementation: org.apache.solr.update.UpdateLog
   [junit4]   2> 1700879 INFO  (qtp1468501467-16756) [n:127.0.0.1:64517_solr c:testSimple1 s:shard1 r:core_node3 x:testSimple1_shard1_replica_n1] o.a.s.u.UpdateLog Initializing UpdateLog: dataDir=null defaultSyncLevel=FLUSH numRecordsToKeep=100 maxNumLogsToKeep=10 numVersionBuckets=65536
   [junit4]   2> 1700879 INFO  (qtp1596802693-16750) [n:127.0.0.1:64516_solr c:testSimple1 s:shard2 r:core_node8 x:testSimple1_shard2_replica_n6] o.a.s.u.UpdateHandler Using UpdateLog implementation: org.apache.solr.update.UpdateLog
   [junit4]   2> 1700879 INFO  (qtp1596802693-16750) [n:127.0.0.1:64516_solr c:testSimple1 s:shard2 r:core_node8 x:testSimple1_shard2_replica_n6] o.a.s.u.UpdateLog Initializing UpdateLog: dataDir=null defaultSyncLevel=FLUSH numRecordsToKeep=100 maxNumLogsToKeep=10 numVersionBuckets=65536
   [junit4]   2> 1700881 INFO  (qtp1468501467-16756) [n:127.0.0.1:64517_solr c:testSimple1 s:shard1 r:core_node3 x:testSimple1_shard1_replica_n1] o.a.s.u.CommitTracker Hard AutoCommit: disabled
   [junit4]   2> 1700881 INFO  (qtp1468501467-16756) [n:127.0.0.1:64517_solr c:testSimple1 s:shard1 r:core_node3 x:testSimple1_shard1_replica_n1] o.a.s.u.CommitTracker Soft AutoCommit: disabled
   [junit4]   2> 1700882 INFO  (qtp1596802693-16750) [n:127.0.0.1:64516_solr c:testSimple1 s:shard2 r:core_node8 x:testSimple1_shard2_replica_n6] o.a.s.u.CommitTracker Hard AutoCommit: disabled
   [junit4]   2> 1700882 INFO  (qtp1596802693-16750) [n:127.0.0.1:64516_solr c:testSimple1 s:shard2 r:core_node8 x:testSimple1_shard2_replica_n6] o.a.s.u.CommitTracker Soft AutoCommit: disabled
   [junit4]   2> 1700884 INFO  (qtp1596802693-16758) [n:127.0.0.1:64516_solr c:testSimple1 s:shard1 r:core_node5 x:testSimple1_shard1_replica_n2] o.a.s.u.UpdateHandler Using UpdateLog implementation: org.apache.solr.update.UpdateLog
   [junit4]   2> 1700884 INFO  (qtp1596802693-16758) [n:127.0.0.1:64516_solr c:testSimple1 s:shard1 r:core_node5 x:testSimple1_shard1_replica_n2] o.a.s.u.UpdateLog Initializing UpdateLog: dataDir=null defaultSyncLevel=FLUSH numRecordsToKeep=100 maxNumLogsToKeep=10 numVersionBuckets=65536
   [junit4]   2> 1700886 INFO  (qtp1596802693-16758) [n:127.0.0.1:64516_solr c:testSimple1 s:shard1 r:core_node5 x:testSimple1_shard1_replica_n2] o.a.s.u.CommitTracker Hard AutoCommit: disabled
   [junit4]   2> 1700886 INFO  (qtp1596802693-16758) [n:127.0.0.1:64516_solr c:testSimple1 s:shard1 r:core_node5 x:testSimple1_shard1_replica_n2] o.a.s.u.CommitTracker Soft AutoCommit: disabled
   [junit4]   2> 1700888 INFO  (qtp1468501467-16746) [n:127.0.0.1:64517_solr c:testSimple1 s:shard2 r:core_node7 x:testSimple1_shard2_replica_n4] o.a.s.s.SolrIndexSearcher Opening [Searcher@3ec58912[testSimple1_shard2_replica_n4] main]
   [junit4]   2> 1700889 INFO  (qtp1468501467-16756) [n:127.0.0.1:64517_solr c:testSimple1 s:shard1 r:core_node3 x:testSimple1_shard1_replica_n1] o.a.s.s.SolrIndexSearcher Opening [Searcher@42d46028[testSimple1_shard1_replica_n1] main]
   [junit4]   2> 1700889 INFO  (qtp1596802693-16750) [n:127.0.0.1:64516_solr c:testSimple1 s:shard2 r:core_node8 x:testSimple1_shard2_replica_n6] o.a.s.s.SolrIndexSearcher Opening [Searcher@7d9f6e7d[testSimple1_shard2_replica_n6] main]
   [junit4]   2> 1700890 INFO  (qtp1468501467-16746) [n:127.0.0.1:64517_solr c:testSimple1 s:shard2 r:core_node7 x:testSimple1_shard2_replica_n4] o.a.s.r.ManagedResourceStorage Configured ZooKeeperStorageIO with znodeBase: /configs/conf
   [junit4]   2> 1700890 INFO  (qtp1468501467-16756) [n:127.0.0.1:64517_solr c:testSimple1 s:shard1 r:core_node3 x:testSimple1_shard1_replica_n1] o.a.s.r.ManagedResourceStorage Configured ZooKeeperStorageIO with znodeBase: /configs/conf
   [junit4]   2> 1700891 INFO  (qtp1468501467-16756) [n:127.0.0.1:64517_solr c:testSimple1 s:shard1 r:core_node3 x:testSimple1_shard1_replica_n1] o.a.s.r.ManagedResourceStorage Loaded null at path _rest_managed.json using ZooKeeperStorageIO:path=/configs/conf
   [junit4]   2> 1700891 INFO  (qtp1468501467-16746) [n:127.0.0.1:64517_solr c:testSimple1 s:shard2 r:core_node7 x:testSimple1_shard2_replica_n4] o.a.s.r.ManagedResourceStorage Loaded null at path _rest_managed.json using ZooKeeperStorageIO:path=/configs/conf
   [junit4]   2> 1700891 INFO  (qtp1596802693-16750) [n:127.0.0.1:64516_solr c:testSimple1 s:shard2 r:core_node8 x:testSimple1_shard2_replica_n6] o.a.s.r.ManagedResourceStorage Configured ZooKeeperStorageIO with znodeBase: /configs/conf
   [junit4]   2> 1700891 INFO  (qtp1468501467-16746) [n:127.0.0.1:64517_solr c:testSimple1 s:shard2 r:core_node7 x:testSimple1_shard2_replica_n4] o.a.s.h.ReplicationHandler Commits will be reserved for 10000ms.
   [junit4]   2> 1700891 INFO  (qtp1468501467-16756) [n:127.0.0.1:64517_solr c:testSimple1 s:shard1 r:core_node3 x:testSimple1_shard1_replica_n1] o.a.s.h.ReplicationHandler Commits will be reserved for 10000ms.
   [junit4]   2> 1700891 INFO  (qtp1468501467-16746) [n:127.0.0.1:64517_solr c:testSimple1 s:shard2 r:core_node7 x:testSimple1_shard2_replica_n4] o.a.s.u.UpdateLog Could not find max version in index or recent updates, using new clock 1590134563983589376
   [junit4]   2> 1700891 INFO  (qtp1468501467-16756) [n:127.0.0.1:64517_solr c:testSimple1 s:shard1 r:core_node3 x:testSimple1_shard1_replica_n1] o.a.s.u.UpdateLog Could not find max version in index or recent updates, using new clock 1590134563983589376
   [junit4]   2> 1700892 INFO  (searcherExecutor-6056-thread-1-processing-n:127.0.0.1:64517_solr x:testSimple1_shard2_replica_n4 s:shard2 c:testSimple1 r:core_node7) [n:127.0.0.1:64517_solr c:testSimple1 s:shard2 r:core_node7 x:testSimple1_shard2_replica_n4] o.a.s.c.SolrCore [testSimple1_shard2_replica_n4] Registered new searcher Searcher@3ec58912[testSimple1_shard2_replica_n4] main{ExitableDirectoryReader(UninvertingDirectoryReader())}
   [junit4]   2> 1700892 INFO  (searcherExecutor-6055-thread-1-processing-n:127.0.0.1:64517_solr x:testSimple1_shard1_replica_n1 s:shard1 c:testSimple1 r:core_node3) [n:127.0.0.1:64517_solr c:testSimple1 s:shard1 r:core_node3 x:testSimple1_shard1_replica_n1] o.a.s.c.SolrCore [testSimple1_shard1_replica_n1] Registered new searcher Searcher@42d46028[testSimple1_shard1_replica_n1] main{ExitableDirectoryReader(UninvertingDirectoryReader())}
   [junit4]   2> 1700892 INFO  (qtp1596802693-16750) [n:127.0.0.1:64516_solr c:testSimple1 s:shard2 r:core_node8 x:testSimple1_shard2_replica_n6] o.a.s.r.ManagedResourceStorage Loaded null at path _rest_managed.json using ZooKeeperStorageIO:path=/configs/conf
   [junit4]   2> 1700892 INFO  (qtp1596802693-16758) [n:127.0.0.1:64516_solr c:testSimple1 s:shard1 r:core_node5 x:testSimple1_shard1_replica_n2] o.a.s.s.SolrIndexSearcher Opening [Searcher@249b5354[testSimple1_shard1_replica_n2] main]
   [junit4]   2> 1700894 INFO  (qtp1596802693-16750) [n:127.0.0.1:64516_solr c:testSimple1 s:shard2 r:core_node8 x:testSimple1_shard2_replica_n6] o.a.s.h.ReplicationHandler Commits will be reserved for 10000ms.
   [junit4]   2> 1700897 INFO  (searcherExecutor-6054-thread-1-processing-n:127.0.0.1:64516_solr x:testSimple1_shard2_replica_n6 s:shard2 c:testSimple1 r:core_node8) [n:127.0.0.1:64516_solr c:testSimple1 s:shard2 r:core_node8 x:testSimple1_shard2_replica_n6] o.a.s.c.SolrCore [testSimple1_shard2_replica_n6] Registered new searcher Searcher@7d9f6e7d[testSimple1_shard2_replica_n6] main{ExitableDirectoryReader(UninvertingDirectoryReader())}
   [junit4]   2> 1700897 INFO  (qtp1596802693-16750) [n:127.0.0.1:64516_solr c:testSimple1 s:shard2 r:core_node8 x:testSimple1_shard2_replica_n6] o.a.s.u.UpdateLog Could not find max version in index or recent updates, using new clock 1590134563989880832
   [junit4]   2> 1700898 INFO  (qtp1468501467-16756) [n:127.0.0.1:64517_solr c:testSimple1 s:shard1 r:core_node3 x:testSimple1_shard1_replica_n1] o.a.s.c.ShardLeaderElectionContext Waiting until we see more replicas up for shard shard1: total=2 found=1 timeoutin=9999ms
   [junit4]   2> 1700898 INFO  (qtp1468501467-16746) [n:127.0.0.1:64517_solr c:testSimple1 s:shard2 r:core_node7 x:testSimple1_shard2_replica_n4] o.a.s.c.ShardLeaderElectionContext Waiting until we see more replicas up for shard shard2: total=2 found=1 timeoutin=9999ms
   [junit4]   2> 1700902 INFO  (qtp1596802693-16758) [n:127.0.0.1:64516_solr c:testSimple1 s:shard1 r:core_node5 x:testSimple1_shard1_replica_n2] o.a.s.r.ManagedResourceStorage Configured ZooKeeperStorageIO with znodeBase: /configs/conf
   [junit4]   2> 1700903 INFO  (qtp1596802693-16758) [n:127.0.0.1:64516_solr c:testSimple1 s:shard1 r:core_node5 x:testSimple1_shard1_replica_n2] o.a.s.r.ManagedResourceStorage Loaded null at path _rest_managed.json using ZooKeeperStorageIO:path=/configs/conf
   [junit4]   2> 1700903 INFO  (qtp1596802693-16758) [n:127.0.0.1:64516_solr c:testSimple1 s:shard1 r:core_node5 x:testSimple1_shard1_replica_n2] o.a.s.h.ReplicationHandler Commits will be reserved for 10000ms.
   [junit4]   2> 1700904 INFO  (searcherExecutor-6053-thread-1-processing-n:127.0.0.1:64516_solr x:testSimple1_shard1_replica_n2 s:shard1 c:testSimple1 r:core_node5) [n:127.0.0.1:64516_solr c:testSimple1 s:shard1 r:core_node5 x:testSimple1_shard1_replica_n2] o.a.s.c.SolrCore [testSimple1_shard1_replica_n2] Registered new searcher Searcher@249b5354[testSimple1_shard1_replica_n2] main{ExitableDirectoryReader(UninvertingDirectoryReader())}
   [junit4]   2> 1700904 INFO  (qtp1596802693-16758) [n:127.0.0.1:64516_solr c:testSimple1 s:shard1 r:core_node5 x:testSimple1_shard1_replica_n2] o.a.s.u.UpdateLog Could not find max version in index or recent updates, using new clock 1590134563997220864
   [junit4]   2> 1701009 INFO  (zkCallback-5270-thread-1-processing-n:127.0.0.1:64517_solr) [n:127.0.0.1:64517_solr    ] o.a.s.c.c.ZkStateReader A cluster state change: [WatchedEvent state:SyncConnected type:NodeDataChanged path:/collections/testSimple1/state.json] for collection [testSimple1] has occurred - updating... (live nodes size: [3])
   [junit4]   2> 1701009 INFO  (zkCallback-5271-thread-2-processing-n:127.0.0.1:64516_solr) [n:127.0.0.1:64516_solr    ] o.a.s.c.c.ZkStateReader A cluster state change: [WatchedEvent state:SyncConnected type:NodeDataChanged path:/collections/testSimple1/state.json] for collection [testSimple1] has occurred - updating... (live nodes size: [3])
   [junit4]   2> 1701009 INFO  (zkCallback-5271-thread-1-processing-n:127.0.0.1:64516_solr) [n:127.0.0.1:64516_solr    ] o.a.s.c.c.ZkStateReader A cluster state change: [WatchedEvent state:SyncConnected type:NodeDataChanged path:/collections/testSimple1/state.json] for collection [testSimple1] has occurred - updating... (live nodes size: [3])
   [junit4]   2> 1701009 INFO  (zkCallback-5270-thread-3-processing-n:127.0.0.1:64517_solr) [n:127.0.0.1:64517_solr    ] o.a.s.c.c.ZkStateReader A cluster state change: [WatchedEvent state:SyncConnected type:NodeDataChanged path:/collections/testSimple1/state.json] for collection [testSimple1] has occurred - updating... (live nodes size: [3])
   [junit4]   2> 1701009 INFO  (zkCallback-5270-thread-2-processing-n:127.0.0.1:64517_solr) [n:127.0.0.1:64517_solr    ] o.a.s.c.c.ZkStateReader A cluster state change: [WatchedEvent state:SyncConnected type:NodeDataChanged path:/collections/testSimple1/state.json] for collection [testSimple1] has occurred - updating... (live nodes size: [3])
   [junit4]   2> 1701404 INFO  (qtp1468501467-16746) [n:127.0.0.1:64517_solr c:testSimple1 s:shard2 r:core_node7 x:testSimple1_shard2_replica_n4] o.a.s.c.ShardLeaderElectionContext Enough replicas found to continue.
   [junit4]   2> 1701404 INFO  (qtp1468501467-16746) [n:127.0.0.1:64517_solr c:testSimple1 s:shard2 r:core_node7 x:testSimple1_shard2_replica_n4] o.a.s.c.ShardLeaderElectionContext I may be the new leader - try and sync
   [junit4]   2> 1701404 INFO  (qtp1468501467-16746) [n:127.0.0.1:64517_solr c:testSimple1 s:shard2 r:core_node7 x:testSimple1_shard2_replica_n4] o.a.s.c.SyncStrategy Sync replicas to https://127.0.0.1:64517/solr/testSimple1_shard2_replica_n4/
   [junit4]   2> 1701404 INFO  (qtp1468501467-16756) [n:127.0.0.1:64517_solr c:testSimple1 s:shard1 r:core_node3 x:testSimple1_shard1_replica_n1] o.a.s.c.ShardLeaderElectionContext Enough replicas found to continue.
   [junit4]   2> 1701404 INFO  (qtp1468501467-16756) [n:127.0.0.1:64517_solr c:testSimple1 s:shard1 r:core_node3 x:testSimple1_shard1_replica_n1] o.a.s.c.ShardLeaderElectionContext I may be the new leader - try and sync
   [junit4]   2> 1701404 INFO  (qtp1468501467-16756) [n:127.0.0.1:64517_solr c:testSimple1 s:shard1 r:core_node3 x:testSimple1_shard1_replica_n1] o.a.s.c.SyncStrategy Sync replicas to https://127.0.0.1:64517/solr/testSimple1_shard1_replica_n1/
   [junit4]   2> 1701404 INFO  (qtp1468501467-16746) [n:127.0.0.1:64517_solr c:testSimple1 s:shard2 r:core_node7 x:testSimple1_shard2_replica_n4] o.a.s.u.PeerSync PeerSync: core=testSimple1_shard2_replica_n4 url=https://127.0.0.1:64517/solr START replicas=[https://127.0.0.1:64516/solr/testSimple1_shard2_replica_n6/] nUpdates=100
   [junit4]   2> 1701404 INFO  (qtp1468501467-16756) [n:127.0.0.1:64517_solr c:testSimple1 s:shard1 r:core_node3 x:testSimple1_shard1_replica_n1] o.a.s.u.PeerSync PeerSync: core=testSimple1_shard1_replica_n1 url=https://127.0.0.1:64517/solr START replicas=[https://127.0.0.1:64516/solr/testSimple1_shard1_replica_n2/] nUpdates=100
   [junit4]   2> 1701408 INFO  (qtp1596802693-16742) [n:127.0.0.1:64516_solr c:testSimple1 s:shard2 r:core_node8 x:testSimple1_shard2_replica_n6] o.a.s.c.S.Request [testSimple1_shard2_replica_n6]  webapp=/solr path=/get params={distrib=false&qt=/get&fingerprint=false&getVersions=100&wt=javabin&version=2} status=0 QTime=0
   [junit4]   2> 1701408 INFO  (qtp1596802693-16745) [n:127.0.0.1:64516_solr c:testSimple1 s:shard1 r:core_node5 x:testSimple1_shard1_replica_n2] o.a.s.c.S.Request [testSimple1_shard1_replica_n2]  webapp=/solr path=/get params={distrib=false&qt=/get&fingerprint=false&getVersions=100&wt=javabin&version=2} status=0 QTime=0
   [junit4]   2> 1701705 INFO  (qtp1468501467-16746) [n:127.0.0.1:64517_solr c:testSimple1 s:shard2 r:core_node7 x:testSimple1_shard2_replica_n4] o.a.s.u.PeerSync PeerSync: core=testSimple1_shard2_replica_n4 url=https://127.0.0.1:64517/solr DONE.  We have no versions.  sync failed.
   [junit4]   2> 1701705 INFO  (qtp1468501467-16746) [n:127.0.0.1:64517_solr c:testSimple1 s:shard2 r:core_node7 x:testSimple1_shard2_replica_n4] o.a.s.c.SyncStrategy Leader's attempt to sync with shard failed, moving to the next candidate
   [junit4]   2> 1701705 INFO  (qtp1468501467-16746) [n:127.0.0.1:64517_solr c:testSimple1 s:shard2 r:core_node7 x:testSimple1_shard2_replica_n4] o.a.s.c.ShardLeaderElectionContext We failed sync, but we have no versions - we can't sync in that case - we were active before, so become leader anyway
   [junit4]   2> 1701706 INFO  (qtp1468501467-16746) [n:127.0.0.1:64517_solr c:testSimple1 s:shard2 r:core_node7 x:testSimple1_shard2_replica_n4] o.a.s.c.ShardLeaderElectionContext Found all replicas participating in election, clear LIR
   [junit4]   2> 1701708 INFO  (qtp1468501467-16756) [n:127.0.0.1:64517_solr c:testSimple1 s:shard1 r:core_node3 x:testSimple1_shard1_replica_n1] o.a.s.u.PeerSync PeerSync: core=testSimple1_shard1_replica_n1 url=https://127.0.0.1:64517/solr DONE.  We have no versions.  sync failed.
   [junit4]   2> 1701709 INFO  (qtp1468501467-16756) [n:127.0.0.1:64517_solr c:testSimple1 s:shard1 r:core_node3 x:testSimple1_shard1_replica_n1] o.a.s.c.SyncStrategy Leader's attempt to sync with shard failed, moving to the next candidate
   [junit4]   2> 1701709 INFO  (qtp1468501467-16756) [n:127.0.0.1:64517_solr c:testSimple1 s:shard1 r:core_node3 x:testSimple1_shard1_replica_n1] o.a.s.c.ShardLeaderElectionContext We failed sync, but we have no versions - we can't sync in that case - we were active before, so become leader anyway
   [junit4]   2> 1701709 INFO  (qtp1468501467-16756) [n:127.0.0.1:64517_solr c:testSimple1 s:shard1 r:core_node3 x:testSimple1_shard1_replica_n1] o.a.s.c.ShardLeaderElectionContext Found all replicas participating in election, clear LIR
   [junit4]   2> 1701712 INFO  (qtp1468501467-16746) [n:127.0.0.1:64517_solr c:testSimple1 s:shard2 r:core_node7 x:testSimple1_shard2_replica_n4] o.a.s.c.ShardLeaderElectionContext I am the new leader: https://127.0.0.1:64517/solr/testSimple1_shard2_replica_n4/ shard2
   [junit4]   2> 1701714 INFO  (qtp1468501467-16756) [n:127.0.0.1:64517_solr c:testSimple1 s:shard1 r:core_node3 x:testSimple1_shard1_replica_n1] o.a.s.c.ShardLeaderElectionContext I am the new leader: https://127.0.0.1:64517/solr/testSimple1_shard1_replica_n1/ shard1
   [junit4]   2> 1701826 INFO  (zkCallback-5270-thread-2-processing-n:127.0.0.1:64517_solr) [n:127.0.0.1:64517_solr    ] o.a.s.c.c.ZkStateReader A cluster state change: [WatchedEvent state:SyncConnected type:NodeDataChanged path:/collections/testSimple1/state.json] for collection [testSimple1] has occurred - updating... (live nodes size: [3])
   [junit4]   2> 1701826 INFO  (zkCallback-5271-thread-1-processing-n:127.0.0.1:64516_solr) [n:127.0.0.1:64516_solr    ] o.a.s.c.c.ZkStateReader A cluster state change: [WatchedEvent state:SyncConnected type:NodeDataChanged path:/collections/testSimple1/state.json] for collection [testSimple1] has occurred - updating... (live nodes size: [3])
   [junit4]   2> 1701826 INFO  (zkCallback-5271-thread-2-processing-n:127.0.0.1:64516_solr) [n:127.0.0.1:64516_solr    ] o.a.s.c.c.ZkStateReader A cluster state change: [WatchedEvent state:SyncConnected type:NodeDataChanged path:/collections/testSimple1/state.json] for collection [testSimple1] has occurred - updating... (live nodes size: [3])
   [junit4]   2> 1701826 INFO  (zkCallback-5270-thread-1-processing-n:127.0.0.1:64517_solr) [n:127.0.0.1:64517_solr    ] o.a.s.c.c.ZkStateReader A cluster state change: [WatchedEvent state:SyncConnected type:NodeDataChanged path:/collections/testSimple1/state.json] for collection [testSimple1] has occurred - updating... (live nodes size: [3])
   [junit4]   2> 1701826 INFO  (zkCallback-5270-thread-3-processing-n:127.0.0.1:64517_solr) [n:127.0.0.1:64517_solr    ] o.a.s.c.c.ZkStateReader A cluster state change: [WatchedEvent state:SyncConnected type:NodeDataChanged path:/collections/testSimple1/state.json] for collection [testSimple1] has occurred - updating... (live nodes size: [3])
   [junit4]   2> 1701878 INFO  (qtp1468501467-16746) [n:127.0.0.1:64517_solr c:testSimple1 s:shard2 r:core_node7 x:testSimple1_shard2_replica_n4] o.a.s.c.ZkController I am the leader, no recovery necessary
   [junit4]   2> 1701878 INFO  (qtp1468501467-16756) [n:127.0.0.1:64517_solr c:testSimple1 s:shard1 r:core_node3 x:testSimple1_shard1_replica_n1] o.a.s.c.ZkController I am the leader, no recovery necessary
   [junit4]   2> 1701880 INFO  (qtp1468501467-16756) [n:127.0.0.1:64517_solr c:testSimple1 s:shard1 r:core_node3 x:testSimple1_shard1_replica_n1] o.a.s.s.HttpSolrCall [admin] webapp=null path=/admin/cores params={qt=/admin/cores&coreNodeName=core_node3&collection.configName=conf&newCollection=true&name=testSimple1_shard1_replica_n1&action=CREATE&numShards=2&collection=testSimple1&shard=shard1&wt=javabin&version=2&replicaType=NRT} status=0 QTime=2141
   [junit4]   2> 1701881 INFO  (qtp1468501467-16746) [n:127.0.0.1:64517_solr c:testSimple1 s:shard2 r:core_node7 x:testSimple1_shard2_replica_n4] o.a.s.s.HttpSolrCall [admin] webapp=null path=/admin/cores params={qt=/admin/cores&coreNodeName=core_node7&collection.configName=conf&newCollection=true&name=testSimple1_shard2_replica_n4&action=CREATE&numShards=2&collection=testSimple1&shard=shard2&wt=javabin&version=2&replicaType=NRT} status=0 QTime=2137
   [junit4]   2> 1701914 INFO  (qtp1596802693-16750) [n:127.0.0.1:64516_solr c:testSimple1 s:shard2 r:core_node8 x:testSimple1_shard2_replica_n6] o.a.s.s.HttpSolrCall [admin] webapp=null path=/admin/cores params={qt=/admin/cores&coreNodeName=core_node8&collection.configName=conf&newCollection=true&name=testSimple1_shard2_replica_n6&action=CREATE&numShards=2&collection=testSimple1&shard=shard2&wt=javabin&version=2&replicaType=NRT} status=0 QTime=2183
   [junit4]   2> 1701916 INFO  (qtp1596802693-16758) [n:127.0.0.1:64516_solr c:testSimple1 s:shard1 r:core_node5 x:testSimple1_shard1_replica_n2] o.a.s.s.HttpSolrCall [admin] webapp=null path=/admin/cores params={qt=/admin/cores&coreNodeName=core_node5&collection.configName=conf&newCollection=true&name=testSimple1_shard1_replica_n2&action=CREATE&numShards=2&collection=testSimple1&shard=shard1&wt=javabin&version=2&replicaType=NRT} status=0 QTime=2186
   [junit4]   2> 1701922 INFO  (qtp1596802693-16748) [n:127.0.0.1:64516_solr    ] o.a.s.h.a.CollectionsHandler Wait for new collection to be active for at most 30 seconds. Check all shard replicas
   [junit4]   2> 1702023 INFO  (zkCallback-5270-thread-1-processing-n:127.0.0.1:64517_solr) [n:127.0.0.1:64517_solr    ] o.a.s.c.c.ZkStateReader A cluster state change: [WatchedEvent state:SyncConnected type:NodeDataChanged path:/collections/testSimple1/state.json] for collection [testSimple1] has occurred - updating... (live nodes size: [3])
   [junit4]   2> 1702023 INFO  (zkCallback-5271-thread-2-processing-n:127.0.0.1:64516_solr) [n:127.0.0.1:64516_solr    ] o.a.s.c.c.ZkStateReader A cluster state change: [WatchedEvent state:SyncConnected type:NodeDataChanged path:/collections/testSimple1/state.json] for collection [testSimple1] has occurred - updating... (live nodes size: [3])
   [junit4]   2> 1702023 INFO  (zkCallback-5271-thread-1-processing-n:127.0.0.1:64516_solr) [n:127.0.0.1:64516_solr    ] o.a.s.c.c.ZkStateReader A cluster state change: [WatchedEvent state:SyncConnected type:NodeDataChanged path:/collections/testSimple1/state.json] for collection [testSimple1] has occurred - updating... (live nodes size: [3])
   [junit4]   2> 1702023 INFO  (zkCallback-5270-thread-4-processing-n:127.0.0.1:64517_solr) [n:127.0.0.1:64517_solr    ] o.a.s.c.c.ZkStateReader A cluster state change: [WatchedEvent state:SyncConnected type:NodeDataChanged path:/collections/testSimple1/state.json] for collection [testSimple1] has occurred - updating... (live nodes size: [3])
   [junit4]   2> 1702023 INFO  (zkCallback-5270-thread-3-processing-n:127.0.0.1:64517_solr) [n:127.0.0.1:64517_solr    ] o.a.s.c.c.ZkStateReader A cluster state change: [WatchedEvent state:SyncConnected type:NodeDataChanged path:/collections/testSimple1/state.json] for collection [testSimple1] has occurred - updating... (live nodes size: [3])
   [junit4]   2> 1702924 INFO  (qtp1596802693-16748) [n:127.0.0.1:64516_solr    ] o.a.s.s.HttpSolrCall [admin] webapp=null 

[...truncated too long message...]

kspace/Lucene-Solr-7.x-MacOSX/solr/build/solr-solrj/test/temp/junit4-J0-20180120_182435_9868796890970949722825.syserr
   [junit4] >>> JVM J0 emitted unexpected output (verbatim) ----
   [junit4] Java HotSpot(TM) 64-Bit Server VM warning: Option UseConcMarkSweepGC was deprecated in version 9.0 and will likely be removed in a future release.
   [junit4] <<< JVM J0: EOF ----

[...truncated 3 lines...]
   [junit4] JVM J1: stderr was not empty, see: /Users/jenkins/workspace/Lucene-Solr-7.x-MacOSX/solr/build/solr-solrj/test/temp/junit4-J1-20180120_182435_98612962870513259413154.syserr
   [junit4] >>> JVM J1 emitted unexpected output (verbatim) ----
   [junit4] Java HotSpot(TM) 64-Bit Server VM warning: Option UseConcMarkSweepGC was deprecated in version 9.0 and will likely be removed in a future release.
   [junit4] <<< JVM J1: EOF ----

[...truncated 1460 lines...]
   [junit4] JVM J0: stderr was not empty, see: /Users/jenkins/workspace/Lucene-Solr-7.x-MacOSX/solr/build/contrib/solr-analysis-extras/test/temp/junit4-J0-20180120_182801_997887982393152708037.syserr
   [junit4] >>> JVM J0 emitted unexpected output (verbatim) ----
   [junit4] Java HotSpot(TM) 64-Bit Server VM warning: Option UseConcMarkSweepGC was deprecated in version 9.0 and will likely be removed in a future release.
   [junit4] <<< JVM J0: EOF ----

[...truncated 3 lines...]
   [junit4] JVM J1: stderr was not empty, see: /Users/jenkins/workspace/Lucene-Solr-7.x-MacOSX/solr/build/contrib/solr-analysis-extras/test/temp/junit4-J1-20180120_182801_99713480445744843614000.syserr
   [junit4] >>> JVM J1 emitted unexpected output (verbatim) ----
   [junit4] Java HotSpot(TM) 64-Bit Server VM warning: Option UseConcMarkSweepGC was deprecated in version 9.0 and will likely be removed in a future release.
   [junit4] <<< JVM J1: EOF ----

[...truncated 782 lines...]
   [junit4] JVM J1: stderr was not empty, see: /Users/jenkins/workspace/Lucene-Solr-7.x-MacOSX/solr/build/contrib/solr-analytics/test/temp/junit4-J1-20180120_182815_70417187710912318442508.syserr
   [junit4] >>> JVM J1 emitted unexpected output (verbatim) ----
   [junit4] Java HotSpot(TM) 64-Bit Server VM warning: Option UseConcMarkSweepGC was deprecated in version 9.0 and will likely be removed in a future release.
   [junit4] <<< JVM J1: EOF ----

[...truncated 3 lines...]
   [junit4] JVM J0: stderr was not empty, see: /Users/jenkins/workspace/Lucene-Solr-7.x-MacOSX/solr/build/contrib/solr-analytics/test/temp/junit4-J0-20180120_182815_70417325464485040869290.syserr
   [junit4] >>> JVM J0 emitted unexpected output (verbatim) ----
   [junit4] Java HotSpot(TM) 64-Bit Server VM warning: Option UseConcMarkSweepGC was deprecated in version 9.0 and will likely be removed in a future release.
   [junit4] <<< JVM J0: EOF ----

[...truncated 553 lines...]
   [junit4] JVM J1: stderr was not empty, see: /Users/jenkins/workspace/Lucene-Solr-7.x-MacOSX/solr/build/contrib/solr-clustering/test/temp/junit4-J1-20180120_182913_1607700773468415457630.syserr
   [junit4] >>> JVM J1 emitted unexpected output (verbatim) ----
   [junit4] Java HotSpot(TM) 64-Bit Server VM warning: Option UseConcMarkSweepGC was deprecated in version 9.0 and will likely be removed in a future release.
   [junit4] <<< JVM J1: EOF ----

[...truncated 3 lines...]
   [junit4] JVM J0: stderr was not empty, see: /Users/jenkins/workspace/Lucene-Solr-7.x-MacOSX/solr/build/contrib/solr-clustering/test/temp/junit4-J0-20180120_182913_1594855954896640803820.syserr
   [junit4] >>> JVM J0 emitted unexpected output (verbatim) ----
   [junit4] Java HotSpot(TM) 64-Bit Server VM warning: Option UseConcMarkSweepGC was deprecated in version 9.0 and will likely be removed in a future release.
   [junit4] <<< JVM J0: EOF ----

[...truncated 1258 lines...]
   [junit4] JVM J1: stderr was not empty, see: /Users/jenkins/workspace/Lucene-Solr-7.x-MacOSX/solr/build/contrib/solr-dataimporthandler-extras/test/temp/junit4-J1-20180120_182932_59317741970168001503110.syserr
   [junit4] >>> JVM J1 emitted unexpected output (verbatim) ----
   [junit4] Java HotSpot(TM) 64-Bit Server VM warning: Option UseConcMarkSweepGC was deprecated in version 9.0 and will likely be removed in a future release.
   [junit4] <<< JVM J1: EOF ----

[...truncated 3 lines...]
   [junit4] JVM J0: stderr was not empty, see: /Users/jenkins/workspace/Lucene-Solr-7.x-MacOSX/solr/build/contrib/solr-dataimporthandler-extras/test/temp/junit4-J0-20180120_182932_59317211247757351835984.syserr
   [junit4] >>> JVM J0 emitted unexpected output (verbatim) ----
   [junit4] Java HotSpot(TM) 64-Bit Server VM warning: Option UseConcMarkSweepGC was deprecated in version 9.0 and will likely be removed in a future release.
   [junit4] <<< JVM J0: EOF ----

[...truncated 649 lines...]
   [junit4] JVM J1: stderr was not empty, see: /Users/jenkins/workspace/Lucene-Solr-7.x-MacOSX/solr/build/contrib/solr-dataimporthandler/test/temp/junit4-J1-20180120_182942_8525334573550690591622.syserr
   [junit4] >>> JVM J1 emitted unexpected output (verbatim) ----
   [junit4] Java HotSpot(TM) 64-Bit Server VM warning: Option UseConcMarkSweepGC was deprecated in version 9.0 and will likely be removed in a future release.
   [junit4] <<< JVM J1: EOF ----

   [junit4] JVM J0: stderr was not empty, see: /Users/jenkins/workspace/Lucene-Solr-7.x-MacOSX/solr/build/contrib/solr-dataimporthandler/test/temp/junit4-J0-20180120_182942_8525573738648433828009.syserr
   [junit4] >>> JVM J0 emitted unexpected output (verbatim) ----
   [junit4] Java HotSpot(TM) 64-Bit Server VM warning: Option UseConcMarkSweepGC was deprecated in version 9.0 and will likely be removed in a future release.
   [junit4] <<< JVM J0: EOF ----

[...truncated 558 lines...]
   [junit4] JVM J0: stderr was not empty, see: /Users/jenkins/workspace/Lucene-Solr-7.x-MacOSX/solr/build/contrib/solr-cell/test/temp/junit4-J0-20180120_183016_10410039231134029261855.syserr
   [junit4] >>> JVM J0 emitted unexpected output (verbatim) ----
   [junit4] Java HotSpot(TM) 64-Bit Server VM warning: Option UseConcMarkSweepGC was deprecated in version 9.0 and will likely be removed in a future release.
   [junit4] <<< JVM J0: EOF ----

[...truncated 3 lines...]
   [junit4] JVM J1: stderr was not empty, see: /Users/jenkins/workspace/Lucene-Solr-7.x-MacOSX/solr/build/contrib/solr-cell/test/temp/junit4-J1-20180120_183016_1042809625421240878156.syserr
   [junit4] >>> JVM J1 emitted unexpected output (verbatim) ----
   [junit4] Java HotSpot(TM) 64-Bit Server VM warning: Option UseConcMarkSweepGC was deprecated in version 9.0 and will likely be removed in a future release.
   [junit4] <<< JVM J1: EOF ----

[...truncated 561 lines...]
   [junit4] JVM J0: stderr was not empty, see: /Users/jenkins/workspace/Lucene-Solr-7.x-MacOSX/solr/build/contrib/solr-langid/test/temp/junit4-J0-20180120_183032_1786496112303197016953.syserr
   [junit4] >>> JVM J0 emitted unexpected output (verbatim) ----
   [junit4] Java HotSpot(TM) 64-Bit Server VM warning: Option UseConcMarkSweepGC was deprecated in version 9.0 and will likely be removed in a future release.
   [junit4] <<< JVM J0: EOF ----

[...truncated 3 lines...]
   [junit4] JVM J1: stderr was not empty, see: /Users/jenkins/workspace/Lucene-Solr-7.x-MacOSX/solr/build/contrib/solr-langid/test/temp/junit4-J1-20180120_183032_17810736158058103751384.syserr
   [junit4] >>> JVM J1 emitted unexpected output (verbatim) ----
   [junit4] Java HotSpot(TM) 64-Bit Server VM warning: Option UseConcMarkSweepGC was deprecated in version 9.0 and will likely be removed in a future release.
   [junit4] <<< JVM J1: EOF ----

[...truncated 655 lines...]
   [junit4] JVM J1: stderr was not empty, see: /Users/jenkins/workspace/Lucene-Solr-7.x-MacOSX/solr/build/contrib/solr-ltr/test/temp/junit4-J1-20180120_183042_8852454754809452977594.syserr
   [junit4] >>> JVM J1 emitted unexpected output (verbatim) ----
   [junit4] Java HotSpot(TM) 64-Bit Server VM warning: Option UseConcMarkSweepGC was deprecated in version 9.0 and will likely be removed in a future release.
   [junit4] <<< JVM J1: EOF ----

[...truncated 3 lines...]
   [junit4] JVM J0: stderr was not empty, see: /Users/jenkins/workspace/Lucene-Solr-7.x-MacOSX/solr/build/contrib/solr-ltr/test/temp/junit4-J0-20180120_183042_88510093853708964656064.syserr
   [junit4] >>> JVM J0 emitted unexpected output (verbatim) ----
   [junit4] Java HotSpot(TM) 64-Bit Server VM warning: Option UseConcMarkSweepGC was deprecated in version 9.0 and will likely be removed in a future release.
   [junit4] <<< JVM J0: EOF ----

[...truncated 595 lines...]
   [junit4] JVM J1: stderr was not empty, see: /Users/jenkins/workspace/Lucene-Solr-7.x-MacOSX/solr/build/contrib/solr-uima/test/temp/junit4-J1-20180120_183113_60611695130945876566821.syserr
   [junit4] >>> JVM J1 emitted unexpected output (verbatim) ----
   [junit4] Java HotSpot(TM) 64-Bit Server VM warning: Option UseConcMarkSweepGC was deprecated in version 9.0 and will likely be removed in a future release.
   [junit4] <<< JVM J1: EOF ----

[...truncated 3 lines...]
   [junit4] JVM J0: stderr was not empty, see: /Users/jenkins/workspace/Lucene-Solr-7.x-MacOSX/solr/build/contrib/solr-uima/test/temp/junit4-J0-20180120_183113_6064947054148021205620.syserr
   [junit4] >>> JVM J0 emitted unexpected output (verbatim) ----
   [junit4] Java HotSpot(TM) 64-Bit Server VM warning: Option UseConcMarkSweepGC was deprecated in version 9.0 and will likely be removed in a future release.
   [junit4] <<< JVM J0: EOF ----

[...truncated 548 lines...]
   [junit4] JVM J0: stderr was not empty, see: /Users/jenkins/workspace/Lucene-Solr-7.x-MacOSX/solr/build/contrib/solr-velocity/test/temp/junit4-J0-20180120_183137_70913999983631247914892.syserr
   [junit4] >>> JVM J0 emitted unexpected output (verbatim) ----
   [junit4] Java HotSpot(TM) 64-Bit Server VM warning: Option UseConcMarkSweepGC was deprecated in version 9.0 and will likely be removed in a future release.
   [junit4] <<< JVM J0: EOF ----

[...truncated 32315 lines...]

Mime
View raw message