lucene-dev mailing list archives

Site index · List index
Message view « Date » · « Thread »
Top « Date » · « Thread »
From Policeman Jenkins Server <jenk...@thetaphi.de>
Subject [JENKINS] Lucene-Solr-7.x-Linux (64bit/jdk1.8.0_144) - Build # 1102 - Still Unstable!
Date Tue, 02 Jan 2018 14:17:52 GMT
Build: https://jenkins.thetaphi.de/job/Lucene-Solr-7.x-Linux/1102/
Java: 64bit/jdk1.8.0_144 -XX:+UseCompressedOops -XX:+UseConcMarkSweepGC

2 tests failed.
FAILED:  junit.framework.TestSuite.org.apache.solr.cloud.TestSolrCloudWithSecureImpersonation

Error Message:
2 threads leaked from SUITE scope at org.apache.solr.cloud.TestSolrCloudWithSecureImpersonation:     1) Thread[id=28551, name=jetty-launcher-7667-thread-2-EventThread, state=TIMED_WAITING, group=TGRP-TestSolrCloudWithSecureImpersonation]         at sun.misc.Unsafe.park(Native Method)         at java.util.concurrent.locks.LockSupport.parkNanos(LockSupport.java:215)         at java.util.concurrent.locks.AbstractQueuedSynchronizer.doAcquireSharedNanos(AbstractQueuedSynchronizer.java:1037)         at java.util.concurrent.locks.AbstractQueuedSynchronizer.tryAcquireSharedNanos(AbstractQueuedSynchronizer.java:1328)         at java.util.concurrent.CountDownLatch.await(CountDownLatch.java:277)         at org.apache.curator.CuratorZookeeperClient.internalBlockUntilConnectedOrTimedOut(CuratorZookeeperClient.java:323)         at org.apache.curator.RetryLoop.callWithRetry(RetryLoop.java:105)         at org.apache.curator.framework.imps.GetDataBuilderImpl.pathInForeground(GetDataBuilderImpl.java:288)         at org.apache.curator.framework.imps.GetDataBuilderImpl.forPath(GetDataBuilderImpl.java:279)         at org.apache.curator.framework.imps.GetDataBuilderImpl.forPath(GetDataBuilderImpl.java:41)         at org.apache.curator.framework.recipes.shared.SharedValue.readValue(SharedValue.java:244)         at org.apache.curator.framework.recipes.shared.SharedValue.access$100(SharedValue.java:44)         at org.apache.curator.framework.recipes.shared.SharedValue$1.process(SharedValue.java:61)         at org.apache.curator.framework.imps.NamespaceWatcher.process(NamespaceWatcher.java:67)         at org.apache.zookeeper.ClientCnxn$EventThread.processEvent(ClientCnxn.java:530)         at org.apache.zookeeper.ClientCnxn$EventThread.run(ClientCnxn.java:505)    2) Thread[id=28547, name=jetty-launcher-7667-thread-1-EventThread, state=TIMED_WAITING, group=TGRP-TestSolrCloudWithSecureImpersonation]         at sun.misc.Unsafe.park(Native Method)         at java.util.concurrent.locks.LockSupport.parkNanos(LockSupport.java:215)         at java.util.concurrent.locks.AbstractQueuedSynchronizer.doAcquireSharedNanos(AbstractQueuedSynchronizer.java:1037)         at java.util.concurrent.locks.AbstractQueuedSynchronizer.tryAcquireSharedNanos(AbstractQueuedSynchronizer.java:1328)         at java.util.concurrent.CountDownLatch.await(CountDownLatch.java:277)         at org.apache.curator.CuratorZookeeperClient.internalBlockUntilConnectedOrTimedOut(CuratorZookeeperClient.java:323)         at org.apache.curator.RetryLoop.callWithRetry(RetryLoop.java:105)         at org.apache.curator.framework.imps.GetDataBuilderImpl.pathInForeground(GetDataBuilderImpl.java:288)         at org.apache.curator.framework.imps.GetDataBuilderImpl.forPath(GetDataBuilderImpl.java:279)         at org.apache.curator.framework.imps.GetDataBuilderImpl.forPath(GetDataBuilderImpl.java:41)         at org.apache.curator.framework.recipes.shared.SharedValue.readValue(SharedValue.java:244)         at org.apache.curator.framework.recipes.shared.SharedValue.access$100(SharedValue.java:44)         at org.apache.curator.framework.recipes.shared.SharedValue$1.process(SharedValue.java:61)         at org.apache.curator.framework.imps.NamespaceWatcher.process(NamespaceWatcher.java:67)         at org.apache.zookeeper.ClientCnxn$EventThread.processEvent(ClientCnxn.java:530)         at org.apache.zookeeper.ClientCnxn$EventThread.run(ClientCnxn.java:505)

Stack Trace:
com.carrotsearch.randomizedtesting.ThreadLeakError: 2 threads leaked from SUITE scope at org.apache.solr.cloud.TestSolrCloudWithSecureImpersonation: 
   1) Thread[id=28551, name=jetty-launcher-7667-thread-2-EventThread, state=TIMED_WAITING, group=TGRP-TestSolrCloudWithSecureImpersonation]
        at sun.misc.Unsafe.park(Native Method)
        at java.util.concurrent.locks.LockSupport.parkNanos(LockSupport.java:215)
        at java.util.concurrent.locks.AbstractQueuedSynchronizer.doAcquireSharedNanos(AbstractQueuedSynchronizer.java:1037)
        at java.util.concurrent.locks.AbstractQueuedSynchronizer.tryAcquireSharedNanos(AbstractQueuedSynchronizer.java:1328)
        at java.util.concurrent.CountDownLatch.await(CountDownLatch.java:277)
        at org.apache.curator.CuratorZookeeperClient.internalBlockUntilConnectedOrTimedOut(CuratorZookeeperClient.java:323)
        at org.apache.curator.RetryLoop.callWithRetry(RetryLoop.java:105)
        at org.apache.curator.framework.imps.GetDataBuilderImpl.pathInForeground(GetDataBuilderImpl.java:288)
        at org.apache.curator.framework.imps.GetDataBuilderImpl.forPath(GetDataBuilderImpl.java:279)
        at org.apache.curator.framework.imps.GetDataBuilderImpl.forPath(GetDataBuilderImpl.java:41)
        at org.apache.curator.framework.recipes.shared.SharedValue.readValue(SharedValue.java:244)
        at org.apache.curator.framework.recipes.shared.SharedValue.access$100(SharedValue.java:44)
        at org.apache.curator.framework.recipes.shared.SharedValue$1.process(SharedValue.java:61)
        at org.apache.curator.framework.imps.NamespaceWatcher.process(NamespaceWatcher.java:67)
        at org.apache.zookeeper.ClientCnxn$EventThread.processEvent(ClientCnxn.java:530)
        at org.apache.zookeeper.ClientCnxn$EventThread.run(ClientCnxn.java:505)
   2) Thread[id=28547, name=jetty-launcher-7667-thread-1-EventThread, state=TIMED_WAITING, group=TGRP-TestSolrCloudWithSecureImpersonation]
        at sun.misc.Unsafe.park(Native Method)
        at java.util.concurrent.locks.LockSupport.parkNanos(LockSupport.java:215)
        at java.util.concurrent.locks.AbstractQueuedSynchronizer.doAcquireSharedNanos(AbstractQueuedSynchronizer.java:1037)
        at java.util.concurrent.locks.AbstractQueuedSynchronizer.tryAcquireSharedNanos(AbstractQueuedSynchronizer.java:1328)
        at java.util.concurrent.CountDownLatch.await(CountDownLatch.java:277)
        at org.apache.curator.CuratorZookeeperClient.internalBlockUntilConnectedOrTimedOut(CuratorZookeeperClient.java:323)
        at org.apache.curator.RetryLoop.callWithRetry(RetryLoop.java:105)
        at org.apache.curator.framework.imps.GetDataBuilderImpl.pathInForeground(GetDataBuilderImpl.java:288)
        at org.apache.curator.framework.imps.GetDataBuilderImpl.forPath(GetDataBuilderImpl.java:279)
        at org.apache.curator.framework.imps.GetDataBuilderImpl.forPath(GetDataBuilderImpl.java:41)
        at org.apache.curator.framework.recipes.shared.SharedValue.readValue(SharedValue.java:244)
        at org.apache.curator.framework.recipes.shared.SharedValue.access$100(SharedValue.java:44)
        at org.apache.curator.framework.recipes.shared.SharedValue$1.process(SharedValue.java:61)
        at org.apache.curator.framework.imps.NamespaceWatcher.process(NamespaceWatcher.java:67)
        at org.apache.zookeeper.ClientCnxn$EventThread.processEvent(ClientCnxn.java:530)
        at org.apache.zookeeper.ClientCnxn$EventThread.run(ClientCnxn.java:505)
	at __randomizedtesting.SeedInfo.seed([DDA44F59B76C1CFD]:0)


FAILED:  org.apache.solr.cloud.AsyncCallRequestStatusResponseTest.testAsyncCallStatusResponse

Error Message:
Expected collection 'asynccall' to have 2 shards and 1 replica null Live Nodes: [127.0.0.1:32821_solr, 127.0.0.1:42081_solr] Last available state: DocCollection(asynccall//collections/asynccall/state.json/3)={   "pullReplicas":"0",   "replicationFactor":"1",   "shards":{     "shard1":{       "range":"80000000-ffffffff",       "state":"active",       "replicas":{"core_node3":{           "core":"asynccall_shard1_replica_n1",           "base_url":"https://127.0.0.1:32821/solr",           "node_name":"127.0.0.1:32821_solr",           "state":"down",           "type":"NRT",           "leader":"true"}}},     "shard2":{       "range":"0-7fffffff",       "state":"active",       "replicas":{"core_node4":{           "core":"asynccall_shard2_replica_n2",           "base_url":"https://127.0.0.1:42081/solr",           "node_name":"127.0.0.1:42081_solr",           "state":"down",           "type":"NRT",           "leader":"true"}}}},   "router":{"name":"compositeId"},   "maxShardsPerNode":"1",   "autoAddReplicas":"false",   "nrtReplicas":"1",   "tlogReplicas":"0"}

Stack Trace:
java.lang.AssertionError: Expected collection 'asynccall' to have 2 shards and 1 replica
null
Live Nodes: [127.0.0.1:32821_solr, 127.0.0.1:42081_solr]
Last available state: DocCollection(asynccall//collections/asynccall/state.json/3)={
  "pullReplicas":"0",
  "replicationFactor":"1",
  "shards":{
    "shard1":{
      "range":"80000000-ffffffff",
      "state":"active",
      "replicas":{"core_node3":{
          "core":"asynccall_shard1_replica_n1",
          "base_url":"https://127.0.0.1:32821/solr",
          "node_name":"127.0.0.1:32821_solr",
          "state":"down",
          "type":"NRT",
          "leader":"true"}}},
    "shard2":{
      "range":"0-7fffffff",
      "state":"active",
      "replicas":{"core_node4":{
          "core":"asynccall_shard2_replica_n2",
          "base_url":"https://127.0.0.1:42081/solr",
          "node_name":"127.0.0.1:42081_solr",
          "state":"down",
          "type":"NRT",
          "leader":"true"}}}},
  "router":{"name":"compositeId"},
  "maxShardsPerNode":"1",
  "autoAddReplicas":"false",
  "nrtReplicas":"1",
  "tlogReplicas":"0"}
	at __randomizedtesting.SeedInfo.seed([DDA44F59B76C1CFD:87A52AB599569124]:0)
	at org.junit.Assert.fail(Assert.java:93)
	at org.apache.solr.cloud.SolrCloudTestCase.waitForState(SolrCloudTestCase.java:269)
	at org.apache.solr.cloud.AsyncCallRequestStatusResponseTest.testAsyncCallStatusResponse(AsyncCallRequestStatusResponseTest.java:43)
	at sun.reflect.NativeMethodAccessorImpl.invoke0(Native Method)
	at sun.reflect.NativeMethodAccessorImpl.invoke(NativeMethodAccessorImpl.java:62)
	at sun.reflect.DelegatingMethodAccessorImpl.invoke(DelegatingMethodAccessorImpl.java:43)
	at java.lang.reflect.Method.invoke(Method.java:498)
	at com.carrotsearch.randomizedtesting.RandomizedRunner.invoke(RandomizedRunner.java:1737)
	at com.carrotsearch.randomizedtesting.RandomizedRunner$8.evaluate(RandomizedRunner.java:934)
	at com.carrotsearch.randomizedtesting.RandomizedRunner$9.evaluate(RandomizedRunner.java:970)
	at com.carrotsearch.randomizedtesting.RandomizedRunner$10.evaluate(RandomizedRunner.java:984)
	at com.carrotsearch.randomizedtesting.rules.SystemPropertiesRestoreRule$1.evaluate(SystemPropertiesRestoreRule.java:57)
	at org.apache.lucene.util.TestRuleSetupTeardownChained$1.evaluate(TestRuleSetupTeardownChained.java:49)
	at org.apache.lucene.util.AbstractBeforeAfterRule$1.evaluate(AbstractBeforeAfterRule.java:45)
	at org.apache.lucene.util.TestRuleThreadAndTestName$1.evaluate(TestRuleThreadAndTestName.java:48)
	at org.apache.lucene.util.TestRuleIgnoreAfterMaxFailures$1.evaluate(TestRuleIgnoreAfterMaxFailures.java:64)
	at org.apache.lucene.util.TestRuleMarkFailure$1.evaluate(TestRuleMarkFailure.java:47)
	at com.carrotsearch.randomizedtesting.rules.StatementAdapter.evaluate(StatementAdapter.java:36)
	at com.carrotsearch.randomizedtesting.ThreadLeakControl$StatementRunner.run(ThreadLeakControl.java:368)
	at com.carrotsearch.randomizedtesting.ThreadLeakControl.forkTimeoutingTask(ThreadLeakControl.java:817)
	at com.carrotsearch.randomizedtesting.ThreadLeakControl$3.evaluate(ThreadLeakControl.java:468)
	at com.carrotsearch.randomizedtesting.RandomizedRunner.runSingleTest(RandomizedRunner.java:943)
	at com.carrotsearch.randomizedtesting.RandomizedRunner$5.evaluate(RandomizedRunner.java:829)
	at com.carrotsearch.randomizedtesting.RandomizedRunner$6.evaluate(RandomizedRunner.java:879)
	at com.carrotsearch.randomizedtesting.RandomizedRunner$7.evaluate(RandomizedRunner.java:890)
	at com.carrotsearch.randomizedtesting.rules.StatementAdapter.evaluate(StatementAdapter.java:36)
	at com.carrotsearch.randomizedtesting.rules.SystemPropertiesRestoreRule$1.evaluate(SystemPropertiesRestoreRule.java:57)
	at org.apache.lucene.util.AbstractBeforeAfterRule$1.evaluate(AbstractBeforeAfterRule.java:45)
	at com.carrotsearch.randomizedtesting.rules.StatementAdapter.evaluate(StatementAdapter.java:36)
	at org.apache.lucene.util.TestRuleStoreClassName$1.evaluate(TestRuleStoreClassName.java:41)
	at com.carrotsearch.randomizedtesting.rules.NoShadowingOrOverridesOnMethodsRule$1.evaluate(NoShadowingOrOverridesOnMethodsRule.java:40)
	at com.carrotsearch.randomizedtesting.rules.NoShadowingOrOverridesOnMethodsRule$1.evaluate(NoShadowingOrOverridesOnMethodsRule.java:40)
	at com.carrotsearch.randomizedtesting.rules.StatementAdapter.evaluate(StatementAdapter.java:36)
	at com.carrotsearch.randomizedtesting.rules.StatementAdapter.evaluate(StatementAdapter.java:36)
	at com.carrotsearch.randomizedtesting.rules.StatementAdapter.evaluate(StatementAdapter.java:36)
	at org.apache.lucene.util.TestRuleAssertionsRequired$1.evaluate(TestRuleAssertionsRequired.java:53)
	at org.apache.lucene.util.TestRuleMarkFailure$1.evaluate(TestRuleMarkFailure.java:47)
	at org.apache.lucene.util.TestRuleIgnoreAfterMaxFailures$1.evaluate(TestRuleIgnoreAfterMaxFailures.java:64)
	at org.apache.lucene.util.TestRuleIgnoreTestSuites$1.evaluate(TestRuleIgnoreTestSuites.java:54)
	at com.carrotsearch.randomizedtesting.rules.StatementAdapter.evaluate(StatementAdapter.java:36)
	at com.carrotsearch.randomizedtesting.ThreadLeakControl$StatementRunner.run(ThreadLeakControl.java:368)
	at java.lang.Thread.run(Thread.java:748)




Build Log:
[...truncated 12694 lines...]
   [junit4] Suite: org.apache.solr.cloud.AsyncCallRequestStatusResponseTest
   [junit4]   2> Creating dataDir: /home/jenkins/workspace/Lucene-Solr-7.x-Linux/solr/build/solr-core/test/J2/temp/solr.cloud.AsyncCallRequestStatusResponseTest_DDA44F59B76C1CFD-001/init-core-data-001
   [junit4]   2> 979085 WARN  (SUITE-AsyncCallRequestStatusResponseTest-seed#[DDA44F59B76C1CFD]-worker) [    ] o.a.s.SolrTestCaseJ4 startTrackingSearchers: numOpens=6 numCloses=6
   [junit4]   2> 979085 INFO  (SUITE-AsyncCallRequestStatusResponseTest-seed#[DDA44F59B76C1CFD]-worker) [    ] o.a.s.SolrTestCaseJ4 Using PointFields (NUMERIC_POINTS_SYSPROP=true) w/NUMERIC_DOCVALUES_SYSPROP=true
   [junit4]   2> 979086 INFO  (SUITE-AsyncCallRequestStatusResponseTest-seed#[DDA44F59B76C1CFD]-worker) [    ] o.a.s.SolrTestCaseJ4 Randomized ssl (true) and clientAuth (false) via: @org.apache.solr.util.RandomizeSSL(reason=, value=NaN, ssl=NaN, clientAuth=NaN)
   [junit4]   2> 979087 INFO  (SUITE-AsyncCallRequestStatusResponseTest-seed#[DDA44F59B76C1CFD]-worker) [    ] o.a.s.SolrTestCaseJ4 SecureRandom sanity checks: test.solr.allowed.securerandom=null & java.security.egd=file:/dev/./urandom
   [junit4]   2> 979088 INFO  (SUITE-AsyncCallRequestStatusResponseTest-seed#[DDA44F59B76C1CFD]-worker) [    ] o.a.s.c.MiniSolrCloudCluster Starting cluster of 2 servers in /home/jenkins/workspace/Lucene-Solr-7.x-Linux/solr/build/solr-core/test/J2/temp/solr.cloud.AsyncCallRequestStatusResponseTest_DDA44F59B76C1CFD-001/tempDir-001
   [junit4]   2> 979088 INFO  (SUITE-AsyncCallRequestStatusResponseTest-seed#[DDA44F59B76C1CFD]-worker) [    ] o.a.s.c.ZkTestServer STARTING ZK TEST SERVER
   [junit4]   2> 979088 INFO  (Thread-5642) [    ] o.a.s.c.ZkTestServer client port:0.0.0.0/0.0.0.0:0
   [junit4]   2> 979088 INFO  (Thread-5642) [    ] o.a.s.c.ZkTestServer Starting server
   [junit4]   2> 979090 ERROR (Thread-5642) [    ] o.a.z.s.ZooKeeperServer ZKShutdownHandler is not registered, so ZooKeeper server won't take any action on ERROR or SHUTDOWN server state changes
   [junit4]   2> 979188 INFO  (SUITE-AsyncCallRequestStatusResponseTest-seed#[DDA44F59B76C1CFD]-worker) [    ] o.a.s.c.ZkTestServer start zk server on port:40263
   [junit4]   2> 979196 INFO  (zkConnectionManagerCallback-5600-thread-1) [    ] o.a.s.c.c.ConnectionManager zkClient has connected
   [junit4]   2> 979198 WARN  (NIOServerCxn.Factory:0.0.0.0/0.0.0.0:0) [    ] o.a.z.s.NIOServerCnxn caught end of stream exception
   [junit4]   2> EndOfStreamException: Unable to read additional data from client sessionid 0x160b71330650000, likely client has closed socket
   [junit4]   2> 	at org.apache.zookeeper.server.NIOServerCnxn.doIO(NIOServerCnxn.java:239)
   [junit4]   2> 	at org.apache.zookeeper.server.NIOServerCnxnFactory.run(NIOServerCnxnFactory.java:203)
   [junit4]   2> 	at java.lang.Thread.run(Thread.java:748)
   [junit4]   2> 979200 INFO  (jetty-launcher-5597-thread-1) [    ] o.e.j.s.Server jetty-9.3.20.v20170531
   [junit4]   2> 979201 INFO  (jetty-launcher-5597-thread-2) [    ] o.e.j.s.Server jetty-9.3.20.v20170531
   [junit4]   2> 979202 INFO  (jetty-launcher-5597-thread-1) [    ] o.e.j.s.h.ContextHandler Started o.e.j.s.ServletContextHandler@669c6103{/solr,null,AVAILABLE}
   [junit4]   2> 979202 INFO  (jetty-launcher-5597-thread-2) [    ] o.e.j.s.h.ContextHandler Started o.e.j.s.ServletContextHandler@6d01640{/solr,null,AVAILABLE}
   [junit4]   2> 979202 INFO  (jetty-launcher-5597-thread-1) [    ] o.e.j.s.AbstractConnector Started ServerConnector@4d37a027{SSL,[ssl, http/1.1]}{127.0.0.1:42081}
   [junit4]   2> 979202 INFO  (jetty-launcher-5597-thread-2) [    ] o.e.j.s.AbstractConnector Started ServerConnector@1c5068b0{SSL,[ssl, http/1.1]}{127.0.0.1:32821}
   [junit4]   2> 979202 INFO  (jetty-launcher-5597-thread-1) [    ] o.e.j.s.Server Started @981101ms
   [junit4]   2> 979202 INFO  (jetty-launcher-5597-thread-2) [    ] o.e.j.s.Server Started @981101ms
   [junit4]   2> 979202 INFO  (jetty-launcher-5597-thread-1) [    ] o.a.s.c.s.e.JettySolrRunner Jetty properties: {hostContext=/solr, hostPort=42081}
   [junit4]   2> 979202 INFO  (jetty-launcher-5597-thread-2) [    ] o.a.s.c.s.e.JettySolrRunner Jetty properties: {hostContext=/solr, hostPort=32821}
   [junit4]   2> 979203 ERROR (jetty-launcher-5597-thread-1) [    ] o.a.s.u.StartupLoggingUtils Missing Java Option solr.log.dir. Logging may be missing or incomplete.
   [junit4]   2> 979203 ERROR (jetty-launcher-5597-thread-2) [    ] o.a.s.u.StartupLoggingUtils Missing Java Option solr.log.dir. Logging may be missing or incomplete.
   [junit4]   2> 979203 INFO  (jetty-launcher-5597-thread-1) [    ] o.a.s.s.SolrDispatchFilter  ___      _       Welcome to Apache Solr™ version 7.3.0
   [junit4]   2> 979203 INFO  (jetty-launcher-5597-thread-2) [    ] o.a.s.s.SolrDispatchFilter  ___      _       Welcome to Apache Solr™ version 7.3.0
   [junit4]   2> 979203 INFO  (jetty-launcher-5597-thread-1) [    ] o.a.s.s.SolrDispatchFilter / __| ___| |_ _   Starting in cloud mode on port null
   [junit4]   2> 979203 INFO  (jetty-launcher-5597-thread-2) [    ] o.a.s.s.SolrDispatchFilter / __| ___| |_ _   Starting in cloud mode on port null
   [junit4]   2> 979203 INFO  (jetty-launcher-5597-thread-1) [    ] o.a.s.s.SolrDispatchFilter \__ \/ _ \ | '_|  Install dir: null
   [junit4]   2> 979203 INFO  (jetty-launcher-5597-thread-2) [    ] o.a.s.s.SolrDispatchFilter \__ \/ _ \ | '_|  Install dir: null
   [junit4]   2> 979203 INFO  (jetty-launcher-5597-thread-1) [    ] o.a.s.s.SolrDispatchFilter |___/\___/_|_|    Start time: 2018-01-02T13:32:56.407Z
   [junit4]   2> 979203 INFO  (jetty-launcher-5597-thread-2) [    ] o.a.s.s.SolrDispatchFilter |___/\___/_|_|    Start time: 2018-01-02T13:32:56.407Z
   [junit4]   2> 979205 INFO  (zkConnectionManagerCallback-5603-thread-1) [    ] o.a.s.c.c.ConnectionManager zkClient has connected
   [junit4]   2> 979205 INFO  (jetty-launcher-5597-thread-1) [    ] o.a.s.s.SolrDispatchFilter solr.xml found in ZooKeeper. Loading...
   [junit4]   2> 979232 INFO  (zkConnectionManagerCallback-5604-thread-1) [    ] o.a.s.c.c.ConnectionManager zkClient has connected
   [junit4]   2> 979238 INFO  (jetty-launcher-5597-thread-2) [    ] o.a.s.s.SolrDispatchFilter solr.xml found in ZooKeeper. Loading...
   [junit4]   2> 979254 INFO  (jetty-launcher-5597-thread-1) [    ] o.a.s.c.ZkContainer Zookeeper client=127.0.0.1:40263/solr
   [junit4]   2> 979263 INFO  (zkConnectionManagerCallback-5608-thread-1) [    ] o.a.s.c.c.ConnectionManager zkClient has connected
   [junit4]   2> 979267 INFO  (jetty-launcher-5597-thread-2) [    ] o.a.s.c.ZkContainer Zookeeper client=127.0.0.1:40263/solr
   [junit4]   2> 979298 INFO  (zkConnectionManagerCallback-5612-thread-1) [    ] o.a.s.c.c.ConnectionManager zkClient has connected
   [junit4]   2> 979301 INFO  (zkConnectionManagerCallback-5614-thread-1-processing-n:127.0.0.1:42081_solr) [n:127.0.0.1:42081_solr    ] o.a.s.c.c.ConnectionManager zkClient has connected
   [junit4]   2> 979313 INFO  (zkConnectionManagerCallback-5616-thread-1-processing-n:127.0.0.1:32821_solr) [n:127.0.0.1:32821_solr    ] o.a.s.c.c.ConnectionManager zkClient has connected
   [junit4]   2> 979319 INFO  (jetty-launcher-5597-thread-2) [n:127.0.0.1:32821_solr    ] o.a.s.c.Overseer Overseer (id=null) closing
   [junit4]   2> 979320 INFO  (jetty-launcher-5597-thread-2) [n:127.0.0.1:32821_solr    ] o.a.s.c.OverseerElectionContext I am going to be the leader 127.0.0.1:32821_solr
   [junit4]   2> 979320 INFO  (jetty-launcher-5597-thread-2) [n:127.0.0.1:32821_solr    ] o.a.s.c.Overseer Overseer (id=99280484846338054-127.0.0.1:32821_solr-n_0000000000) starting
   [junit4]   2> 979335 INFO  (jetty-launcher-5597-thread-1) [n:127.0.0.1:42081_solr    ] o.a.s.c.Overseer Overseer (id=null) closing
   [junit4]   2> 979335 INFO  (jetty-launcher-5597-thread-1) [n:127.0.0.1:42081_solr    ] o.a.s.c.ZkController Register node as live in ZooKeeper:/live_nodes/127.0.0.1:42081_solr
   [junit4]   2> 979343 INFO  (zkCallback-5613-thread-1-processing-n:127.0.0.1:42081_solr) [n:127.0.0.1:42081_solr    ] o.a.s.c.c.ZkStateReader Updated live nodes from ZooKeeper... (0) -> (1)
   [junit4]   2> 979344 INFO  (OverseerStateUpdate-99280484846338054-127.0.0.1:32821_solr-n_0000000000) [n:127.0.0.1:32821_solr    ] o.a.s.c.c.ZkStateReader Updated live nodes from ZooKeeper... (0) -> (1)
   [junit4]   2> 979344 INFO  (jetty-launcher-5597-thread-2) [n:127.0.0.1:32821_solr    ] o.a.s.c.ZkController Register node as live in ZooKeeper:/live_nodes/127.0.0.1:32821_solr
   [junit4]   2> 979345 INFO  (zkCallback-5613-thread-1-processing-n:127.0.0.1:42081_solr) [n:127.0.0.1:42081_solr    ] o.a.s.c.c.ZkStateReader Updated live nodes from ZooKeeper... (1) -> (2)
   [junit4]   2> 979345 INFO  (zkCallback-5615-thread-1-processing-n:127.0.0.1:32821_solr) [n:127.0.0.1:32821_solr    ] o.a.s.c.c.ZkStateReader Updated live nodes from ZooKeeper... (1) -> (2)
   [junit4]   2> 979381 INFO  (jetty-launcher-5597-thread-1) [n:127.0.0.1:42081_solr    ] o.a.s.m.r.SolrJmxReporter JMX monitoring for 'solr_42081.solr.node' (registry 'solr.node') enabled at server: com.sun.jmx.mbeanserver.JmxMBeanServer@100c4f86
   [junit4]   2> 979386 INFO  (jetty-launcher-5597-thread-1) [n:127.0.0.1:42081_solr    ] o.a.s.m.r.SolrJmxReporter JMX monitoring for 'solr_42081.solr.jvm' (registry 'solr.jvm') enabled at server: com.sun.jmx.mbeanserver.JmxMBeanServer@100c4f86
   [junit4]   2> 979386 INFO  (jetty-launcher-5597-thread-1) [n:127.0.0.1:42081_solr    ] o.a.s.m.r.SolrJmxReporter JMX monitoring for 'solr_42081.solr.jetty' (registry 'solr.jetty') enabled at server: com.sun.jmx.mbeanserver.JmxMBeanServer@100c4f86
   [junit4]   2> 979387 INFO  (jetty-launcher-5597-thread-1) [n:127.0.0.1:42081_solr    ] o.a.s.c.CorePropertiesLocator Found 0 core definitions underneath /home/jenkins/workspace/Lucene-Solr-7.x-Linux/solr/build/solr-core/test/J2/temp/solr.cloud.AsyncCallRequestStatusResponseTest_DDA44F59B76C1CFD-001/tempDir-001/node1/.
   [junit4]   2> 979460 INFO  (jetty-launcher-5597-thread-2) [n:127.0.0.1:32821_solr    ] o.a.s.m.r.SolrJmxReporter JMX monitoring for 'solr_32821.solr.node' (registry 'solr.node') enabled at server: com.sun.jmx.mbeanserver.JmxMBeanServer@100c4f86
   [junit4]   2> 979467 INFO  (jetty-launcher-5597-thread-2) [n:127.0.0.1:32821_solr    ] o.a.s.m.r.SolrJmxReporter JMX monitoring for 'solr_32821.solr.jvm' (registry 'solr.jvm') enabled at server: com.sun.jmx.mbeanserver.JmxMBeanServer@100c4f86
   [junit4]   2> 979467 INFO  (jetty-launcher-5597-thread-2) [n:127.0.0.1:32821_solr    ] o.a.s.m.r.SolrJmxReporter JMX monitoring for 'solr_32821.solr.jetty' (registry 'solr.jetty') enabled at server: com.sun.jmx.mbeanserver.JmxMBeanServer@100c4f86
   [junit4]   2> 979468 INFO  (jetty-launcher-5597-thread-2) [n:127.0.0.1:32821_solr    ] o.a.s.c.CorePropertiesLocator Found 0 core definitions underneath /home/jenkins/workspace/Lucene-Solr-7.x-Linux/solr/build/solr-core/test/J2/temp/solr.cloud.AsyncCallRequestStatusResponseTest_DDA44F59B76C1CFD-001/tempDir-001/node2/.
   [junit4]   2> 979483 INFO  (zkConnectionManagerCallback-5622-thread-1) [    ] o.a.s.c.c.ConnectionManager zkClient has connected
   [junit4]   2> 979485 INFO  (zkConnectionManagerCallback-5626-thread-1) [    ] o.a.s.c.c.ConnectionManager zkClient has connected
   [junit4]   2> 979486 INFO  (SUITE-AsyncCallRequestStatusResponseTest-seed#[DDA44F59B76C1CFD]-worker) [    ] o.a.s.c.c.ZkStateReader Updated live nodes from ZooKeeper... (0) -> (2)
   [junit4]   2> 979486 INFO  (SUITE-AsyncCallRequestStatusResponseTest-seed#[DDA44F59B76C1CFD]-worker) [    ] o.a.s.c.s.i.ZkClientClusterStateProvider Cluster at 127.0.0.1:40263/solr ready
   [junit4]   2> 979495 INFO  (TEST-AsyncCallRequestStatusResponseTest.testAsyncCallStatusResponse-seed#[DDA44F59B76C1CFD]) [    ] o.a.s.SolrTestCaseJ4 ###Starting testAsyncCallStatusResponse
   [junit4]   2> 979507 INFO  (qtp1566498685-18816) [n:127.0.0.1:32821_solr    ] o.a.s.h.a.CollectionsHandler Invoked Collection Action :create with params async=caeae54f-a8d3-45f5-916d-881a112a8820&replicationFactor=1&collection.configName=conf&name=asynccall&nrtReplicas=1&action=CREATE&numShards=2&wt=javabin&version=2 and sendToOCPQueue=true
   [junit4]   2> 979508 INFO  (qtp1566498685-18816) [n:127.0.0.1:32821_solr    ] o.a.s.s.HttpSolrCall [admin] webapp=null path=/admin/collections params={async=caeae54f-a8d3-45f5-916d-881a112a8820&replicationFactor=1&collection.configName=conf&name=asynccall&nrtReplicas=1&action=CREATE&numShards=2&wt=javabin&version=2} status=0 QTime=0
   [junit4]   2> 979512 INFO  (OverseerThreadFactory-3459-thread-1-processing-n:127.0.0.1:32821_solr) [n:127.0.0.1:32821_solr    ] o.a.s.c.CreateCollectionCmd Create collection asynccall
   [junit4]   2> 979515 INFO  (zkCallback-5625-thread-1) [    ] o.a.s.c.c.ZkStateReader A cluster state change: [WatchedEvent state:SyncConnected type:NodeCreated path:/collections/asynccall/state.json] for collection [asynccall] has occurred - updating... (live nodes size: [2])
   [junit4]   2> 979616 INFO  (OverseerStateUpdate-99280484846338054-127.0.0.1:32821_solr-n_0000000000) [n:127.0.0.1:32821_solr    ] o.a.s.c.o.SliceMutator createReplica() {
   [junit4]   2>   "operation":"ADDREPLICA",
   [junit4]   2>   "collection":"asynccall",
   [junit4]   2>   "shard":"shard1",
   [junit4]   2>   "core":"asynccall_shard1_replica_n1",
   [junit4]   2>   "state":"down",
   [junit4]   2>   "base_url":"https://127.0.0.1:32821/solr",
   [junit4]   2>   "type":"NRT",
   [junit4]   2>   "waitForFinalState":"false"} 
   [junit4]   2> 979617 INFO  (OverseerStateUpdate-99280484846338054-127.0.0.1:32821_solr-n_0000000000) [n:127.0.0.1:32821_solr    ] o.a.s.c.o.SliceMutator createReplica() {
   [junit4]   2>   "operation":"ADDREPLICA",
   [junit4]   2>   "collection":"asynccall",
   [junit4]   2>   "shard":"shard2",
   [junit4]   2>   "core":"asynccall_shard2_replica_n2",
   [junit4]   2>   "state":"down",
   [junit4]   2>   "base_url":"https://127.0.0.1:42081/solr",
   [junit4]   2>   "type":"NRT",
   [junit4]   2>   "waitForFinalState":"false"} 
   [junit4]   2> 979717 INFO  (zkCallback-5625-thread-1) [    ] o.a.s.c.c.ZkStateReader A cluster state change: [WatchedEvent state:SyncConnected type:NodeDataChanged path:/collections/asynccall/state.json] for collection [asynccall] has occurred - updating... (live nodes size: [2])
   [junit4]   2> 979822 INFO  (qtp1566498685-18815) [n:127.0.0.1:32821_solr    ] o.a.s.s.HttpSolrCall [admin] webapp=null path=/admin/cores params={qt=/admin/cores&collection.configName=conf&newCollection=true&collection=asynccall&version=2&replicaType=NRT&async=caeae54f-a8d3-45f5-916d-881a112a88202601118792265481&coreNodeName=core_node3&name=asynccall_shard1_replica_n1&action=CREATE&numShards=2&shard=shard1&wt=javabin} status=0 QTime=0
   [junit4]   2> 979822 INFO  (parallelCoreAdminExecutor-3462-thread-1-processing-n:127.0.0.1:32821_solr caeae54f-a8d3-45f5-916d-881a112a88202601118792265481 CREATE) [n:127.0.0.1:32821_solr    ] o.a.s.h.a.CoreAdminOperation core create command qt=/admin/cores&collection.configName=conf&newCollection=true&collection=asynccall&version=2&replicaType=NRT&async=caeae54f-a8d3-45f5-916d-881a112a88202601118792265481&coreNodeName=core_node3&name=asynccall_shard1_replica_n1&action=CREATE&numShards=2&shard=shard1&wt=javabin
   [junit4]   2> 979822 INFO  (parallelCoreAdminExecutor-3462-thread-1-processing-n:127.0.0.1:32821_solr caeae54f-a8d3-45f5-916d-881a112a88202601118792265481 CREATE) [n:127.0.0.1:32821_solr    ] o.a.s.c.TransientSolrCoreCacheDefault Allocating transient cache for 2147483647 transient cores
   [junit4]   2> 979836 INFO  (qtp2126475454-18808) [n:127.0.0.1:42081_solr    ] o.a.s.s.HttpSolrCall [admin] webapp=null path=/admin/cores params={qt=/admin/cores&collection.configName=conf&newCollection=true&collection=asynccall&version=2&replicaType=NRT&async=caeae54f-a8d3-45f5-916d-881a112a88202601118793163291&coreNodeName=core_node4&name=asynccall_shard2_replica_n2&action=CREATE&numShards=2&shard=shard2&wt=javabin} status=0 QTime=0
   [junit4]   2> 979836 INFO  (parallelCoreAdminExecutor-3460-thread-1-processing-n:127.0.0.1:42081_solr caeae54f-a8d3-45f5-916d-881a112a88202601118793163291 CREATE) [n:127.0.0.1:42081_solr    ] o.a.s.h.a.CoreAdminOperation core create command qt=/admin/cores&collection.configName=conf&newCollection=true&collection=asynccall&version=2&replicaType=NRT&async=caeae54f-a8d3-45f5-916d-881a112a88202601118793163291&coreNodeName=core_node4&name=asynccall_shard2_replica_n2&action=CREATE&numShards=2&shard=shard2&wt=javabin
   [junit4]   2> 979836 INFO  (parallelCoreAdminExecutor-3460-thread-1-processing-n:127.0.0.1:42081_solr caeae54f-a8d3-45f5-916d-881a112a88202601118793163291 CREATE) [n:127.0.0.1:42081_solr    ] o.a.s.c.TransientSolrCoreCacheDefault Allocating transient cache for 2147483647 transient cores
   [junit4]   2> 979837 INFO  (qtp2126475454-18810) [n:127.0.0.1:42081_solr    ] o.a.s.h.a.CoreAdminOperation Checking request status for : caeae54f-a8d3-45f5-916d-881a112a88202601118793163291
   [junit4]   2> 979837 INFO  (qtp2126475454-18810) [n:127.0.0.1:42081_solr    ] o.a.s.s.HttpSolrCall [admin] webapp=null path=/admin/cores params={qt=/admin/cores&requestid=caeae54f-a8d3-45f5-916d-881a112a88202601118793163291&action=REQUESTSTATUS&wt=javabin&version=2} status=0 QTime=0
   [junit4]   2> 979939 INFO  (zkCallback-5625-thread-1) [    ] o.a.s.c.c.ZkStateReader A cluster state change: [WatchedEvent state:SyncConnected type:NodeDataChanged path:/collections/asynccall/state.json] for collection [asynccall] has occurred - updating... (live nodes size: [2])
   [junit4]   2> 979939 INFO  (zkCallback-5615-thread-1-processing-n:127.0.0.1:32821_solr) [n:127.0.0.1:32821_solr    ] o.a.s.c.c.ZkStateReader A cluster state change: [WatchedEvent state:SyncConnected type:NodeDataChanged path:/collections/asynccall/state.json] for collection [asynccall] has occurred - updating... (live nodes size: [2])
   [junit4]   2> 979939 INFO  (zkCallback-5613-thread-1-processing-n:127.0.0.1:42081_solr) [n:127.0.0.1:42081_solr    ] o.a.s.c.c.ZkStateReader A cluster state change: [WatchedEvent state:SyncConnected type:NodeDataChanged path:/collections/asynccall/state.json] for collection [asynccall] has occurred - updating... (live nodes size: [2])
   [junit4]   2> 979939 INFO  (zkCallback-5613-thread-2-processing-n:127.0.0.1:42081_solr) [n:127.0.0.1:42081_solr    ] o.a.s.c.c.ZkStateReader A cluster state change: [WatchedEvent state:SyncConnected type:NodeDataChanged path:/collections/asynccall/state.json] for collection [asynccall] has occurred - updating... (live nodes size: [2])
   [junit4]   2> 979939 INFO  (zkCallback-5615-thread-2-processing-n:127.0.0.1:32821_solr) [n:127.0.0.1:32821_solr    ] o.a.s.c.c.ZkStateReader A cluster state change: [WatchedEvent state:SyncConnected type:NodeDataChanged path:/collections/asynccall/state.json] for collection [asynccall] has occurred - updating... (live nodes size: [2])
   [junit4]   2> 980835 INFO  (parallelCoreAdminExecutor-3462-thread-1-processing-n:127.0.0.1:32821_solr caeae54f-a8d3-45f5-916d-881a112a88202601118792265481 CREATE) [n:127.0.0.1:32821_solr c:asynccall s:shard1 r:core_node3 x:asynccall_shard1_replica_n1] o.a.s.c.SolrConfig Using Lucene MatchVersion: 7.3.0
   [junit4]   2> 980837 INFO  (qtp2126475454-18812) [n:127.0.0.1:42081_solr    ] o.a.s.h.a.CoreAdminOperation Checking request status for : caeae54f-a8d3-45f5-916d-881a112a88202601118793163291
   [junit4]   2> 980838 INFO  (qtp2126475454-18812) [n:127.0.0.1:42081_solr    ] o.a.s.s.HttpSolrCall [admin] webapp=null path=/admin/cores params={qt=/admin/cores&requestid=caeae54f-a8d3-45f5-916d-881a112a88202601118793163291&action=REQUESTSTATUS&wt=javabin&version=2} status=0 QTime=0
   [junit4]   2> 980841 INFO  (parallelCoreAdminExecutor-3462-thread-1-processing-n:127.0.0.1:32821_solr caeae54f-a8d3-45f5-916d-881a112a88202601118792265481 CREATE) [n:127.0.0.1:32821_solr c:asynccall s:shard1 r:core_node3 x:asynccall_shard1_replica_n1] o.a.s.s.IndexSchema [asynccall_shard1_replica_n1] Schema name=minimal
   [junit4]   2> 980843 INFO  (parallelCoreAdminExecutor-3462-thread-1-processing-n:127.0.0.1:32821_solr caeae54f-a8d3-45f5-916d-881a112a88202601118792265481 CREATE) [n:127.0.0.1:32821_solr c:asynccall s:shard1 r:core_node3 x:asynccall_shard1_replica_n1] o.a.s.s.IndexSchema Loaded schema minimal/1.1 with uniqueid field id
   [junit4]   2> 980843 INFO  (parallelCoreAdminExecutor-3462-thread-1-processing-n:127.0.0.1:32821_solr caeae54f-a8d3-45f5-916d-881a112a88202601118792265481 CREATE) [n:127.0.0.1:32821_solr c:asynccall s:shard1 r:core_node3 x:asynccall_shard1_replica_n1] o.a.s.c.CoreContainer Creating SolrCore 'asynccall_shard1_replica_n1' using configuration from collection asynccall, trusted=true
   [junit4]   2> 980844 INFO  (parallelCoreAdminExecutor-3462-thread-1-processing-n:127.0.0.1:32821_solr caeae54f-a8d3-45f5-916d-881a112a88202601118792265481 CREATE) [n:127.0.0.1:32821_solr c:asynccall s:shard1 r:core_node3 x:asynccall_shard1_replica_n1] o.a.s.m.r.SolrJmxReporter JMX monitoring for 'solr_32821.solr.core.asynccall.shard1.replica_n1' (registry 'solr.core.asynccall.shard1.replica_n1') enabled at server: com.sun.jmx.mbeanserver.JmxMBeanServer@100c4f86
   [junit4]   2> 980844 INFO  (parallelCoreAdminExecutor-3462-thread-1-processing-n:127.0.0.1:32821_solr caeae54f-a8d3-45f5-916d-881a112a88202601118792265481 CREATE) [n:127.0.0.1:32821_solr c:asynccall s:shard1 r:core_node3 x:asynccall_shard1_replica_n1] o.a.s.c.SolrCore solr.RecoveryStrategy.Builder
   [junit4]   2> 980844 INFO  (parallelCoreAdminExecutor-3462-thread-1-processing-n:127.0.0.1:32821_solr caeae54f-a8d3-45f5-916d-881a112a88202601118792265481 CREATE) [n:127.0.0.1:32821_solr c:asynccall s:shard1 r:core_node3 x:asynccall_shard1_replica_n1] o.a.s.c.SolrCore [[asynccall_shard1_replica_n1] ] Opening new SolrCore at [/home/jenkins/workspace/Lucene-Solr-7.x-Linux/solr/build/solr-core/test/J2/temp/solr.cloud.AsyncCallRequestStatusResponseTest_DDA44F59B76C1CFD-001/tempDir-001/node2/asynccall_shard1_replica_n1], dataDir=[/home/jenkins/workspace/Lucene-Solr-7.x-Linux/solr/build/solr-core/test/J2/temp/solr.cloud.AsyncCallRequestStatusResponseTest_DDA44F59B76C1CFD-001/tempDir-001/node2/./asynccall_shard1_replica_n1/data/]
   [junit4]   2> 980850 INFO  (parallelCoreAdminExecutor-3460-thread-1-processing-n:127.0.0.1:42081_solr caeae54f-a8d3-45f5-916d-881a112a88202601118793163291 CREATE) [n:127.0.0.1:42081_solr c:asynccall s:shard2 r:core_node4 x:asynccall_shard2_replica_n2] o.a.s.c.SolrConfig Using Lucene MatchVersion: 7.3.0
   [junit4]   2> 980866 INFO  (parallelCoreAdminExecutor-3460-thread-1-processing-n:127.0.0.1:42081_solr caeae54f-a8d3-45f5-916d-881a112a88202601118793163291 CREATE) [n:127.0.0.1:42081_solr c:asynccall s:shard2 r:core_node4 x:asynccall_shard2_replica_n2] o.a.s.s.IndexSchema [asynccall_shard2_replica_n2] Schema name=minimal
   [junit4]   2> 980868 INFO  (parallelCoreAdminExecutor-3460-thread-1-processing-n:127.0.0.1:42081_solr caeae54f-a8d3-45f5-916d-881a112a88202601118793163291 CREATE) [n:127.0.0.1:42081_solr c:asynccall s:shard2 r:core_node4 x:asynccall_shard2_replica_n2] o.a.s.s.IndexSchema Loaded schema minimal/1.1 with uniqueid field id
   [junit4]   2> 980868 INFO  (parallelCoreAdminExecutor-3460-thread-1-processing-n:127.0.0.1:42081_solr caeae54f-a8d3-45f5-916d-881a112a88202601118793163291 CREATE) [n:127.0.0.1:42081_solr c:asynccall s:shard2 r:core_node4 x:asynccall_shard2_replica_n2] o.a.s.c.CoreContainer Creating SolrCore 'asynccall_shard2_replica_n2' using configuration from collection asynccall, trusted=true
   [junit4]   2> 980869 INFO  (parallelCoreAdminExecutor-3460-thread-1-processing-n:127.0.0.1:42081_solr caeae54f-a8d3-45f5-916d-881a112a88202601118793163291 CREATE) [n:127.0.0.1:42081_solr c:asynccall s:shard2 r:core_node4 x:asynccall_shard2_replica_n2] o.a.s.m.r.SolrJmxReporter JMX monitoring for 'solr_42081.solr.core.asynccall.shard2.replica_n2' (registry 'solr.core.asynccall.shard2.replica_n2') enabled at server: com.sun.jmx.mbeanserver.JmxMBeanServer@100c4f86
   [junit4]   2> 980869 INFO  (parallelCoreAdminExecutor-3460-thread-1-processing-n:127.0.0.1:42081_solr caeae54f-a8d3-45f5-916d-881a112a88202601118793163291 CREATE) [n:127.0.0.1:42081_solr c:asynccall s:shard2 r:core_node4 x:asynccall_shard2_replica_n2] o.a.s.c.SolrCore solr.RecoveryStrategy.Builder
   [junit4]   2> 980869 INFO  (parallelCoreAdminExecutor-3460-thread-1-processing-n:127.0.0.1:42081_solr caeae54f-a8d3-45f5-916d-881a112a88202601118793163291 CREATE) [n:127.0.0.1:42081_solr c:asynccall s:shard2 r:core_node4 x:asynccall_shard2_replica_n2] o.a.s.c.SolrCore [[asynccall_shard2_replica_n2] ] Opening new SolrCore at [/home/jenkins/workspace/Lucene-Solr-7.x-Linux/solr/build/solr-core/test/J2/temp/solr.cloud.AsyncCallRequestStatusResponseTest_DDA44F59B76C1CFD-001/tempDir-001/node1/asynccall_shard2_replica_n2], dataDir=[/home/jenkins/workspace/Lucene-Solr-7.x-Linux/solr/build/solr-core/test/J2/temp/solr.cloud.AsyncCallRequestStatusResponseTest_DDA44F59B76C1CFD-001/tempDir-001/node1/./asynccall_shard2_replica_n2/data/]
   [junit4]   2> 980889 INFO  (parallelCoreAdminExecutor-3462-thread-1-processing-n:127.0.0.1:32821_solr caeae54f-a8d3-45f5-916d-881a112a88202601118792265481 CREATE) [n:127.0.0.1:32821_solr c:asynccall s:shard1 r:core_node3 x:asynccall_shard1_replica_n1] o.a.s.u.UpdateHandler Using UpdateLog implementation: org.apache.solr.update.UpdateLog
   [junit4]   2> 980889 INFO  (parallelCoreAdminExecutor-3462-thread-1-processing-n:127.0.0.1:32821_solr caeae54f-a8d3-45f5-916d-881a112a88202601118792265481 CREATE) [n:127.0.0.1:32821_solr c:asynccall s:shard1 r:core_node3 x:asynccall_shard1_replica_n1] o.a.s.u.UpdateLog Initializing UpdateLog: dataDir=null defaultSyncLevel=FLUSH numRecordsToKeep=100 maxNumLogsToKeep=10 numVersionBuckets=65536
   [junit4]   2> 980890 INFO  (parallelCoreAdminExecutor-3462-thread-1-processing-n:127.0.0.1:32821_solr caeae54f-a8d3-45f5-916d-881a112a88202601118792265481 CREATE) [n:127.0.0.1:32821_solr c:asynccall s:shard1 r:core_node3 x:asynccall_shard1_replica_n1] o.a.s.u.CommitTracker Hard AutoCommit: disabled
   [junit4]   2> 980890 INFO  (parallelCoreAdminExecutor-3462-thread-1-processing-n:127.0.0.1:32821_solr caeae54f-a8d3-45f5-916d-881a112a88202601118792265481 CREATE) [n:127.0.0.1:32821_solr c:asynccall s:shard1 r:core_node3 x:asynccall_shard1_replica_n1] o.a.s.u.CommitTracker Soft AutoCommit: disabled
   [junit4]   2> 980891 INFO  (parallelCoreAdminExecutor-3462-thread-1-processing-n:127.0.0.1:32821_solr caeae54f-a8d3-45f5-916d-881a112a88202601118792265481 CREATE) [n:127.0.0.1:32821_solr c:asynccall s:shard1 r:core_node3 x:asynccall_shard1_replica_n1] o.a.s.s.SolrIndexSearcher Opening [Searcher@40bc66fe[asynccall_shard1_replica_n1] main]
   [junit4]   2> 980892 INFO  (parallelCoreAdminExecutor-3462-thread-1-processing-n:127.0.0.1:32821_solr caeae54f-a8d3-45f5-916d-881a112a88202601118792265481 CREATE) [n:127.0.0.1:32821_solr c:asynccall s:shard1 r:core_node3 x:asynccall_shard1_replica_n1] o.a.s.r.ManagedResourceStorage Configured ZooKeeperStorageIO with znodeBase: /configs/conf
   [junit4]   2> 980892 INFO  (parallelCoreAdminExecutor-3462-thread-1-processing-n:127.0.0.1:32821_solr caeae54f-a8d3-45f5-916d-881a112a88202601118792265481 CREATE) [n:127.0.0.1:32821_solr c:asynccall s:shard1 r:core_node3 x:asynccall_shard1_replica_n1] o.a.s.r.ManagedResourceStorage Loaded null at path _rest_managed.json using ZooKeeperStorageIO:path=/configs/conf
   [junit4]   2> 980893 INFO  (parallelCoreAdminExecutor-3462-thread-1-processing-n:127.0.0.1:32821_solr caeae54f-a8d3-45f5-916d-881a112a88202601118792265481 CREATE) [n:127.0.0.1:32821_solr c:asynccall s:shard1 r:core_node3 x:asynccall_shard1_replica_n1] o.a.s.h.ReplicationHandler Commits will be reserved for 10000ms.
   [junit4]   2> 980893 INFO  (parallelCoreAdminExecutor-3462-thread-1-processing-n:127.0.0.1:32821_solr caeae54f-a8d3-45f5-916d-881a112a88202601118792265481 CREATE) [n:127.0.0.1:32821_solr c:asynccall s:shard1 r:core_node3 x:asynccall_shard1_replica_n1] o.a.s.u.UpdateLog Could not find max version in index or recent updates, using new clock 1588487759433039872
   [junit4]   2> 980894 INFO  (parallelCoreAdminExecutor-3460-thread-1-processing-n:127.0.0.1:42081_solr caeae54f-a8d3-45f5-916d-881a112a88202601118793163291 CREATE) [n:127.0.0.1:42081_solr c:asynccall s:shard2 r:core_node4 x:asynccall_shard2_replica_n2] o.a.s.u.UpdateHandler Using UpdateLog implementation: org.apache.solr.update.UpdateLog
   [junit4]   2> 980894 INFO  (parallelCoreAdminExecutor-3460-thread-1-processing-n:127.0.0.1:42081_solr caeae54f-a8d3-45f5-916d-881a112a88202601118793163291 CREATE) [n:127.0.0.1:42081_solr c:asynccall s:shard2 r:core_node4 x:asynccall_shard2_replica_n2] o.a.s.u.UpdateLog Initializing UpdateLog: dataDir=null defaultSyncLevel=FLUSH numRecordsToKeep=100 maxNumLogsToKeep=10 numVersionBuckets=65536
   [junit4]   2> 980895 INFO  (searcherExecutor-3464-thread-1-processing-x:asynccall_shard1_replica_n1 r:core_node3 caeae54f-a8d3-45f5-916d-881a112a88202601118792265481 CREATE n:127.0.0.1:32821_solr s:shard1 c:asynccall) [n:127.0.0.1:32821_solr c:asynccall s:shard1 r:core_node3 x:asynccall_shard1_replica_n1] o.a.s.c.SolrCore [asynccall_shard1_replica_n1] Registered new searcher Searcher@40bc66fe[asynccall_shard1_replica_n1] main{ExitableDirectoryReader(UninvertingDirectoryReader())}
   [junit4]   2> 980895 INFO  (parallelCoreAdminExecutor-3460-thread-1-processing-n:127.0.0.1:42081_solr caeae54f-a8d3-45f5-916d-881a112a88202601118793163291 CREATE) [n:127.0.0.1:42081_solr c:asynccall s:shard2 r:core_node4 x:asynccall_shard2_replica_n2] o.a.s.u.CommitTracker Hard AutoCommit: disabled
   [junit4]   2> 980895 INFO  (parallelCoreAdminExecutor-3460-thread-1-processing-n:127.0.0.1:42081_solr caeae54f-a8d3-45f5-916d-881a112a88202601118793163291 CREATE) [n:127.0.0.1:42081_solr c:asynccall s:shard2 r:core_node4 x:asynccall_shard2_replica_n2] o.a.s.u.CommitTracker Soft AutoCommit: disabled
   [junit4]   2> 980895 INFO  (parallelCoreAdminExecutor-3462-thread-1-processing-n:127.0.0.1:32821_solr caeae54f-a8d3-45f5-916d-881a112a88202601118792265481 CREATE) [n:127.0.0.1:32821_solr c:asynccall s:shard1 r:core_node3 x:asynccall_shard1_replica_n1] o.a.s.c.ShardLeaderElectionContext Enough replicas found to continue.
   [junit4]   2> 980895 INFO  (parallelCoreAdminExecutor-3462-thread-1-processing-n:127.0.0.1:32821_solr caeae54f-a8d3-45f5-916d-881a112a88202601118792265481 CREATE) [n:127.0.0.1:32821_solr c:asynccall s:shard1 r:core_node3 x:asynccall_shard1_replica_n1] o.a.s.c.ShardLeaderElectionContext I may be the new leader - try and sync
   [junit4]   2> 980895 INFO  (parallelCoreAdminExecutor-3462-thread-1-processing-n:127.0.0.1:32821_solr caeae54f-a8d3-45f5-916d-881a112a88202601118792265481 CREATE) [n:127.0.0.1:32821_solr c:asynccall s:shard1 r:core_node3 x:asynccall_shard1_replica_n1] o.a.s.c.SyncStrategy Sync replicas to https://127.0.0.1:32821/solr/asynccall_shard1_replica_n1/
   [junit4]   2> 980895 INFO  (parallelCoreAdminExecutor-3462-thread-1-processing-n:127.0.0.1:32821_solr caeae54f-a8d3-45f5-916d-881a112a88202601118792265481 CREATE) [n:127.0.0.1:32821_solr c:asynccall s:shard1 r:core_node3 x:asynccall_shard1_replica_n1] o.a.s.c.SyncStrategy Sync Success - now sync replicas to me
   [junit4]   2> 980895 INFO  (parallelCoreAdminExecutor-3462-thread-1-processing-n:127.0.0.1:32821_solr caeae54f-a8d3-45f5-916d-881a112a88202601118792265481 CREATE) [n:127.0.0.1:32821_solr c:asynccall s:shard1 r:core_node3 x:asynccall_shard1_replica_n1] o.a.s.c.SyncStrategy https://127.0.0.1:32821/solr/asynccall_shard1_replica_n1/ has no replicas
   [junit4]   2> 980895 INFO  (parallelCoreAdminExecutor-3462-thread-1-processing-n:127.0.0.1:32821_solr caeae54f-a8d3-45f5-916d-881a112a88202601118792265481 CREATE) [n:127.0.0.1:32821_solr c:asynccall s:shard1 r:core_node3 x:asynccall_shard1_replica_n1] o.a.s.c.ShardLeaderElectionContext Found all replicas participating in election, clear LIR
   [junit4]   2> 980896 INFO  (parallelCoreAdminExecutor-3460-thread-1-processing-n:127.0.0.1:42081_solr caeae54f-a8d3-45f5-916d-881a112a88202601118793163291 CREATE) [n:127.0.0.1:42081_solr c:asynccall s:shard2 r:core_node4 x:asynccall_shard2_replica_n2] o.a.s.s.SolrIndexSearcher Opening [Searcher@5c2a7a37[asynccall_shard2_replica_n2] main]
   [junit4]   2> 980897 INFO  (parallelCoreAdminExecutor-3462-thread-1-processing-n:127.0.0.1:32821_solr caeae54f-a8d3-45f5-916d-881a112a88202601118792265481 CREATE) [n:127.0.0.1:32821_solr c:asynccall s:shard1 r:core_node3 x:asynccall_shard1_replica_n1] o.a.s.c.ShardLeaderElectionContext I am the new leader: https://127.0.0.1:32821/solr/asynccall_shard1_replica_n1/ shard1
   [junit4]   2> 980897 INFO  (parallelCoreAdminExecutor-3460-thread-1-processing-n:127.0.0.1:42081_solr caeae54f-a8d3-45f5-916d-881a112a88202601118793163291 CREATE) [n:127.0.0.1:42081_solr c:asynccall s:shard2 r:core_node4 x:asynccall_shard2_replica_n2] o.a.s.r.ManagedResourceStorage Configured ZooKeeperStorageIO with znodeBase: /configs/conf
   [junit4]   2> 980897 INFO  (parallelCoreAdminExecutor-3460-thread-1-processing-n:127.0.0.1:42081_solr caeae54f-a8d3-45f5-916d-881a112a88202601118793163291 CREATE) [n:127.0.0.1:42081_solr c:asynccall s:shard2 r:core_node4 x:asynccall_shard2_replica_n2] o.a.s.r.ManagedResourceStorage Loaded null at path _rest_managed.json using ZooKeeperStorageIO:path=/configs/conf
   [junit4]   2> 980897 INFO  (parallelCoreAdminExecutor-3460-thread-1-processing-n:127.0.0.1:42081_solr caeae54f-a8d3-45f5-916d-881a112a88202601118793163291 CREATE) [n:127.0.0.1:42081_solr c:asynccall s:shard2 r:core_node4 x:asynccall_shard2_replica_n2] o.a.s.h.ReplicationHandler Commits will be reserved for 10000ms.
   [junit4]   2> 980898 INFO  (searcherExecutor-3465-thread-1-processing-x:asynccall_shard2_replica_n2 r:core_node4 caeae54f-a8d3-45f5-916d-881a112a88202601118793163291 CREATE n:127.0.0.1:42081_solr s:shard2 c:asynccall) [n:127.0.0.1:42081_solr c:asynccall s:shard2 r:core_node4 x:asynccall_shard2_replica_n2] o.a.s.c.SolrCore [asynccall_shard2_replica_n2] Registered new searcher Searcher@5c2a7a37[asynccall_shard2_replica_n2] main{ExitableDirectoryReader(UninvertingDirectoryReader())}
   [junit4]   2> 980898 INFO  (parallelCoreAdminExecutor-3460-thread-1-processing-n:127.0.0.1:42081_solr caeae54f-a8d3-45f5-916d-881a112a88202601118793163291 CREATE) [n:127.0.0.1:42081_solr c:asynccall s:shard2 r:core_node4 x:asynccall_shard2_replica_n2] o.a.s.u.UpdateLog Could not find max version in index or recent updates, using new clock 1588487759438282752
   [junit4]   2> 980905 INFO  (parallelCoreAdminExecutor-3460-thread-1-processing-n:127.0.0.1:42081_solr caeae54f-a8d3-45f5-916d-881a112a88202601118793163291 CREATE) [n:127.0.0.1:42081_solr c:asynccall s:shard2 r:core_node4 x:asynccall_shard2_replica_n2] o.a.s.c.ShardLeaderElectionContext Enough replicas found to continue.
   [junit4]   2> 980905 INFO  (parallelCoreAdminExecutor-3460-thread-1-processing-n:127.0.0.1:42081_solr caeae54f-a8d3-45f5-916d-881a112a88202601118793163291 CREATE) [n:127.0.0.1:42081_solr c:asynccall s:shard2 r:core_node4 x:asynccall_shard2_replica_n2] o.a.s.c.ShardLeaderElectionContext I may be the new leader - try and sync
   [junit4]   2> 980905 INFO  (parallelCoreAdminExecutor-3460-thread-1-processing-n:127.0.0.1:42081_solr caeae54f-a8d3-45f5-916d-881a112a88202601118793163291 CREATE) [n:127.0.0.1:42081_solr c:asynccall s:shard2 r:core_node4 x:asynccall_shard2_replica_n2] o.a.s.c.SyncStrategy Sync replicas to https://127.0.0.1:42081/solr/asynccall_shard2_replica_n2/
   [junit4]   2> 980905 INFO  (parallelCoreAdminExecutor-3460-thread-1-processing-n:127.0.0.1:42081_solr caeae54f-a8d3-45f5-916d-881a112a88202601118793163291 CREATE) [n:127.0.0.1:42081_solr c:asynccall s:shard2 r:core_node4 x:asynccall_shard2_replica_n2] o.a.s.c.SyncStrategy Sync Success - now sync replicas to me
   [junit4]   2> 980905 INFO  (parallelCoreAdminExecutor-3460-thread-1-processing-n:127.0.0.1:42081_solr caeae54f-a8d3-45f5-916d-881a112a88202601118793163291 CREATE) [n:127.0.0.1:42081_solr c:asynccall s:shard2 r:core_node4 x:asynccall_shard2_replica_n2] o.a.s.c.SyncStrategy https://127.0.0.1:42081/solr/asynccall_shard2_replica_n2/ has no replicas
   [junit4]   2> 980905 INFO  (parallelCoreAdminExecutor-3460-thread-1-processing-n:127.0.0.1:42081_solr caeae54f-a8d3-45f5-916d-881a112a88202601118793163291 CREATE) [n:127.0.0.1:42081_solr c:asynccall s:shard2 r:core_node4 x:asynccall_shard2_replica_n2] o.a.s.c.ShardLeaderElectionContext Found all replicas participating in election, clear LIR
   [junit4]   2> 980906 INFO  (parallelCoreAdminExecutor-3460-thread-1-processing-n:127.0.0.1:42081_solr caeae54f-a8d3-45f5-916d-881a112a88202601118793163291 CREATE) [n:127.0.0.1:42081_solr c:asynccall s:shard2 r:core_node4 x:asynccall_shard2_replica_n2] o.a.s.c.ShardLeaderElectionContext I am the new leader: https://127.0.0.1:42081/solr/asynccall_shard2_replica_n2/ shard2
   [junit4]   2> 981008 INFO  (zkCallback-5625-thread-1) [    ] o.a.s.c.c.ZkStateReader A cluster state change: [WatchedEvent state:SyncConnected type:NodeDataChanged path:/collections/asynccall/state.json] for collection [asynccall] has occurred - updating... (live nodes size: [2])
   [junit4]   2> 981008 INFO  (zkCallback-5613-thread-1-processing-n:127.0.0.1:42081_solr) [n:127.0.0.1:42081_solr    ] o.a.s.c.c.ZkStateReader A cluster state change: [WatchedEvent state:SyncConnected type:NodeDataChanged path:/collections/asynccall/state.json] for collection [asynccall] has occurred - updating... (live nodes size: [2])
   [junit4]   2> 981008 INFO  (zkCallback-5615-thread-1-processing-n:127.0.0.1:32821_solr) [n:127.0.0.1:32821_solr    ] o.a.s.c.c.ZkStateReader A cluster state change: [WatchedEvent state:SyncConnected type:NodeDataChanged path:/collections/asynccall/state.json] for collection [asynccall] has occurred - updating... (live nodes size: [2])
   [junit4]   2> 981008 INFO  (zkCallback-5613-thread-2-processing-n:127.0.0.1:42081_solr) [n:127.0.0.1:42081_solr    ] o.a.s.c.c.ZkStateReader A cluster state change: [WatchedEvent state:SyncConnected type:NodeDataChanged path:/collections/asynccall/state.json] for collection [asynccall] has occurred - updating... (live nodes size: [2])
   [junit4]   2> 981008 INFO  (zkCallback-5615-thread-2-processing-n:127.0.0.1:32821_solr) [n:127.0.0.1:32821_solr    ] o.a.s.c.c.ZkStateReader A cluster state change: [WatchedEvent state:SyncConnected type:NodeDataChanged path:/collections/asynccall/state.json] for collection [asynccall] has occurred - updating... (live nodes size: [2])
   [junit4]   2> 981048 INFO  (parallelCoreAdminExecutor-3462-thread-1-processing-n:127.0.0.1:32821_solr caeae54f-a8d3-45f5-916d-881a112a88202601118792265481 CREATE) [n:127.0.0.1:32821_solr c:asynccall s:shard1 r:core_node3 x:asynccall_shard1_replica_n1] o.a.s.c.ZkController I am the leader, no recovery necessary
   [junit4]   2> 981058 INFO  (parallelCoreAdminExecutor-3460-thread-1-processing-n:127.0.0.1:42081_solr caeae54f-a8d3-45f5-916d-881a112a88202601118793163291 CREATE) [n:127.0.0.1:42081_solr c:asynccall s:shard2 r:core_node4 x:asynccall_shard2_replica_n2] o.a.s.c.ZkController I am the leader, no recovery necessary
   [junit4]   2> 981838 INFO  (qtp2126475454-18801) [n:127.0.0.1:42081_solr    ] o.a.s.h.a.CoreAdminOperation Checking request status for : caeae54f-a8d3-45f5-916d-881a112a88202601118793163291
   [junit4]   2> 981838 INFO  (qtp2126475454-18801) [n:127.0.0.1:42081_solr    ] o.a.s.s.HttpSolrCall [admin] webapp=null path=/admin/cores params={qt=/admin/cores&requestid=caeae54f-a8d3-45f5-916d-881a112a88202601118793163291&action=REQUESTSTATUS&wt=javabin&version=2} status=0 QTime=0
   [junit4]   2> 981839 INFO  (qtp1566498685-18807) [n:127.0.0.1:32821_solr    ] o.a.s.h.a.CoreAdminOperation Checking request status for : caeae54f-a8d3-45f5-916d-881a112a88202601118792265481
   [junit4]   2> 981839 INFO  (qtp1566498685-18807) [n:127.0.0.1:32821_solr    ] o.a.s.s.HttpSolrCall [admin] webapp=null path=/admin/cores params={qt=/admin/cores&requestid=caeae54f-a8d3-45f5-916d-881a112a88202601118792265481&action=REQUESTSTATUS&wt=javabin&version=2} status=0 QTime=0
   [junit4]   2> 981840 INFO  (OverseerThreadFactory-3459-thread-1-processing-n:127.0.0.1:32821_solr) [n:127.0.0.1:32821_solr    ] o.a.s.c.OverseerTaskQueue Response ZK path: /overseer/collection-queue-work/qnr-0000000000 doesn't exist.  Requestor may have disconnected from ZooKeeper
   [junit4]   2> 983513 INFO  (OverseerCollectionConfigSetProcessor-99280484846338054-127.0.0.1:32821_solr-n_0000000000) [n:127.0.0.1:32821_solr    ] o.a.s.c.OverseerTaskQueue Response ZK path: /overseer/collection-queue-work/qnr-0000000000 doesn't exist.  Requestor may have disconnected from ZooKeeper
   [junit4]   2> 1069515 INFO  (TEST-AsyncCallRequestStatusResponseTest.testAsyncCallStatusResponse-seed#[DDA44F59B76C1CFD]) [    ] o.a.s.SolrTestCaseJ4 ###Ending testAsyncCallStatusResponse
   [junit4]   2> NOTE: reproduce with: ant test  -Dtestcase=AsyncCallRequestStatusResponseTest -Dtests.method=testAsyncCallStatusResponse -Dtests.seed=DDA44F59B76C1CFD -Dtests.multiplier=3 -Dtests.slow=true -Dtests.locale=de-AT -Dtests.timezone=ECT -Dtests.asserts=true -Dtests.file.encoding=UTF-8
   [junit4] FAILURE 90.0s J2 | AsyncCallRequestStatusResponseTest.testAsyncCallStatusResponse <<<
   [junit4]    > Throwable #1: java.lang.AssertionError: Expected collection 'asynccall' to have 2 shards and 1 replica
   [junit4]    > null
   [junit4]    > Live Nodes: [127.0.0.1:32821_solr, 127.0.0.1:42081_solr]
   [junit4]    > Last available state: DocCollection(asynccall//collections/asynccall/state.json/3)={
   [junit4]    >   "pullReplicas":"0",
   [junit4]    >   "replicationFactor":"1",
   [junit4]    >   "shards":{
   [junit4]    >     "shard1":{
   [junit4]    >       "range":"80000000-ffffffff",
   [junit4]    >       "state":"active",
   [junit4]    >       "replicas":{"core_node3":{
   [junit4]    >           "core":"asynccall_shard1_replica_n1",
   [junit4]    >           "base_url":"https://127.0.0.1:32821/solr",
   [junit4]    >           "node_name":"127.0.0.1:32821_solr",
   [junit4]    >           "state":"down",
   [junit4]    >           "type":"NRT",
   [junit4]    >           "leader":"true"}}},
   [junit4]    >     "shard2":{
   [junit4]    >       "range":"0-7fffffff",
   [junit4]    >       "state":"active",
   [junit4]    >       "replicas":{"core_node4":{
   [junit4]    >           "core":"asynccall_shard2_replica_n2",
   [junit4]    >           "base_url":"https://127.0.0.1:42081/solr",
   [junit4]    >           "node_name":"127.0.0.1:42081_solr",
   [junit4]    >           "state":"down",
   [junit4]    >           "type":"NRT",
   [junit4]    >           "leader":"true"}}}},
   [junit4]    >   "router":{"name":"compositeId"},
   [junit4]    >   "maxShardsPerNode":"1",
   [junit4]    >   "autoAddReplicas":"false",
   [junit4]    >   "nrtReplicas":"1",
   [junit4]    >   "tlogReplicas":"0"}
   [junit4]    > 	at __randomizedtesting.SeedInfo.seed([DDA44F59B76C1CFD:87A52AB599569124]:0)
   [junit4]    > 	at org.apache.solr.cloud.SolrCloudTestCase.waitForState(SolrCloudTestCase.java:269)
   [junit4]    > 	at org.apache.solr.cloud.AsyncCallRequestStatusResponseTest.testAsyncCallStatusResponse(AsyncCallRequestStatusResponseTest.java:43)
   [junit4]    > 	at java.lang.Thread.run(Thread.java:748)
   [junit4]   2> 1069520 INFO  (jetty-closer-5598-thread-1) [    ] o.e.j.s.AbstractConnector Stopped ServerConnector@4d37a027{SSL,[ssl, http/1.1]}{127.0.0.1:0}
   [junit4]   2> 1069520 INFO  (jetty-closer-5598-thread-1) [    ] o.a.s.c.CoreContainer Shutting down CoreContainer instance=1573226895
   [junit4]   2> 1069520 INFO  (jetty-closer-5598-thread-1) [    ] o.a.s.m.SolrMetricManager Closing metric reporters for registry=solr.node, tag=null
   [junit4]   2> 1069520 INFO  (jetty-closer-5598-thread-1) [    ] o.a.s.m.r.SolrJmxReporter Closing reporter [org.apache.solr.metrics.reporters.SolrJmxReporter@71607478: rootName = solr_42081, domain = solr.node, service url = null, agent id = null] for registry solr.node / com.codahale.metrics.MetricRegistry@19b626f5
   [junit4]   2> 1069520 INFO  (jetty-closer-5598-thread-2) [    ] o.e.j.s.AbstractConnector Stopped ServerConnector@1c5068b0{SSL,[ssl, http/1.1]}{127.0.0.1:0}
   [junit4]   2> 1069521 INFO  (jetty-closer-5598-thread-2) [    ] o.a.s.c.CoreContainer Shutting down CoreContainer instance=1486267429
   [junit4]   2> 1069521 INFO  (jetty-closer-5598-thread-2) [    ] o.a.s.m.SolrMetricManager Closing metric reporters for registry=solr.node, tag=null
   [junit4]   2> 1069521 INFO  (jetty-closer-5598-thread-2) [    ] o.a.s.m.r.SolrJmxReporter Closing reporter [org.apache.solr.metrics.reporters.SolrJmxReporter@7bc65335: rootName = solr_32821, domain = solr.node, service url = null, agent id = null] for registry solr.node / com.codahale.metrics.MetricRegistry@c8965ad
   [junit4]   2> 1069539 INFO  (jetty-closer-5598-thread-1) [    ] o.a.s.m.SolrMetricManager Closing metric reporters for registry=solr.jvm, tag=null
   [junit4]   2> 1069539 INFO  (jetty-closer-5598-thread-1) [    ] o.a.s.m.r.SolrJmxReporter Closing reporter [org.apache.solr.metrics.reporters.SolrJmxReporter@5913c512: rootName = solr_42081, domain = solr.jvm, service url = null, agent id = null] for registry solr.jvm / com.codahale.metrics.MetricRegistry@40c8f6c1
   [junit4]   2> 1069540 INFO  (jetty-closer-5598-thread-2) [    ] o.a.s.m.SolrMetricManager Closing metric reporters for registry=solr.jvm, tag=null
   [junit4]   2> 1069540 INFO  (jetty-closer-5598-thread-2) [    ] o.a.s.m.r.SolrJmxReporter Closing reporter [org.apache.solr.metrics.reporters.SolrJmxReporter@35952279: rootName = solr_32821, domain = solr.jvm, service url = null, agent id = null] for registry solr.jvm / com.codahale.metrics.MetricRegistry@40c8f6c1
   [junit4]   2> 1069545 INFO  (jetty-closer-5598-thread-1) [    ] o.a.s.m.SolrMetricManager Closing metric reporters for registry=solr.jetty, tag=null
   [junit4]   2> 1069545 INFO  (jetty-closer-5598-thread-1) [    ] o.a.s.m.r.SolrJmxReporter Closing reporter [org.apache.solr.metrics.reporters.SolrJmxReporter@1b8dc428: rootName = solr_42081, domain = solr.jetty, service url = null, agent id = null] for registry solr.jetty / com.codahale.metrics.MetricRegistry@3ec6ff5d
   [junit4]   2> 1069546 INFO  (jetty-closer-5598-thread-1) [    ] o.a.s.c.ZkController Remove node as live in ZooKeeper:/live_nodes/127.0.0.1:42081_solr
   [junit4]   2> 1069546 INFO  (jetty-closer-5598-thread-1) [    ] o.a.s.m.SolrMetricManager Closing metric reporters for registry=solr.cluster, tag=null
   [junit4]   2> 1069547 INFO  (jetty-closer-5598-thread-2) [    ] o.a.s.m.SolrMetricManager Closing metric reporters for registry=solr.jetty, tag=null
   [junit4]   2> 1069547 INFO  (jetty-closer-5598-thread-2) [    ] o.a.s.m.r.SolrJmxReporter Closing reporter [org.apache.solr.metrics.reporters.SolrJmxReporter@66a51adb: rootName = solr_32821, domain = solr.jetty, service url = null, agent id = null] for registry solr.jetty / com.codahale.metrics.MetricRegistry@3ec6ff5d
   [junit4]   2> 1069547 INFO  (jetty-closer-5598-thread-2) [    ] o.a.s.c.ZkController Remove node as live in ZooKeeper:/live_nodes/127.0.0.1:32821_solr
   [junit4]   2> 1069547 INFO  (jetty-closer-5598-thread-2) [    ] o.a.s.m.SolrMetricManager Closing metric reporters for registry=solr.cluster, tag=null
   [junit4]   2> 1069553 INFO  (coreCloseExecutor-3474-thread-1) [n:127.0.0.1:32821_solr c:asynccall s:shard1 r:core_node3 x:asynccall_shard1_replica_n1] o.a.s.c.SolrCore [asynccall_shard1_replica_n1]  CLOSING SolrCore org.apache.solr.core.SolrCore@46d6b4a2
   [junit4]   2> 1069554 INFO  (zkCallback-5615-thread-4-processing-n:127.0.0.1:32821_solr) [n:127.0.0.1:32821_solr    ] o.a.s.c.c.ZkStateReader Updated live nodes from ZooKeeper... (2) -> (0)
   [junit4]   2> 1069554 INFO  (coreCloseExecutor-3474-thread-1) [n:127.0.0.1:32821_solr c:asynccall s:shard1 r:core_node3 x:asynccall_shard1_replica_n1] o.a.s.m.SolrMetricManager Closing metric reporters for registry=solr.core.asynccall.shard1.replica_n1, tag=1188476066
   [junit4]   2> 1069554 INFO  (coreCloseExecutor-3474-thread-1) [n:127.0.0.1:32821_solr c:asynccall s:shard1 r:core_node3 x:asynccall_shard1_replica_n1] o.a.s.m.r.SolrJmxReporter Closing reporter [org.apache.solr.metrics.reporters.SolrJmxReporter@3a3a7307: rootName = solr_32821, domain = solr.core.asynccall.shard1.replica_n1, service url = null, agent id = null] for registry solr.core.asynccall.shard1.replica_n1 / com.codahale.metrics.MetricRegistry@2f3fb7b5
   [junit4]   2> 1069554 INFO  (coreCloseExecutor-3475-thread-1) [n:127.0.0.1:42081_solr c:asynccall s:shard2 r:core_node4 x:asynccall_shard2_replica_n2] o.a.s.c.SolrCore [asynccall_shard2_replica_n2]  CLOSING SolrCore org.apache.solr.core.SolrCore@1479b6bd
   [junit4]   2> 1069554 INFO  (coreCloseExecutor-3475-thread-1) [n:127.0.0.1:42081_solr c:asynccall s:shard2 r:core_node4 x:asynccall_shard2_replica_n2] o.a.s.m.SolrMetricManager Closing metric reporters for registry=solr.core.asynccall.shard2.replica_n2, tag=343520957
   [junit4]   2> 1069554 INFO  (coreCloseExecutor-3475-thread-1) [n:127.0.0.1:42081_solr c:asynccall s:shard2 r:core_node4 x:asynccall_shard2_replica_n2] o.a.s.m.r.SolrJmxReporter Closing reporter [org.apache.solr.metrics.reporters.SolrJmxReporter@572f1138: rootName = solr_42081, domain = solr.core.asynccall.shard2.replica_n2, service url = null, agent id = null] for registry solr.core.asynccall.shard2.replica_n2 / com.codahale.metrics.MetricRegistry@3e24ddbd
   [junit4]   2> 1069555 INFO  (zkCallback-5613-thread-3-processing-n:127.0.0.1:42081_solr) [n:127.0.0.1:42081_solr    ] o.a.s.c.c.ZkStateReader Updated live nodes from ZooKeeper... (2) -> (0)
   [junit4]   2> 1069562 INFO  (coreCloseExecutor-3474-thread-1) [n:127.0.0.1:32821_solr c:asynccall s:shard1 r:core_node3 x:asynccall_shard1_replica_n1] o.a.s.m.SolrMetricManager Closing metric reporters for registry=solr.collection.asynccall.shard1.leader, tag=1188476066
   [junit4]   2> 1069563 INFO  (coreCloseExecutor-3475-thread-1) [n:127.0.0.1:42081_solr c:asynccall s:shard2 r:core_node4 x:asynccall_shard2_replica_n2] o.a.s.m.SolrMetricManager Closing metric reporters for registry=solr.collection.asynccall.shard2.leader, tag=343520957
   [junit4]   2> 1069564 INFO  (jetty-closer-5598-thread-2) [    ] o.a.s.c.Overseer Overseer (id=99280484846338054-127.0.0.1:32821_solr-n_0000000000) closing
   [junit4]   2> 1069564 INFO  (OverseerStateUpdate-99280484846338054-127.0.0.1:32821_solr-n_0000000000) [n:127.0.0.1:32821_solr    ] o.a.s.c.Overseer Overseer Loop exiting : 127.0.0.1:32821_solr
   [junit4]   2> 1069564 WARN  (OverseerAutoScalingTriggerThread-99280484846338054-127.0.0.1:32821_solr-n_0000000000) [n:127.0.0.1:32821_solr    ] o.a.s.c.a.OverseerTriggerThread OverseerTriggerThread woken up but we are closed, exiting.
   [junit4]   2> 1069565 INFO  (zkCallback-5613-thread-3-processing-n:127.0.0.1:42081_solr) [n:127.0.0.1:42081_solr    ] o.a.s.c.OverseerElectionContext I am going to be the leader 127.0.0.1:42081_solr
   [junit4]   2> 1069565 INFO  (jetty-closer-5598-thread-2) [    ] o.e.j.s.h.ContextHandler Stopped o.e.j.s.ServletContextHandler@6d01640{/solr,null,UNAVAILABLE}
   [junit4]   2> 1071066 INFO  (jetty-closer-5598-thread-1) [    ] o.e.j.s.h.ContextHandler Stopped o.e.j.s.ServletContextHandler@669c6103{/solr,null,UNAVAILABLE}
   [junit4]   2> 1071067 ERROR (SUITE-AsyncCallRequestStatusResponseTest-seed#[DDA44F59B76C1CFD]-worker) [    ] o.a.z.s.ZooKeeperServer ZKShutdownHandler is not registered, so ZooKeeper server won't take any action on ERROR or SHUTDOWN server state changes
   [junit4]   2> 1071067 INFO  (SUITE-AsyncCallRequestStatusResponseTest-seed#[DDA44F59B76C1CFD]-worker) [    ] o.a.s.c.ZkTestServer connecting to 127.0.0.1:40263 40263
   [junit4]   2> 1071132 INFO  (Thread-5642) [    ] o.a.s.c.ZkTestServer connecting to 127.0.0.1:40263 40263
   [junit4]   2> 1071132 WARN  (Thread-5642) [    ] o.a.s.c.ZkTestServer Watch limit violations: 
   [junit4]   2> Maximum concurrent create/delete watches above limit:
   [junit4]   2> 
   [junit4]   2> 	3	/solr/aliases.json
   [junit4]   2> 	2	/solr/security.json
   [junit4]   2> 	2	/solr/configs/conf
   [junit4]   2> 
   [junit4]   2> Maximum concurrent data watches above limit:
   [junit4]   2> 
   [junit4]   2> 	9	/solr/collections/asynccall/state.json
   [junit4]   2> 	3	/solr/clusterstate.json
   [junit4]   2> 	3	/solr/clusterprops.json
   [junit4]   2> 
   [junit4]   2> Maximum concurrent children watches above limit:
   [junit4]   2> 
   [junit4]   2> 	3	/solr/live_nodes
   [junit4]   2> 	3	/solr/collections
   [junit4]   2> 
   [junit4]   2> NOTE: leaving temporary files on disk at: /home/jenkins/workspace/Lucene-Solr-7.x-Linux/solr/build/solr-core/test/J2/temp/solr.cloud.AsyncCallRequestStatusResponseTest_DDA44F59B76C1CFD-001
   [junit4]   2> Jan 02, 2018 1:34:28 PM com.carrotsearch.randomizedtesting.ThreadLeakControl checkThreadLeaks
   [junit4]   2> WARNING: Will linger awaiting termination of 1 leaked thread(s).
   [junit4]   2> NOTE: test params are: codec=Asserting(Lucene70): {}, docValues:{}, maxPointsInLeafNode=535, maxMBSortInHeap=7.167919805329502, sim=RandomSimilarity(queryNorm=false): {}, locale=de-AT, timezone=ECT
   [junit4]   2> NOTE: Linux 4.10.0-40-generic amd64/Oracle Corporation 1.8.0_144 (64-bit)/cpus=8,threads=1,free=159524784,total=518979584
   [junit4]   2> NOTE: All tests run in this JVM: [CollectionReloadTest, TestZkChroot, IndexSchemaTest, TestEmbeddedSolrServerConstructors, SolrCoreCheckLockOnStartupTest, TestSolrConfigHandlerConcurrent, DocValuesNotIndexedTest, DirectSolrConnectionTest, TestLeaderInitiatedRecoveryThread, TestPullReplica, TestJavabinTupleStreamParser, TestDistribDocBasedVersion, HdfsThreadLeakTest, InfixSuggestersTest, TestReloadDeadlock, TestHdfsUpdateLog, SolrJmxReporterTest, DocExpirationUpdateProcessorFactoryTest, MetricUtilsTest, JvmMetricsTest, HdfsBasicDistributedZkTest, TestSystemIdResolver, TestSchemalessBufferedUpdates, FileBasedSpellCheckerTest, TestMaxScoreQueryParser, BJQParserTest, OverseerTest, TestHdfsCloudBackupRestore, TestPolicyCloud, TestDistributedGrouping, TestNamedUpdateProcessors, TestJsonRequest, DistributedFacetPivotLargeTest, DistributedFacetSimpleRefinementLongTailTest, TestStressLiveNodes, SolrTestCaseJ4Test, TestNoOpRegenerator, PreAnalyzedUpdateProcessorTest, LargeFieldTest, TestQueryTypes, TestCollectionsAPIViaSolrCloudCluster, ZkStateReaderTest, FieldAnalysisRequestHandlerTest, TimeZoneUtilsTest, TestShardHandlerFactory, AnalyticsMergeStrategyTest, ConfigSetsAPITest, SmileWriterTest, RequiredFieldsTest, ScriptEngineTest, SuggesterTest, TestCloudPivotFacet, TestConfigSetsAPIZkFailure, BlockJoinFacetSimpleTest, TestMaxTokenLenTokenizer, ClusterStateTest, TestNumericRangeQuery64, DistanceFunctionTest, TestImpersonationWithHadoopAuth, TestInitParams, SpellCheckCollatorWithCollapseTest, TestRequestForwarding, HdfsWriteToMultipleCollectionsTest, CollectionsAPIAsyncDistributedZkTest, TestHalfAndHalfDocValues, SolrIndexMetricsTest, TestDistributedStatsComponentCardinality, TestClassicSimilarityFactory, TestLRUCache, PluginInfoTest, TestTriggerIntegration, TestRawTransformer, BlockCacheTest, TestPivotHelperCode, BadComponentTest, SSLMigrationTest, AutoAddReplicasIntegrationTest, LoggingHandlerTest, MoveReplicaHDFSTest, TestConfigOverlay, TestTolerantSearch, DeleteNodeTest, TestLegacyTerms, RequestLoggingTest, XsltUpdateRequestHandlerTest, AsyncCallRequestStatusResponseTest]
   [junit4] Completed [324/764 (1!)] on J2 in 92.81s, 1 test, 1 failure <<< FAILURES!

[...truncated 744 lines...]
   [junit4] Suite: org.apache.solr.cloud.TestSolrCloudWithSecureImpersonation
   [junit4]   2> Creating dataDir: /home/jenkins/workspace/Lucene-Solr-7.x-Linux/solr/build/solr-core/test/J2/temp/solr.cloud.TestSolrCloudWithSecureImpersonation_DDA44F59B76C1CFD-001/init-core-data-001
   [junit4]   2> 1958182 WARN  (SUITE-TestSolrCloudWithSecureImpersonation-seed#[DDA44F59B76C1CFD]-worker) [    ] o.a.s.SolrTestCaseJ4 startTrackingSearchers: numOpens=12 numCloses=12
   [junit4]   2> 1958182 INFO  (SUITE-TestSolrCloudWithSecureImpersonation-seed#[DDA44F59B76C1CFD]-worker) [    ] o.a.s.SolrTestCaseJ4 Using PointFields (NUMERIC_POINTS_SYSPROP=true) w/NUMERIC_DOCVALUES_SYSPROP=false
   [junit4]   2> 1958184 INFO  (SUITE-TestSolrCloudWithSecureImpersonation-seed#[DDA44F59B76C1CFD]-worker) [    ] o.a.s.SolrTestCaseJ4 Randomized ssl (false) and clientAuth (true) via: @org.apache.solr.util.RandomizeSSL(reason=, value=NaN, ssl=NaN, clientAuth=NaN)
   [junit4]   2> 1958184 INFO  (SUITE-TestSolrCloudWithSecureImpersonation-seed#[DDA44F59B76C1CFD]-worker) [    ] o.a.s.SolrTestCaseJ4 SecureRandom sanity checks: test.solr.allowed.securerandom=null & java.security.egd=file:/dev/./urandom
   [junit4]   2> 1958204 INFO  (SUITE-TestSolrCloudWithSecureImpersonation-seed#[DDA44F59B76C1CFD]-worker) [    ] o.a.s.c.MiniSolrCloudCluster Starting cluster of 2 servers in /home/jenkins/workspace/Lucene-Solr-7.x-Linux/solr/build/solr-core/test/J2/temp/solr.cloud.TestSolrCloudWithSecureImpersonation_DDA44F59B76C1CFD-001/tempDir-001
   [junit4]   2> 1958204 INFO  (SUITE-TestSolrCloudWithSecureImpersonation-seed#[DDA44F59B76C1CFD]-worker) [    ] o.a.s.c.ZkTestServer STARTING ZK TEST SERVER
   [junit4]   2> 1958204 INFO  (Thread-8131) [    ] o.a.s.c.ZkTestServer client port:0.0.0.0/0.0.0.0:0
   [junit4]   2> 1958204 INFO  (Thread-8131) [    ] o.a.s.c.ZkTestServer Starting server
   [junit4]   2> 1958206 ERROR (Thread-8131) [    ] o.a.z.s.ZooKeeperServer ZKShutdownHandler is not registered, so ZooKeeper server won't take any action on ERROR or SHUTDOWN server state changes
   [junit4]   2> 1958304 INFO  (SUITE-TestSolrCloudWithSecureImpersonation-seed#[DDA44F59B76C1CFD]-worker) [    ] o.a.s.c.ZkTestServer start zk server on port:39059
   [junit4]   2> 1958306 INFO  (zkConnectionManagerCallback-7670-thread-1) [    ] o.a.s.c.c.ConnectionManager zkClient has connected
   [junit4]   2> 1958310 INFO  (jetty-launcher-7667-thread-1) [    ] o.e.j.s.Server jetty-9.3.20.v20170531
   [junit4]   2> 1958310 INFO  (jetty-launcher-7667-thread-2) [    ] o.e.j.s.Server jetty-9.3.20.v20170531
   [junit4]   2> 1958315 INFO  (jetty-launcher-7667-thread-1) [    ] o.e.j.s.h.ContextHandler Started o.e.j.s.ServletContextHandler@73a55c9e{/solr,null,AVAILABLE}
   [junit4]   2> 1958315 INFO  (jetty-launcher-7667-thread-2) [    ] o.e.j.s.h.ContextHandler Started o.e.j.s.ServletContextHandler@36454066{/solr,null,AVAILABLE}
   [junit4]   2> 1958319 INFO  (jetty-launcher-7667-thread-2) [    ] o.e.j.s.AbstractConnector Started ServerConnector@58b5518{HTTP/1.1,[http/1.1]}{127.0.0.1:34687}
   [junit4]   2> 1958319 INFO  (jetty-launcher-7667-thread-1) [    ] o.e.j.s.AbstractConnector Started ServerConnector@7f90fbeb{HTTP/1.1,[http/1.1]}{127.0.0.1:39861}
   [junit4]   2> 1958319 INFO  (jetty-launcher-7667-thread-2) [    ] o.e.j.s.Server Started @1960218ms
   [junit4]   2> 1958319 INFO  (jetty-launcher-7667-thread-1) [    ] o.e.j.s.Server Started @1960218ms
   [junit4]   2> 1958319 INFO  (jetty-launcher-7667-thread-2) [    ] o.a.s.c.s.e.JettySolrRunner Jetty properties: {hostContext=/solr, hostPort=34687}
   [junit4]   2> 1958319 INFO  (jetty-launcher-7667-thread-1) [    ] o.a.s.c.s.e.JettySolrRunner Jetty properties: {hostContext=/solr, hostPort=39861}
   [junit4]   2> 1958320 ERROR (jetty-launcher-7667-thread-2) [    ] o.a.s.u.StartupLoggingUtils Missing Java Option solr.log.dir. Logging may be missing or incomplete.
   [junit4]   2> 1958320 ERROR (jetty-launcher-7667-thread-1) [    ] o.a.s.u.StartupLoggingUtils Missing Java Option solr.log.dir. Logging may be missing or incomplete.
   [junit4]   2> 1958320 INFO  (jetty-launcher-7667-thread-2) [    ] o.a.s.s.SolrDispatchFilter  ___      _       Welcome to Apache Solr™ version 7.3.0
   [junit4]   2> 1958320 INFO  (jetty-launcher-7667-thread-1) [    ] o.a.s.s.SolrDispatchFilter  ___      _       Welcome to Apache Solr™ version 7.3.0
   [junit4]   2> 1958320 INFO  (jetty-launcher-7667-thread-2) [    ] o.a.s.s.SolrDispatchFilter / __| ___| |_ _   Starting in cloud mode on port null
   [junit4]   2> 1958320 INFO  (jetty-launcher-7667-thread-1) [    ] o.a.s.s.SolrDispatchFilter / __| ___| |_ _   Starting in cloud mode on port null
   [junit4]   2> 1958320 INFO  (jetty-launcher-7667-thread-2) [    ] o.a.s.s.SolrDispatchFilter \__ \/ _ \ | '_|  Install dir: null
   [junit4]   2> 1958320 INFO  (jetty-launcher-7667-thread-1) [    ] o.a.s.s.SolrDispatchFilter \__ \/ _ \ | '_|  Install dir: null
   [junit4]   2> 1958320 INFO  (jetty-launcher-7667-thread-2) [    ] o.a.s.s.SolrDispatchFilter |___/\___/_|_|    Start time: 2018-01-02T13:49:15.524Z
   [junit4]   2> 1958320 INFO  (jetty-launcher-7667-thread-1) [    ] o.a.s.s.SolrDispatchFilter |___/\___/_|_|    Start time: 2018-01-02T13:49:15.524Z
   [junit4]   2> 1958322 INFO  (zkConnectionManagerCallback-7673-thread-1) [    ] o.a.s.c.c.ConnectionManager zkClient has connected
   [junit4]   2> 1958322 INFO  (zkConnectionManagerCallback-7674-thread-1) [    ] o.a.s.c.c.ConnectionManager zkClient has connected
   [junit4]   2> 1958323 INFO  (jetty-launcher-7667-thread-1) [    ] o.a.s.s.SolrDispatchFilter solr.xml found in ZooKeeper. Loading...
   [junit4]   2> 1958323 INFO  (jetty-launcher-7667-thread-2) [    ] o.a.s.s.SolrDispatchFilter solr.xml found in ZooKeeper. Loading...
   [junit4]   2> 1958334 INFO  (jetty-launcher-7667-thread-1) [    ] o.a.s.c.ZkContainer Zookeeper client=127.0.0.1:39059/solr
   [junit4]   2> 1958334 INFO  (jetty-launcher-7667-thread-2) [    ] o.a.s.c.ZkContainer Zookeeper client=127.0.0.1:39059/solr
   [junit4]   2> 1958336 INFO  (zkConnectionManagerCallback-7680-thread-1) [    ] o.a.s.c.c.ConnectionManager zkClient has connected
   [junit4]   2> 1958336 INFO  (zkConnectionManagerCallback-7682-thread-1) [    ] o.a.s.c.c.ConnectionManager zkClient has connected
   [junit4]   2> 1958336 WARN  (NIOServerCxn.Factory:0.0.0.0/0.0.0.0:0) [    ] o.a.z.s.NIOServerCnxn caught end of stream exception
   [junit4]   2> EndOfStreamException: Unable to read additional data from client sessionid 0x160b72221110004, likely client has closed socket
   [junit4]   2> 	at org.apache.zookeeper.server.NIOServerCnxn.doIO(NIOServerCnxn.java:239)
   [junit4]   2> 	at org.apache.zookeeper.server.NIOServerCnxnFactory.run(NIOServerCnxnFactory.java:203)
   [junit4]   2> 	at java.lang.Thread.run(Thread.java:748)
   [junit4]   2> 1958337 INFO  (zkConnectionManagerCallback-7684-thread-1-processing-n:127.0.0.1:39861_solr) [n:127.0.0.1:39861_solr    ] o.a.s.c.c.ConnectionManager zkClient has connected
   [junit4]   2> 1958338 INFO  (zkConnectionManagerCallback-7686-thread-1-processing-n:127.0.0.1:34687_solr) [n:127.0.0.1:34687_solr    ] o.a.s.c.c.ConnectionManager zkClient has connected
   [junit4]   2> 1958384 INFO  (jetty-launcher-7667-thread-2) [n:127.0.0.1:34687_solr    ] o.a.s.c.Overseer Overseer (id=null) closing
   [junit4]   2> 1958385 INFO  (jetty-launcher-7667-thread-1) [n:127.0.0.1:39861_solr    ] o.a.s.c.Overseer Overseer (id=null) closing
   [junit4]   2> 1958385 INFO  (jetty-launcher-7667-thread-2) [n:127.0.0.1:34687_solr    ] o.a.s.c.OverseerElectionContext I am going to be the leader 127.0.0.1:34687_solr
   [junit4]   2> 1958385 INFO  (jetty-launcher-7667-thread-1) [n:127.0.0.1:39861_solr    ] o.a.s.c.ZkController Register node as live in ZooKeeper:/live_nodes/127.0.0.1:39861_solr
   [junit4]   2> 1958385 INFO  (jetty-launcher-7667-thread-2) [n:127.0.0.1:34687_solr    ] o.a.s.c.Overseer Overseer (id=99280549013684230-127.0.0.1:34687_solr-n_0000000000) starting
   [junit4]   2> 1958388 INFO  (zkCallback-7683-thread-1-processing-n:127.0.0.1:39861_solr) [n:127.0.0.1:39861_solr    ] o.a.s.c.c.ZkStateReader Updated live nodes from ZooKeeper... (0) -> (1)
   [junit4]   2> 1958388 INFO  (zkCallback-7685-thread-1-processing-n:127.0.0.1:34687_solr) [n:127.0.0.1:34687_solr    ] o.a.s.c.c.ZkStateReader Updated live nodes from ZooKeeper... (0) -> (1)
   [junit4]   2> 1958390 INFO  (jetty-launcher-7667-thread-2) [n:127.0.0.1:34687_solr    ] o.a.s.c.ZkController Register node as live in ZooKeeper:/live_nodes/127.0.0.1:34687_solr
   [junit4]   2> 1958390 INFO  (zkCallback-7683-thread-1-processing-n:127.0.0.1:39861_solr) [n:127.0.0.1:39861_solr    ] o.a.s.c.c.ZkStateReader Updated live nodes from ZooKeeper... (1) -> (2)
   [junit4]   2> 1958391 INFO  (zkCallback-7685-thread-1-processing-n:127.0.0.1:34687_solr) [n:127.0.0.1:34687_solr    ] o.a.s.c.c.ZkStateReader Updated live nodes from ZooKeeper... (1) -> (2)
   [junit4]   2> 1958425 INFO  (jetty-launcher-7667-thread-1) [n:127.0.0.1:39861_solr    ] o.a.s.c.CoreContainer Initializing authentication plugin: org.apache.solr.security.HttpParamDelegationTokenPlugin
   [junit4]   2> 1958428 WARN  (jetty-launcher-7667-thread-1) [n:127.0.0.1:39861_solr    ] o.a.s.c.s.i.Krb5HttpClientBuilder org.apache.solr.client.solrj.impl.Krb5HttpClientBuilder is configured without specifying system property 'java.security.auth.login.config'
   [junit4]   2> 1958430 INFO  (jetty-launcher-7667-thread-1) [n:127.0.0.1:39861_solr    ] o.a.s.s.KerberosPlugin Params: {solr.kerberos.impersonator.user.noGroups.hosts=*, solr.kerberos.impersonator.user.bogusGroup.groups=__some_bogus_group, token.valid=30, cookie.domain=127.0.0.1, solr.kerberos.impersonator.user.anyHostAnyUser.groups=*, solr.kerberos.impersonator.user.bogusGroup.hosts=*, solr.kerberos.impersonator.user.anyHostAnyUser.hosts=*, token.validity=36000, solr.kerberos.impersonator.user.noHosts.groups=*, type=kerberos, solr.kerberos.impersonator.user.localHostAnyGroup.groups=*, delegation-token.token-kind=solr-dt, solr.kerberos.impersonator.user.wrongHost.hosts=1.1.1.1.1.1, cookie.path=/, zk-dt-secret-manager.znodeWorkingPath=solr/security/zkdtsm, solr.kerberos.impersonator.user.localHostAnyGroup.hosts=localhost.localdomain,localhost,127.0.0.1, signer.secret.provider.zookeeper.path=/token, solr.kerberos.impersonator.user.anyHostUsersGroup.groups=jenkins, zk-dt-secret-manager.enable=true, solr.kerberos.impersonator.user.wrongHost.groups=*, kerberos.name.rules=DEFAULT, signer.secret.provider=zookeeper, solr.kerberos.impersonator.user.anyHostUsersGroup.hosts=*}
   [junit4]   2> 1958430 INFO  (jetty-launcher-7667-thread-2) [n:127.0.0.1:34687_solr    ] o.a.s.c.CoreContainer Initializing authentication plugin: org.apache.solr.security.HttpParamDelegationTokenPlugin
   [junit4]   2> 1958430 WARN  (jetty-launcher-7667-thread-2) [n:127.0.0.1:34687_solr    ] o.a.s.c.s.i.Krb5HttpClientBuilder org.apache.solr.client.solrj.impl.Krb5HttpClientBuilder is configured without specifying system property 'java.security.auth.login.config'
   [junit4]   2> 1958430 INFO  (jetty-launcher-7667-thread-2) [n:127.0.0.1:34687_solr    ] o.a.s.s.KerberosPlugin Params: {solr.kerberos.impersonator.user.noGroups.hosts=*, solr.kerberos.impersonator.user.bogusGroup.groups=__some_bogus_group, token.valid=30, cookie.domain=127.0.0.1, solr.kerberos.impersonator.user.anyHostAnyUser.groups=*, solr.kerberos.impersonator.user.bogusGroup.hosts=*, solr.kerberos.impersonator.user.anyHostAnyUser.hosts=*, token.validity=36000, solr.kerberos.impersonator.user.noHosts.groups=*, type=kerberos, solr.kerberos.impersonator.user.localHostAnyGroup.groups=*, delegation-token.token-kind=solr-dt, solr.kerberos.impersonator.user.wrongHost.hosts=1.1.1.1.1.1, cookie.path=/, zk-dt-secret-manager.znodeWorkingPath=solr/security/zkdtsm, solr.kerberos.impersonator.user.localHostAnyGroup.hosts=localhost.localdomain,localhost,127.0.0.1, signer.secret.provider.zookeeper.path=/token, solr.kerberos.impersonator.user.anyHostUsersGroup.groups=jenkins, zk-dt-secret-manager.enable=true, solr.kerberos.impersonator.user.wrongHost.groups=*, kerberos.name.rules=DEFAULT, signer.secret.provider=zookeeper, solr.kerberos.impersonator.user.anyHostUsersGroup.hosts=*}
   [junit4]   2> 1958433 INFO  (jetty-launcher-7667-thread-1) [n:127.0.0.1:39861_solr    ] o.a.c.f.i.CuratorFrameworkImpl Starting
   [junit4]   2> 1958440 INFO  (jetty-launcher-7667-thread-2) [n:127.0.0.1:34687_solr    ] o.a.c.f.i.CuratorFrameworkImpl Starting
   [junit4]   2> 1958441 INFO  (jetty-launcher-7667-thread-1-EventThread) [n:127.0.0.1:39861_solr    ] o.a.c.f.s.ConnectionStateManager State change: CONNECTED
   [junit4]   2> 1958446 INFO  (jetty-launcher-7667-thread-2-EventThread) [n:127.0.0.1:34687_solr    ] o.a.c.f.s.ConnectionStateManager State change: CONNECTED
   [junit4]   2> 1958453 WARN  (jetty-launcher-7667-thread-2) [n:127.0.0.1:34687_solr    ] o.a.s.c.s.i.Krb5HttpClientBuilder org.apache.solr.client.solrj.impl.Krb5HttpClientBuilder is configured without specifying system property 'java.security.auth.login.config'
   [junit4]   2> 1958476 INFO  (jetty-launcher-7667-thread-2) [n:127.0.0.1:34687_solr    ] o.a.s.m.r.SolrJmxReporter JMX monitoring for 'solr_34687.solr.node' (registry 'solr.node') enabled at server: com.sun.jmx.mbeanserver.JmxMBeanServer@100c4f86
   [junit4]   2> 1958480 INFO  (jetty-launcher-7667-thread-2) [n:127.0.0.1:34687_solr    ] o.a.s.m.r.SolrJmxReporter JMX monitoring for 'solr_34687.solr.jvm' (registry 'solr.jvm') enabled at server: com.sun.jmx.mbeanserver.JmxMBeanServer@100c4f86
   [junit4]   2> 1958481 INFO  (jetty-launcher-7667-thread-2) [n:127.0.0.1:34687_solr    ] o.a.s.m.r.SolrJmxReporter JMX monitoring for 'solr_34687.solr.jetty' (registry 'solr.jetty') enabled at server: com.sun.jmx.mbeanserver.JmxMBeanServer@100c4f86
   [junit4]   2> 1958481 INFO  (jetty-launcher-7667-thread-2) [n:127.0.0.1:34687_solr    ] o.a.s.c.CorePropertiesLocator Found 0 core definitions underneath /home/jenkins/workspace/Lucene-Solr-7.x-Linux/solr/build/solr-core/test/J2/temp/solr.cloud.TestSolrCloudWithSecureImpersonation_DDA44F59B76C1CFD-001/tempDir-001/node2/.
   [junit4]   2> 1959447 WARN  (jetty-launcher-7667-thread-1) [n:127.0.0.1:39861_solr    ] o.a.s.c.s.i.Krb5HttpClientBuilder org.apache.solr.client.solrj.impl.Krb5HttpClientBuilder is configured without specifying system property 'java.security.auth.login.config'
   [junit4]   2> 1959478 INFO  (jetty-launcher-7667-thread-1) [n:127.0.0.1:39861_solr    ] o.a.s.m.r.SolrJmxReporter JMX monitoring for 'solr_39861.solr.node' (registry 'solr.node') enabled at server: com.sun.jmx.mbeanserver.JmxMBeanServer@100c4f86
   [junit4]   2> 1959486 INFO  (jetty-launcher-7667-thread-1) [n:127.0.0.1:39861_solr    ] o.a.s.m.r.SolrJmxReporter JMX monitoring for 'solr_39861.solr.jvm' (registry 'solr.jvm') enabled at server: com.sun.jmx.mbeanserver.JmxMBeanServer@100c4f86
   [junit4]   2> 1959486 INFO  (jetty-launcher-7667-thread-1) [n:127.0.0.1:39861_solr    ] o.a.s.m.r.SolrJmxReporter JMX monitoring for 'solr_39861.solr.jetty' (registry 'solr.jetty') enabled at server: com.sun.jmx.mbeanserver.JmxMBeanServer@100c4f86
   [junit4]   2> 1959487 INFO  (jetty-launcher-7667-thread-1) [n:127.0.0.1:39861_solr    ] o.a.s.c.CorePropertiesLocator Found 0 core definitions underneath /home/jenkins/workspace/Lucene-Solr-7.x-Linux/solr/build/solr-core/test/J2/temp/solr.cloud.TestSolrCloudWithSecureImpersonation_DDA44F59B76C1CFD-001/tempDir-001/node1/.
   [junit4]   2> 1959518 INFO  (zkConnectionManagerCallback-7692-thread-1) [    ] o.a.s.c.c.ConnectionManager zkClient has connected
   [junit4]   2> 1959530 INFO  (TEST-TestSolrCloudWithSecureImpersonation.testProxyWrongHost-seed#[DDA44F59B76C1CFD]) [    ] o.a.s.SolrTestCaseJ4 ###Starting testProxyWrongHost
   [junit4]   2> 1965342 WARN  (TEST-TestSolrCloudWithSecureImpersonation.testProxyWrongHost-seed#[DDA44F59B76C1CFD]) [    ] o.a.h.c.p.ResponseProcessCookies Invalid cookie header: "Set-Cookie: hadoop.auth="u=wrongHost&p=wrongHost&t=test&e=1514936956737&s=gjMgA2evLKXsB/Ndal4FxYUQ/CM="; Path=/; Domain=127.0.0.1; Expires=Máirt, 02-Ean-2018 23:49:16 GMT; HttpOnly". Invalid 'expires' attribute: Máirt, 02-Ean-2018 23:49:16 GMT
   [junit4]   2> 1965343 INFO  (TEST-TestSolrCloudWithSecureImpersonation.testProxyWrongHost-seed#[DDA44F59B76C1CFD]) [    ] o.a.s.SolrTestCaseJ4 ###Ending testProxyWrongHost
   [junit4]   2> 1965385 INFO  (TEST-TestSolrCloudWithSecureImpersonation.testProxyInvalidGroup-seed#[DDA44F59B76C1CFD]) [    ] o.a.s.SolrTestCaseJ4 ###Starting testProxyInvalidGroup
   [junit4]   2> 1965423 WARN  (qtp897646469-28511) [    ] o.a.h.s.ShellBasedUnixGroupsMapping got exception trying to get groups for user bar: id: ‘bar’: no such user
   [junit4]   2> id: ‘bar’: no such user
   [junit4]   2> 
   [junit4]   2> 1965437 WARN  (TEST-TestSolrCloudWithSecureImpersonation.testProxyInvalidGroup-seed#[DDA44F59B76C1CFD]) [    ] o.a.h.c.p.ResponseProcessCookies Invalid cookie header: "Set-Cookie: hadoop.auth="u=bogusGroup&p=bogusGroup&t=test&e=1514936962589&s=mkWdtnN1OTlREw5saBNvkY1DjAs="; Path=/; Domain=127.0.0.1; Expires=Máirt, 02-Ean-2018 23:49:22 GMT; HttpOnly". Invalid 'expires' attribute: Máirt, 02-Ean-2018 23:49:22 GMT
   [junit4]   2> 1965438 INFO  (TEST-TestSolrCloudWithSecureImpersonation.testProxyInvalidGroup-seed#[DDA44F59B76C1CFD]) [    ] o.a.s.SolrTestCaseJ4 ###Ending testProxyInvalidGroup
   [junit4]   2> 1965480 INFO  (TEST-TestSolrCloudWithSecureImpersonation.testProxyInvalidProxyUser-seed#[DDA44F59B76C1CFD]) [    ] o.a.s.SolrTestCaseJ4 ###Starting testProxyInvalidProxyUser
   [junit4]   2> 1965482 WARN  (TEST-TestSolrCloudWithSecureImpersonation.testProxyInvalidProxyUser-seed#[DDA44F59B76C1CFD]) [    ] o.a.h.c.p.ResponseProcessCookies Invalid cookie header: "Set-Cookie: hadoop.auth="u=bar&p=bar&t=test&e=1514936962684&s=qosuAyV8JXzvLCkcZ1GzFdxkkZ8="; Path=/; Domain=127.0.0.1; Expires=Máirt, 02-Ean-2018 23:49:22 GMT; HttpOnly". Invalid 'expires' attribute: Máirt, 02-Ean-2018 23:49:22 GMT
   [junit4]   2> 1965483 INFO  (TEST-TestSolrCloudWithSecureImpersonation.testProxyInvalidProxyUser-seed#[DDA44F59B76C1CFD]) [    ] o.a.s.SolrTestCaseJ4 ###Ending testProxyInvalidProxyUser
   [junit4]   2> 1965528 INFO  (TEST-TestSolrCloudWithSecureImpersonation.testProxyNullProxyUser-seed#[DDA44F59B76C1CFD]) [    ] o.a.s.SolrTestCaseJ4 ###Starting testProxyNullProxyUser
   [junit4]   2> 1965528 INFO  (qtp897646469-28498) [    ] o.a.s.s.SolrDispatchFilter Error authenticating
   [junit4]   2> java.lang.IllegalArgumentException: userName is NULL, empty or contains a '&'
   [junit4]   2> 	at org.apache.hadoop.security.authentication.util.AuthToken.checkForIllegalArgument(AuthToken.java:87)
   [junit4]   2> 	at org.apache.hadoop.security.authentication.util.AuthToken.<init>(AuthToken.java:70)
   [junit4]   2> 	at org.apache.hadoop.security.authentication.server.AuthenticationToken.<init>(AuthenticationToken.java:58)
   [junit4]   2> 	at org.apache.solr.security.HttpParamDelegationTokenPlugin$HttpParamDelegationTokenAuthenticationHandler$HttpParamAuthenticationHandler.authenticate(HttpParamDelegationTokenPlugin.java:213)
   [junit4]   2> 	at org.apache.hadoop.security.token.delegation.web.DelegationTokenAuthenticationHandler.authenticate(DelegationTokenAuthenticationHandler.java:348)
   [junit4]   2> 	at org.apache.solr.security.RequestContinuesRecorderAuthenticationHandler.authenticate(RequestContinuesRecorderAuthenticationHandler.java:69)
   [junit4]   2> 	at org.apache.hadoop.security.authentication.server.AuthenticationFilter.doFilter(AuthenticationFilter.java:518)
   [junit4]   2> 	at org.apache.solr.security.DelegationTokenKerberosFilter.doFilter(DelegationTokenKerberosFilter.java:134)
   [junit4]   2> 	at org.apache.solr.security.HttpParamDelegationTokenPlugin$HttpParamToRequestFilter.doFilter(HttpParamDelegationTokenPlugin.java:245)
   [junit4]   2> 	at org.apache.solr.security.KerberosPlugin.doAuthenticate(KerberosPlugin.java:243)
   [junit4]   2> 	at org.apache.solr.servlet.SolrDispatchFilter.authenticateRequest(SolrDispatchFilter.java:451)
   [junit4]   2> 	at org.apache.solr.servlet.SolrDispatchFilter.doFilter(SolrDispatchFilter.java:347)
   [junit4]   2> 	at org.apache.solr.servlet.SolrDispatchFilter.doFilter(SolrDispatchFilt

[...truncated too long message...]

keeperClient.internalBlockUntilConnectedOrTimedOut(CuratorZookeeperClient.java:323)
   [junit4]   2> 	at org.apache.curator.RetryLoop.callWithRetry(RetryLoop.java:105)
   [junit4]   2> 	at org.apache.curator.framework.imps.GetDataBuilderImpl.pathInForeground(GetDataBuilderImpl.java:288)
   [junit4]   2> 	at org.apache.curator.framework.imps.GetDataBuilderImpl.forPath(GetDataBuilderImpl.java:279)
   [junit4]   2> 	at org.apache.curator.framework.imps.GetDataBuilderImpl.forPath(GetDataBuilderImpl.java:41)
   [junit4]   2> 	at org.apache.curator.framework.recipes.shared.SharedValue.readValue(SharedValue.java:244)
   [junit4]   2> 	at org.apache.curator.framework.recipes.shared.SharedValue.access$100(SharedValue.java:44)
   [junit4]   2> 	at org.apache.curator.framework.recipes.shared.SharedValue$1.process(SharedValue.java:61)
   [junit4]   2> 	at org.apache.curator.framework.imps.NamespaceWatcher.process(NamespaceWatcher.java:67)
   [junit4]   2> 	at org.apache.zookeeper.ClientCnxn$EventThread.processEvent(ClientCnxn.java:530)
   [junit4]   2> 	at org.apache.zookeeper.ClientCnxn$EventThread.run(ClientCnxn.java:505)
   [junit4]   2> Jan 02, 2018 1:50:01 PM com.carrotsearch.randomizedtesting.ThreadLeakControl tryToInterruptAll
   [junit4]   2> INFO: All leaked threads terminated.
   [junit4]   2> NOTE: test params are: codec=Asserting(Lucene70): {}, docValues:{}, maxPointsInLeafNode=1334, maxMBSortInHeap=6.608567518653556, sim=RandomSimilarity(queryNorm=false): {}, locale=ga-IE, timezone=Etc/GMT-8
   [junit4]   2> NOTE: Linux 4.10.0-40-generic amd64/Oracle Corporation 1.8.0_144 (64-bit)/cpus=8,threads=1,free=305783704,total=518979584
   [junit4]   2> NOTE: All tests run in this JVM: [CollectionReloadTest, TestZkChroot, IndexSchemaTest, TestEmbeddedSolrServerConstructors, SolrCoreCheckLockOnStartupTest, TestSolrConfigHandlerConcurrent, DocValuesNotIndexedTest, DirectSolrConnectionTest, TestLeaderInitiatedRecoveryThread, TestPullReplica, TestJavabinTupleStreamParser, TestDistribDocBasedVersion, HdfsThreadLeakTest, InfixSuggestersTest, TestReloadDeadlock, TestHdfsUpdateLog, SolrJmxReporterTest, DocExpirationUpdateProcessorFactoryTest, MetricUtilsTest, JvmMetricsTest, HdfsBasicDistributedZkTest, TestSystemIdResolver, TestSchemalessBufferedUpdates, FileBasedSpellCheckerTest, TestMaxScoreQueryParser, BJQParserTest, OverseerTest, TestHdfsCloudBackupRestore, TestPolicyCloud, TestDistributedGrouping, TestNamedUpdateProcessors, TestJsonRequest, DistributedFacetPivotLargeTest, DistributedFacetSimpleRefinementLongTailTest, TestStressLiveNodes, SolrTestCaseJ4Test, TestNoOpRegenerator, PreAnalyzedUpdateProcessorTest, LargeFieldTest, TestQueryTypes, TestCollectionsAPIViaSolrCloudCluster, ZkStateReaderTest, FieldAnalysisRequestHandlerTest, TimeZoneUtilsTest, TestShardHandlerFactory, AnalyticsMergeStrategyTest, ConfigSetsAPITest, SmileWriterTest, RequiredFieldsTest, ScriptEngineTest, SuggesterTest, TestCloudPivotFacet, TestConfigSetsAPIZkFailure, BlockJoinFacetSimpleTest, TestMaxTokenLenTokenizer, ClusterStateTest, TestNumericRangeQuery64, DistanceFunctionTest, TestImpersonationWithHadoopAuth, TestInitParams, SpellCheckCollatorWithCollapseTest, TestRequestForwarding, HdfsWriteToMultipleCollectionsTest, CollectionsAPIAsyncDistributedZkTest, TestHalfAndHalfDocValues, SolrIndexMetricsTest, TestDistributedStatsComponentCardinality, TestClassicSimilarityFactory, TestLRUCache, PluginInfoTest, TestTriggerIntegration, TestRawTransformer, BlockCacheTest, TestPivotHelperCode, BadComponentTest, SSLMigrationTest, AutoAddReplicasIntegrationTest, LoggingHandlerTest, MoveReplicaHDFSTest, TestConfigOverlay, TestTolerantSearch, DeleteNodeTest, TestLegacyTerms, RequestLoggingTest, XsltUpdateRequestHandlerTest, AsyncCallRequestStatusResponseTest, TestFieldSortValues, TestFieldCacheSortRandom, TestGroupingSearch, TestCoreDiscovery, UnloadDistributedZkTest, TestDynamicLoading, TestFiltering, ReturnFieldsTest, BitVectorTest, TestTolerantUpdateProcessorRandomCloud, TestCloudDeleteByQuery, HighlighterTest, AlternateDirectoryTest, TestFieldResource, SuggesterWFSTTest, TestPayloadScoreQParserPlugin, TestComputePlanAction, TestCSVResponseWriter, LeaderElectionContextKeyTest, SolrMetricManagerTest, HdfsRecoveryZkTest, TestDistribIDF, TestUninvertingReader, TestValueSourceCache, TestGenericDistributedQueue, NodeLostTriggerTest, TestElisionMultitermQuery, TestMiniSolrCloudClusterSSL, TestTrieFacet, CopyFieldTest, TestRuleBasedAuthorizationPlugin, TestReplicationHandlerBackup, PKIAuthenticationIntegrationTest, EnumFieldTest, CSVRequestHandlerTest, TestComponentsName, TestLFUCache, TestHighlightDedupGrouping, TestEmbeddedSolrServerSchemaAPI, ConnectionReuseTest, AliasIntegrationTest, ChaosMonkeySafeLeaderWithPullReplicasTest, ConcurrentDeleteAndCreateCollectionTest, CustomCollectionTest, DeleteShardTest, DistribJoinFromCollectionTest, DistributedVersionInfoTest, LeaderInitiatedRecoveryOnCommitTest, MigrateRouteKeyTest, MoveReplicaTest, OverseerModifyCollectionTest, OverseerStatusTest, RemoteQueryErrorTest, ReplaceNodeTest, SharedFSAutoReplicaFailoverTest, SimpleCollectionCreateDeleteTest, SolrXmlInZkTest, TestAuthenticationFramework, TestCloudSearcherWarming, TestLocalFSCloudBackupRestore, TestPullReplicaErrorHandling, TestSSLRandomization, TestSegmentSorting, TestSkipOverseerOperations, TestSolrCloudWithSecureImpersonation]
   [junit4]   2> NOTE: reproduce with: ant test  -Dtestcase=TestSolrCloudWithSecureImpersonation -Dtests.seed=DDA44F59B76C1CFD -Dtests.multiplier=3 -Dtests.slow=true -Dtests.locale=ga-IE -Dtests.timezone=Etc/GMT-8 -Dtests.asserts=true -Dtests.file.encoding=UTF-8
   [junit4] ERROR   0.00s J2 | TestSolrCloudWithSecureImpersonation (suite) <<<
   [junit4]    > Throwable #1: com.carrotsearch.randomizedtesting.ThreadLeakError: 2 threads leaked from SUITE scope at org.apache.solr.cloud.TestSolrCloudWithSecureImpersonation: 
   [junit4]    >    1) Thread[id=28551, name=jetty-launcher-7667-thread-2-EventThread, state=TIMED_WAITING, group=TGRP-TestSolrCloudWithSecureImpersonation]
   [junit4]    >         at sun.misc.Unsafe.park(Native Method)
   [junit4]    >         at java.util.concurrent.locks.LockSupport.parkNanos(LockSupport.java:215)
   [junit4]    >         at java.util.concurrent.locks.AbstractQueuedSynchronizer.doAcquireSharedNanos(AbstractQueuedSynchronizer.java:1037)
   [junit4]    >         at java.util.concurrent.locks.AbstractQueuedSynchronizer.tryAcquireSharedNanos(AbstractQueuedSynchronizer.java:1328)
   [junit4]    >         at java.util.concurrent.CountDownLatch.await(CountDownLatch.java:277)
   [junit4]    >         at org.apache.curator.CuratorZookeeperClient.internalBlockUntilConnectedOrTimedOut(CuratorZookeeperClient.java:323)
   [junit4]    >         at org.apache.curator.RetryLoop.callWithRetry(RetryLoop.java:105)
   [junit4]    >         at org.apache.curator.framework.imps.GetDataBuilderImpl.pathInForeground(GetDataBuilderImpl.java:288)
   [junit4]    >         at org.apache.curator.framework.imps.GetDataBuilderImpl.forPath(GetDataBuilderImpl.java:279)
   [junit4]    >         at org.apache.curator.framework.imps.GetDataBuilderImpl.forPath(GetDataBuilderImpl.java:41)
   [junit4]    >         at org.apache.curator.framework.recipes.shared.SharedValue.readValue(SharedValue.java:244)
   [junit4]    >         at org.apache.curator.framework.recipes.shared.SharedValue.access$100(SharedValue.java:44)
   [junit4]    >         at org.apache.curator.framework.recipes.shared.SharedValue$1.process(SharedValue.java:61)
   [junit4]    >         at org.apache.curator.framework.imps.NamespaceWatcher.process(NamespaceWatcher.java:67)
   [junit4]    >         at org.apache.zookeeper.ClientCnxn$EventThread.processEvent(ClientCnxn.java:530)
   [junit4]    >         at org.apache.zookeeper.ClientCnxn$EventThread.run(ClientCnxn.java:505)
   [junit4]    >    2) Thread[id=28547, name=jetty-launcher-7667-thread-1-EventThread, state=TIMED_WAITING, group=TGRP-TestSolrCloudWithSecureImpersonation]
   [junit4]    >         at sun.misc.Unsafe.park(Native Method)
   [junit4]    >         at java.util.concurrent.locks.LockSupport.parkNanos(LockSupport.java:215)
   [junit4]    >         at java.util.concurrent.locks.AbstractQueuedSynchronizer.doAcquireSharedNanos(AbstractQueuedSynchronizer.java:1037)
   [junit4]    >         at java.util.concurrent.locks.AbstractQueuedSynchronizer.tryAcquireSharedNanos(AbstractQueuedSynchronizer.java:1328)
   [junit4]    >         at java.util.concurrent.CountDownLatch.await(CountDownLatch.java:277)
   [junit4]    >         at org.apache.curator.CuratorZookeeperClient.internalBlockUntilConnectedOrTimedOut(CuratorZookeeperClient.java:323)
   [junit4]    >         at org.apache.curator.RetryLoop.callWithRetry(RetryLoop.java:105)
   [junit4]    >         at org.apache.curator.framework.imps.GetDataBuilderImpl.pathInForeground(GetDataBuilderImpl.java:288)
   [junit4]    >         at org.apache.curator.framework.imps.GetDataBuilderImpl.forPath(GetDataBuilderImpl.java:279)
   [junit4]    >         at org.apache.curator.framework.imps.GetDataBuilderImpl.forPath(GetDataBuilderImpl.java:41)
   [junit4]    >         at org.apache.curator.framework.recipes.shared.SharedValue.readValue(SharedValue.java:244)
   [junit4]    >         at org.apache.curator.framework.recipes.shared.SharedValue.access$100(SharedValue.java:44)
   [junit4]    >         at org.apache.curator.framework.recipes.shared.SharedValue$1.process(SharedValue.java:61)
   [junit4]    >         at org.apache.curator.framework.imps.NamespaceWatcher.process(NamespaceWatcher.java:67)
   [junit4]    >         at org.apache.zookeeper.ClientCnxn$EventThread.processEvent(ClientCnxn.java:530)
   [junit4]    >         at org.apache.zookeeper.ClientCnxn$EventThread.run(ClientCnxn.java:505)
   [junit4]    > 	at __randomizedtesting.SeedInfo.seed([DDA44F59B76C1CFD]:0)
   [junit4] Completed [561/764 (2!)] on J2 in 46.46s, 12 tests, 1 error <<< FAILURES!

[...truncated 48897 lines...]

Mime
View raw message