lucene-dev mailing list archives

Site index · List index
Message view « Date » · « Thread »
Top « Date » · « Thread »
From Policeman Jenkins Server <jenk...@thetaphi.de>
Subject [JENKINS] Lucene-Solr-7.x-MacOSX (64bit/jdk1.8.0) - Build # 344 - Still Unstable!
Date Sat, 16 Dec 2017 23:30:47 GMT
Build: https://jenkins.thetaphi.de/job/Lucene-Solr-7.x-MacOSX/344/
Java: 64bit/jdk1.8.0 -XX:+UseCompressedOops -XX:+UseConcMarkSweepGC

1 tests failed.
FAILED:  org.apache.solr.client.solrj.io.stream.StreamExpressionTest.testDistributions

Error Message:


Stack Trace:
java.lang.AssertionError
	at __randomizedtesting.SeedInfo.seed([7709C33AFEFFF840:C8F68290200518DC]:0)
	at org.junit.Assert.fail(Assert.java:92)
	at org.junit.Assert.assertTrue(Assert.java:43)
	at org.junit.Assert.assertTrue(Assert.java:54)
	at org.apache.solr.client.solrj.io.stream.StreamExpressionTest.testDistributions(StreamExpressionTest.java:6553)
	at sun.reflect.NativeMethodAccessorImpl.invoke0(Native Method)
	at sun.reflect.NativeMethodAccessorImpl.invoke(NativeMethodAccessorImpl.java:62)
	at sun.reflect.DelegatingMethodAccessorImpl.invoke(DelegatingMethodAccessorImpl.java:43)
	at java.lang.reflect.Method.invoke(Method.java:498)
	at com.carrotsearch.randomizedtesting.RandomizedRunner.invoke(RandomizedRunner.java:1737)
	at com.carrotsearch.randomizedtesting.RandomizedRunner$8.evaluate(RandomizedRunner.java:934)
	at com.carrotsearch.randomizedtesting.RandomizedRunner$9.evaluate(RandomizedRunner.java:970)
	at com.carrotsearch.randomizedtesting.RandomizedRunner$10.evaluate(RandomizedRunner.java:984)
	at com.carrotsearch.randomizedtesting.rules.SystemPropertiesRestoreRule$1.evaluate(SystemPropertiesRestoreRule.java:57)
	at org.apache.lucene.util.TestRuleSetupTeardownChained$1.evaluate(TestRuleSetupTeardownChained.java:49)
	at org.apache.lucene.util.AbstractBeforeAfterRule$1.evaluate(AbstractBeforeAfterRule.java:45)
	at org.apache.lucene.util.TestRuleThreadAndTestName$1.evaluate(TestRuleThreadAndTestName.java:48)
	at org.apache.lucene.util.TestRuleIgnoreAfterMaxFailures$1.evaluate(TestRuleIgnoreAfterMaxFailures.java:64)
	at org.apache.lucene.util.TestRuleMarkFailure$1.evaluate(TestRuleMarkFailure.java:47)
	at com.carrotsearch.randomizedtesting.rules.StatementAdapter.evaluate(StatementAdapter.java:36)
	at com.carrotsearch.randomizedtesting.ThreadLeakControl$StatementRunner.run(ThreadLeakControl.java:368)
	at com.carrotsearch.randomizedtesting.ThreadLeakControl.forkTimeoutingTask(ThreadLeakControl.java:817)
	at com.carrotsearch.randomizedtesting.ThreadLeakControl$3.evaluate(ThreadLeakControl.java:468)
	at com.carrotsearch.randomizedtesting.RandomizedRunner.runSingleTest(RandomizedRunner.java:943)
	at com.carrotsearch.randomizedtesting.RandomizedRunner$5.evaluate(RandomizedRunner.java:829)
	at com.carrotsearch.randomizedtesting.RandomizedRunner$6.evaluate(RandomizedRunner.java:879)
	at com.carrotsearch.randomizedtesting.RandomizedRunner$7.evaluate(RandomizedRunner.java:890)
	at com.carrotsearch.randomizedtesting.rules.StatementAdapter.evaluate(StatementAdapter.java:36)
	at com.carrotsearch.randomizedtesting.rules.SystemPropertiesRestoreRule$1.evaluate(SystemPropertiesRestoreRule.java:57)
	at org.apache.lucene.util.AbstractBeforeAfterRule$1.evaluate(AbstractBeforeAfterRule.java:45)
	at com.carrotsearch.randomizedtesting.rules.StatementAdapter.evaluate(StatementAdapter.java:36)
	at org.apache.lucene.util.TestRuleStoreClassName$1.evaluate(TestRuleStoreClassName.java:41)
	at com.carrotsearch.randomizedtesting.rules.NoShadowingOrOverridesOnMethodsRule$1.evaluate(NoShadowingOrOverridesOnMethodsRule.java:40)
	at com.carrotsearch.randomizedtesting.rules.NoShadowingOrOverridesOnMethodsRule$1.evaluate(NoShadowingOrOverridesOnMethodsRule.java:40)
	at com.carrotsearch.randomizedtesting.rules.StatementAdapter.evaluate(StatementAdapter.java:36)
	at com.carrotsearch.randomizedtesting.rules.StatementAdapter.evaluate(StatementAdapter.java:36)
	at com.carrotsearch.randomizedtesting.rules.StatementAdapter.evaluate(StatementAdapter.java:36)
	at org.apache.lucene.util.TestRuleAssertionsRequired$1.evaluate(TestRuleAssertionsRequired.java:53)
	at org.apache.lucene.util.TestRuleMarkFailure$1.evaluate(TestRuleMarkFailure.java:47)
	at org.apache.lucene.util.TestRuleIgnoreAfterMaxFailures$1.evaluate(TestRuleIgnoreAfterMaxFailures.java:64)
	at org.apache.lucene.util.TestRuleIgnoreTestSuites$1.evaluate(TestRuleIgnoreTestSuites.java:54)
	at com.carrotsearch.randomizedtesting.rules.StatementAdapter.evaluate(StatementAdapter.java:36)
	at com.carrotsearch.randomizedtesting.ThreadLeakControl$StatementRunner.run(ThreadLeakControl.java:368)
	at java.lang.Thread.run(Thread.java:748)




Build Log:
[...truncated 14840 lines...]
   [junit4] Suite: org.apache.solr.client.solrj.io.stream.StreamExpressionTest
   [junit4]   2> Creating dataDir: /Users/jenkins/workspace/Lucene-Solr-7.x-MacOSX/solr/build/solr-solrj/test/J1/temp/solr.client.solrj.io.stream.StreamExpressionTest_7709C33AFEFFF840-001/init-core-data-001
   [junit4]   2> 14197 INFO  (SUITE-StreamExpressionTest-seed#[7709C33AFEFFF840]-worker) [    ] o.a.s.SolrTestCaseJ4 Using PointFields (NUMERIC_POINTS_SYSPROP=true) w/NUMERIC_DOCVALUES_SYSPROP=false
   [junit4]   2> 14198 INFO  (SUITE-StreamExpressionTest-seed#[7709C33AFEFFF840]-worker) [    ] o.a.s.SolrTestCaseJ4 Randomized ssl (false) and clientAuth (false) via: @org.apache.solr.util.RandomizeSSL(reason=, value=NaN, ssl=NaN, clientAuth=NaN) w/ MAC_OS_X supressed clientAuth
   [junit4]   2> 14199 INFO  (SUITE-StreamExpressionTest-seed#[7709C33AFEFFF840]-worker) [    ] o.a.s.SolrTestCaseJ4 SecureRandom sanity checks: test.solr.allowed.securerandom=null & java.security.egd=file:/dev/./urandom
   [junit4]   2> 14208 INFO  (SUITE-StreamExpressionTest-seed#[7709C33AFEFFF840]-worker) [    ] o.a.s.c.MiniSolrCloudCluster Starting cluster of 4 servers in /Users/jenkins/workspace/Lucene-Solr-7.x-MacOSX/solr/build/solr-solrj/test/J1/temp/solr.client.solrj.io.stream.StreamExpressionTest_7709C33AFEFFF840-001/tempDir-001
   [junit4]   2> 14237 INFO  (SUITE-StreamExpressionTest-seed#[7709C33AFEFFF840]-worker) [    ] o.a.s.c.ZkTestServer STARTING ZK TEST SERVER
   [junit4]   2> 14243 INFO  (Thread-8) [    ] o.a.s.c.ZkTestServer client port:0.0.0.0/0.0.0.0:0
   [junit4]   2> 14243 INFO  (Thread-8) [    ] o.a.s.c.ZkTestServer Starting server
   [junit4]   2> 14443 INFO  (SUITE-StreamExpressionTest-seed#[7709C33AFEFFF840]-worker) [    ] o.a.s.c.ZkTestServer start zk server on port:52123
   [junit4]   2> 14575 WARN  (NIOServerCxn.Factory:0.0.0.0/0.0.0.0:0) [    ] o.a.z.s.NIOServerCnxn Exception causing close of session 0x0 due to java.io.IOException: ZooKeeperServer not running
   [junit4]   2> 14593 ERROR (Thread-8) [    ] o.a.z.s.ZooKeeperServer ZKShutdownHandler is not registered, so ZooKeeper server won't take any action on ERROR or SHUTDOWN server state changes
   [junit4]   2> 16141 INFO  (zkConnectionManagerCallback-6-thread-1) [    ] o.a.s.c.c.ConnectionManager zkClient has connected
   [junit4]   2> 16680 INFO  (jetty-launcher-3-thread-2) [    ] o.e.j.s.Server jetty-9.3.20.v20170531
   [junit4]   2> 16685 INFO  (jetty-launcher-3-thread-4) [    ] o.e.j.s.Server jetty-9.3.20.v20170531
   [junit4]   2> 16685 INFO  (jetty-launcher-3-thread-3) [    ] o.e.j.s.Server jetty-9.3.20.v20170531
   [junit4]   2> 16686 INFO  (jetty-launcher-3-thread-1) [    ] o.e.j.s.Server jetty-9.3.20.v20170531
   [junit4]   2> 16790 INFO  (jetty-launcher-3-thread-1) [    ] o.e.j.s.h.ContextHandler Started o.e.j.s.ServletContextHandler@76cae4dc{/solr,null,AVAILABLE}
   [junit4]   2> 16791 INFO  (jetty-launcher-3-thread-4) [    ] o.e.j.s.h.ContextHandler Started o.e.j.s.ServletContextHandler@6ae8509d{/solr,null,AVAILABLE}
   [junit4]   2> 16791 INFO  (jetty-launcher-3-thread-3) [    ] o.e.j.s.h.ContextHandler Started o.e.j.s.ServletContextHandler@7586f850{/solr,null,AVAILABLE}
   [junit4]   2> 16791 INFO  (jetty-launcher-3-thread-2) [    ] o.e.j.s.h.ContextHandler Started o.e.j.s.ServletContextHandler@39e71dc4{/solr,null,AVAILABLE}
   [junit4]   2> 16837 INFO  (jetty-launcher-3-thread-2) [    ] o.e.j.s.AbstractConnector Started ServerConnector@22a0d70b{HTTP/1.1,[http/1.1]}{127.0.0.1:52142}
   [junit4]   2> 16837 INFO  (jetty-launcher-3-thread-2) [    ] o.e.j.s.Server Started @22579ms
   [junit4]   2> 16837 INFO  (jetty-launcher-3-thread-2) [    ] o.a.s.c.s.e.JettySolrRunner Jetty properties: {hostContext=/solr, hostPort=52142}
   [junit4]   2> 16843 INFO  (jetty-launcher-3-thread-3) [    ] o.e.j.s.AbstractConnector Started ServerConnector@3d47808a{HTTP/1.1,[http/1.1]}{127.0.0.1:52143}
   [junit4]   2> 16843 INFO  (jetty-launcher-3-thread-3) [    ] o.e.j.s.Server Started @22585ms
   [junit4]   2> 16843 INFO  (jetty-launcher-3-thread-4) [    ] o.e.j.s.AbstractConnector Started ServerConnector@7005355a{HTTP/1.1,[http/1.1]}{127.0.0.1:52141}
   [junit4]   2> 16844 INFO  (jetty-launcher-3-thread-4) [    ] o.e.j.s.Server Started @22586ms
   [junit4]   2> 16844 INFO  (jetty-launcher-3-thread-4) [    ] o.a.s.c.s.e.JettySolrRunner Jetty properties: {hostContext=/solr, hostPort=52141}
   [junit4]   2> 16842 INFO  (jetty-launcher-3-thread-1) [    ] o.e.j.s.AbstractConnector Started ServerConnector@7a603d7b{HTTP/1.1,[http/1.1]}{127.0.0.1:52140}
   [junit4]   2> 16844 INFO  (jetty-launcher-3-thread-1) [    ] o.e.j.s.Server Started @22586ms
   [junit4]   2> 16844 INFO  (jetty-launcher-3-thread-1) [    ] o.a.s.c.s.e.JettySolrRunner Jetty properties: {hostContext=/solr, hostPort=52140}
   [junit4]   2> 16843 INFO  (jetty-launcher-3-thread-3) [    ] o.a.s.c.s.e.JettySolrRunner Jetty properties: {hostContext=/solr, hostPort=52143}
   [junit4]   2> 16893 ERROR (jetty-launcher-3-thread-3) [    ] o.a.s.u.StartupLoggingUtils Missing Java Option solr.log.dir. Logging may be missing or incomplete.
   [junit4]   2> 16893 INFO  (jetty-launcher-3-thread-3) [    ] o.a.s.s.SolrDispatchFilter  ___      _       Welcome to Apache Solr? version 7.3.0
   [junit4]   2> 16894 INFO  (jetty-launcher-3-thread-3) [    ] o.a.s.s.SolrDispatchFilter / __| ___| |_ _   Starting in cloud mode on port null
   [junit4]   2> 16894 INFO  (jetty-launcher-3-thread-3) [    ] o.a.s.s.SolrDispatchFilter \__ \/ _ \ | '_|  Install dir: null
   [junit4]   2> 16894 ERROR (jetty-launcher-3-thread-1) [    ] o.a.s.u.StartupLoggingUtils Missing Java Option solr.log.dir. Logging may be missing or incomplete.
   [junit4]   2> 16893 ERROR (jetty-launcher-3-thread-2) [    ] o.a.s.u.StartupLoggingUtils Missing Java Option solr.log.dir. Logging may be missing or incomplete.
   [junit4]   2> 16898 INFO  (jetty-launcher-3-thread-2) [    ] o.a.s.s.SolrDispatchFilter  ___      _       Welcome to Apache Solr? version 7.3.0
   [junit4]   2> 16898 INFO  (jetty-launcher-3-thread-2) [    ] o.a.s.s.SolrDispatchFilter / __| ___| |_ _   Starting in cloud mode on port null
   [junit4]   2> 16898 INFO  (jetty-launcher-3-thread-2) [    ] o.a.s.s.SolrDispatchFilter \__ \/ _ \ | '_|  Install dir: null
   [junit4]   2> 16894 ERROR (jetty-launcher-3-thread-4) [    ] o.a.s.u.StartupLoggingUtils Missing Java Option solr.log.dir. Logging may be missing or incomplete.
   [junit4]   2> 16898 INFO  (jetty-launcher-3-thread-4) [    ] o.a.s.s.SolrDispatchFilter  ___      _       Welcome to Apache Solr? version 7.3.0
   [junit4]   2> 16898 INFO  (jetty-launcher-3-thread-4) [    ] o.a.s.s.SolrDispatchFilter / __| ___| |_ _   Starting in cloud mode on port null
   [junit4]   2> 16898 INFO  (jetty-launcher-3-thread-4) [    ] o.a.s.s.SolrDispatchFilter \__ \/ _ \ | '_|  Install dir: null
   [junit4]   2> 16899 INFO  (jetty-launcher-3-thread-3) [    ] o.a.s.s.SolrDispatchFilter |___/\___/_|_|    Start time: 2017-12-16T23:12:16.621Z
   [junit4]   2> 16899 INFO  (jetty-launcher-3-thread-2) [    ] o.a.s.s.SolrDispatchFilter |___/\___/_|_|    Start time: 2017-12-16T23:12:16.624Z
   [junit4]   2> 16897 INFO  (jetty-launcher-3-thread-1) [    ] o.a.s.s.SolrDispatchFilter  ___      _       Welcome to Apache Solr? version 7.3.0
   [junit4]   2> 16899 INFO  (jetty-launcher-3-thread-1) [    ] o.a.s.s.SolrDispatchFilter / __| ___| |_ _   Starting in cloud mode on port null
   [junit4]   2> 16899 INFO  (jetty-launcher-3-thread-1) [    ] o.a.s.s.SolrDispatchFilter \__ \/ _ \ | '_|  Install dir: null
   [junit4]   2> 16900 INFO  (jetty-launcher-3-thread-1) [    ] o.a.s.s.SolrDispatchFilter |___/\___/_|_|    Start time: 2017-12-16T23:12:16.626Z
   [junit4]   2> 16899 INFO  (jetty-launcher-3-thread-4) [    ] o.a.s.s.SolrDispatchFilter |___/\___/_|_|    Start time: 2017-12-16T23:12:16.624Z
   [junit4]   2> 16902 INFO  (jetty-launcher-3-thread-3) [    ] o.a.s.c.SolrResourceLoader solr home defaulted to 'solr/' (could not find system property or JNDI)
   [junit4]   2> 16909 INFO  (zkConnectionManagerCallback-8-thread-1) [    ] o.a.s.c.c.ConnectionManager zkClient has connected
   [junit4]   2> 16911 INFO  (zkConnectionManagerCallback-10-thread-1) [    ] o.a.s.c.c.ConnectionManager zkClient has connected
   [junit4]   2> 16918 INFO  (zkConnectionManagerCallback-12-thread-1) [    ] o.a.s.c.c.ConnectionManager zkClient has connected
   [junit4]   2> 16918 INFO  (jetty-launcher-3-thread-3) [    ] o.a.s.s.SolrDispatchFilter solr.xml found in ZooKeeper. Loading...
   [junit4]   2> 16920 INFO  (jetty-launcher-3-thread-4) [    ] o.a.s.s.SolrDispatchFilter solr.xml found in ZooKeeper. Loading...
   [junit4]   2> 16930 INFO  (jetty-launcher-3-thread-2) [    ] o.a.s.s.SolrDispatchFilter solr.xml found in ZooKeeper. Loading...
   [junit4]   2> 16931 INFO  (zkConnectionManagerCallback-14-thread-1) [    ] o.a.s.c.c.ConnectionManager zkClient has connected
   [junit4]   2> 16932 INFO  (jetty-launcher-3-thread-1) [    ] o.a.s.s.SolrDispatchFilter solr.xml found in ZooKeeper. Loading...
   [junit4]   2> 17030 INFO  (jetty-launcher-3-thread-2) [    ] o.a.s.c.ZkContainer Zookeeper client=127.0.0.1:52123/solr
   [junit4]   2> 17031 INFO  (jetty-launcher-3-thread-3) [    ] o.a.s.c.ZkContainer Zookeeper client=127.0.0.1:52123/solr
   [junit4]   2> 17033 INFO  (jetty-launcher-3-thread-1) [    ] o.a.s.c.ZkContainer Zookeeper client=127.0.0.1:52123/solr
   [junit4]   2> 17035 INFO  (jetty-launcher-3-thread-4) [    ] o.a.s.c.ZkContainer Zookeeper client=127.0.0.1:52123/solr
   [junit4]   2> 17082 INFO  (zkConnectionManagerCallback-24-thread-1) [    ] o.a.s.c.c.ConnectionManager zkClient has connected
   [junit4]   2> 17084 INFO  (zkConnectionManagerCallback-28-thread-1) [    ] o.a.s.c.c.ConnectionManager zkClient has connected
   [junit4]   2> 17084 INFO  (zkConnectionManagerCallback-30-thread-1) [    ] o.a.s.c.c.ConnectionManager zkClient has connected
   [junit4]   2> 17085 INFO  (zkConnectionManagerCallback-26-thread-1) [    ] o.a.s.c.c.ConnectionManager zkClient has connected
   [junit4]   2> 17100 INFO  (zkConnectionManagerCallback-32-thread-1-processing-n:127.0.0.1:52142_solr) [n:127.0.0.1:52142_solr    ] o.a.s.c.c.ConnectionManager zkClient has connected
   [junit4]   2> 17101 INFO  (zkConnectionManagerCallback-36-thread-1-processing-n:127.0.0.1:52140_solr) [n:127.0.0.1:52140_solr    ] o.a.s.c.c.ConnectionManager zkClient has connected
   [junit4]   2> 17101 INFO  (zkConnectionManagerCallback-34-thread-1-processing-n:127.0.0.1:52141_solr) [n:127.0.0.1:52141_solr    ] o.a.s.c.c.ConnectionManager zkClient has connected
   [junit4]   2> 17102 INFO  (zkConnectionManagerCallback-38-thread-1-processing-n:127.0.0.1:52143_solr) [n:127.0.0.1:52143_solr    ] o.a.s.c.c.ConnectionManager zkClient has connected
   [junit4]   2> 17184 WARN  (jetty-launcher-3-thread-3) [n:127.0.0.1:52143_solr    ] o.a.s.c.ZkController The _default configset could not be uploaded. Please provide 'solr.default.confdir' parameter that points to a configset intended to be the default. Current 'solr.default.confdir' value: null
   [junit4]   2> 17184 WARN  (jetty-launcher-3-thread-1) [n:127.0.0.1:52140_solr    ] o.a.s.c.ZkController The _default configset could not be uploaded. Please provide 'solr.default.confdir' parameter that points to a configset intended to be the default. Current 'solr.default.confdir' value: null
   [junit4]   2> 17184 WARN  (jetty-launcher-3-thread-4) [n:127.0.0.1:52141_solr    ] o.a.s.c.ZkController The _default configset could not be uploaded. Please provide 'solr.default.confdir' parameter that points to a configset intended to be the default. Current 'solr.default.confdir' value: null
   [junit4]   2> 17190 WARN  (jetty-launcher-3-thread-2) [n:127.0.0.1:52142_solr    ] o.a.s.c.ZkController The _default configset could not be uploaded. Please provide 'solr.default.confdir' parameter that points to a configset intended to be the default. Current 'solr.default.confdir' value: null
   [junit4]   2> 17228 INFO  (jetty-launcher-3-thread-1) [n:127.0.0.1:52140_solr    ] o.a.s.c.Overseer Overseer (id=null) closing
   [junit4]   2> 17228 INFO  (jetty-launcher-3-thread-3) [n:127.0.0.1:52143_solr    ] o.a.s.c.Overseer Overseer (id=null) closing
   [junit4]   2> 17230 INFO  (jetty-launcher-3-thread-4) [n:127.0.0.1:52141_solr    ] o.a.s.c.Overseer Overseer (id=null) closing
   [junit4]   2> 17230 INFO  (jetty-launcher-3-thread-3) [n:127.0.0.1:52143_solr    ] o.a.s.c.OverseerElectionContext I am going to be the leader 127.0.0.1:52143_solr
   [junit4]   2> 17234 INFO  (jetty-launcher-3-thread-4) [n:127.0.0.1:52141_solr    ] o.a.s.c.ZkController Register node as live in ZooKeeper:/live_nodes/127.0.0.1:52141_solr
   [junit4]   2> 17234 INFO  (jetty-launcher-3-thread-1) [n:127.0.0.1:52140_solr    ] o.a.s.c.ZkController Register node as live in ZooKeeper:/live_nodes/127.0.0.1:52140_solr
   [junit4]   2> 17235 INFO  (jetty-launcher-3-thread-3) [n:127.0.0.1:52143_solr    ] o.a.s.c.Overseer Overseer (id=99186503462813708-127.0.0.1:52143_solr-n_0000000000) starting
   [junit4]   2> 17236 INFO  (jetty-launcher-3-thread-2) [n:127.0.0.1:52142_solr    ] o.a.s.c.Overseer Overseer (id=null) closing
   [junit4]   2> 17239 INFO  (jetty-launcher-3-thread-2) [n:127.0.0.1:52142_solr    ] o.a.s.c.ZkController Register node as live in ZooKeeper:/live_nodes/127.0.0.1:52142_solr
   [junit4]   2> 17262 INFO  (zkCallback-33-thread-1-processing-n:127.0.0.1:52141_solr) [n:127.0.0.1:52141_solr    ] o.a.s.c.c.ZkStateReader Updated live nodes from ZooKeeper... (0) -> (3)
   [junit4]   2> 17262 INFO  (zkCallback-35-thread-1-processing-n:127.0.0.1:52140_solr) [n:127.0.0.1:52140_solr    ] o.a.s.c.c.ZkStateReader Updated live nodes from ZooKeeper... (0) -> (3)
   [junit4]   2> 17262 INFO  (zkCallback-37-thread-1-processing-n:127.0.0.1:52143_solr) [n:127.0.0.1:52143_solr    ] o.a.s.c.c.ZkStateReader Updated live nodes from ZooKeeper... (0) -> (3)
   [junit4]   2> 17263 INFO  (zkCallback-31-thread-1-processing-n:127.0.0.1:52142_solr) [n:127.0.0.1:52142_solr    ] o.a.s.c.c.ZkStateReader Updated live nodes from ZooKeeper... (0) -> (3)
   [junit4]   2> 17524 INFO  (jetty-launcher-3-thread-3) [n:127.0.0.1:52143_solr    ] o.a.s.c.ZkController Register node as live in ZooKeeper:/live_nodes/127.0.0.1:52143_solr
   [junit4]   2> 17530 INFO  (zkCallback-37-thread-1-processing-n:127.0.0.1:52143_solr) [n:127.0.0.1:52143_solr    ] o.a.s.c.c.ZkStateReader Updated live nodes from ZooKeeper... (3) -> (4)
   [junit4]   2> 17530 INFO  (zkCallback-35-thread-1-processing-n:127.0.0.1:52140_solr) [n:127.0.0.1:52140_solr    ] o.a.s.c.c.ZkStateReader Updated live nodes from ZooKeeper... (3) -> (4)
   [junit4]   2> 17530 INFO  (zkCallback-31-thread-1-processing-n:127.0.0.1:52142_solr) [n:127.0.0.1:52142_solr    ] o.a.s.c.c.ZkStateReader Updated live nodes from ZooKeeper... (3) -> (4)
   [junit4]   2> 17530 INFO  (zkCallback-33-thread-1-processing-n:127.0.0.1:52141_solr) [n:127.0.0.1:52141_solr    ] o.a.s.c.c.ZkStateReader Updated live nodes from ZooKeeper... (3) -> (4)
   [junit4]   2> 17778 INFO  (jetty-launcher-3-thread-2) [n:127.0.0.1:52142_solr    ] o.a.s.m.r.SolrJmxReporter JMX monitoring for 'solr_52142.solr.node' (registry 'solr.node') enabled at server: com.sun.jmx.mbeanserver.JmxMBeanServer@7c1fb3da
   [junit4]   2> 17788 INFO  (jetty-launcher-3-thread-2) [n:127.0.0.1:52142_solr    ] o.a.s.m.r.SolrJmxReporter JMX monitoring for 'solr_52142.solr.jvm' (registry 'solr.jvm') enabled at server: com.sun.jmx.mbeanserver.JmxMBeanServer@7c1fb3da
   [junit4]   2> 17788 INFO  (jetty-launcher-3-thread-2) [n:127.0.0.1:52142_solr    ] o.a.s.m.r.SolrJmxReporter JMX monitoring for 'solr_52142.solr.jetty' (registry 'solr.jetty') enabled at server: com.sun.jmx.mbeanserver.JmxMBeanServer@7c1fb3da
   [junit4]   2> 17802 INFO  (jetty-launcher-3-thread-1) [n:127.0.0.1:52140_solr    ] o.a.s.m.r.SolrJmxReporter JMX monitoring for 'solr_52140.solr.node' (registry 'solr.node') enabled at server: com.sun.jmx.mbeanserver.JmxMBeanServer@7c1fb3da
   [junit4]   2> 17803 INFO  (jetty-launcher-3-thread-1) [n:127.0.0.1:52140_solr    ] o.a.s.m.r.SolrJmxReporter JMX monitoring for 'solr_52140.solr.jvm' (registry 'solr.jvm') enabled at server: com.sun.jmx.mbeanserver.JmxMBeanServer@7c1fb3da
   [junit4]   2> 17803 INFO  (jetty-launcher-3-thread-1) [n:127.0.0.1:52140_solr    ] o.a.s.m.r.SolrJmxReporter JMX monitoring for 'solr_52140.solr.jetty' (registry 'solr.jetty') enabled at server: com.sun.jmx.mbeanserver.JmxMBeanServer@7c1fb3da
   [junit4]   2> 17833 INFO  (jetty-launcher-3-thread-4) [n:127.0.0.1:52141_solr    ] o.a.s.m.r.SolrJmxReporter JMX monitoring for 'solr_52141.solr.node' (registry 'solr.node') enabled at server: com.sun.jmx.mbeanserver.JmxMBeanServer@7c1fb3da
   [junit4]   2> 17833 INFO  (jetty-launcher-3-thread-4) [n:127.0.0.1:52141_solr    ] o.a.s.m.r.SolrJmxReporter JMX monitoring for 'solr_52141.solr.jvm' (registry 'solr.jvm') enabled at server: com.sun.jmx.mbeanserver.JmxMBeanServer@7c1fb3da
   [junit4]   2> 17834 INFO  (jetty-launcher-3-thread-4) [n:127.0.0.1:52141_solr    ] o.a.s.m.r.SolrJmxReporter JMX monitoring for 'solr_52141.solr.jetty' (registry 'solr.jetty') enabled at server: com.sun.jmx.mbeanserver.JmxMBeanServer@7c1fb3da
   [junit4]   2> 17843 INFO  (jetty-launcher-3-thread-3) [n:127.0.0.1:52143_solr    ] o.a.s.m.r.SolrJmxReporter JMX monitoring for 'solr_52143.solr.node' (registry 'solr.node') enabled at server: com.sun.jmx.mbeanserver.JmxMBeanServer@7c1fb3da
   [junit4]   2> 17843 INFO  (jetty-launcher-3-thread-3) [n:127.0.0.1:52143_solr    ] o.a.s.m.r.SolrJmxReporter JMX monitoring for 'solr_52143.solr.jvm' (registry 'solr.jvm') enabled at server: com.sun.jmx.mbeanserver.JmxMBeanServer@7c1fb3da
   [junit4]   2> 17845 INFO  (jetty-launcher-3-thread-1) [n:127.0.0.1:52140_solr    ] o.a.s.c.CorePropertiesLocator Found 0 core definitions underneath /Users/jenkins/workspace/Lucene-Solr-7.x-MacOSX/solr/build/solr-solrj/test/J1/temp/solr.client.solrj.io.stream.StreamExpressionTest_7709C33AFEFFF840-001/tempDir-001/node1/.
   [junit4]   2> 17846 INFO  (jetty-launcher-3-thread-2) [n:127.0.0.1:52142_solr    ] o.a.s.c.CorePropertiesLocator Found 0 core definitions underneath /Users/jenkins/workspace/Lucene-Solr-7.x-MacOSX/solr/build/solr-solrj/test/J1/temp/solr.client.solrj.io.stream.StreamExpressionTest_7709C33AFEFFF840-001/tempDir-001/node2/.
   [junit4]   2> 17847 INFO  (jetty-launcher-3-thread-3) [n:127.0.0.1:52143_solr    ] o.a.s.m.r.SolrJmxReporter JMX monitoring for 'solr_52143.solr.jetty' (registry 'solr.jetty') enabled at server: com.sun.jmx.mbeanserver.JmxMBeanServer@7c1fb3da
   [junit4]   2> 17848 INFO  (jetty-launcher-3-thread-4) [n:127.0.0.1:52141_solr    ] o.a.s.c.CorePropertiesLocator Found 0 core definitions underneath /Users/jenkins/workspace/Lucene-Solr-7.x-MacOSX/solr/build/solr-solrj/test/J1/temp/solr.client.solrj.io.stream.StreamExpressionTest_7709C33AFEFFF840-001/tempDir-001/node4/.
   [junit4]   2> 17849 INFO  (jetty-launcher-3-thread-3) [n:127.0.0.1:52143_solr    ] o.a.s.c.CorePropertiesLocator Found 0 core definitions underneath /Users/jenkins/workspace/Lucene-Solr-7.x-MacOSX/solr/build/solr-solrj/test/J1/temp/solr.client.solrj.io.stream.StreamExpressionTest_7709C33AFEFFF840-001/tempDir-001/node3/.
   [junit4]   2> 18178 INFO  (zkConnectionManagerCallback-48-thread-1) [    ] o.a.s.c.c.ConnectionManager zkClient has connected
   [junit4]   2> 18187 INFO  (zkConnectionManagerCallback-52-thread-1) [    ] o.a.s.c.c.ConnectionManager zkClient has connected
   [junit4]   2> 18189 INFO  (SUITE-StreamExpressionTest-seed#[7709C33AFEFFF840]-worker) [    ] o.a.s.c.c.ZkStateReader Updated live nodes from ZooKeeper... (0) -> (4)
   [junit4]   2> 18190 INFO  (SUITE-StreamExpressionTest-seed#[7709C33AFEFFF840]-worker) [    ] o.a.s.c.s.i.ZkClientClusterStateProvider Cluster at 127.0.0.1:52123/solr ready
   [junit4]   2> 18813 INFO  (qtp1702888122-58) [n:127.0.0.1:52141_solr    ] o.a.s.h.a.CollectionsHandler Invoked Collection Action :create with params replicationFactor=1&collection.configName=conf&name=collection1_collection&nrtReplicas=1&action=CREATE&numShards=2&wt=javabin&version=2 and sendToOCPQueue=true
   [junit4]   2> 18854 INFO  (OverseerThreadFactory-33-thread-1-processing-n:127.0.0.1:52143_solr) [n:127.0.0.1:52143_solr    ] o.a.s.c.CreateCollectionCmd Create collection collection1_collection
   [junit4]   2> 19010 INFO  (OverseerStateUpdate-99186503462813708-127.0.0.1:52143_solr-n_0000000000) [n:127.0.0.1:52143_solr    ] o.a.s.c.o.SliceMutator createReplica() {
   [junit4]   2>   "operation":"ADDREPLICA",
   [junit4]   2>   "collection":"collection1_collection",
   [junit4]   2>   "shard":"shard1",
   [junit4]   2>   "core":"collection1_collection_shard1_replica_n1",
   [junit4]   2>   "state":"down",
   [junit4]   2>   "base_url":"http://127.0.0.1:52142/solr",
   [junit4]   2>   "type":"NRT",
   [junit4]   2>   "waitForFinalState":"false"} 
   [junit4]   2> 19017 INFO  (OverseerStateUpdate-99186503462813708-127.0.0.1:52143_solr-n_0000000000) [n:127.0.0.1:52143_solr    ] o.a.s.c.o.SliceMutator createReplica() {
   [junit4]   2>   "operation":"ADDREPLICA",
   [junit4]   2>   "collection":"collection1_collection",
   [junit4]   2>   "shard":"shard2",
   [junit4]   2>   "core":"collection1_collection_shard2_replica_n2",
   [junit4]   2>   "state":"down",
   [junit4]   2>   "base_url":"http://127.0.0.1:52143/solr",
   [junit4]   2>   "type":"NRT",
   [junit4]   2>   "waitForFinalState":"false"} 
   [junit4]   2> 19249 INFO  (qtp41083760-54) [n:127.0.0.1:52143_solr    ] o.a.s.h.a.CoreAdminOperation core create command qt=/admin/cores&coreNodeName=core_node4&collection.configName=conf&newCollection=true&name=collection1_collection_shard2_replica_n2&action=CREATE&numShards=2&collection=collection1_collection&shard=shard2&wt=javabin&version=2&replicaType=NRT
   [junit4]   2> 19249 INFO  (qtp302039255-75) [n:127.0.0.1:52142_solr    ] o.a.s.h.a.CoreAdminOperation core create command qt=/admin/cores&coreNodeName=core_node3&collection.configName=conf&newCollection=true&name=collection1_collection_shard1_replica_n1&action=CREATE&numShards=2&collection=collection1_collection&shard=shard1&wt=javabin&version=2&replicaType=NRT
   [junit4]   2> 19250 INFO  (qtp302039255-75) [n:127.0.0.1:52142_solr    ] o.a.s.c.TransientSolrCoreCacheDefault Allocating transient cache for 2147483647 transient cores
   [junit4]   2> 19250 INFO  (qtp41083760-54) [n:127.0.0.1:52143_solr    ] o.a.s.c.TransientSolrCoreCacheDefault Allocating transient cache for 2147483647 transient cores
   [junit4]   2> 19387 INFO  (zkCallback-37-thread-1-processing-n:127.0.0.1:52143_solr) [n:127.0.0.1:52143_solr    ] o.a.s.c.c.ZkStateReader A cluster state change: [WatchedEvent state:SyncConnected type:NodeDataChanged path:/collections/collection1_collection/state.json] for collection [collection1_collection] has occurred - updating... (live nodes size: [4])
   [junit4]   2> 19387 INFO  (zkCallback-37-thread-2-processing-n:127.0.0.1:52143_solr) [n:127.0.0.1:52143_solr    ] o.a.s.c.c.ZkStateReader A cluster state change: [WatchedEvent state:SyncConnected type:NodeDataChanged path:/collections/collection1_collection/state.json] for collection [collection1_collection] has occurred - updating... (live nodes size: [4])
   [junit4]   2> 19387 INFO  (zkCallback-31-thread-1-processing-n:127.0.0.1:52142_solr) [n:127.0.0.1:52142_solr    ] o.a.s.c.c.ZkStateReader A cluster state change: [WatchedEvent state:SyncConnected type:NodeDataChanged path:/collections/collection1_collection/state.json] for collection [collection1_collection] has occurred - updating... (live nodes size: [4])
   [junit4]   2> 19388 INFO  (zkCallback-31-thread-2-processing-n:127.0.0.1:52142_solr) [n:127.0.0.1:52142_solr    ] o.a.s.c.c.ZkStateReader A cluster state change: [WatchedEvent state:SyncConnected type:NodeDataChanged path:/collections/collection1_collection/state.json] for collection [collection1_collection] has occurred - updating... (live nodes size: [4])
   [junit4]   2> 20302 INFO  (qtp302039255-75) [n:127.0.0.1:52142_solr c:collection1_collection s:shard1 r:core_node3 x:collection1_collection_shard1_replica_n1] o.a.s.c.SolrConfig Using Lucene MatchVersion: 7.3.0
   [junit4]   2> 20307 INFO  (qtp41083760-54) [n:127.0.0.1:52143_solr c:collection1_collection s:shard2 r:core_node4 x:collection1_collection_shard2_replica_n2] o.a.s.c.SolrConfig Using Lucene MatchVersion: 7.3.0
   [junit4]   2> 20338 INFO  (qtp302039255-75) [n:127.0.0.1:52142_solr c:collection1_collection s:shard1 r:core_node3 x:collection1_collection_shard1_replica_n1] o.a.s.s.IndexSchema [collection1_collection_shard1_replica_n1] Schema name=test
   [junit4]   2> 20340 INFO  (qtp41083760-54) [n:127.0.0.1:52143_solr c:collection1_collection s:shard2 r:core_node4 x:collection1_collection_shard2_replica_n2] o.a.s.s.IndexSchema [collection1_collection_shard2_replica_n2] Schema name=test
   [junit4]   2> 20479 WARN  (qtp41083760-54) [n:127.0.0.1:52143_solr c:collection1_collection s:shard2 r:core_node4 x:collection1_collection_shard2_replica_n2] o.a.s.c.SolrResourceLoader Solr loaded a deprecated plugin/analysis class [solr.GeoHashField]. Please consult documentation how to replace it accordingly.
   [junit4]   2> 20493 WARN  (qtp41083760-54) [n:127.0.0.1:52143_solr c:collection1_collection s:shard2 r:core_node4 x:collection1_collection_shard2_replica_n2] o.a.s.c.SolrResourceLoader Solr loaded a deprecated plugin/analysis class [solr.LatLonType]. Please consult documentation how to replace it accordingly.
   [junit4]   2> 20499 WARN  (qtp41083760-54) [n:127.0.0.1:52143_solr c:collection1_collection s:shard2 r:core_node4 x:collection1_collection_shard2_replica_n2] o.a.s.s.IndexSchema Field lowerfilt1and2 is not multivalued and destination for multiple copyFields (2)
   [junit4]   2> 20499 WARN  (qtp41083760-54) [n:127.0.0.1:52143_solr c:collection1_collection s:shard2 r:core_node4 x:collection1_collection_shard2_replica_n2] o.a.s.s.IndexSchema Field text is not multivalued and destination for multiple copyFields (3)
   [junit4]   2> 20500 INFO  (qtp41083760-54) [n:127.0.0.1:52143_solr c:collection1_collection s:shard2 r:core_node4 x:collection1_collection_shard2_replica_n2] o.a.s.s.IndexSchema Loaded schema test/1.6 with uniqueid field id
   [junit4]   2> 20501 WARN  (qtp302039255-75) [n:127.0.0.1:52142_solr c:collection1_collection s:shard1 r:core_node3 x:collection1_collection_shard1_replica_n1] o.a.s.s.IndexSchema Field lowerfilt1and2 is not multivalued and destination for multiple copyFields (2)
   [junit4]   2> 20501 WARN  (qtp302039255-75) [n:127.0.0.1:52142_solr c:collection1_collection s:shard1 r:core_node3 x:collection1_collection_shard1_replica_n1] o.a.s.s.IndexSchema Field text is not multivalued and destination for multiple copyFields (3)
   [junit4]   2> 20501 INFO  (qtp302039255-75) [n:127.0.0.1:52142_solr c:collection1_collection s:shard1 r:core_node3 x:collection1_collection_shard1_replica_n1] o.a.s.s.IndexSchema Loaded schema test/1.6 with uniqueid field id
   [junit4]   2> 20504 INFO  (qtp41083760-54) [n:127.0.0.1:52143_solr c:collection1_collection s:shard2 r:core_node4 x:collection1_collection_shard2_replica_n2] o.a.s.c.CoreContainer Creating SolrCore 'collection1_collection_shard2_replica_n2' using configuration from collection collection1_collection, trusted=true
   [junit4]   2> 20504 INFO  (qtp302039255-75) [n:127.0.0.1:52142_solr c:collection1_collection s:shard1 r:core_node3 x:collection1_collection_shard1_replica_n1] o.a.s.c.CoreContainer Creating SolrCore 'collection1_collection_shard1_replica_n1' using configuration from collection collection1_collection, trusted=true
   [junit4]   2> 20506 INFO  (qtp302039255-75) [n:127.0.0.1:52142_solr c:collection1_collection s:shard1 r:core_node3 x:collection1_collection_shard1_replica_n1] o.a.s.m.r.SolrJmxReporter JMX monitoring for 'solr_52142.solr.core.collection1_collection.shard1.replica_n1' (registry 'solr.core.collection1_collection.shard1.replica_n1') enabled at server: com.sun.jmx.mbeanserver.JmxMBeanServer@7c1fb3da
   [junit4]   2> 20506 INFO  (qtp41083760-54) [n:127.0.0.1:52143_solr c:collection1_collection s:shard2 r:core_node4 x:collection1_collection_shard2_replica_n2] o.a.s.m.r.SolrJmxReporter JMX monitoring for 'solr_52143.solr.core.collection1_collection.shard2.replica_n2' (registry 'solr.core.collection1_collection.shard2.replica_n2') enabled at server: com.sun.jmx.mbeanserver.JmxMBeanServer@7c1fb3da
   [junit4]   2> 20506 INFO  (qtp302039255-75) [n:127.0.0.1:52142_solr c:collection1_collection s:shard1 r:core_node3 x:collection1_collection_shard1_replica_n1] o.a.s.c.SolrCore solr.RecoveryStrategy.Builder
   [junit4]   2> 20506 INFO  (qtp41083760-54) [n:127.0.0.1:52143_solr c:collection1_collection s:shard2 r:core_node4 x:collection1_collection_shard2_replica_n2] o.a.s.c.SolrCore solr.RecoveryStrategy.Builder
   [junit4]   2> 20506 INFO  (qtp302039255-75) [n:127.0.0.1:52142_solr c:collection1_collection s:shard1 r:core_node3 x:collection1_collection_shard1_replica_n1] o.a.s.c.SolrCore [[collection1_collection_shard1_replica_n1] ] Opening new SolrCore at [/Users/jenkins/workspace/Lucene-Solr-7.x-MacOSX/solr/build/solr-solrj/test/J1/temp/solr.client.solrj.io.stream.StreamExpressionTest_7709C33AFEFFF840-001/tempDir-001/node2/collection1_collection_shard1_replica_n1], dataDir=[/Users/jenkins/workspace/Lucene-Solr-7.x-MacOSX/solr/build/solr-solrj/test/J1/temp/solr.client.solrj.io.stream.StreamExpressionTest_7709C33AFEFFF840-001/tempDir-001/node2/./collection1_collection_shard1_replica_n1/data/]
   [junit4]   2> 20506 INFO  (qtp41083760-54) [n:127.0.0.1:52143_solr c:collection1_collection s:shard2 r:core_node4 x:collection1_collection_shard2_replica_n2] o.a.s.c.SolrCore [[collection1_collection_shard2_replica_n2] ] Opening new SolrCore at [/Users/jenkins/workspace/Lucene-Solr-7.x-MacOSX/solr/build/solr-solrj/test/J1/temp/solr.client.solrj.io.stream.StreamExpressionTest_7709C33AFEFFF840-001/tempDir-001/node3/collection1_collection_shard2_replica_n2], dataDir=[/Users/jenkins/workspace/Lucene-Solr-7.x-MacOSX/solr/build/solr-solrj/test/J1/temp/solr.client.solrj.io.stream.StreamExpressionTest_7709C33AFEFFF840-001/tempDir-001/node3/./collection1_collection_shard2_replica_n2/data/]
   [junit4]   2> 20602 INFO  (qtp41083760-54) [n:127.0.0.1:52143_solr c:collection1_collection s:shard2 r:core_node4 x:collection1_collection_shard2_replica_n2] o.a.s.u.UpdateHandler Using UpdateLog implementation: org.apache.solr.update.UpdateLog
   [junit4]   2> 20602 INFO  (qtp41083760-54) [n:127.0.0.1:52143_solr c:collection1_collection s:shard2 r:core_node4 x:collection1_collection_shard2_replica_n2] o.a.s.u.UpdateLog Initializing UpdateLog: dataDir= defaultSyncLevel=FLUSH numRecordsToKeep=100 maxNumLogsToKeep=10 numVersionBuckets=65536
   [junit4]   2> 20603 INFO  (qtp41083760-54) [n:127.0.0.1:52143_solr c:collection1_collection s:shard2 r:core_node4 x:collection1_collection_shard2_replica_n2] o.a.s.u.CommitTracker Hard AutoCommit: disabled
   [junit4]   2> 20603 INFO  (qtp41083760-54) [n:127.0.0.1:52143_solr c:collection1_collection s:shard2 r:core_node4 x:collection1_collection_shard2_replica_n2] o.a.s.u.CommitTracker Soft AutoCommit: disabled
   [junit4]   2> 20605 INFO  (qtp302039255-75) [n:127.0.0.1:52142_solr c:collection1_collection s:shard1 r:core_node3 x:collection1_collection_shard1_replica_n1] o.a.s.u.UpdateHandler Using UpdateLog implementation: org.apache.solr.update.UpdateLog
   [junit4]   2> 20605 INFO  (qtp302039255-75) [n:127.0.0.1:52142_solr c:collection1_collection s:shard1 r:core_node3 x:collection1_collection_shard1_replica_n1] o.a.s.u.UpdateLog Initializing UpdateLog: dataDir= defaultSyncLevel=FLUSH numRecordsToKeep=100 maxNumLogsToKeep=10 numVersionBuckets=65536
   [junit4]   2> 20606 INFO  (qtp41083760-54) [n:127.0.0.1:52143_solr c:collection1_collection s:shard2 r:core_node4 x:collection1_collection_shard2_replica_n2] o.a.s.s.SolrIndexSearcher Opening [Searcher@66bfdedf[collection1_collection_shard2_replica_n2] main]
   [junit4]   2> 20615 INFO  (qtp302039255-75) [n:127.0.0.1:52142_solr c:collection1_collection s:shard1 r:core_node3 x:collection1_collection_shard1_replica_n1] o.a.s.u.CommitTracker Hard AutoCommit: disabled
   [junit4]   2> 20616 INFO  (qtp302039255-75) [n:127.0.0.1:52142_solr c:collection1_collection s:shard1 r:core_node3 x:collection1_collection_shard1_replica_n1] o.a.s.u.CommitTracker Soft AutoCommit: disabled
   [junit4]   2> 20621 INFO  (qtp302039255-75) [n:127.0.0.1:52142_solr c:collection1_collection s:shard1 r:core_node3 x:collection1_collection_shard1_replica_n1] o.a.s.s.SolrIndexSearcher Opening [Searcher@5c509701[collection1_collection_shard1_replica_n1] main]
   [junit4]   2> 20622 INFO  (qtp41083760-54) [n:127.0.0.1:52143_solr c:collection1_collection s:shard2 r:core_node4 x:collection1_collection_shard2_replica_n2] o.a.s.r.ManagedResourceStorage Configured ZooKeeperStorageIO with znodeBase: /configs/conf
   [junit4]   2> 20622 INFO  (qtp41083760-54) [n:127.0.0.1:52143_solr c:collection1_collection s:shard2 r:core_node4 x:collection1_collection_shard2_replica_n2] o.a.s.r.ManagedResourceStorage Loaded null at path _rest_managed.json using ZooKeeperStorageIO:path=/configs/conf
   [junit4]   2> 20623 INFO  (qtp41083760-54) [n:127.0.0.1:52143_solr c:collection1_collection s:shard2 r:core_node4 x:collection1_collection_shard2_replica_n2] o.a.s.h.ReplicationHandler Commits will be reserved for 10000ms.
   [junit4]   2> 20623 INFO  (qtp302039255-75) [n:127.0.0.1:52142_solr c:collection1_collection s:shard1 r:core_node3 x:collection1_collection_shard1_replica_n1] o.a.s.r.ManagedResourceStorage Configured ZooKeeperStorageIO with znodeBase: /configs/conf
   [junit4]   2> 20623 INFO  (qtp302039255-75) [n:127.0.0.1:52142_solr c:collection1_collection s:shard1 r:core_node3 x:collection1_collection_shard1_replica_n1] o.a.s.r.ManagedResourceStorage Loaded null at path _rest_managed.json using ZooKeeperStorageIO:path=/configs/conf
   [junit4]   2> 20623 INFO  (qtp302039255-75) [n:127.0.0.1:52142_solr c:collection1_collection s:shard1 r:core_node3 x:collection1_collection_shard1_replica_n1] o.a.s.h.ReplicationHandler Commits will be reserved for 10000ms.
   [junit4]   2> 20634 INFO  (searcherExecutor-42-thread-1-processing-n:127.0.0.1:52143_solr x:collection1_collection_shard2_replica_n2 s:shard2 c:collection1_collection r:core_node4) [n:127.0.0.1:52143_solr c:collection1_collection s:shard2 r:core_node4 x:collection1_collection_shard2_replica_n2] o.a.s.c.SolrCore [collection1_collection_shard2_replica_n2] Registered new searcher Searcher@66bfdedf[collection1_collection_shard2_replica_n2] main{ExitableDirectoryReader(UninvertingDirectoryReader())}
   [junit4]   2> 20634 INFO  (searcherExecutor-43-thread-1-processing-n:127.0.0.1:52142_solr x:collection1_collection_shard1_replica_n1 s:shard1 c:collection1_collection r:core_node3) [n:127.0.0.1:52142_solr c:collection1_collection s:shard1 r:core_node3 x:collection1_collection_shard1_replica_n1] o.a.s.c.SolrCore [collection1_collection_shard1_replica_n1] Registered new searcher Searcher@5c509701[collection1_collection_shard1_replica_n1] main{ExitableDirectoryReader(UninvertingDirectoryReader())}
   [junit4]   2> 20636 INFO  (qtp41083760-54) [n:127.0.0.1:52143_solr c:collection1_collection s:shard2 r:core_node4 x:collection1_collection_shard2_replica_n2] o.a.s.u.UpdateLog Could not find max version in index or recent updates, using new clock 1586984061881024512
   [junit4]   2> 20637 INFO  (qtp302039255-75) [n:127.0.0.1:52142_solr c:collection1_collection s:shard1 r:core_node3 x:collection1_collection_shard1_replica_n1] o.a.s.u.UpdateLog Could not find max version in index or recent updates, using new clock 1586984061882073088
   [junit4]   2> 20664 INFO  (qtp302039255-75) [n:127.0.0.1:52142_solr c:collection1_collection s:shard1 r:core_node3 x:collection1_collection_shard1_replica_n1] o.a.s.c.ShardLeaderElectionContext Enough replicas found to continue.
   [junit4]   2> 20664 INFO  (qtp41083760-54) [n:127.0.0.1:52143_solr c:collection1_collection s:shard2 r:core_node4 x:collection1_collection_shard2_replica_n2] o.a.s.c.ShardLeaderElectionContext Enough replicas found to continue.
   [junit4]   2> 20665 INFO  (qtp41083760-54) [n:127.0.0.1:52143_solr c:collection1_collection s:shard2 r:core_node4 x:collection1_collection_shard2_replica_n2] o.a.s.c.ShardLeaderElectionContext I may be the new leader - try and sync
   [junit4]   2> 20665 INFO  (qtp302039255-75) [n:127.0.0.1:52142_solr c:collection1_collection s:shard1 r:core_node3 x:collection1_collection_shard1_replica_n1] o.a.s.c.ShardLeaderElectionContext I may be the new leader - try and sync
   [junit4]   2> 20667 INFO  (qtp302039255-75) [n:127.0.0.1:52142_solr c:collection1_collection s:shard1 r:core_node3 x:collection1_collection_shard1_replica_n1] o.a.s.c.SyncStrategy Sync replicas to http://127.0.0.1:52142/solr/collection1_collection_shard1_replica_n1/
   [junit4]   2> 20667 INFO  (qtp41083760-54) [n:127.0.0.1:52143_solr c:collection1_collection s:shard2 r:core_node4 x:collection1_collection_shard2_replica_n2] o.a.s.c.SyncStrategy Sync replicas to http://127.0.0.1:52143/solr/collection1_collection_shard2_replica_n2/
   [junit4]   2> 20669 INFO  (qtp302039255-75) [n:127.0.0.1:52142_solr c:collection1_collection s:shard1 r:core_node3 x:collection1_collection_shard1_replica_n1] o.a.s.c.SyncStrategy Sync Success - now sync replicas to me
   [junit4]   2> 20669 INFO  (qtp41083760-54) [n:127.0.0.1:52143_solr c:collection1_collection s:shard2 r:core_node4 x:collection1_collection_shard2_replica_n2] o.a.s.c.SyncStrategy Sync Success - now sync replicas to me
   [junit4]   2> 20669 INFO  (qtp302039255-75) [n:127.0.0.1:52142_solr c:collection1_collection s:shard1 r:core_node3 x:collection1_collection_shard1_replica_n1] o.a.s.c.SyncStrategy http://127.0.0.1:52142/solr/collection1_collection_shard1_replica_n1/ has no replicas
   [junit4]   2> 20669 INFO  (qtp41083760-54) [n:127.0.0.1:52143_solr c:collection1_collection s:shard2 r:core_node4 x:collection1_collection_shard2_replica_n2] o.a.s.c.SyncStrategy http://127.0.0.1:52143/solr/collection1_collection_shard2_replica_n2/ has no replicas
   [junit4]   2> 20669 INFO  (qtp302039255-75) [n:127.0.0.1:52142_solr c:collection1_collection s:shard1 r:core_node3 x:collection1_collection_shard1_replica_n1] o.a.s.c.ShardLeaderElectionContext Found all replicas participating in election, clear LIR
   [junit4]   2> 20669 INFO  (qtp41083760-54) [n:127.0.0.1:52143_solr c:collection1_collection s:shard2 r:core_node4 x:collection1_collection_shard2_replica_n2] o.a.s.c.ShardLeaderElectionContext Found all replicas participating in election, clear LIR
   [junit4]   2> 20689 INFO  (qtp41083760-54) [n:127.0.0.1:52143_solr c:collection1_collection s:shard2 r:core_node4 x:collection1_collection_shard2_replica_n2] o.a.s.c.ShardLeaderElectionContext I am the new leader: http://127.0.0.1:52143/solr/collection1_collection_shard2_replica_n2/ shard2
   [junit4]   2> 20693 INFO  (qtp302039255-75) [n:127.0.0.1:52142_solr c:collection1_collection s:shard1 r:core_node3 x:collection1_collection_shard1_replica_n1] o.a.s.c.ShardLeaderElectionContext I am the new leader: http://127.0.0.1:52142/solr/collection1_collection_shard1_replica_n1/ shard1
   [junit4]   2> 20802 INFO  (zkCallback-37-thread-2-processing-n:127.0.0.1:52143_solr) [n:127.0.0.1:52143_solr    ] o.a.s.c.c.ZkStateReader A cluster state change: [WatchedEvent state:SyncConnected type:NodeDataChanged path:/collections/collection1_collection/state.json] for collection [collection1_collection] has occurred - updating... (live nodes size: [4])
   [junit4]   2> 20802 INFO  (zkCallback-37-thread-3-processing-n:127.0.0.1:52143_solr) [n:127.0.0.1:52143_solr    ] o.a.s.c.c.ZkStateReader A cluster state change: [WatchedEvent state:SyncConnected type:NodeDataChanged path:/collections/collection1_collection/state.json] for collection [collection1_collection] has occurred - updating... (live nodes size: [4])
   [junit4]   2> 20802 INFO  (zkCallback-31-thread-2-processing-n:127.0.0.1:52142_solr) [n:127.0.0.1:52142_solr    ] o.a.s.c.c.ZkStateReader A cluster state change: [WatchedEvent state:SyncConnected type:NodeDataChanged path:/collections/collection1_collection/state.json] for collection [collection1_collection] has occurred - updating... (live nodes size: [4])
   [junit4]   2> 20802 INFO  (zkCallback-31-thread-1-processing-n:127.0.0.1:52142_solr) [n:127.0.0.1:52142_solr    ] o.a.s.c.c.ZkStateReader A cluster state change: [WatchedEvent state:SyncConnected type:NodeDataChanged path:/collections/collection1_collection/state.json] for collection [collection1_collection] has occurred - updating... (live nodes size: [4])
   [junit4]   2> 20806 INFO  (qtp302039255-75) [n:127.0.0.1:52142_solr c:collection1_collection s:shard1 r:core_node3 x:collection1_collection_shard1_replica_n1] o.a.s.c.ZkController I am the leader, no recovery necessary
   [junit4]   2> 20821 INFO  (qtp302039255-75) [n:127.0.0.1:52142_solr c:collection1_collection s:shard1 r:core_node3 x:collection1_collection_shard1_replica_n1] o.a.s.s.HttpSolrCall [admin] webapp=null path=/admin/cores params={qt=/admin/cores&coreNodeName=core_node3&collection.configName=conf&newCollection=true&name=collection1_collection_shard1_replica_n1&action=CREATE&numShards=2&collection=collection1_collection&shard=shard1&wt=javabin&version=2&replicaType=NRT} status=0 QTime=1575
   [junit4]   2> 20846 INFO  (qtp41083760-54) [n:127.0.0.1:52143_solr c:collection1_collection s:shard2 r:core_node4 x:collection1_collection_shard2_replica_n2] o.a.s.c.ZkController I am the leader, no recovery necessary
   [junit4]   2> 20849 INFO  (qtp41083760-54) [n:127.0.0.1:52143_solr c:collection1_collection s:shard2 r:core_node4 x:collection1_collection_shard2_replica_n2] o.a.s.s.HttpSolrCall [admin] webapp=null path=/admin/cores params={qt=/admin/cores&coreNodeName=core_node4&collection.configName=conf&newCollection=true&name=collection1_collection_shard2_replica_n2&action=CREATE&numShards=2&collection=collection1_collection&shard=shard2&wt=javabin&version=2&replicaType=NRT} status=0 QTime=1603
   [junit4]   2> 20922 INFO  (qtp1702888122-58) [n:127.0.0.1:52141_solr    ] o.a.s.h.a.CollectionsHandler Wait for new collection to be active for at most 30 seconds. Check all shard replicas
   [junit4]   2> 20955 INFO  (zkCallback-31-thread-1-processing-n:127.0.0.1:52142_solr) [n:127.0.0.1:52142_solr    ] o.a.s.c.c.ZkStateReader A cluster state change: [WatchedEvent state:SyncConnected type:NodeDataChanged path:/collections/collection1_collection/state.json] for collection [collection1_collection] has occurred - updating... (live nodes size: [4])
   [junit4]   2> 20955 INFO  (zkCallback-37-thread-1-processing-n:127.0.0.1:52143_solr) [n:127.0.0.1:52143_solr    ] o.a.s.c.c.ZkStateReader A cluster state change: [WatchedEvent state:SyncConnected type:NodeDataChanged path:/collections/collection1_collection/state.json] for collection [collection1_collection] has occurred - updating... (live nodes size: [4])
   [junit4]   2> 20955 INFO  (zkCallback-37-thread-3-processing-n:127.0.0.1:52143_solr) [n:127.0.0.1:52143_solr    ] o.a.s.c.c.ZkStateReader A cluster state change: [WatchedEvent state:SyncConnected type:NodeDataChanged path:/collections/collection1_collection/state.json] for collection [collection1_collection] has occurred - updating... (live nodes size: [4])
   [junit4]   2> 20955 INFO  (zkCallback-31-thread-2-processing-n:127.0.0.1:52142_solr) [n:127.0.0.1:52142_solr    ] o.a.s.c.c.ZkStateReader A cluster state change: [WatchedEvent state:SyncConnected type:NodeDataChanged path:/collections/collection1_collection/state.json] for collection [collection1_collection] has occurred - updating... (live nodes size: [4])
   [junit4]   2> 21925 INFO  (qtp1702888122-58) [n:127.0.0.1:52141_solr    ] o.a.s.s.HttpSolrCall [admin] webapp=null path=/admin/collections params={replicationFactor=1&collection.configName=conf&name=collection1_collection&nrtReplicas=1&action=CREATE&numShards=2&wt=javabin&version=2} status=0 QTime=3115
   [junit4]   2> 21938 INFO  (SUITE-StreamExpressionTest-seed#[7709C33AFEFFF840]-worker) [    ] o.a.s.c.AbstractDistribZkTestBase Wait for recoveries to finish - collection: collection1_collection failOnTimeout:true timeout (sec):90
   [junit4]   2> 21939 INFO  (SUITE-StreamExpressionTest-seed#[7709C33AFEFFF840]-worker) [    ] o.a.s.c.AbstractDistribZkTestBase Recoveries finished - collection: collection1_collection
   [junit4]   2> 21943 INFO  (qtp1702888122-66) [n:127.0.0.1:52141_solr    ] o.a.s.h.a.CollectionsHandler Invoked Collection Action :createalias with params collections=collection1_collection&name=collection1&action=CREATEALIAS&wt=javabin&version=2 and sendToOCPQueue=true
   [junit4]   2> 21948 INFO  (OverseerCollectionConfigSetProcessor-99186503462813708-127.0.0.1:52143_solr-n_0000000000) [n:127.0.0.1:52143_solr    ] o.a.s.c.OverseerTaskQueue Response ZK path: /overseer/collection-queue-work/qnr-0000000000 doesn't exist.  Requestor may have disconnected from ZooKeeper
   [junit4]   2> 22061 INFO  (qtp1702888122-66) [n:127.0.0.1:52141_solr    ] o.a.s.s.HttpSolrCall [admin] webapp=null path=/admin/collections params={collections=collection1_collection&name=collection1&action=CREATEALIAS&wt=javabin&version=2} status=0 QTime=117
   [junit4]   2> 22097 INFO  (TEST-StreamExpressionTest.testListStream-seed#[7709C33AFEFFF840]) [    ] o.a.s.SolrTestCaseJ4 ###Starting testListStream
   [junit4]   2> 22211 INFO  (qtp302039255-76) [n:127.0.0.1:52142_solr c:collection1_collection s:shard1 r:core_node3 x:collection1_collection_shard1_replica_n1] o.a.s.u.p.LogUpdateProcessorFactory [collection1_collection_shard1_replica_n1]  webapp=/solr path=/update params={update.distrib=TOLEADER&distrib.from=http://127.0.0.1:52143/solr/collection1_collection_shard2_replica_n2/&wt=javabin&version=2}{deleteByQuery=*:* (-1586984063525191680)} 0 9
   [junit4]   2> 22217 INFO  (qtp41083760-59) [n:127.0.0.1:52143_solr c:collection1_collection s:shard2 r:core_node4 x:collection1_collection_shard2_replica_n2] o.a.s.u.DirectUpdateHandler2 start commit{_version_=1586984063538823168,optimize=false,openSearcher=true,waitSearcher=true,expungeDeletes=false,softCommit=false,prepareCommit=false}
   [junit4]   2> 22217 INFO  (qtp302039255-77) [n:127.0.0.1:52142_solr c:collection1_collection s:shard1 r:core_node3 x:collection1_collection_shard1_replica_n1] o.a.s.u.DirectUpdateHandler2 start commit{_version_=1586984063538823168,optimize=false,openSearcher=true,waitSearcher=true,expungeDeletes=false,softCommit=false,prepareCommit=false}
   [junit4]   2> 22217 INFO  (qtp41083760-59) [n:127.0.0.1:52143_solr c:collection1_collection s:shard2 r:core_node4 x:collection1_collection_shard2_replica_n2] o.a.s.u.DirectUpdateHandler2 No uncommitted changes. Skipping IW.commit.
   [junit4]   2> 22217 INFO  (qtp302039255-77) [n:127.0.0.1:52142_solr c:collection1_collection s:shard1 r:core_node3 x:collection1_collection_shard1_replica_n1] o.a.s.u.DirectUpdateHandler2 No uncommitted changes. Skipping IW.commit.
   [junit4]   2> 22219 INFO  (qtp41083760-59) [n:127.0.0.1:52143_solr c:collection1_collection s:shard2 r:core_node4 x:collection1_collection_shard2_replica_n2] o.a.s.u.DirectUpdateHandler2 end_commit_flush
   [junit4]   2> 22219 INFO  (qtp41083760-59) [n:127.0.0.1:52143_solr c:collection1_collection s:shard2 r:core_node4 x:collection1_collection_shard2_replica_n2] o.a.s.u.p.LogUpdateProcessorFactory [collection1_collection_shard2_replica_n2]  webapp=/solr path=/update params={update.distrib=FROMLEADER&waitSearcher=true&openSearcher=true&commit=true&softCommit=false&distrib.from=http://127.0.0.1:52143/solr/collection1_collection_shard2_replica_n2/&commit_end_point=true&wt=javabin&version=2&expungeDeletes=false}{commit=} 0 2
   [junit4]   2> 22224 INFO  (qtp302039255-77) [n:127.0.0.1:52142_solr c:collection1_collection s:shard1 r:core_node3 x:collection1_collection_shard1_replica_n1] o.a.s.u.DirectUpdateHandler2 end_commit_flush
   [junit4]   2> 22225 INFO  (qtp302039255-77) [n:127.0.0.1:52142_solr c:collection1_collection s:shard1 r:core_node3 x:collection1_collection_shard1_replica_n1] o.a.s.u.p.LogUpdateProcessorFactory [collection1_collection_shard1_replica_n1]  webapp=/solr path=/update params={update.distrib=FROMLEADER&waitSearcher=true&openSearcher=true&commit=true&softCommit=false&distrib.from=http://127.0.0.1:52143/solr/collection1_collection_shard2_replica_n2/&commit_end_point=true&wt=javabin&version=2&expungeDeletes=false}{commit=} 0 7
   [junit4]   2> 22229 INFO  (qtp41083760-56) [n:127.0.0.1:52143_solr c:collection1_collection s:shard2 r:core_node4 x:collection1_collection_shard2_replica_n2] o.a.s.u.p.LogUpdateProcessorFactory [collection1_collection_shard2_replica_n2]  webapp=/solr path=/update params={_stateVer_=collection1_collection:4&commit=true&wt=javabin&version=2}{deleteByQuery=*:* (-1586984063508414464),commit=} 0 112
   [junit4]   2> 22362 INFO  (qtp41083760-60) [n:127.0.0.1:52143_solr c:collection1_collection s:shard2 r:core_node4 x:collection1_collection_shard2_replica_n2] o.a.s.u.p.LogUpdateProcessorFactory [collection1_collection_shard2_replica_n2]  webapp=/solr path=/update params={_stateVer_=collection1_collection:4&wt=javabin&version=2}{add=[hello (1586984063561891840), hello1 (1586984063688769536), hello2 (1586984063689818112)]} 0 127
   [junit4]   2> 22366 INFO  (qtp302039255-78) [n:127.0.0.1:52142_solr c:collection1_collection s:shard1 r:core_node3 x:collection1_collection_shard1_replica_n1] o.a.s.u.DirectUpdateHandler2 start commit{_version_=1586984063695060992,optimize=false,openSearcher=true,waitSearcher=true,expungeDeletes=false,softCommit=false,prepareCommit=false}
   [junit4]   2> 22368 INFO  (qtp302039255-78) [n:127.0.0.1:52142_solr c:collection1_collection s:shard1 r:core_node3 x:collection1_collection_shard1_replica_n1] o.a.s.u.DirectUpdateHandler2 No uncommitted changes. Skipping IW.commit.
   [junit4]   2> 22368 INFO  (qtp302039255-78) [n:127.0.0.1:52142_solr c:collection1_collection s:shard1 r:core_node3 x:collection1_collection_shard1_replica_n1] o.a.s.u.DirectUpdateHandler2 end_commit_flush
   [junit4]   2> 22369 INFO  (qtp41083760-61) [n:127.0.0.1:52143_solr c:collection1_collection s:shard2 r:core_node4 x:collection1_collection_shard2_replica_n2] o.a.s.u.DirectUpdateHandler2 start commit{_version_=1586984063698206720,optimize=false,openSearcher=true,waitSearcher=true,expungeDeletes=false,softCommit=false,prepareCommit=false}
   [junit4]   2> 22369 INFO  (qtp302039255-78) [n:127.0.0.1:52142_solr c:collection1_collection s:shard1 r:core_node3 x:collection1_collection_shard1_replica_n1] o.a.s.u.p.LogUpdateProcessorFactory [collection1_collection_shard1_replica_n1]  webapp=/solr path=/update params={update.distrib=FROMLEADER&waitSearcher=true&openSearcher=true&commit=true&softCommit=false&distrib.from=http://127.0.0.1:52143/solr/collection1_collection_shard2_replica_n2/&commit_end_point=true&wt=javabin&version=2&expungeDeletes=false}{commit=} 0 2
   [junit4]   2> 22371 INFO  (qtp41083760-61) [n:127.0.0.1:52143_solr c:collection1_collection s:shard2 r:core_node4 x:collection1_collection_shard2_replica_n2] o.a.s.u.SolrIndexWriter Calling setCommitData with IW:org.apache.solr.update.SolrIndexWriter@79dfaf8a commitCommandVersion:1586984063698206720
   [junit4]   2> 22724 INFO  (qtp41083760-61) [n:127.0.0.1:52143_solr c:collection1_collection s:shard2 r:core_node4 x:collection1_collection_shard2_replica_n2] o.a.s.s.SolrIndexSearcher Opening [Searcher@6ec4e575[collection1_collection_shard2_replica_n2] main]
   [junit4]   2> 22727 INFO  (searcherExecutor-42-thread-1-processing-n:127.0.0.1:52143_solr x:collection1_collection_shard2_replica_n2 s:shard2 c:collection1_collection r:core_node4) [n:127.0.0.1:52143_solr c:collection1_collection s:shard2 r:core_node4 x:collection1_collection_shard2_replica_n2] o.a.s.c.SolrCore [collection1_collection_shard2_replica_n2] Registered new searcher Searcher@6ec4e575[collection1_collection_shard2_replica_n2] main{ExitableDirectoryReader(UninvertingDirectoryReader(Uninverting(_0(7.3.0):c3)))}
   [junit4]   2> 22734 INFO  (qtp41083760-61) [n:127.0.0.1:52143_solr c:collection1_collection s:shard2 r:core_node4 x:collection1_collection_shard2_replica_n2] o.a.s.u.DirectUpdateHandler2 end_commit_flush
   [junit4]   2> 22734 INFO  (qtp41083760-61) [n:127.0.0.1:52143_solr c:collection1_collection s:shard2 r:core_node4 x:collection1_collection_shard2_replica_n2] o.a.s.u.p.LogUpdateProcessorFactory [collection1_collection_shard2_replica_n2]  webapp=/solr path=/update params={update.distrib=FROMLEADER&waitSearcher=true&openSearcher=true&commit=true&softCommit=false&distrib.from=http://127.0.0.1:52143/solr/collection1_collection_shard2_replica_n2/&commit_end_point=true&wt=javabin&version=2&expungeDeletes=false}{commit=} 0 367
   [junit4]   2> 22736 INFO  (qtp41083760-60) [n:127.0.0.1:52143_solr c:collection1_collection s:shard2 r:core_node4 x:collection1_collection_shard2_replica_n2] o.a.s.u.p.LogUpdateProcessorFactory [collection1_collection_shard2_replica_n2]  webapp=/solr path=/update params={_stateVer_=collection1_collection:4&commit=true&wt=javabin&version=2}{commit=} 0 371
   [junit4]   2> 22754 INFO  (qtp1702888122-68) [n:127.0.0.1:52141_solr    ] o.a.s.c.TransientSolrCoreCacheDefault Allocating transient cache for 2147483647 transient cores
   [junit4]   2> 22789 INFO  (qtp302039255-80) [n:127.0.0.1:52142_solr c:collection1_collection s:shard1 r:core_node3 x:collection1_collection_shard1_replica_n1] o.a.s.c.S.Request [collection1_collection_shard1_replica_n1]  webapp=/solr path=/stream params={indent=off&expr=list(search(collection1,+q%3D"id:hello",++fl%3Did,+sort%3D"id+desc"),search(collection1,+q%3D"id:hello1",+fl%3Did,+sort%3D"id+desc"),search(collection1,+q%3D"id:hello2",+fl%3Did,+sort%3D"id+desc"))&wt=json&version=2.2} status=0 QTime=29
   [junit4]   2> 22806 INFO  (zkConnectionManagerCallback-56-thread-1-processing-n:127.0.0.1:52142_solr x:collection1_collection_shard1_replica_n1 s:shard1 c:collection1_collection r:core_node3) [n:127.0.0.1:52142_solr c:collection1_collection s:shard1 r:core_node3 x:collection1_collection_shard1_replica_n1] o.a.s.c.c.ConnectionManager zkClient has connected
   [junit4]   2> 22810 INFO  (qtp302039255-80) [n:127.0.0.1:52142_solr c:collection1_collection s:shard1 r:core_node3 x:collection1_collection_shard1_replica_n1] o.a.s.c.c.ZkStateReader Updated live nodes from ZooKeeper... (0) -> (4)
   [junit4]   2> 22813 INFO  (qtp302039255-80) [n:127.0.0.1:52142_solr c:collection1_collection s:shard1 r:core_node3 x:collection1_collection_shard1_replica_n1] o.a.s.c.s.i.ZkClientClusterStateProvider Cluster at 127.0.0.1:52123/solr ready
   [junit4]   2> 22860 INFO  (qtp302039255-49) [n:127.0.0.1:52142_solr c:collection1_collection s:shard1 r:core_node3 x:collection1_collection_shard1_replica_n1] o.a.s.c.S.Request [collection1_collection_shard1_replica_n1]  webapp=/solr path=/select params={q=id:hello&distrib=false&fl=id&sort=id+desc&wt=json&version=2.2} hits=0 status=0 QTime=36
   [junit4]   2> 22901 INFO  (qtp41083760-52) [n:127.0.0.1:52143_solr c:collection1_collection s:shard2 r:core_node4 x:collection1_collection_shard2_replica_n2] o.a.s.c.S.Request [collection1_collection_shard2_replica_n2]  webapp=/solr path=/select params={q=id:hello&distrib=false&fl=id&sort=id+desc&wt=json&version=2.2} hits=1 status=0 QTime=77
   [junit4]   2> 22915 INFO  (qtp41083760-56) [n:127.0.0.1:52143_solr c:collection1_collection s:shard2 r:core_node4 x:collection1_collection_shard2_replica_n2] o.a.s.c.S.Request [collection1_collection_shard2_replica_n2]  webapp=/solr path=/select params={q=id:hello1&distrib=false&fl=id&sort=id+desc&wt=json&version=2.2} hits=1 status=0 QTime=0
   [junit4]   2> 22915 INFO  (qtp302039255-77) [n:127.0.0.1:52142_solr c:collection1_collection s:shard1 r:core_node3 x:collection1_collection_shard1_replica_n1] o.a.s.c.S.Request [collection1_collection_shard1_replica_n1]  webapp=/solr path=/select params={q=id:hello1&distrib=false&fl=id&sort=id+desc&wt=json&version=2.2} hits=0 status=0 QTime=0
   [junit4]   2> 22923 INFO  (qtp302039255-75) [n:127.0.0.1:52142_solr c:collection1_collection s:shard1 r:core_node3 x:collection1_collection_shard1_replica_n1] o.a.s.c.S.Request [collection1_collection_shard1_replica_n1]  webapp=/solr path=/select params={q=id:hello2&distrib=false&fl=id&sort=id+desc&wt=json&version=2.2} hits=0 status=0 QTime=0
   [junit4]   2> 22923 INFO  (qtp41083760-57) [n:127.0.0.1:52143_solr c:collection1_collection s:shard2 r:core_node4 x:collection1_collection_shard2_replica_n2] o.a.s.c.S.Request [collection1_collection_shard2_replica_n2]  webapp=/solr path=/select params={q=id:hello2&distrib=false&fl=id&sort=id+desc&wt=json&version=2.2} hits=1 status=0 QTime=0
   [junit4]   2> 22936 INFO  (TEST-StreamExpressionTest.testListStream-seed#[7709C33AFEFFF840]) [    ] o.a.s.SolrTestCaseJ4 ###Ending testListStream
   [junit4]   2> 22981 INFO  (TEST-StreamExpressionTest.testPriorityStream-seed#[7709C33AFEFFF840]) [    ] o.a.s.SolrTestCaseJ4 ###Starting testPriorityStream
   [junit4]   2> 23080 INFO  (qtp41083760-54) [n:127.0.0.1:52143_solr c:collection1_collection s:shard2 r:core_node4 x:collection1_collection_shard2_replica_n2] o.a.s.s.SolrIndexSearcher Opening [Searcher@35a6a30c[collection1_collection_shard2_replica_n2] realtime]
   [junit4]   2> 23081 INFO  (qtp302039255-76) [n:127.0.0.1:52142_solr c:collection1_collection s:shard1 r:core_node3 x:collection1_collection_shard1_replica_n1] o.a.s.u.p.LogUpdateProcessorFactory [collection1_collection_shard1_replica_n1]  webapp=/solr path=/update params={update.distrib=TOLEADER&distrib.from=http://127.0.0.1:52143/solr/collection1_collection_shard2_replica_n2/&wt=javabin&version=2}{deleteByQuery=*:* (-1586984064344129536)} 0 96
   [junit4]   2> 23086 INFO  (qtp302039255-77) [n:127.0.0.1:52142_solr c:collection1_collection s:shard1 r:core_node3 x:collection1_collection_shard1_replica_n1] o.a.s.u.DirectUpdateHandler2 start commit{_version_=1586984064450035712,optimize=false,openSearcher=true,waitSearcher=true,expungeDeletes=false,softCommit=false,prepareCommit=false}
   [junit4]   2> 23086 INFO  (qtp41083760-56) [n:127.0.0.1:52143_solr c:collection1_collection s:shard2 r:core_node4 x:collection1_collection_shard2_replica_n2] o.a.s.u.DirectUpdateHandler2 start commit{_version_=1586984064450035712,optimize=false,openSearcher=true,waitSearcher=true,expungeDeletes=false,softCommit=false,prepareCommit=false}
   [junit4]   2> 23086 INFO  (qtp302039255-77) [n:127.0.0.1:52142_solr c:collection1_collection s:shard1 r:core_node3 x:collection1_collection_shard1_replica_n1] o.a.s.u.DirectUpdateHandler2 No uncommitted changes. Skipping IW.commit.
   [junit4]   2> 23087 INFO  (qtp41083760-56) [n:127.0.0.1:52143_solr c:collection1_collection s:shard2 r:core_node4 x:collection1_collection_shard2_replica_n2] o.a.s.u.SolrIndexWriter Calling setCommitData with IW:org.apache.solr.update.SolrIndexWriter@79dfaf8a commitCommandVersion:1586984064450035712
   [junit4]   2> 23088 INFO  (qtp302039255-77) [n:127.0.0.1:52142_solr c:collection1_collection s:shard1 r:core_node3 x:collection1_collection_shard1_replica_n1] o.a.s.u.DirectUpdateHandler2 end_commit_flush
   [junit4]   2> 23088 INFO  (qtp302039255-77) [n:127.0.0.1:52142_solr c:collection1_collection s:shard1 r:core_node3 x:collection1_collection_shard1_replica_n1] o.a.s.u.p.LogUpdateProcessorFactory [collection1_collection_shard1_replica_n1]  webapp=/solr path=/update params={update.distrib=FROMLEADER&waitSearcher=true&openSearcher=true&commit=true&softCommit=false&distrib.from=http://127.0.0.1:52143/solr/collection1_collection_shard2_replica_n2/&commit_end_point=true&wt=javabin&version=2&expungeDeletes=false}{commit=} 0 2
   [junit4]   2> 23089 INFO  (qtp41083760-56) [n:127.0.0.1:52143_solr c:collection1_collection s:shard2 r:core_node4 x:collection1_collection_shard2_replica_n2] o.a.s.s.SolrIndexSearcher Opening [Searcher@55ee075d[collection1_collection_shard2_replica_n2] main]
   [junit4]   2> 23091 INFO  (qtp41083760-56) [n:127.0.0.1:52143_solr c:collection1_collection s:shard2 r:core_node4 x:collection1_collection_shard2_replica_n2] o.a.s.u.DirectUpdateHandler2 end_commit_flush
   [junit4]   2> 23094 INFO  (searcherExecutor-42-thread-1-processing-n:127.0.0.1:52143_solr x:collection1_collection_shard2_replica_n2 s:shard2 c:collection1_collection r:core_node4) [n:127.0.0.1:52143_solr c:collection1_collection s:shard2 r:core_node4 x:collection1_collection_shard2_replica_n2] o.a.s.c.SolrCore [collection1_collection_shard2_replica_n2] Registered new searcher Searcher@55ee075d[collection1_collection_shard2_replica_n2] main{ExitableDirectoryReader(UninvertingDirectoryReader())}
   [junit4]   2> 23117 INFO  (qtp41083760-56) [n:127.0.0.1:52143_solr c:collection1_collection s:shard2 r:core_node4 x:collection1_collection_shard2_replica_n2] o.a.s.u.p.LogUpdateProcessorFactory [collection1_collection_shard2_replica_n2]  webapp=/solr path=/update params={update.distrib=FROMLEADER&waitSearcher=true&openSearcher=true&commit=true&softCommit=false&distrib.from=http://127.0.0.1:52143/solr/collection1_collection_shard2_replica_n2/&commit_end_point=true&wt=javabin&version=2&expungeDeletes=false}{commit=} 0 31
   [junit4]   2> 23120 INFO  (qtp41083760-54) [n:127.0.0.1:52143_solr c:collection1_collection s:shard2 r:core_node4 x:collection1_collection_shard2_replica_n2] o.a.s.u.p.LogUpdateProcessorFactory [collection1_collection_shard2_replica_n2]  webapp=/solr path=/update params={_stateVer_=collection1_collection:4&commit=true&wt=javabin&version=2}{deleteByQuery=*:* (-1586984064342032384),commit=} 0 138
   [junit4]   2> 23128 INFO  (TEST-StreamExpressionTest.testPriorityStream-seed#[7709C33AFEFFF840]) [    ] o.a.s.SolrTestCaseJ4 ###Ending testPriorityStream
   [junit4] IGNOR/A 0.21s J1 | StreamExpressionTest.testPriorityStream
   [junit4]    > Assumption #1: got: <false>, expected: is <true>
   [junit4]   2> 23180 INFO  (TEST-StreamExpressionTest.testClassifyStream-seed#[7709C33AFEFFF840]) [    ] o.a.s.SolrTestCaseJ4 ###Starting testClassifyStream
   [junit4]   2> 23202 INFO  (qtp41083760-60) [n:127.0.0.1:52143_solr c:collection1_collection s:shard2 r:core_node4 x:collection1_collection_shard2_replica_n2] o.a.s.u.p.LogUpdateProcessorFactory [collection1_collection_shard2_replica_n2]  webapp=/solr path=/update params={update.distrib=TOLEADER&distrib.from=http://127.0.0.1:52142/solr/collection1_collection_shard1_replica_n1/&wt=javabin&version=2}{deleteByQuery=*:* (-1586984064559087616)} 0 14
   [junit4]   2> 23207 INFO  (qtp41083760-57) [n:127.0.0.1:52143_solr c:collection1_collection s:shard2 r:core_node4 x:collection1_collection_shard2_replica_n2] o.a.s.u.DirectUpdateHandler2 start commit{_version_=1586984064576913408,optimize=false,openSearcher=true,waitSearcher=true,expungeDeletes=false,softCommit=false,prepareCommit=false}
   [junit4]   2> 23207 INFO  (qtp41083760-57) [n:127.0.0.1:52143_solr c:collection1_collection s:shard2 r:core_node4 x:collection1_collection_shard2_replica_n2] o.a.s.u.DirectUpdateHandler2 No uncommitted changes. Skipping IW.commit.
   [junit4]   2> 23208 INFO  (qtp302039255-49) [n:127.0.0.1:52142_solr c:collection1_collection s:shard1 r:core_node3 x:collection1_collection_shard1_replica_n1] o.a.s.u.DirectUpdateHandler2 start commit{_version_=1586984064577961984,optimize=false,openSearcher=true,waitSearcher=true,expungeDeletes=false,softCommit=false,prepareCommit=false}
   [junit4]   2> 23208 INFO  (qtp302039255-49) [n:127.0.0.1:52142_solr c:collection1_collection s:shard1 r:core_node3 x:collection1_collection_shard1_replica_n1] o.a.s.u.DirectUpdateHandler2 No uncommitted changes. Skipping IW.commit.
   [junit4]   2> 23210 INFO  (qtp41083760-57) [n:127.0.0.1:52143_solr c:collection1_collection s:shard2 r:core_node4 x:collection1_collection_shard2_replica_n2] o.a.s.u.DirectUpdateHandler2 end_commit_flush
   [junit4]   2> 23210 INFO  (qtp41083760-57) [n:127.0.0.1:52143_solr c:collection1_collection s:shard2 r:core_node4 x:collection1_collection_shard2_replica_n2] o.a.s.u.p.LogUpdateProcessorFactory [collection1_collection_shard2_replica_n2]  webapp=/solr path=/update params={update.distrib=FROMLEADER&waitSearcher=true&openSearcher=true&commit=true&softCommit=false&distrib.from=http://127.0.0.1:52142/solr/collection1_collection_shard1_replica_n1/&commit_end_point=true&wt=javabin&version=2&expungeDeletes=false}{commit=} 0 3
   [junit4]   2> 23211 INFO  (qtp302039255-49) [n:127.0.0.1:52142_solr c:collection1_collection s:shard1 r:core_node3 x:collection1_collection_shard1_replica_n1] o.a.s.u.DirectUpdateHandler2 end_commit_flush
   [junit4]   2> 23211 INFO  (qtp302039255-49) [n:127.0.0.1:52142_solr c:collection1_collection s:shard1 r:core_node3 x:collection1_collection_shard1_replica_n1] o.a.s.u.p.LogUpdateProcessorFactory [collection1_collection_shard1_replica_n1]  webapp=/solr path=/update params={update.distrib=FROMLEADER&waitSearcher=true&openSearcher=true&commit=true&softCommit=false&distrib.from=http://127.0.0.1:52142/solr/collection1_collection_shard1_replica_n1/&commit_end_point=true&wt=javabin&version=2&expungeDeletes=false}{commit=} 0 3
   [junit4]   2> 23212 INFO  (qtp302039255-75) [n:127.0.0.1:52142_solr c:collection1_collection s:shard1 r:core_node3 x:collection1_collection_shard1_replica_n1] o.a.s.u.p.LogUpdateProcessorFactory [collection1_collection_shard1_replica_n1]  webapp=/solr path=/update params={_stateVer_=collection1_collection:4&commit=true&wt=javabin&version=2}{deleteByQuery=*:* (-1586984064551747584),commit=} 0 30
   [junit4]   2> 23213 INFO  (TEST-StreamExpressionTest.testClassifyStream-seed#[7709C33AFEFFF840]) [    ] o.a.s.SolrTestCaseJ4 ###Ending testClassifyStream
   [junit4] IGNOR/A 0.07s J1 | StreamExpressionTest.testClassifyStream
   [junit4]    > Assumption #1: got: <false>, expected: is <true>
   [junit4]   2> 23252 INFO  (TEST-StreamExpressionTest.testStandardize-seed#[7709C33AFEFFF840]) [    ] o.a.s.SolrTestCaseJ4 ###Starting testStandardize
   [junit4]   2> 23261 INFO  (qtp302039255-80) [n:127.0.0.1:52142_solr c:collection1_collection s:shard1 r:core_node3 x:collection1_collection_shard1_replica_n1] o.a.s.u.p.LogUpdateProcessorFactory [collection1_collection_shard1_replica_n1]  webapp=/solr path=/update params={update.distrib=TOLEADER&distrib.from=http://127.0.0.1:52143/solr/collection1_collection_shard2_replica_n2/&wt=javabin&version=2}{deleteByQuery=*:* (-1586984064631439360)} 0 2
   [junit4]   2> 23266 INFO  (qtp41083760-59) [n:127.0.0.1:52143_solr c:collection1_collection s:shard2 r:core_node4 x:collection1_collection_shard2_replica_n2] o.a.s.u.DirectUpdateHandler2 start commit{_version_=1586984064638779392,optimize=false,openSearcher=true,waitSearcher=true,expungeDeletes=false,softCommit=false,prepareCommit=false}
   [junit4]   2> 23266 INFO  (qtp41083760-59) [n:127.0.0.1:52143_solr c:collection1_collection s:shard2 r:core_node4 x:collection1_collection_shard2_replica_n2] o.a.s.u.DirectUpdateHandler2 No uncommitted changes. Skipping IW.commit.
   [junit4]   2> 23268 INFO  (qtp41083760-59) [n:127.0.0.1:52143_solr c:collection1_collection s:shard2 r:core_node4 x:collection1_collection_shard2_replica_n2] o.a.s.u.DirectUpdateHandler2 end_commit_flush
   [junit4]   2> 23268 INFO  (qtp41083760-59) [n:127.0.0.1:52143_solr c:collection1_collection s:shard2 r:core_node4 x:collection1_collection_shard2_replica_n2] o.a.s.u.p.LogUpdateProcessorFactory [collection1_collection_shard2_replica_n2]  webapp=/solr path=/update params={update.distrib=FROMLEADER&waitSearcher=true&openSearcher=true&commit=true&softCommit=false&distrib.from=http://127.0.0.1:52143/solr/collection1_collection_shard2_replica_n2/&commit_end_point=true&wt=javabin&version=2&expungeDeletes=false}{commit=} 0 2
   [junit4]   2> 23270 INFO  (qtp302039255-76) [n:127.0.0.1:52142_solr c:collection1_collection s:shard1 r:core_node3 x:collection1_collection_shard1_replica_n1] o.a.s.u.DirectUpdateHandler2 start commit{_version_=1586984064642973696,optimize=false,openSearcher=true,waitSearcher=true,expungeDeletes=false,softCommit=false,prepareCommit=false}
   [junit4]   2> 23270 INFO  (qtp302039255-76) [n:127.0.0.1:52142_solr c:collection1_collection s:shard1 r:core_node3 x:collection1_collection_shard1_replica_n1] o.a.s.u.DirectUpdateHandler2 No uncommitted changes. Skipping IW.commit.
   [junit4]   2> 23272 INFO  (qtp302039255-76) [n:127.0.0.1:52142_solr c:collection1_collection s:shard1 r:core_node3 x:collection1_collection_shard1_replica_n1] o.a.s.u.DirectUpdateHandler2 end_commit_flush
   [junit4]   2> 23272 INFO  (qtp302039255-76) [n:127.0.0.1:52142_solr c:collection1_collection s:shard1 r:core_node3 x:collection1_collection_shard1_replica_n1] o.a.s.u.p.LogUpdateProcessorFactory [collection1_collection_shard1_replica_n1]  webapp=/solr path=/update params={update.distrib=FROMLEADER&waitSearcher=true&openSearcher=true&commit=true&softCommit=false&distrib.from=http://127.0.0.1:52143/solr/collection1_collection_shard2_replica_n2/&commit_end_point=true&wt=javabin&version=2&expungeDeletes=false}{commit=} 0 2
   [junit4]   2> 23274 INFO  (qtp41083760-52) [n:127.0.0.1:52143_solr c:collection1_collection s:shard2 r:core_node4 x:collection1_collection_shard2_replica_n2] o.a.s.u.p.LogUpdateProcessorFactory [collection1_collection_shard2_replica_n2]  webapp=/solr path=/update params={_stateVer_=collection1_collection:4&commit=true&wt=javabin&version=2}{deleteByQuery=*:* (-1586984064628293632),commit=} 0 20
   [junit4]   2> 23291 INFO  (qtp302039255-77) [n:127.0.0.1:52142_solr c:collection1_collection s:shard1 r:core_node3 x:collection1_collection_shard1_replica_n1] o.a.s.c.S.Request [collection1_collection_shard1_replica_n1]  webapp=/solr path=/stream params={indent=off&expr=let(echo%3Dtrue,+a%3Dstandardize(matrix(array(1,2,3),+array(4,5,6))),+b%3Dstandardize(array(4,5,6)))&wt=json&version=2.2} status=0 QTime=9
   [junit4]   2> 23573 INFO  (TEST-StreamExpressionTest.testStandardize-seed#[7709C33AFEFFF840]) [    ] o.a.s.SolrTestCaseJ4 ###Ending testStandardize
   [junit4]   2> 23681 INFO  (TEST-StreamExpressionTest.testLogNormalDistribution-seed#[7709C33AFEFFF840]) [    ] o.a.s.SolrTestCaseJ4 ###Starting testLogNormalDistribution
   [junit4]   2> 23686 INFO  (qtp302039255-79) [n:127.0.0.1:52142_solr c:collection1_collection s:shard1 r:core_node3 x:collection1_collection_shard1_replica_n1] o.a.s.u.p.LogUpdateProcessorFactory [collection1_collection_shard1_replica_n1]  webapp=/solr path=/update params={update.distrib=TOLEADER&distrib.from=http://127.0.0.1:52143/solr/collection1_collection_shard2_replica_n2/&wt=javabin&version=2}{deleteByQuery=*:* (-1586984065078132736)} 0 1
   [junit4]   2> 23689 INFO  (qtp302039255-78) [n:127.0.0.1:52142_solr c:collection1_collection s:shard1 r:core_node3 x:collection1_collection_shard1_replica_n1] o.a.s.u.DirectUpdateHandler2 start commit{_version_=1586984065082327040,optimize=false,openSearcher=true,waitSearcher=true,expungeDeletes=false,softCommit=false,prepareCommit=false}
   [junit4]   2> 23689 INFO  (qtp302039255-78) [n:127.0.0.1:52142_solr c:collection1_collection s:shard1 r:core_node3 x:collection1_collection_shard1_replica_n1] o.a.s.u.DirectUpdateHandler2 No uncommitted changes. Skipping IW.commit.
   [junit4]   2> 23689 INFO  (qtp41083760-54) [n:127.0.0.1:52143_solr c:collection1_collection s:shard2 r:core_node4 x:collection1_collection_shard2_replica_n2] o.a.s.u.DirectUpdateHandler2 start commit{_version_=1586984065082327040,optimize=false,openSearcher=true,waitSearcher=true,expungeDeletes=false,softCommit=false,prepareCommit=false}
   [junit4]   2> 23689 INFO  (qtp41083760-54) [n:127.0.0.1:52143_solr c:collection1_collection s:shard2 r:core_node4 x:collection1_collection_shard2_replica_n2] o.a.s.u.DirectUpdateHandler2 No uncommitted changes. Skipping IW.commit.
   [junit4]   2> 23690 INFO  (qtp302039255-78) [n:127.0.0.1:52142_solr c:collection1_collection s:shard1 r:core_node3 x:collection1_collection_shard1_replica_n1] o.a.s.u.DirectUpdateHandler2 end_commit_flush
   [junit4]   2> 23690 INFO  (qtp302039255-78) [n:127.0.0.1:52142_solr c:collection1_collection s:shard1 r:core_node3 x:collection1_collection_shard1_replica_n1] o.a.s.u.p.LogUpdateProcessorFactory [collection1_collection_shard1_replica_n1]  webapp=/solr path=/update params={update.distrib=FROMLEADER&waitSearcher=true&openSearcher=true&commit=true&softCommit=false&distrib.from=http://127.0.0.1:52143/solr/collection1_collection_shard2_replica_n2/&commit_end_point=true&wt=javabin&version=2&expungeDeletes=false}{commit=} 0 1
   [junit4]   2> 23690 INFO  (qtp41083760-54) [n:127.0.0.1:52143_solr c:collection1_collection s:shard2 r:core_node4 x:collection1_collection_shard2_replica_n2] o.a.s.u.DirectUpdateHandler2 end_commit_flush
   [junit4]   2> 23690 INFO  (qtp41083760-54) [n:127.0.0.1:52143_solr c:collection1_collection s:shard2 r:core_node4 x:collection1_collection_shard2_replica_n2] o.a.s.u.p.LogUpdateProcessorFactory [collection1_collection_shard2_replica_n2]  webapp=/solr path=/update params={update.distrib=FROMLEADER&waitSearcher=true&openSearcher=true&commit=true&softCommit=false&distrib.from=http://127.0.0.1:52143/solr/collection1_collection_shard2_replica_n2/&commit_end_point=true&wt=javabin&version=2&expungeDeletes=false}{commit=} 0 1
   [junit4]   2> 23691 INFO  (qtp41083760-56) [n:127.0.0.1:52143_solr c:collection1_collection s:shard2 r:core_node4 x:collection1_collection_shard2_replica_n2] o.a.s.u.p.LogUpdateProcessorFactory [collection1_collection_shard2_replica_n2]  webapp=/solr path=/update params={_stateVer_=collection1_collection:4&commit=true&wt=javabin&version=2}{deleteByQuery=*:* (-1586984065076035584),commit=} 0 8
   [junit4]   2> 23698 INFO  (qtp302039255-49) [n:127.0.0.1:52142_solr c:collection1_collection s:shard1 r:core_node3 x:collection1_collection_shard1_replica_n1] o.a.s.c.S.Request [collection1_collection_shard1_replica_n1]  webapp=/solr path=/stream params={indent=off&expr=let(echo%3Dtrue,+a%3Ddescribe(sample(logNormalDistribution(.1,+0),10000)),+b%3Ddescribe(sample(logNormalDistribution(.3,+0),10000)),+c%3Ddescribe(sample(logNormalDistribution(.6,+0),10000)),d%3Dmean(sample(logNormalDistribution(.3,+0),10000)),+e%3Dmean(sample(logNormalDistribution(.3,+2),10000)),+)&wt=json&version=2.2} status=0 QTime=1
   [junit4]   2> 23952 INFO  (OverseerCollectionConfigSetProcessor-99186503462813708-127.0.0.1:52143_solr-n_0000000000) [n:127.0.0.1:52143_solr    ] o.a.s.c.OverseerTaskQueue Response ZK path: /overseer/collection-queue-work/qnr-0000000002 doesn't exist.  Requestor may have disconnected from ZooKeeper
   [junit4]   2> 24475 INFO  (TEST-StreamExpressionTest.testLogNormalDistribution-seed#[7709C33AFEFFF840]) [    ] o.a.s.SolrTestCaseJ4 ###Ending testLogNormalDistribution
   [junit4]   2> 24507 INFO  (TEST-StreamExpressionTest.testArray-seed#[7709C33AFEFFF840]) [    ] o.a.s.SolrTestCaseJ4 ###Starting testArray
   [junit4]   2> 24518 INFO  (qtp41083760-61) [n:127.0.0.1:52143_solr c:collection1_collection s:shard2 r:core_node4 x:collection1_collection_shard2_replica_n2] o.a.s.u.p.LogUpdateProcessorFactory [collection1_collection_shard2_replica_n2]  webapp=/solr path=/update params={update.distrib=TOLEADER&distrib.from=http://127.0.0.1:52142/solr/collection1_collection_shard1_replica_n1/&wt=javabin&version=2}{deleteByQuery=*:* (-1586984065950547968)} 0 1
   [junit4]   2> 24521 INFO  (qtp41083760-60) [n:127.0.0.1:52143_solr c:collection1_collection s:shard2 r:core_node4 x:collection1_collection_shard2_replica_n2] o.a.s.u.DirectUpdateHandler2 start commit{_version_=1586984065954742272,optimize=false,openSearcher=true,waitSearcher=true,expungeDeletes=false,softCommit=false,prepareCommit=false}
   [junit4]   2> 24521 INFO  (qtp302039255-80) [n:127.0.0.1:52142_solr c:collection1_collection s:shard1 r:core_node3 x:collection1_collection_shard1_replica_n1] o.a.s.u.DirectUpdateHandler2 start commit{_version_=1586984065954742272,optimize=false,openSearcher=true,waitSearcher=true,expungeDeletes=false,softCommit=false,prepareCommit=false}
   [junit4]   2> 24521 INFO  (qtp302039255-80) [n:127.0.0.1:52142_solr c:collection1_collection s:shard1 r:core_node3 x:collection1_collection_shard1_replica_n1] o.a.s.u.DirectUpdateHandler2 No uncommitted changes. Skipping IW.commit.
   [junit4]   2> 24521 INFO  (qtp41083760-60) [n:127.0.0.1:52143_solr c:collection1_collection s:shard2 r:core_node4 x:collection1_collection_shard2_replica_n2] o.a.s.u.DirectUpdateHandler2 No uncommitted changes. Skipping IW.commit.
   [junit4]   2> 24524 INFO  (qtp302039255-80) [n:127.0.0.1:52142_solr c:collection1_collection s:shard1 r:core_node3 x:collection1_collection_shard1_replica_n1] o.a.s.u.DirectUpdateHandler2 end_commit_flush
   [junit4]   2> 24524 INFO  (qtp302039255-80) [n:127.0.0.1:52142_solr c:collection1_collection s:shard1 r:core_node3 x:collection1_collection_shard1_replica_n1] o.a.s.u.p.LogUpdateProcessorFactory [collection1_collection_shard1_replica_n1]  webapp=/solr path=/update params={update.distrib=FROMLEADER&waitSearcher=true&openSearcher=true&commit=true&softCommit=false&distrib.from=http://127.0.0.1:52142/solr/collection1_collection_shard1_replica_n1/&commit_end_point=true&wt=javabin&version=2&expungeDeletes=false}{commit=} 0 2
   [junit4]   2> 24524 INFO  (qtp41083760-60) [n:127.0.0.1:52143_solr c:collection1_collection s:shard2 r:core_node4 x:collection1_collection_shard2_replica_n2] o.a.s.u.DirectUpdateHandler2 end_commit_flush
   [junit4]   2> 24524 INFO  (qtp41083760-60) [n:127.0.0.1:52143_solr c:collection1_collection s:shard2 r:core_node4 x:collection1_collection_shard2_replica_n2] o.a.s.u.p.LogUpdateProcessorFactory [collection1_collection_shard2_replica_n2]  webapp=/solr path=/update params={update.distrib=FROMLEADER&waitSearcher=true&openSearcher=true&commit=true&softCommit=false&distrib.from=http://127.0.0.1:52142/solr/collection1_collection_shard1_replica_n1/&commit_end_point=true&wt=javabin&version=2&expungeDeletes=false}{commit=} 0 3
   [junit4]   2> 24526 INFO  (qtp302039255-75) [n:127.0.0.1:52142_solr c:collection1_collection s:shard1 r:core_node3 x:collection1_collection_shard1_replica_n1] o.a.s.u.p.LogUpdateProcessorFactory [collection1_collection_shard1_replica_n1]  webapp=/solr path=/update params={_stateVer_=collection1_collection:4&commit=true&wt=javabin&version=2}{deleteByQuery=*:* (-1586984065941110784),commit=} 0 17
   [junit4]   2> 24531 INFO  (qtp302039255-76) [n:127.0.0.1:52142_solr c:collection1_collection s:shard1 r:core_node3 x:collection1_collection_shard1_replica_n1] o.a.s.c.S.Request [collection1_collection_shard1_replica_n1]  webapp=/solr path=/stream params={indent=off&expr=array(1,+2,+3,+300,+2,+500)&wt=json&version=2.2} status=0 QTime=0
   [junit4]   2> 24537 INFO  (qtp302039255-77) [n:127.0.0.1:52142_solr c:collection1_collection s:shard1 r:core_node3 x:collection1_collection_shard1_replica_n1] o.a.s.c.S.Request [collection1_collection_shard1_replica_n1]  webapp=/solr path=/stream params={indent=off&expr=array(1.122,+2.222,+3.333,+300.1,+2.13,+500.23)&wt=json&version=2.2} status=0 QTime=0
   [junit4]   2> 24538 INFO  (TEST-StreamExpressionTest.testArray-seed#[7709C33AFEFFF840]) [    ] o.a.s.SolrTestCaseJ4 ###Ending testArray
   [junit4]   2> 24559 INFO  (TEST-StreamExpressionTest.testTopicStream-seed#[7709C33AFEFFF840]) [    ] o.a.s.SolrTestCaseJ4 ###Starting testTopicStream
   [junit4]   2> 24568 INFO  (qtp302039255-79) [n:127.0.0.1:52142_solr c:collection1_collection s:shard1 r:core_node3 x:collection1_collection_shard1_replica_n1] o.a.s.u.p.LogUpdateProcessorFactory [collection1_collection_shard1_replica_n1]  webapp=/solr path=/update params={update.distrib=TOLEADER&distrib.from=http://127.0.0.1:52143/solr/collection1_collection_shard2_replica_n2/&wt=javabin&version=2}{deleteByQuery=*:* (-1586984065997733888)} 0 6
   [junit4]   2> 24571 INFO  (qtp41083760-59) [n:127.0.0.1:52143_solr c:collection1_collection s:shard2 r:core_node4 x:collection1_collection_shard2_replica_n2] o.a.s.u.DirectUpdateHandler2 start commit{_version_=1586984066007171072,optimize=false,openSearcher=true,waitSearcher=true,expungeDeletes=false,softCommit=false,prepareCommit=false}
   [junit4]   2> 24571 INFO  (qtp302039255-78) [n:127.0.0.1:52142_solr c:collection1_collection s:shard1 r:core_node3 x:collection1_collection_shard1_replica_n1] o.a.s.u.DirectUpdateHandler2 start commit{_version_=1586984066007171072,optimize=false,openSearcher=true,waitSearcher=true,expungeDeletes=false,softCommit=false,prepareCommit=false}
   [junit4]   2> 24571 INFO  (qtp302039255-78) [n:127.0.0.1:52142_solr c:collection1_collection s:shard1 r:core_node3 x:collection1_collection_shard1_replica_n1] o.a.s.u.DirectUpdateHandler2 No uncommitted changes. Skipping IW.commit.
   [junit4]   2> 24571 INFO  (qtp41083760-59) [n:127.0.0.1:52143_solr c:collection1_collection s:shard2 r:core_node4 x:collection1_collection_shard2_replica_n2] o.a.s.u.DirectUpdateHandler2 No uncommitted changes. Skipping IW.commit.
   [junit4]   2> 24575 INFO  (qtp302039255-78) [n:127.0.0.1:52142_solr c:collection1_collection s:shard1 r:core_node3 x:collection1_collection_shard1_replica_n1] o.a.s.u.DirectUpdateHandler2 end_commit_flush
   [junit4]   2> 24575 INFO  (qtp302039255-78) [n:127.0.0.1:52142_solr c:collection1_collection s:shard1 r:core_node3 x:collection1_collection_shard1_replica_n1] o.a.s.u.p.LogUpdateProcessorFactory [collection1_collection_shard1_replica_n1]  webapp=/solr path=/update params={update.distrib=FROMLEADER&waitSearcher=true&openSearcher=true&commit=true&softCommit=false&distrib.from=http://127.0.0.1:52143/solr/collection1_collection_shard2_replica_n2/&commit_end_point=true&wt=javabin&version=2&expungeDeletes=false}{commit=} 0 4
   [junit4]   2> 24576 INFO  (qtp41083760-59) [n:127.0.0.1:52143_solr c:collection1_collection s:shard2 r:core_node4 x:collection1_collection_shard2_replica_n2] o.a.s.u.DirectUpdateHandler2 end_commit_flush
   [junit4]   2> 24577 INFO  (qtp41083760-59) [n:127.0.0.1:52143_solr c:collection1_collection s:shard2 r:core_node4 x:collection1_collection_shard2_replica_n2] o.a.s.u.p.LogUpdateProcessorFactory [collection1_collection_shard2_replica_n2]  webapp=/solr path=/update params={update.distrib=FROMLEADER&waitSearcher=true&openSearcher=true&commit=true&softCommit=false&distrib.from=http://127.0.0.1:52143/solr/collection1_collection_shard2_replica_n2/&commit_end_point=true&wt=javabin&version=2&expungeDeletes=false}{commit=} 0 5
   [junit4]   2> 24578 INFO  (qtp41083760-57) [n:127.0.0.1:52143_solr c:collection1_collection s:shard2 r:core_node4 x:collection1_collection_shard2_replica_n2] o.a.s.u.p.LogUpdateProcessorFactory [collection1_collection_shard2_replica_n2]  webapp=/solr path=/update params={_stateVer_=collection1_collection:4&commit=true&wt=javabin&version=2}{deleteByQuery=*:* (-1586984065995636736),commit=} 0 18
   [junit4]   2> 24579 INFO  (TEST-StreamExpressionTest.testTopicStream-seed#[7709C33AFEFFF840]) [    ] o.a.s.SolrTestCaseJ4 ###Ending testTopicStream
   [junit4] IGNOR/A 0.04s J1 | StreamExpressionTest.testTopicStream
   [junit4]    > Assumption #1: got: <false>, expected: is <true>
   [junit4]   2> 24601 INFO  (TEST-StreamExpressionTest.testParameterSubstitution-seed#[7709C33AFEFFF840]) [    ] o.a.s.SolrTestCaseJ4 ###Starting testParameterSubstitution
   [junit4]   2> 24646 INFO  (qtp41083760-52) [n:127.0.0.1:52143_solr c:collection1_collection s:shard2 r:core_node4 x:collection1_collection_shard2_replica_n2] o.a.s.u.p.LogUpdateProcessorFactory [collection1_collection_shard2_replica_n2]  webapp=/solr path=/update params={update.distrib=TOLEADER&distrib.from=http://127.0.0.1:52142/solr/collection1_collection_shard1_replica_n1/&wt=javabin&version=2}{deleteByQuery=*:* (-1586984066047016960)} 0 37
   [junit4]   2> 24649 INFO  (qtp41083760-54) [n:127.0.0.1:52143_solr c:collection1_collection s:shard2 r:core_node4 x:collection1_collection_shard2_replica_n2] o.a.s.u.DirectUpdateHandler2 start commit{_version_=1586984066088960000,optimize=false,openSearcher=true,waitSearcher=true,expungeDeletes=false,softCommit=false,prepareCommit=false}
   [junit4]   2> 24649 INFO  (qtp41083760-54) [n:127.0.0.1:52143_solr c:collection1_collection s:shard2 r:core_node4 x:collection1_collection_shard2_replica_n2] o.a.s.u.DirectUpdateHandler2 No uncommitted changes. Skipping IW.commit.
   [junit4]   2> 24649 INFO  (qtp302039255-80) [n:127.0.0.1:52142_solr c:collection1_collection s:shard1 r:core_node3 x:collection1_collection_shard1_replica_n1] o.a.s.u.DirectUpdateHandler2 start commit{_version_=1586984066088960000,optimize=false,openSearcher=true,waitSearcher=true,expungeDeletes=false,softCommit=false,prepareCommit=false}
   [junit4]   2> 24649 INFO  (qtp302039255-80) [n:127.0.0.1:52142_solr c:collection1_collection s:shard1 r:core_node3 x:collection1_collection_shard1_replica_n1] o.a.s.u.DirectUpdateHandler2 No uncommitted changes. Skipping IW.commit.
   [junit4]   2> 24650 INFO  (qtp41083760-54) [n:127.0.0.1:52143_solr c:collection1_collection s:shard2 r:core_node4 x:collection1_collection_shard2_replica_n2] o.a.s.u.DirectUpdateHandler2 end_commit_flush
   [junit4]   2> 24650 INFO  (qtp41083760-54) [n:127.0.0.1:52143_solr c:collection1_collection s:shard2 r:core_node4 x:collection1_collection_

[...truncated too long message...]

AwareThreadPoolExecutor.lambda$execute$0(ExecutorUtil.java:188)
   [junit4]   2> 	at java.util.concurrent.ThreadPoolExecutor.runWorker(ThreadPoolExecutor.java:1149)
   [junit4]   2> 	at java.util.concurrent.ThreadPoolExecutor$Worker.run(ThreadPoolExecutor.java:624)
   [junit4]   2> 	at java.lang.Thread.run(Thread.java:748)
   [junit4]   2> 116771 WARN  (zkCallback-33-thread-2-processing-n:127.0.0.1:52141_solr) [n:127.0.0.1:52141_solr    ] o.a.s.c.ZkController Unable to register nodeLost path for 127.0.0.1:52142_solr
   [junit4]   2> org.apache.zookeeper.KeeperException$SessionExpiredException: KeeperErrorCode = Session expired for /autoscaling/nodeLost/127.0.0.1:52142_solr
   [junit4]   2> 	at org.apache.zookeeper.KeeperException.create(KeeperException.java:127)
   [junit4]   2> 	at org.apache.zookeeper.KeeperException.create(KeeperException.java:51)
   [junit4]   2> 	at org.apache.zookeeper.ZooKeeper.create(ZooKeeper.java:783)
   [junit4]   2> 	at org.apache.solr.common.cloud.SolrZkClient.lambda$create$7(SolrZkClient.java:364)
   [junit4]   2> 	at org.apache.solr.common.cloud.ZkCmdExecutor.retryOperation(ZkCmdExecutor.java:60)
   [junit4]   2> 	at org.apache.solr.common.cloud.SolrZkClient.create(SolrZkClient.java:364)
   [junit4]   2> 	at org.apache.solr.cloud.ZkController.lambda$registerLiveNodesListener$2(ZkController.java:879)
   [junit4]   2> 	at org.apache.solr.common.cloud.ZkStateReader.lambda$refreshLiveNodes$1(ZkStateReader.java:704)
   [junit4]   2> 	at java.util.concurrent.ConcurrentHashMap$KeySetView.forEach(ConcurrentHashMap.java:4649)
   [junit4]   2> 	at org.apache.solr.common.cloud.ZkStateReader.refreshLiveNodes(ZkStateReader.java:703)
   [junit4]   2> 	at org.apache.solr.common.cloud.ZkStateReader.access$900(ZkStateReader.java:72)
   [junit4]   2> 	at org.apache.solr.common.cloud.ZkStateReader$LiveNodeWatcher.refreshAndWatch(ZkStateReader.java:1090)
   [junit4]   2> 	at org.apache.solr.common.cloud.ZkStateReader$LiveNodeWatcher.process(ZkStateReader.java:1085)
   [junit4]   2> 	at org.apache.solr.common.cloud.SolrZkClient$1.lambda$process$1(SolrZkClient.java:268)
   [junit4]   2> 	at java.util.concurrent.Executors$RunnableAdapter.call(Executors.java:511)
   [junit4]   2> 	at java.util.concurrent.FutureTask.run(FutureTask.java:266)
   [junit4]   2> 	at org.apache.solr.common.util.ExecutorUtil$MDCAwareThreadPoolExecutor.lambda$execute$0(ExecutorUtil.java:188)
   [junit4]   2> 	at java.util.concurrent.ThreadPoolExecutor.runWorker(ThreadPoolExecutor.java:1149)
   [junit4]   2> 	at java.util.concurrent.ThreadPoolExecutor$Worker.run(ThreadPoolExecutor.java:624)
   [junit4]   2> 	at java.lang.Thread.run(Thread.java:748)
   [junit4]   2> 116780 WARN  (zkCallback-33-thread-2-processing-n:127.0.0.1:52141_solr) [n:127.0.0.1:52141_solr    ] o.a.s.c.ZkController Unable to register nodeLost path for 127.0.0.1:52143_solr
   [junit4]   2> org.apache.zookeeper.KeeperException$SessionExpiredException: KeeperErrorCode = Session expired for /autoscaling/nodeLost/127.0.0.1:52143_solr
   [junit4]   2> 	at org.apache.zookeeper.KeeperException.create(KeeperException.java:127)
   [junit4]   2> 	at org.apache.zookeeper.KeeperException.create(KeeperException.java:51)
   [junit4]   2> 	at org.apache.zookeeper.ZooKeeper.create(ZooKeeper.java:783)
   [junit4]   2> 	at org.apache.solr.common.cloud.SolrZkClient.lambda$create$7(SolrZkClient.java:364)
   [junit4]   2> 	at org.apache.solr.common.cloud.ZkCmdExecutor.retryOperation(ZkCmdExecutor.java:60)
   [junit4]   2> 	at org.apache.solr.common.cloud.SolrZkClient.create(SolrZkClient.java:364)
   [junit4]   2> 	at org.apache.solr.cloud.ZkController.lambda$registerLiveNodesListener$2(ZkController.java:879)
   [junit4]   2> 	at org.apache.solr.common.cloud.ZkStateReader.lambda$refreshLiveNodes$1(ZkStateReader.java:704)
   [junit4]   2> 	at java.util.concurrent.ConcurrentHashMap$KeySetView.forEach(ConcurrentHashMap.java:4649)
   [junit4]   2> 	at org.apache.solr.common.cloud.ZkStateReader.refreshLiveNodes(ZkStateReader.java:703)
   [junit4]   2> 	at org.apache.solr.common.cloud.ZkStateReader.access$900(ZkStateReader.java:72)
   [junit4]   2> 	at org.apache.solr.common.cloud.ZkStateReader$LiveNodeWatcher.refreshAndWatch(ZkStateReader.java:1090)
   [junit4]   2> 	at org.apache.solr.common.cloud.ZkStateReader$LiveNodeWatcher.process(ZkStateReader.java:1085)
   [junit4]   2> 	at org.apache.solr.common.cloud.SolrZkClient$1.lambda$process$1(SolrZkClient.java:268)
   [junit4]   2> 	at java.util.concurrent.Executors$RunnableAdapter.call(Executors.java:511)
   [junit4]   2> 	at java.util.concurrent.FutureTask.run(FutureTask.java:266)
   [junit4]   2> 	at org.apache.solr.common.util.ExecutorUtil$MDCAwareThreadPoolExecutor.lambda$execute$0(ExecutorUtil.java:188)
   [junit4]   2> 	at java.util.concurrent.ThreadPoolExecutor.runWorker(ThreadPoolExecutor.java:1149)
   [junit4]   2> 	at java.util.concurrent.ThreadPoolExecutor$Worker.run(ThreadPoolExecutor.java:624)
   [junit4]   2> 	at java.lang.Thread.run(Thread.java:748)
   [junit4]   2> 116780 INFO  (jetty-closer-4-thread-2) [    ] o.e.j.s.h.ContextHandler Stopped o.e.j.s.ServletContextHandler@76cae4dc{/solr,null,UNAVAILABLE}
   [junit4]   2> 116784 INFO  (jetty-closer-4-thread-1) [    ] o.e.j.s.h.ContextHandler Stopped o.e.j.s.ServletContextHandler@6ae8509d{/solr,null,UNAVAILABLE}
   [junit4]   2> 116788 ERROR (SUITE-StreamExpressionTest-seed#[7709C33AFEFFF840]-worker) [    ] o.a.z.s.ZooKeeperServer ZKShutdownHandler is not registered, so ZooKeeper server won't take any action on ERROR or SHUTDOWN server state changes
   [junit4]   2> 116790 INFO  (SUITE-StreamExpressionTest-seed#[7709C33AFEFFF840]-worker) [    ] o.a.s.c.ZkTestServer connecting to 127.0.0.1:52123 52123
   [junit4]   2> 117899 INFO  (Thread-8) [    ] o.a.s.c.ZkTestServer connecting to 127.0.0.1:52123 52123
   [junit4]   2> 118063 WARN  (Thread-8) [    ] o.a.s.c.ZkTestServer Watch limit violations: 
   [junit4]   2> Maximum concurrent create/delete watches above limit:
   [junit4]   2> 
   [junit4]   2> 	80	/solr/aliases.json
   [junit4]   2> 	80	/solr/clusterprops.json
   [junit4]   2> 	12	/solr/configs/conf
   [junit4]   2> 	4	/solr/security.json
   [junit4]   2> 
   [junit4]   2> Maximum concurrent data watches above limit:
   [junit4]   2> 
   [junit4]   2> 	80	/solr/clusterstate.json
   [junit4]   2> 	20	/solr/collections/parallelDestinationCollection/state.json
   [junit4]   2> 	20	/solr/collections/destinationCollection/state.json
   [junit4]   2> 	18	/solr/collections/parallelDestinationCollection1/state.json
   [junit4]   2> 	12	/solr/collections/collection1_collection/state.json
   [junit4]   2> 	10	/solr/collections/mainCorpus1/state.json
   [junit4]   2> 	10	/solr/collections/destination/state.json
   [junit4]   2> 	10	/solr/collections/destination1/state.json
   [junit4]   2> 	10	/solr/collections/workQueue1/state.json
   [junit4]   2> 	10	/solr/collections/workQueue/state.json
   [junit4]   2> 	10	/solr/collections/mainCorpus/state.json
   [junit4]   2> 	2	/solr/overseer_elect/election/99186503462813708-127.0.0.1:52143_solr-n_0000000000
   [junit4]   2> 
   [junit4]   2> Maximum concurrent children watches above limit:
   [junit4]   2> 
   [junit4]   2> 	80	/solr/live_nodes
   [junit4]   2> 	80	/solr/collections
   [junit4]   2> 
   [junit4]   2> NOTE: leaving temporary files on disk at: /Users/jenkins/workspace/Lucene-Solr-7.x-MacOSX/solr/build/solr-solrj/test/J1/temp/solr.client.solrj.io.stream.StreamExpressionTest_7709C33AFEFFF840-001
   [junit4]   2> NOTE: test params are: codec=Asserting(Lucene70): {expr_s=PostingsFormat(name=LuceneFixedGap), join2_s=Lucene50(blocksize=128), multiDefault=Lucene50(blocksize=128), subject=Lucene50(blocksize=128), a1_s=Lucene50(blocksize=128), a2_s=PostingsFormat(name=LuceneFixedGap), test_t=PostingsFormat(name=MockRandom), level1_s=PostingsFormat(name=LuceneFixedGap), ident_s=Lucene50(blocksize=128), body_t=PostingsFormat(name=MockRandom), s_multi=PostingsFormat(name=LuceneFixedGap), col_s=Lucene50(blocksize=128), level2_s=Lucene50(blocksize=128), a_ss=Lucene50(blocksize=128), a_s=PostingsFormat(name=LuceneFixedGap), a_t=Lucene50(blocksize=128), side_s=PostingsFormat(name=MockRandom), id=PostingsFormat(name=MockRandom), text=PostingsFormat(name=LuceneFixedGap)}, docValues:{expr_s=DocValuesFormat(name=Direct), join2_s=DocValuesFormat(name=Memory), multiDefault=DocValuesFormat(name=Memory), price_f=DocValuesFormat(name=Memory), a1_s=DocValuesFormat(name=Asserting), intDefault=DocValuesFormat(name=Asserting), a_f=DocValuesFormat(name=Asserting), join1_i=DocValuesFormat(name=Direct), a2_s=DocValuesFormat(name=Direct), a_i=DocValuesFormat(name=Lucene70), join3_i=DocValuesFormat(name=Lucene70), test_i=DocValuesFormat(name=Memory), field_i=DocValuesFormat(name=Memory), level1_s=DocValuesFormat(name=Direct), s_multi=DocValuesFormat(name=Direct), col_s=DocValuesFormat(name=Asserting), level2_s=DocValuesFormat(name=Asserting), a_ss=DocValuesFormat(name=Memory), a_s=DocValuesFormat(name=Direct), id=DocValuesFormat(name=Lucene70), timestamp=DocValuesFormat(name=Memory), i_multi=DocValuesFormat(name=Lucene70), b_ls=DocValuesFormat(name=Asserting), test_dt=DocValuesFormat(name=Direct), ident_s=DocValuesFormat(name=Asserting), order_i=DocValuesFormat(name=Memory), _version_=DocValuesFormat(name=Asserting), side_s=DocValuesFormat(name=Lucene70), miles_i=DocValuesFormat(name=Asserting)}, maxPointsInLeafNode=465, maxMBSortInHeap=7.466029071790098, sim=RandomSimilarity(queryNorm=false): {}, locale=mt-MT, timezone=America/Belize
   [junit4]   2> NOTE: Mac OS X 10.11.6 x86_64/Oracle Corporation 1.8.0_144 (64-bit)/cpus=3,threads=1,free=39654392,total=116154368
   [junit4]   2> NOTE: All tests run in this JVM: [LargeVolumeEmbeddedTest, TestFastInputStream, ClientUtilsTest, TestConfigSetAdminRequest, StreamExpressionTest]
   [junit4] Completed [61/146 (1!)] on J1 in 103.95s, 139 tests, 1 failure, 9 skipped <<< FAILURES!

[...truncated 47442 lines...]

Mime
View raw message