lucene-dev mailing list archives

Site index · List index
Message view « Date » · « Thread »
Top « Date » · « Thread »
From Policeman Jenkins Server <jenk...@thetaphi.de>
Subject [JENKINS] Lucene-Solr-master-Linux (64bit/jdk1.8.0_144) - Build # 21035 - Still Unstable!
Date Tue, 05 Dec 2017 15:51:52 GMT
Build: https://jenkins.thetaphi.de/job/Lucene-Solr-master-Linux/21035/
Java: 64bit/jdk1.8.0_144 -XX:-UseCompressedOops -XX:+UseG1GC

2 tests failed.
FAILED:  org.apache.lucene.search.TestTopFieldCollectorEarlyTermination.testEarlyTermination

Error Message:


Stack Trace:
java.lang.AssertionError
	at __randomizedtesting.SeedInfo.seed([71B0072AA2373F2F:BE2746759A5BAF2C]:0)
	at org.junit.Assert.fail(Assert.java:92)
	at org.junit.Assert.assertTrue(Assert.java:43)
	at org.junit.Assert.assertTrue(Assert.java:54)
	at org.apache.lucene.search.TestTopFieldCollectorEarlyTermination.doTestEarlyTermination(TestTopFieldCollectorEarlyTermination.java:159)
	at org.apache.lucene.search.TestTopFieldCollectorEarlyTermination.testEarlyTermination(TestTopFieldCollectorEarlyTermination.java:113)
	at sun.reflect.NativeMethodAccessorImpl.invoke0(Native Method)
	at sun.reflect.NativeMethodAccessorImpl.invoke(NativeMethodAccessorImpl.java:62)
	at sun.reflect.DelegatingMethodAccessorImpl.invoke(DelegatingMethodAccessorImpl.java:43)
	at java.lang.reflect.Method.invoke(Method.java:498)
	at com.carrotsearch.randomizedtesting.RandomizedRunner.invoke(RandomizedRunner.java:1737)
	at com.carrotsearch.randomizedtesting.RandomizedRunner$8.evaluate(RandomizedRunner.java:934)
	at com.carrotsearch.randomizedtesting.RandomizedRunner$9.evaluate(RandomizedRunner.java:970)
	at com.carrotsearch.randomizedtesting.RandomizedRunner$10.evaluate(RandomizedRunner.java:984)
	at org.apache.lucene.util.TestRuleSetupTeardownChained$1.evaluate(TestRuleSetupTeardownChained.java:49)
	at org.apache.lucene.util.AbstractBeforeAfterRule$1.evaluate(AbstractBeforeAfterRule.java:45)
	at org.apache.lucene.util.TestRuleThreadAndTestName$1.evaluate(TestRuleThreadAndTestName.java:48)
	at org.apache.lucene.util.TestRuleIgnoreAfterMaxFailures$1.evaluate(TestRuleIgnoreAfterMaxFailures.java:64)
	at org.apache.lucene.util.TestRuleMarkFailure$1.evaluate(TestRuleMarkFailure.java:47)
	at com.carrotsearch.randomizedtesting.rules.StatementAdapter.evaluate(StatementAdapter.java:36)
	at com.carrotsearch.randomizedtesting.ThreadLeakControl$StatementRunner.run(ThreadLeakControl.java:368)
	at com.carrotsearch.randomizedtesting.ThreadLeakControl.forkTimeoutingTask(ThreadLeakControl.java:817)
	at com.carrotsearch.randomizedtesting.ThreadLeakControl$3.evaluate(ThreadLeakControl.java:468)
	at com.carrotsearch.randomizedtesting.RandomizedRunner.runSingleTest(RandomizedRunner.java:943)
	at com.carrotsearch.randomizedtesting.RandomizedRunner$5.evaluate(RandomizedRunner.java:829)
	at com.carrotsearch.randomizedtesting.RandomizedRunner$6.evaluate(RandomizedRunner.java:879)
	at com.carrotsearch.randomizedtesting.RandomizedRunner$7.evaluate(RandomizedRunner.java:890)
	at org.apache.lucene.util.AbstractBeforeAfterRule$1.evaluate(AbstractBeforeAfterRule.java:45)
	at com.carrotsearch.randomizedtesting.rules.StatementAdapter.evaluate(StatementAdapter.java:36)
	at org.apache.lucene.util.TestRuleStoreClassName$1.evaluate(TestRuleStoreClassName.java:41)
	at com.carrotsearch.randomizedtesting.rules.NoShadowingOrOverridesOnMethodsRule$1.evaluate(NoShadowingOrOverridesOnMethodsRule.java:40)
	at com.carrotsearch.randomizedtesting.rules.NoShadowingOrOverridesOnMethodsRule$1.evaluate(NoShadowingOrOverridesOnMethodsRule.java:40)
	at com.carrotsearch.randomizedtesting.rules.StatementAdapter.evaluate(StatementAdapter.java:36)
	at com.carrotsearch.randomizedtesting.rules.StatementAdapter.evaluate(StatementAdapter.java:36)
	at com.carrotsearch.randomizedtesting.rules.StatementAdapter.evaluate(StatementAdapter.java:36)
	at org.apache.lucene.util.TestRuleAssertionsRequired$1.evaluate(TestRuleAssertionsRequired.java:53)
	at org.apache.lucene.util.TestRuleMarkFailure$1.evaluate(TestRuleMarkFailure.java:47)
	at org.apache.lucene.util.TestRuleIgnoreAfterMaxFailures$1.evaluate(TestRuleIgnoreAfterMaxFailures.java:64)
	at org.apache.lucene.util.TestRuleIgnoreTestSuites$1.evaluate(TestRuleIgnoreTestSuites.java:54)
	at com.carrotsearch.randomizedtesting.rules.StatementAdapter.evaluate(StatementAdapter.java:36)
	at com.carrotsearch.randomizedtesting.ThreadLeakControl$StatementRunner.run(ThreadLeakControl.java:368)
	at java.lang.Thread.run(Thread.java:748)


FAILED:  org.apache.solr.cloud.CreateCollectionCleanupTest.testCreateCollectionCleanup

Error Message:
Error from server at http://127.0.0.1:42265/solr: Could not fully remove collection: foo

Stack Trace:
org.apache.solr.client.solrj.impl.HttpSolrClient$RemoteSolrException: Error from server at http://127.0.0.1:42265/solr: Could not fully remove collection: foo
	at __randomizedtesting.SeedInfo.seed([E4CE9E77E2A4A338:506B306C207DF890]:0)
	at org.apache.solr.client.solrj.impl.HttpSolrClient.executeMethod(HttpSolrClient.java:643)
	at org.apache.solr.client.solrj.impl.HttpSolrClient.request(HttpSolrClient.java:255)
	at org.apache.solr.client.solrj.impl.HttpSolrClient.request(HttpSolrClient.java:244)
	at org.apache.solr.client.solrj.impl.LBHttpSolrClient.doRequest(LBHttpSolrClient.java:483)
	at org.apache.solr.client.solrj.impl.LBHttpSolrClient.request(LBHttpSolrClient.java:413)
	at org.apache.solr.client.solrj.impl.CloudSolrClient.sendRequest(CloudSolrClient.java:1103)
	at org.apache.solr.client.solrj.impl.CloudSolrClient.requestWithRetryOnStaleState(CloudSolrClient.java:883)
	at org.apache.solr.client.solrj.impl.CloudSolrClient.request(CloudSolrClient.java:816)
	at org.apache.solr.client.solrj.SolrRequest.process(SolrRequest.java:194)
	at org.apache.solr.client.solrj.SolrRequest.process(SolrRequest.java:211)
	at org.apache.solr.cloud.CreateCollectionCleanupTest.testCreateCollectionCleanup(CreateCollectionCleanupTest.java:75)
	at sun.reflect.NativeMethodAccessorImpl.invoke0(Native Method)
	at sun.reflect.NativeMethodAccessorImpl.invoke(NativeMethodAccessorImpl.java:62)
	at sun.reflect.DelegatingMethodAccessorImpl.invoke(DelegatingMethodAccessorImpl.java:43)
	at java.lang.reflect.Method.invoke(Method.java:498)
	at com.carrotsearch.randomizedtesting.RandomizedRunner.invoke(RandomizedRunner.java:1737)
	at com.carrotsearch.randomizedtesting.RandomizedRunner$8.evaluate(RandomizedRunner.java:934)
	at com.carrotsearch.randomizedtesting.RandomizedRunner$9.evaluate(RandomizedRunner.java:970)
	at com.carrotsearch.randomizedtesting.RandomizedRunner$10.evaluate(RandomizedRunner.java:984)
	at com.carrotsearch.randomizedtesting.rules.SystemPropertiesRestoreRule$1.evaluate(SystemPropertiesRestoreRule.java:57)
	at org.apache.lucene.util.TestRuleSetupTeardownChained$1.evaluate(TestRuleSetupTeardownChained.java:49)
	at org.apache.lucene.util.AbstractBeforeAfterRule$1.evaluate(AbstractBeforeAfterRule.java:45)
	at org.apache.lucene.util.TestRuleThreadAndTestName$1.evaluate(TestRuleThreadAndTestName.java:48)
	at org.apache.lucene.util.TestRuleIgnoreAfterMaxFailures$1.evaluate(TestRuleIgnoreAfterMaxFailures.java:64)
	at org.apache.lucene.util.TestRuleMarkFailure$1.evaluate(TestRuleMarkFailure.java:47)
	at com.carrotsearch.randomizedtesting.rules.StatementAdapter.evaluate(StatementAdapter.java:36)
	at com.carrotsearch.randomizedtesting.ThreadLeakControl$StatementRunner.run(ThreadLeakControl.java:368)
	at com.carrotsearch.randomizedtesting.ThreadLeakControl.forkTimeoutingTask(ThreadLeakControl.java:817)
	at com.carrotsearch.randomizedtesting.ThreadLeakControl$3.evaluate(ThreadLeakControl.java:468)
	at com.carrotsearch.randomizedtesting.RandomizedRunner.runSingleTest(RandomizedRunner.java:943)
	at com.carrotsearch.randomizedtesting.RandomizedRunner$5.evaluate(RandomizedRunner.java:829)
	at com.carrotsearch.randomizedtesting.RandomizedRunner$6.evaluate(RandomizedRunner.java:879)
	at com.carrotsearch.randomizedtesting.RandomizedRunner$7.evaluate(RandomizedRunner.java:890)
	at com.carrotsearch.randomizedtesting.rules.StatementAdapter.evaluate(StatementAdapter.java:36)
	at com.carrotsearch.randomizedtesting.rules.SystemPropertiesRestoreRule$1.evaluate(SystemPropertiesRestoreRule.java:57)
	at org.apache.lucene.util.AbstractBeforeAfterRule$1.evaluate(AbstractBeforeAfterRule.java:45)
	at com.carrotsearch.randomizedtesting.rules.StatementAdapter.evaluate(StatementAdapter.java:36)
	at org.apache.lucene.util.TestRuleStoreClassName$1.evaluate(TestRuleStoreClassName.java:41)
	at com.carrotsearch.randomizedtesting.rules.NoShadowingOrOverridesOnMethodsRule$1.evaluate(NoShadowingOrOverridesOnMethodsRule.java:40)
	at com.carrotsearch.randomizedtesting.rules.NoShadowingOrOverridesOnMethodsRule$1.evaluate(NoShadowingOrOverridesOnMethodsRule.java:40)
	at com.carrotsearch.randomizedtesting.rules.StatementAdapter.evaluate(StatementAdapter.java:36)
	at com.carrotsearch.randomizedtesting.rules.StatementAdapter.evaluate(StatementAdapter.java:36)
	at com.carrotsearch.randomizedtesting.rules.StatementAdapter.evaluate(StatementAdapter.java:36)
	at org.apache.lucene.util.TestRuleAssertionsRequired$1.evaluate(TestRuleAssertionsRequired.java:53)
	at org.apache.lucene.util.TestRuleMarkFailure$1.evaluate(TestRuleMarkFailure.java:47)
	at org.apache.lucene.util.TestRuleIgnoreAfterMaxFailures$1.evaluate(TestRuleIgnoreAfterMaxFailures.java:64)
	at org.apache.lucene.util.TestRuleIgnoreTestSuites$1.evaluate(TestRuleIgnoreTestSuites.java:54)
	at com.carrotsearch.randomizedtesting.rules.StatementAdapter.evaluate(StatementAdapter.java:36)
	at com.carrotsearch.randomizedtesting.ThreadLeakControl$StatementRunner.run(ThreadLeakControl.java:368)
	at java.lang.Thread.run(Thread.java:748)




Build Log:
[...truncated 1762 lines...]
   [junit4] Suite: org.apache.lucene.search.TestTopFieldCollectorEarlyTermination
   [junit4]   2> NOTE: reproduce with: ant test  -Dtestcase=TestTopFieldCollectorEarlyTermination -Dtests.method=testEarlyTermination -Dtests.seed=71B0072AA2373F2F -Dtests.multiplier=3 -Dtests.slow=true -Dtests.locale=ro-RO -Dtests.timezone=NZ -Dtests.asserts=true -Dtests.file.encoding=ISO-8859-1
   [junit4] FAILURE 1.61s J1 | TestTopFieldCollectorEarlyTermination.testEarlyTermination <<<
   [junit4]    > Throwable #1: java.lang.AssertionError
   [junit4]    > 	at __randomizedtesting.SeedInfo.seed([71B0072AA2373F2F:BE2746759A5BAF2C]:0)
   [junit4]    > 	at org.apache.lucene.search.TestTopFieldCollectorEarlyTermination.doTestEarlyTermination(TestTopFieldCollectorEarlyTermination.java:159)
   [junit4]    > 	at org.apache.lucene.search.TestTopFieldCollectorEarlyTermination.testEarlyTermination(TestTopFieldCollectorEarlyTermination.java:113)
   [junit4]    > 	at java.lang.Thread.run(Thread.java:748)
   [junit4]   2> NOTE: test params are: codec=Asserting(Lucene70): {s=PostingsFormat(name=Direct)}, docValues:{ndv2=DocValuesFormat(name=Direct), ndv1=DocValuesFormat(name=Lucene70), s=DocValuesFormat(name=Asserting)}, maxPointsInLeafNode=842, maxMBSortInHeap=5.4000947262877155, sim=Asserting(org.apache.lucene.search.similarities.AssertingSimilarity@5b316450), locale=ro-RO, timezone=NZ
   [junit4]   2> NOTE: Linux 4.10.0-40-generic amd64/Oracle Corporation 1.8.0_144 (64-bit)/cpus=8,threads=1,free=397344552,total=536870912
   [junit4]   2> NOTE: All tests run in this JVM: [Test2BBKDPoints, TestFSTs, TestFilterIterator, TestBooleanOr, TestLucene70DocValuesFormat, TestPositiveScoresOnlyCollector, TestIndexOrDocValuesQuery, TestToken, TestFieldValueQuery, TestIndexWriterOnJRECrash, TestOrdinalMap, TestIndexingSequenceNumbers, TestCloseableThreadLocal, TestFieldInvertState, TestTerms, TestCharArraySet, TestNoMergeScheduler, TestRecyclingByteBlockAllocator, TestCharsRefBuilder, Test2BPostings, TestPerFieldDocValuesFormat, TestDeterminism, TestBM25Similarity, TestBasicModelIne, TestBlockPostingsFormat3, TestDoc, TestForTooMuchCloning, TestParallelLeafReader, TestBooleanRewrites, TestCrash, TestSortedSetSortField, TestComplexExplanations, TestTimeLimitingCollector, TestMultiDocValues, TestGraphTokenizers, TestDuelingCodecs, TestPhraseQuery, TestBytesRefAttImpl, TestIndexFileDeleter, TestByteArrayDataInput, TestCustomNorms, TestLucene60FieldInfoFormat, TestLockFactory, TestTieredMergePolicy, TestSortRandom, TestReusableStringReader, TestRollback, TestNRTReaderCleanup, TestStressNRT, TestReaderWrapperDVTypeCheck, TestSearcherManager, TestMergeSchedulerExternal, TestMultiTermConstantScore, TestSpanExplanationsOfNonMatches, TestAllFilesDetectTruncation, TestBasicModelG, TestSloppyMath, TestFastDecompressionMode, Test2BDocs, TestPrefixInBooleanQuery, TestTimSorterWorstCase, TestTransactions, TestRadixSelector, TestMatchNoDocsQuery, TestLevenshteinAutomata, TestConcurrentMergeScheduler, TestOmitTf, TestTopFieldCollectorEarlyTermination]
   [junit4] Completed [466/477 (1!)] on J1 in 4.28s, 3 tests, 1 failure <<< FAILURES!

[...truncated 10549 lines...]
   [junit4] Suite: org.apache.solr.cloud.CreateCollectionCleanupTest
   [junit4]   2> Creating dataDir: /home/jenkins/workspace/Lucene-Solr-master-Linux/solr/build/solr-core/test/J1/temp/solr.cloud.CreateCollectionCleanupTest_E4CE9E77E2A4A338-001/init-core-data-001
   [junit4]   2> 734809 WARN  (SUITE-CreateCollectionCleanupTest-seed#[E4CE9E77E2A4A338]-worker) [    ] o.a.s.SolrTestCaseJ4 startTrackingSearchers: numOpens=6 numCloses=6
   [junit4]   2> 734809 INFO  (SUITE-CreateCollectionCleanupTest-seed#[E4CE9E77E2A4A338]-worker) [    ] o.a.s.SolrTestCaseJ4 Using PointFields (NUMERIC_POINTS_SYSPROP=true) w/NUMERIC_DOCVALUES_SYSPROP=true
   [junit4]   2> 734810 INFO  (SUITE-CreateCollectionCleanupTest-seed#[E4CE9E77E2A4A338]-worker) [    ] o.a.s.SolrTestCaseJ4 Randomized ssl (false) and clientAuth (false) via: @org.apache.solr.util.RandomizeSSL(reason=, value=NaN, ssl=NaN, clientAuth=NaN)
   [junit4]   2> 734810 INFO  (SUITE-CreateCollectionCleanupTest-seed#[E4CE9E77E2A4A338]-worker) [    ] o.a.s.SolrTestCaseJ4 SecureRandom sanity checks: test.solr.allowed.securerandom=null & java.security.egd=file:/dev/./urandom
   [junit4]   2> 734810 INFO  (SUITE-CreateCollectionCleanupTest-seed#[E4CE9E77E2A4A338]-worker) [    ] o.a.s.c.MiniSolrCloudCluster Starting cluster of 1 servers in /home/jenkins/workspace/Lucene-Solr-master-Linux/solr/build/solr-core/test/J1/temp/solr.cloud.CreateCollectionCleanupTest_E4CE9E77E2A4A338-001/tempDir-001
   [junit4]   2> 734810 INFO  (SUITE-CreateCollectionCleanupTest-seed#[E4CE9E77E2A4A338]-worker) [    ] o.a.s.c.ZkTestServer STARTING ZK TEST SERVER
   [junit4]   2> 734811 INFO  (Thread-1606) [    ] o.a.s.c.ZkTestServer client port:0.0.0.0/0.0.0.0:0
   [junit4]   2> 734811 INFO  (Thread-1606) [    ] o.a.s.c.ZkTestServer Starting server
   [junit4]   2> 734812 ERROR (Thread-1606) [    ] o.a.z.s.ZooKeeperServer ZKShutdownHandler is not registered, so ZooKeeper server won't take any action on ERROR or SHUTDOWN server state changes
   [junit4]   2> 734911 INFO  (SUITE-CreateCollectionCleanupTest-seed#[E4CE9E77E2A4A338]-worker) [    ] o.a.s.c.ZkTestServer start zk server on port:44535
   [junit4]   2> 734916 INFO  (jetty-launcher-1167-thread-1) [    ] o.e.j.s.Server jetty-9.3.20.v20170531
   [junit4]   2> 734916 INFO  (jetty-launcher-1167-thread-1) [    ] o.e.j.s.h.ContextHandler Started o.e.j.s.ServletContextHandler@7d2a400c{/solr,null,AVAILABLE}
   [junit4]   2> 734918 INFO  (jetty-launcher-1167-thread-1) [    ] o.e.j.s.AbstractConnector Started ServerConnector@77f16193{HTTP/1.1,[http/1.1]}{127.0.0.1:42265}
   [junit4]   2> 734918 INFO  (jetty-launcher-1167-thread-1) [    ] o.e.j.s.Server Started @736421ms
   [junit4]   2> 734918 INFO  (jetty-launcher-1167-thread-1) [    ] o.a.s.c.s.e.JettySolrRunner Jetty properties: {hostContext=/solr, hostPort=42265}
   [junit4]   2> 734918 ERROR (jetty-launcher-1167-thread-1) [    ] o.a.s.u.StartupLoggingUtils Missing Java Option solr.log.dir. Logging may be missing or incomplete.
   [junit4]   2> 734919 INFO  (jetty-launcher-1167-thread-1) [    ] o.a.s.s.SolrDispatchFilter  ___      _       Welcome to Apache Solr? version 8.0.0
   [junit4]   2> 734919 INFO  (jetty-launcher-1167-thread-1) [    ] o.a.s.s.SolrDispatchFilter / __| ___| |_ _   Starting in cloud mode on port null
   [junit4]   2> 734919 INFO  (jetty-launcher-1167-thread-1) [    ] o.a.s.s.SolrDispatchFilter \__ \/ _ \ | '_|  Install dir: null
   [junit4]   2> 734919 INFO  (jetty-launcher-1167-thread-1) [    ] o.a.s.s.SolrDispatchFilter |___/\___/_|_|    Start time: 2017-12-05T15:02:27.277Z
   [junit4]   2> 734922 INFO  (jetty-launcher-1167-thread-1) [    ] o.a.s.s.SolrDispatchFilter solr.xml found in ZooKeeper. Loading...
   [junit4]   2> 734925 INFO  (jetty-launcher-1167-thread-1) [    ] o.a.s.c.SolrXmlConfig MBean server found: com.sun.jmx.mbeanserver.JmxMBeanServer@27726bbd, but no JMX reporters were configured - adding default JMX reporter.
   [junit4]   2> 734927 INFO  (jetty-launcher-1167-thread-1) [    ] o.a.s.c.ZkContainer Zookeeper client=127.0.0.1:44535/solr
   [junit4]   2> 734956 INFO  (jetty-launcher-1167-thread-1) [n:127.0.0.1:42265_solr    ] o.a.s.c.Overseer Overseer (id=null) closing
   [junit4]   2> 734957 INFO  (jetty-launcher-1167-thread-1) [n:127.0.0.1:42265_solr    ] o.a.s.c.OverseerElectionContext I am going to be the leader 127.0.0.1:42265_solr
   [junit4]   2> 734957 INFO  (jetty-launcher-1167-thread-1) [n:127.0.0.1:42265_solr    ] o.a.s.c.Overseer Overseer (id=99122292140867587-127.0.0.1:42265_solr-n_0000000000) starting
   [junit4]   2> 734960 INFO  (jetty-launcher-1167-thread-1) [n:127.0.0.1:42265_solr    ] o.a.s.c.ZkController Register node as live in ZooKeeper:/live_nodes/127.0.0.1:42265_solr
   [junit4]   2> 734964 INFO  (zkCallback-1174-thread-1-processing-n:127.0.0.1:42265_solr) [n:127.0.0.1:42265_solr    ] o.a.s.c.c.ZkStateReader Updated live nodes from ZooKeeper... (0) -> (1)
   [junit4]   2> 735007 INFO  (jetty-launcher-1167-thread-1) [n:127.0.0.1:42265_solr    ] o.a.s.m.r.SolrJmxReporter JMX monitoring for 'solr.node' (registry 'solr.node') enabled at server: com.sun.jmx.mbeanserver.JmxMBeanServer@27726bbd
   [junit4]   2> 735012 INFO  (jetty-launcher-1167-thread-1) [n:127.0.0.1:42265_solr    ] o.a.s.m.r.SolrJmxReporter JMX monitoring for 'solr.jvm' (registry 'solr.jvm') enabled at server: com.sun.jmx.mbeanserver.JmxMBeanServer@27726bbd
   [junit4]   2> 735012 INFO  (jetty-launcher-1167-thread-1) [n:127.0.0.1:42265_solr    ] o.a.s.m.r.SolrJmxReporter JMX monitoring for 'solr.jetty' (registry 'solr.jetty') enabled at server: com.sun.jmx.mbeanserver.JmxMBeanServer@27726bbd
   [junit4]   2> 735013 INFO  (jetty-launcher-1167-thread-1) [n:127.0.0.1:42265_solr    ] o.a.s.c.CorePropertiesLocator Found 0 core definitions underneath /home/jenkins/workspace/Lucene-Solr-master-Linux/solr/build/solr-core/test/J1/temp/solr.cloud.CreateCollectionCleanupTest_E4CE9E77E2A4A338-001/tempDir-001/node1/.
   [junit4]   2> 735033 INFO  (SUITE-CreateCollectionCleanupTest-seed#[E4CE9E77E2A4A338]-worker) [    ] o.a.s.c.c.ZkStateReader Updated live nodes from ZooKeeper... (0) -> (1)
   [junit4]   2> 735033 INFO  (SUITE-CreateCollectionCleanupTest-seed#[E4CE9E77E2A4A338]-worker) [    ] o.a.s.c.s.i.ZkClientClusterStateProvider Cluster at 127.0.0.1:44535/solr ready
   [junit4]   2> 735055 INFO  (TEST-CreateCollectionCleanupTest.testCreateCollectionCleanup-seed#[E4CE9E77E2A4A338]) [    ] o.a.s.SolrTestCaseJ4 ###Starting testCreateCollectionCleanup
   [junit4]   2> 735056 INFO  (qtp270488878-6935) [n:127.0.0.1:42265_solr    ] o.a.s.h.a.CollectionsHandler Invoked Collection Action :create with params replicationFactor=1&property.dataDir=/some_invalid_dir/foo&collection.configName=conf1&name=foo&nrtReplicas=1&action=CREATE&numShards=1&wt=javabin&version=2 and sendToOCPQueue=true
   [junit4]   2> 735058 INFO  (OverseerThreadFactory-3063-thread-1-processing-n:127.0.0.1:42265_solr) [n:127.0.0.1:42265_solr    ] o.a.s.c.CreateCollectionCmd Create collection foo
   [junit4]   2> 735162 INFO  (OverseerStateUpdate-99122292140867587-127.0.0.1:42265_solr-n_0000000000) [n:127.0.0.1:42265_solr    ] o.a.s.c.o.SliceMutator createReplica() {
   [junit4]   2>   "operation":"ADDREPLICA",
   [junit4]   2>   "collection":"foo",
   [junit4]   2>   "shard":"shard1",
   [junit4]   2>   "core":"foo_shard1_replica_n1",
   [junit4]   2>   "state":"down",
   [junit4]   2>   "base_url":"http://127.0.0.1:42265/solr",
   [junit4]   2>   "type":"NRT",
   [junit4]   2>   "waitForFinalState":"false"} 
   [junit4]   2> 735363 INFO  (qtp270488878-6937) [n:127.0.0.1:42265_solr    ] o.a.s.h.a.CoreAdminOperation core create command qt=/admin/cores&property.dataDir=/some_invalid_dir/foo&collection.configName=conf1&newCollection=true&collection=foo&version=2&replicaType=NRT&coreNodeName=core_node2&name=foo_shard1_replica_n1&action=CREATE&numShards=1&shard=shard1&wt=javabin
   [junit4]   2> 735364 INFO  (qtp270488878-6937) [n:127.0.0.1:42265_solr    ] o.a.s.c.TransientSolrCoreCacheDefault Allocating transient cache for 2147483647 transient cores
   [junit4]   2> 735466 INFO  (zkCallback-1174-thread-1-processing-n:127.0.0.1:42265_solr) [n:127.0.0.1:42265_solr    ] o.a.s.c.c.ZkStateReader A cluster state change: [WatchedEvent state:SyncConnected type:NodeDataChanged path:/collections/foo/state.json] for collection [foo] has occurred - updating... (live nodes size: [1])
   [junit4]   2> 735466 INFO  (zkCallback-1174-thread-2-processing-n:127.0.0.1:42265_solr) [n:127.0.0.1:42265_solr    ] o.a.s.c.c.ZkStateReader A cluster state change: [WatchedEvent state:SyncConnected type:NodeDataChanged path:/collections/foo/state.json] for collection [foo] has occurred - updating... (live nodes size: [1])
   [junit4]   2> 736376 INFO  (qtp270488878-6937) [n:127.0.0.1:42265_solr c:foo s:shard1 r:core_node2 x:foo_shard1_replica_n1] o.a.s.c.SolrConfig Using Lucene MatchVersion: 8.0.0
   [junit4]   2> 736406 INFO  (qtp270488878-6937) [n:127.0.0.1:42265_solr c:foo s:shard1 r:core_node2 x:foo_shard1_replica_n1] o.a.s.s.IndexSchema [foo_shard1_replica_n1] Schema name=minimal
   [junit4]   2> 736409 INFO  (qtp270488878-6937) [n:127.0.0.1:42265_solr c:foo s:shard1 r:core_node2 x:foo_shard1_replica_n1] o.a.s.s.IndexSchema Loaded schema minimal/1.1 with uniqueid field id
   [junit4]   2> 736410 INFO  (qtp270488878-6937) [n:127.0.0.1:42265_solr c:foo s:shard1 r:core_node2 x:foo_shard1_replica_n1] o.a.s.c.CoreContainer Creating SolrCore 'foo_shard1_replica_n1' using configuration from collection foo, trusted=true
   [junit4]   2> 736410 INFO  (qtp270488878-6937) [n:127.0.0.1:42265_solr c:foo s:shard1 r:core_node2 x:foo_shard1_replica_n1] o.a.s.m.r.SolrJmxReporter JMX monitoring for 'solr.core.foo.shard1.replica_n1' (registry 'solr.core.foo.shard1.replica_n1') enabled at server: com.sun.jmx.mbeanserver.JmxMBeanServer@27726bbd
   [junit4]   2> 736410 INFO  (qtp270488878-6937) [n:127.0.0.1:42265_solr c:foo s:shard1 r:core_node2 x:foo_shard1_replica_n1] o.a.s.c.SolrCore solr.RecoveryStrategy.Builder
   [junit4]   2> 736410 INFO  (qtp270488878-6937) [n:127.0.0.1:42265_solr c:foo s:shard1 r:core_node2 x:foo_shard1_replica_n1] o.a.s.c.SolrCore [[foo_shard1_replica_n1] ] Opening new SolrCore at [/home/jenkins/workspace/Lucene-Solr-master-Linux/solr/build/solr-core/test/J1/temp/solr.cloud.CreateCollectionCleanupTest_E4CE9E77E2A4A338-001/tempDir-001/node1/foo_shard1_replica_n1], dataDir=[/some_invalid_dir/foo/]
   [junit4]   2> 736446 INFO  (qtp270488878-6937) [n:127.0.0.1:42265_solr c:foo s:shard1 r:core_node2 x:foo_shard1_replica_n1] o.a.s.u.UpdateHandler Using UpdateLog implementation: org.apache.solr.update.UpdateLog
   [junit4]   2> 736446 INFO  (qtp270488878-6937) [n:127.0.0.1:42265_solr c:foo s:shard1 r:core_node2 x:foo_shard1_replica_n1] o.a.s.u.UpdateLog Initializing UpdateLog: dataDir=null defaultSyncLevel=FLUSH numRecordsToKeep=100 maxNumLogsToKeep=10 numVersionBuckets=65536
   [junit4]   2> 736447 INFO  (qtp270488878-6937) [n:127.0.0.1:42265_solr c:foo s:shard1 r:core_node2 x:foo_shard1_replica_n1] o.a.s.c.SolrCore [foo_shard1_replica_n1]  CLOSING SolrCore org.apache.solr.core.SolrCore@4a243fef
   [junit4]   2> 736447 INFO  (qtp270488878-6937) [n:127.0.0.1:42265_solr c:foo s:shard1 r:core_node2 x:foo_shard1_replica_n1] o.a.s.m.SolrMetricManager Closing metric reporters for registry=solr.core.foo.shard1.replica_n1, tag=1243889647
   [junit4]   2> 736447 INFO  (qtp270488878-6937) [n:127.0.0.1:42265_solr c:foo s:shard1 r:core_node2 x:foo_shard1_replica_n1] o.a.s.m.r.SolrJmxReporter Closing reporter [org.apache.solr.metrics.reporters.SolrJmxReporter@49cbc540: rootName = null, domain = solr.core.foo.shard1.replica_n1, service url = null, agent id = null] for registry solr.core.foo.shard1.replica_n1 / com.codahale.metrics.MetricRegistry@6af3980f
   [junit4]   2> 736452 INFO  (qtp270488878-6937) [n:127.0.0.1:42265_solr c:foo s:shard1 r:core_node2 x:foo_shard1_replica_n1] o.a.s.m.SolrMetricManager Closing metric reporters for registry=solr.collection.foo.shard1.leader, tag=1243889647
   [junit4]   2> 736453 ERROR (qtp270488878-6937) [n:127.0.0.1:42265_solr c:foo s:shard1 r:core_node2 x:foo_shard1_replica_n1] o.a.s.h.RequestHandlerBase org.apache.solr.common.SolrException: Error CREATEing SolrCore 'foo_shard1_replica_n1': Unable to create core [foo_shard1_replica_n1] Caused by: access denied ("java.io.FilePermission" "/some_invalid_dir/foo/tlog" "write")
   [junit4]   2> 	at org.apache.solr.core.CoreContainer.create(CoreContainer.java:991)
   [junit4]   2> 	at org.apache.solr.handler.admin.CoreAdminOperation.lambda$static$0(CoreAdminOperation.java:91)
   [junit4]   2> 	at org.apache.solr.handler.admin.CoreAdminOperation.execute(CoreAdminOperation.java:384)
   [junit4]   2> 	at org.apache.solr.handler.admin.CoreAdminHandler$CallInfo.call(CoreAdminHandler.java:389)
   [junit4]   2> 	at org.apache.solr.handler.admin.CoreAdminHandler.handleRequestBody(CoreAdminHandler.java:174)
   [junit4]   2> 	at org.apache.solr.handler.RequestHandlerBase.handleRequest(RequestHandlerBase.java:177)
   [junit4]   2> 	at org.apache.solr.servlet.HttpSolrCall.handleAdmin(HttpSolrCall.java:735)
   [junit4]   2> 	at org.apache.solr.servlet.HttpSolrCall.handleAdminRequest(HttpSolrCall.java:716)
   [junit4]   2> 	at org.apache.solr.servlet.HttpSolrCall.call(HttpSolrCall.java:497)
   [junit4]   2> 	at org.apache.solr.servlet.SolrDispatchFilter.doFilter(SolrDispatchFilter.java:382)
   [junit4]   2> 	at org.apache.solr.servlet.SolrDispatchFilter.doFilter(SolrDispatchFilter.java:326)
   [junit4]   2> 	at org.eclipse.jetty.servlet.ServletHandler$CachedChain.doFilter(ServletHandler.java:1759)
   [junit4]   2> 	at org.apache.solr.client.solrj.embedded.JettySolrRunner$DebugFilter.doFilter(JettySolrRunner.java:139)
   [junit4]   2> 	at org.eclipse.jetty.servlet.ServletHandler$CachedChain.doFilter(ServletHandler.java:1759)
   [junit4]   2> 	at org.eclipse.jetty.servlet.ServletHandler.doHandle(ServletHandler.java:582)
   [junit4]   2> 	at org.eclipse.jetty.server.session.SessionHandler.doHandle(SessionHandler.java:224)
   [junit4]   2> 	at org.eclipse.jetty.server.handler.ContextHandler.doHandle(ContextHandler.java:1180)
   [junit4]   2> 	at org.eclipse.jetty.servlet.ServletHandler.doScope(ServletHandler.java:512)
   [junit4]   2> 	at org.eclipse.jetty.server.session.SessionHandler.doScope(SessionHandler.java:185)
   [junit4]   2> 	at org.eclipse.jetty.server.handler.ContextHandler.doScope(ContextHandler.java:1112)
   [junit4]   2> 	at org.eclipse.jetty.server.handler.ScopedHandler.handle(ScopedHandler.java:141)
   [junit4]   2> 	at org.eclipse.jetty.server.handler.gzip.GzipHandler.handle(GzipHandler.java:426)
   [junit4]   2> 	at org.eclipse.jetty.server.handler.HandlerWrapper.handle(HandlerWrapper.java:134)
   [junit4]   2> 	at org.eclipse.jetty.server.Server.handle(Server.java:534)
   [junit4]   2> 	at org.eclipse.jetty.server.HttpChannel.handle(HttpChannel.java:320)
   [junit4]   2> 	at org.eclipse.jetty.server.HttpConnection.onFillable(HttpConnection.java:251)
   [junit4]   2> 	at org.eclipse.jetty.io.AbstractConnection$ReadCallback.succeeded(AbstractConnection.java:283)
   [junit4]   2> 	at org.eclipse.jetty.io.FillInterest.fillable(FillInterest.java:108)
   [junit4]   2> 	at org.eclipse.jetty.io.SelectChannelEndPoint$2.run(SelectChannelEndPoint.java:93)
   [junit4]   2> 	at org.eclipse.jetty.util.thread.strategy.ExecuteProduceConsume.executeProduceConsume(ExecuteProduceConsume.java:303)
   [junit4]   2> 	at org.eclipse.jetty.util.thread.strategy.ExecuteProduceConsume.produceConsume(ExecuteProduceConsume.java:148)
   [junit4]   2> 	at org.eclipse.jetty.util.thread.strategy.ExecuteProduceConsume.run(ExecuteProduceConsume.java:136)
   [junit4]   2> 	at org.eclipse.jetty.util.thread.QueuedThreadPool.runJob(QueuedThreadPool.java:671)
   [junit4]   2> 	at org.eclipse.jetty.util.thread.QueuedThreadPool$2.run(QueuedThreadPool.java:589)
   [junit4]   2> 	at java.lang.Thread.run(Thread.java:748)
   [junit4]   2> Caused by: org.apache.solr.common.SolrException: Unable to create core [foo_shard1_replica_n1]
   [junit4]   2> 	at org.apache.solr.core.CoreContainer.createFromDescriptor(CoreContainer.java:1057)
   [junit4]   2> 	at org.apache.solr.core.CoreContainer.create(CoreContainer.java:952)
   [junit4]   2> 	... 34 more
   [junit4]   2> Caused by: org.apache.solr.common.SolrException: Error Instantiating Update Handler, solr.DirectUpdateHandler2 failed to instantiate org.apache.solr.update.UpdateHandler
   [junit4]   2> 	at org.apache.solr.core.SolrCore.<init>(SolrCore.java:1008)
   [junit4]   2> 	at org.apache.solr.core.SolrCore.<init>(SolrCore.java:863)
   [junit4]   2> 	at org.apache.solr.core.CoreContainer.createFromDescriptor(CoreContainer.java:1041)
   [junit4]   2> 	... 35 more
   [junit4]   2> Caused by: org.apache.solr.common.SolrException: Error Instantiating Update Handler, solr.DirectUpdateHandler2 failed to instantiate org.apache.solr.update.UpdateHandler
   [junit4]   2> 	at org.apache.solr.core.SolrCore.createInstance(SolrCore.java:807)
   [junit4]   2> 	at org.apache.solr.core.SolrCore.createUpdateHandler(SolrCore.java:855)
   [junit4]   2> 	at org.apache.solr.core.SolrCore.initUpdateHandler(SolrCore.java:1108)
   [junit4]   2> 	at org.apache.solr.core.SolrCore.<init>(SolrCore.java:978)
   [junit4]   2> 	... 37 more
   [junit4]   2> Caused by: java.lang.reflect.InvocationTargetException
   [junit4]   2> 	at sun.reflect.GeneratedConstructorAccessor126.newInstance(Unknown Source)
   [junit4]   2> 	at sun.reflect.DelegatingConstructorAccessorImpl.newInstance(DelegatingConstructorAccessorImpl.java:45)
   [junit4]   2> 	at java.lang.reflect.Constructor.newInstance(Constructor.java:423)
   [junit4]   2> 	at org.apache.solr.core.SolrCore.createInstance(SolrCore.java:793)
   [junit4]   2> 	... 40 more
   [junit4]   2> Caused by: java.security.AccessControlException: access denied ("java.io.FilePermission" "/some_invalid_dir/foo/tlog" "write")
   [junit4]   2> 	at java.security.AccessControlContext.checkPermission(AccessControlContext.java:472)
   [junit4]   2> 	at java.security.AccessController.checkPermission(AccessController.java:884)
   [junit4]   2> 	at java.lang.SecurityManager.checkPermission(SecurityManager.java:549)
   [junit4]   2> 	at java.lang.SecurityManager.checkWrite(SecurityManager.java:979)
   [junit4]   2> 	at java.io.File.mkdir(File.java:1311)
   [junit4]   2> 	at java.io.File.mkdirs(File.java:1343)
   [junit4]   2> 	at org.apache.solr.update.UpdateLog.init(UpdateLog.java:359)
   [junit4]   2> 	at org.apache.solr.update.UpdateHandler.<init>(UpdateHandler.java:161)
   [junit4]   2> 	at org.apache.solr.update.UpdateHandler.<init>(UpdateHandler.java:116)
   [junit4]   2> 	at org.apache.solr.update.DirectUpdateHandler2.<init>(DirectUpdateHandler2.java:113)
   [junit4]   2> 	... 44 more
   [junit4]   2> 
   [junit4]   2> 736454 INFO  (qtp270488878-6937) [n:127.0.0.1:42265_solr c:foo s:shard1 r:core_node2 x:foo_shard1_replica_n1] o.a.s.s.HttpSolrCall [admin] webapp=null path=/admin/cores params={qt=/admin/cores&property.dataDir=/some_invalid_dir/foo&collection.configName=conf1&newCollection=true&collection=foo&version=2&replicaType=NRT&coreNodeName=core_node2&name=foo_shard1_replica_n1&action=CREATE&numShards=1&shard=shard1&wt=javabin} status=400 QTime=1090
   [junit4]   2> 736454 ERROR (OverseerThreadFactory-3063-thread-1-processing-n:127.0.0.1:42265_solr) [n:127.0.0.1:42265_solr    ] o.a.s.c.OverseerCollectionMessageHandler Error from shard: http://127.0.0.1:42265/solr
   [junit4]   2> org.apache.solr.client.solrj.impl.HttpSolrClient$RemoteSolrException: Error from server at http://127.0.0.1:42265/solr: Error CREATEing SolrCore 'foo_shard1_replica_n1': Unable to create core [foo_shard1_replica_n1] Caused by: access denied ("java.io.FilePermission" "/some_invalid_dir/foo/tlog" "write")
   [junit4]   2> 	at org.apache.solr.client.solrj.impl.HttpSolrClient.executeMethod(HttpSolrClient.java:643)
   [junit4]   2> 	at org.apache.solr.client.solrj.impl.HttpSolrClient.request(HttpSolrClient.java:255)
   [junit4]   2> 	at org.apache.solr.client.solrj.impl.HttpSolrClient.request(HttpSolrClient.java:244)
   [junit4]   2> 	at org.apache.solr.client.solrj.SolrClient.request(SolrClient.java:1219)
   [junit4]   2> 	at org.apache.solr.handler.component.HttpShardHandler.lambda$submit$0(HttpShardHandler.java:172)
   [junit4]   2> 	at java.util.concurrent.FutureTask.run(FutureTask.java:266)
   [junit4]   2> 	at java.util.concurrent.Executors$RunnableAdapter.call(Executors.java:511)
   [junit4]   2> 	at java.util.concurrent.FutureTask.run(FutureTask.java:266)
   [junit4]   2> 	at com.codahale.metrics.InstrumentedExecutorService$InstrumentedRunnable.run(InstrumentedExecutorService.java:176)
   [junit4]   2> 	at org.apache.solr.common.util.ExecutorUtil$MDCAwareThreadPoolExecutor.lambda$execute$0(ExecutorUtil.java:188)
   [junit4]   2> 	at java.util.concurrent.ThreadPoolExecutor.runWorker(ThreadPoolExecutor.java:1149)
   [junit4]   2> 	at java.util.concurrent.ThreadPoolExecutor$Worker.run(ThreadPoolExecutor.java:624)
   [junit4]   2> 	at java.lang.Thread.run(Thread.java:748)
   [junit4]   2> 736455 ERROR (OverseerThreadFactory-3063-thread-1-processing-n:127.0.0.1:42265_solr) [n:127.0.0.1:42265_solr    ] o.a.s.c.OverseerCollectionMessageHandler Cleaning up collection [foo].
   [junit4]   2> 736455 INFO  (OverseerThreadFactory-3063-thread-1-processing-n:127.0.0.1:42265_solr) [n:127.0.0.1:42265_solr    ] o.a.s.c.OverseerCollectionMessageHandler Executing Collection Cmd : action=UNLOAD&deleteInstanceDir=true&deleteDataDir=true
   [junit4]   2> 736456 INFO  (qtp270488878-6930) [n:127.0.0.1:42265_solr    ] o.a.s.s.HttpSolrCall [admin] webapp=null path=/admin/cores params={deleteInstanceDir=true&core=foo_shard1_replica_n1&qt=/admin/cores&deleteDataDir=true&action=UNLOAD&wt=javabin&version=2} status=0 QTime=0
   [junit4]   2> 766490 INFO  (zkCallback-1174-thread-3-processing-n:127.0.0.1:42265_solr) [n:127.0.0.1:42265_solr    ] o.a.s.c.c.ZkStateReader A cluster state change: [WatchedEvent state:SyncConnected type:NodeDeleted path:/collections/foo/state.json] for collection [foo] has occurred - updating... (live nodes size: [1])
   [junit4]   2> 766490 INFO  (zkCallback-1174-thread-2-processing-n:127.0.0.1:42265_solr) [n:127.0.0.1:42265_solr    ] o.a.s.c.c.ZkStateReader A cluster state change: [WatchedEvent state:SyncConnected type:NodeDeleted path:/collections/foo/state.json] for collection [foo] has occurred - updating... (live nodes size: [1])
   [junit4]   2> 766491 ERROR (OverseerThreadFactory-3063-thread-1-processing-n:127.0.0.1:42265_solr) [n:127.0.0.1:42265_solr    ] o.a.s.c.OverseerCollectionMessageHandler Collection: foo operation: create failed:org.apache.solr.common.SolrException: Could not fully remove collection: foo
   [junit4]   2> 	at org.apache.solr.cloud.DeleteCollectionCmd.call(DeleteCollectionCmd.java:109)
   [junit4]   2> 	at org.apache.solr.cloud.OverseerCollectionMessageHandler.cleanupCollection(OverseerCollectionMessageHandler.java:678)
   [junit4]   2> 	at org.apache.solr.cloud.CreateCollectionCmd.call(CreateCollectionCmd.java:302)
   [junit4]   2> 	at org.apache.solr.cloud.OverseerCollectionMessageHandler.processMessage(OverseerCollectionMessageHandler.java:232)
   [junit4]   2> 	at org.apache.solr.cloud.OverseerTaskProcessor$Runner.run(OverseerTaskProcessor.java:464)
   [junit4]   2> 	at org.apache.solr.common.util.ExecutorUtil$MDCAwareThreadPoolExecutor.lambda$execute$0(ExecutorUtil.java:188)
   [junit4]   2> 	at java.util.concurrent.ThreadPoolExecutor.runWorker(ThreadPoolExecutor.java:1149)
   [junit4]   2> 	at java.util.concurrent.ThreadPoolExecutor$Worker.run(ThreadPoolExecutor.java:624)
   [junit4]   2> 	at java.lang.Thread.run(Thread.java:748)
   [junit4]   2> 
   [junit4]   2> 766502 INFO  (qtp270488878-6935) [n:127.0.0.1:42265_solr    ] o.a.s.s.HttpSolrCall [admin] webapp=null path=/admin/collections params={replicationFactor=1&property.dataDir=/some_invalid_dir/foo&collection.configName=conf1&name=foo&nrtReplicas=1&action=CREATE&numShards=1&wt=javabin&version=2} status=500 QTime=31446
   [junit4]   2> 766503 ERROR (qtp270488878-6935) [n:127.0.0.1:42265_solr    ] o.a.s.s.HttpSolrCall null:org.apache.solr.common.SolrException: Could not fully remove collection: foo
   [junit4]   2> 	at org.apache.solr.handler.admin.CollectionsHandler.handleResponse(CollectionsHandler.java:309)
   [junit4]   2> 	at org.apache.solr.handler.admin.CollectionsHandler.invokeAction(CollectionsHandler.java:246)
   [junit4]   2> 	at org.apache.solr.handler.admin.CollectionsHandler.handleRequestBody(CollectionsHandler.java:224)
   [junit4]   2> 	at org.apache.solr.handler.RequestHandlerBase.handleRequest(RequestHandlerBase.java:177)
   [junit4]   2> 	at org.apache.solr.servlet.HttpSolrCall.handleAdmin(HttpSolrCall.java:735)
   [junit4]   2> 	at org.apache.solr.servlet.HttpSolrCall.handleAdminRequest(HttpSolrCall.java:716)
   [junit4]   2> 	at org.apache.solr.servlet.HttpSolrCall.call(HttpSolrCall.java:497)
   [junit4]   2> 	at org.apache.solr.servlet.SolrDispatchFilter.doFilter(SolrDispatchFilter.java:382)
   [junit4]   2> 	at org.apache.solr.servlet.SolrDispatchFilter.doFilter(SolrDispatchFilter.java:326)
   [junit4]   2> 	at org.eclipse.jetty.servlet.ServletHandler$CachedChain.doFilter(ServletHandler.java:1759)
   [junit4]   2> 	at org.apache.solr.client.solrj.embedded.JettySolrRunner$DebugFilter.doFilter(JettySolrRunner.java:139)
   [junit4]   2> 	at org.eclipse.jetty.servlet.ServletHandler$CachedChain.doFilter(ServletHandler.java:1759)
   [junit4]   2> 	at org.eclipse.jetty.servlet.ServletHandler.doHandle(ServletHandler.java:582)
   [junit4]   2> 	at org.eclipse.jetty.server.session.SessionHandler.doHandle(SessionHandler.java:224)
   [junit4]   2> 	at org.eclipse.jetty.server.handler.ContextHandler.doHandle(ContextHandler.java:1180)
   [junit4]   2> 	at org.eclipse.jetty.servlet.ServletHandler.doScope(ServletHandler.java:512)
   [junit4]   2> 	at org.eclipse.jetty.server.session.SessionHandler.doScope(SessionHandler.java:185)
   [junit4]   2> 	at org.eclipse.jetty.server.handler.ContextHandler.doScope(ContextHandler.java:1112)
   [junit4]   2> 	at org.eclipse.jetty.server.handler.ScopedHandler.handle(ScopedHandler.java:141)
   [junit4]   2> 	at org.eclipse.jetty.server.handler.gzip.GzipHandler.handle(GzipHandler.java:493)
   [junit4]   2> 	at org.eclipse.jetty.server.handler.HandlerWrapper.handle(HandlerWrapper.java:134)
   [junit4]   2> 	at org.eclipse.jetty.server.Server.handle(Server.java:534)
   [junit4]   2> 	at org.eclipse.jetty.server.HttpChannel.handle(HttpChannel.java:320)
   [junit4]   2> 	at org.eclipse.jetty.server.HttpConnection.onFillable(HttpConnection.java:251)
   [junit4]   2> 	at org.eclipse.jetty.io.AbstractConnection$ReadCallback.succeeded(AbstractConnection.java:283)
   [junit4]   2> 	at org.eclipse.jetty.io.FillInterest.fillable(FillInterest.java:108)
   [junit4]   2> 	at org.eclipse.jetty.io.SelectChannelEndPoint$2.run(SelectChannelEndPoint.java:93)
   [junit4]   2> 	at org.eclipse.jetty.util.thread.strategy.ExecuteProduceConsume.executeProduceConsume(ExecuteProduceConsume.java:303)
   [junit4]   2> 	at org.eclipse.jetty.util.thread.strategy.ExecuteProduceConsume.produceConsume(ExecuteProduceConsume.java:148)
   [junit4]   2> 	at org.eclipse.jetty.util.thread.strategy.ExecuteProduceConsume.run(ExecuteProduceConsume.java:136)
   [junit4]   2> 	at org.eclipse.jetty.util.thread.QueuedThreadPool.runJob(QueuedThreadPool.java:671)
   [junit4]   2> 	at org.eclipse.jetty.util.thread.QueuedThreadPool$2.run(QueuedThreadPool.java:589)
   [junit4]   2> 	at java.lang.Thread.run(Thread.java:748)
   [junit4]   2> 
   [junit4]   2> 766504 INFO  (TEST-CreateCollectionCleanupTest.testCreateCollectionCleanup-seed#[E4CE9E77E2A4A338]) [    ] o.a.s.SolrTestCaseJ4 ###Ending testCreateCollectionCleanup
   [junit4]   2> NOTE: reproduce with: ant test  -Dtestcase=CreateCollectionCleanupTest -Dtests.method=testCreateCollectionCleanup -Dtests.seed=E4CE9E77E2A4A338 -Dtests.multiplier=3 -Dtests.slow=true -Dtests.locale=sr-ME -Dtests.timezone=Brazil/DeNoronha -Dtests.asserts=true -Dtests.file.encoding=US-ASCII
   [junit4] ERROR   31.5s J1 | CreateCollectionCleanupTest.testCreateCollectionCleanup <<<
   [junit4]    > Throwable #1: org.apache.solr.client.solrj.impl.HttpSolrClient$RemoteSolrException: Error from server at http://127.0.0.1:42265/solr: Could not fully remove collection: foo
   [junit4]    > 	at __randomizedtesting.SeedInfo.seed([E4CE9E77E2A4A338:506B306C207DF890]:0)
   [junit4]    > 	at org.apache.solr.client.solrj.impl.HttpSolrClient.executeMethod(HttpSolrClient.java:643)
   [junit4]    > 	at org.apache.solr.client.solrj.impl.HttpSolrClient.request(HttpSolrClient.java:255)
   [junit4]    > 	at org.apache.solr.client.solrj.impl.HttpSolrClient.request(HttpSolrClient.java:244)
   [junit4]    > 	at org.apache.solr.client.solrj.impl.LBHttpSolrClient.doRequest(LBHttpSolrClient.java:483)
   [junit4]    > 	at org.apache.solr.client.solrj.impl.LBHttpSolrClient.request(LBHttpSolrClient.java:413)
   [junit4]    > 	at org.apache.solr.client.solrj.impl.CloudSolrClient.sendRequest(CloudSolrClient.java:1103)
   [junit4]    > 	at org.apache.solr.client.solrj.impl.CloudSolrClient.requestWithRetryOnStaleState(CloudSolrClient.java:883)
   [junit4]    > 	at org.apache.solr.client.solrj.impl.CloudSolrClient.request(CloudSolrClient.java:816)
   [junit4]    > 	at org.apache.solr.client.solrj.SolrRequest.process(SolrRequest.java:194)
   [junit4]    > 	at org.apache.solr.client.solrj.SolrRequest.process(SolrRequest.java:211)
   [junit4]    > 	at org.apache.solr.cloud.CreateCollectionCleanupTest.testCreateCollectionCleanup(CreateCollectionCleanupTest.java:75)
   [junit4]    > 	at java.lang.Thread.run(Thread.java:748)
   [junit4]   2> 766510 INFO  (jetty-closer-1168-thread-1) [    ] o.e.j.s.AbstractConnector Stopped ServerConnector@77f16193{HTTP/1.1,[http/1.1]}{127.0.0.1:0}
   [junit4]   2> 766511 INFO  (jetty-closer-1168-thread-1) [    ] o.a.s.c.CoreContainer Shutting down CoreContainer instance=1926937529
   [junit4]   2> 766511 INFO  (jetty-closer-1168-thread-1) [    ] o.a.s.m.SolrMetricManager Closing metric reporters for registry=solr.node, tag=null
   [junit4]   2> 766511 INFO  (jetty-closer-1168-thread-1) [    ] o.a.s.m.r.SolrJmxReporter Closing reporter [org.apache.solr.metrics.reporters.SolrJmxReporter@ea2d9a7: rootName = null, domain = solr.node, service url = null, agent id = null] for registry solr.node / com.codahale.metrics.MetricRegistry@290ee1d5
   [junit4]   2> 766520 INFO  (jetty-closer-1168-thread-1) [    ] o.a.s.m.SolrMetricManager Closing metric reporters for registry=solr.jvm, tag=null
   [junit4]   2> 766520 INFO  (jetty-closer-1168-thread-1) [    ] o.a.s.m.r.SolrJmxReporter Closing reporter [org.apache.solr.metrics.reporters.SolrJmxReporter@879e7b9: rootName = null, domain = solr.jvm, service url = null, agent id = null] for registry solr.jvm / com.codahale.metrics.MetricRegistry@3313b12d
   [junit4]   2> 766526 INFO  (jetty-closer-1168-thread-1) [    ] o.a.s.m.SolrMetricManager Closing metric reporters for registry=solr.jetty, tag=null
   [junit4]   2> 766526 INFO  (jetty-closer-1168-thread-1) [    ] o.a.s.m.r.SolrJmxReporter Closing reporter [org.apache.solr.metrics.reporters.SolrJmxReporter@64e41467: rootName = null, domain = solr.jetty, service url = null, agent id = null] for registry solr.jetty / com.codahale.metrics.MetricRegistry@7b0af9b4
   [junit4]   2> 766528 INFO  (jetty-closer-1168-thread-1) [    ] o.a.s.c.ZkController Remove node as live in ZooKeeper:/live_nodes/127.0.0.1:42265_solr
   [junit4]   2> 766529 INFO  (jetty-closer-1168-thread-1) [    ] o.a.s.m.SolrMetricManager Closing metric reporters for registry=solr.cluster, tag=null
   [junit4]   2> 766529 INFO  (zkCallback-1174-thread-2-processing-n:127.0.0.1:42265_solr) [n:127.0.0.1:42265_solr    ] o.a.s.c.c.ZkStateReader Updated live nodes from ZooKeeper... (1) -> (0)
   [junit4]   2> 766529 INFO  (jetty-closer-1168-thread-1) [    ] o.a.s.c.Overseer Overseer (id=99122292140867587-127.0.0.1:42265_solr-n_0000000000) closing
   [junit4]   2> 766529 INFO  (OverseerStateUpdate-99122292140867587-127.0.0.1:42265_solr-n_0000000000) [n:127.0.0.1:42265_solr    ] o.a.s.c.Overseer Overseer Loop exiting : 127.0.0.1:42265_solr
   [junit4]   2> 766529 WARN  (OverseerAutoScalingTriggerThread-99122292140867587-127.0.0.1:42265_solr-n_0000000000) [n:127.0.0.1:42265_solr    ] o.a.s.c.a.OverseerTriggerThread OverseerTriggerThread woken up but we are closed, exiting.
   [junit4]   2> 766532 INFO  (jetty-closer-1168-thread-1) [    ] o.e.j.s.h.ContextHandler Stopped o.e.j.s.ServletContextHandler@7d2a400c{/solr,null,UNAVAILABLE}
   [junit4]   2> 766533 ERROR (SUITE-CreateCollectionCleanupTest-seed#[E4CE9E77E2A4A338]-worker) [    ] o.a.z.s.ZooKeeperServer ZKShutdownHandler is not registered, so ZooKeeper server won't take any action on ERROR or SHUTDOWN server state changes
   [junit4]   2> 766533 INFO  (SUITE-CreateCollectionCleanupTest-seed#[E4CE9E77E2A4A338]-worker) [    ] o.a.s.c.ZkTestServer connecting to 127.0.0.1:44535 44535
   [junit4]   2> 771594 INFO  (Thread-1606) [    ] o.a.s.c.ZkTestServer connecting to 127.0.0.1:44535 44535
   [junit4]   2> 771595 WARN  (Thread-1606) [    ] o.a.s.c.ZkTestServer Watch limit violations: 
   [junit4]   2> Maximum concurrent create/delete watches above limit:
   [junit4]   2> 
   [junit4]   2> 	2	/solr/aliases.json
   [junit4]   2> 	2	/solr/clusterprops.json
   [junit4]   2> 
   [junit4]   2> Maximum concurrent data watches above limit:
   [junit4]   2> 
   [junit4]   2> 	3	/solr/collections/foo/state.json
   [junit4]   2> 	2	/solr/clusterstate.json
   [junit4]   2> 
   [junit4]   2> Maximum concurrent children watches above limit:
   [junit4]   2> 
   [junit4]   2> 	2	/solr/live_nodes
   [junit4]   2> 	2	/solr/collections
   [junit4]   2> 
   [junit4]   2> NOTE: leaving temporary files on disk at: /home/jenkins/workspace/Lucene-Solr-master-Linux/solr/build/solr-core/test/J1/temp/solr.cloud.CreateCollectionCleanupTest_E4CE9E77E2A4A338-001
   [junit4]   2> NOTE: test params are: codec=Asserting(Lucene70): {}, docValues:{}, maxPointsInLeafNode=791, maxMBSortInHeap=5.569041521308206, sim=Asserting(org.apache.lucene.search.similarities.AssertingSimilarity@1f376ffe), locale=sr-ME, timezone=Brazil/DeNoronha
   [junit4]   2> NOTE: Linux 4.10.0-40-generic amd64/Oracle Corporation 1.8.0_144 (64-bit)/cpus=8,threads=1,free=251274448,total=536870912
   [junit4]   2> NOTE: All tests run in this JVM: [TestIntervalFaceting, ZkCLITest, ConjunctionSolrSpellCheckerTest, SolrIndexConfigTest, TestManagedResource, TestReRankQParserPlugin, TestSolrCloudSnapshots, TestManagedSchema, TestDelegationWithHadoopAuth, TestCloudNestedDocsSort, TestExactStatsCache, TestCloudInspectUtil, TestBulkSchemaAPI, MoveReplicaTest, PreAnalyzedFieldTest, TestLuceneMatchVersion, TestDocSet, SystemLogListenerTest, HdfsNNFailoverTest, ConvertedLegacyTest, AssignTest, OverseerModifyCollectionTest, SaslZkACLProviderTest, TestXmlQParser, TestConfigSetsAPI, TestPerFieldSimilarity, ManagedSchemaRoundRobinCloudTest, TestAddFieldRealTimeGet, TestRequestStatusCollectionAPI, StatsReloadRaceTest, OverseerTaskQueueTest, BadIndexSchemaTest, TestQuerySenderNoQuery, SignatureUpdateProcessorFactoryTest, BlockJoinFacetRandomTest, SpellingQueryConverterTest, BooleanFieldTest, OpenCloseCoreStressTest, TestDownShardTolerantSearch, ConcurrentDeleteAndCreateCollectionTest, TestXIncludeConfig, TestLazyCores, TestNonDefinedSimilarityFactory, TestShortCircuitedRequests, RulesTest, TestOnReconnectListenerSupport, CdcrVersionReplicationTest, TestInPlaceUpdatesStandalone, CachingDirectoryFactoryTest, TestRangeQuery, TestFastWriter, TestRTGBase, DistributedFacetPivotLongTailTest, TermVectorComponentDistributedTest, SolrGraphiteReporterTest, TestStressRecovery, TestDocTermOrds, DeleteLastCustomShardedReplicaTest, PrimUtilsTest, TestTrackingShardHandlerFactory, DocValuesMultiTest, TestSerializedLuceneMatchVersion, TestJsonFacets, CoreMergeIndexesAdminHandlerTest, TestNRTOpen, TestComplexPhraseQParserPlugin, PropertiesRequestHandlerTest, SolrCmdDistributorTest, TestZkAclsWithHadoopAuth, UtilsToolTest, TestPseudoReturnFields, SampleTest, AutoscalingHistoryHandlerTest, TestRemoteStreaming, CreateCollectionCleanupTest]
   [junit4] Completed [218/752 (1!)] on J1 in 36.80s, 1 test, 1 error <<< FAILURES!

[...truncated 49069 lines...]

Mime
View raw message