lucene-dev mailing list archives

Site index · List index
Message view « Date » · « Thread »
Top « Date » · « Thread »
From Policeman Jenkins Server <jenk...@thetaphi.de>
Subject [JENKINS] Lucene-Solr-7.x-Linux (32bit/jdk1.8.0_144) - Build # 1011 - Still Unstable!
Date Mon, 18 Dec 2017 17:59:43 GMT
Build: https://jenkins.thetaphi.de/job/Lucene-Solr-7.x-Linux/1011/
Java: 32bit/jdk1.8.0_144 -server -XX:+UseParallelGC

3 tests failed.
FAILED:  junit.framework.TestSuite.org.apache.solr.cloud.TestSolrCloudWithSecureImpersonation

Error Message:
2 threads leaked from SUITE scope at org.apache.solr.cloud.TestSolrCloudWithSecureImpersonation:     1) Thread[id=3777, name=jetty-launcher-872-thread-1-EventThread, state=TIMED_WAITING, group=TGRP-TestSolrCloudWithSecureImpersonation]         at sun.misc.Unsafe.park(Native Method)         at java.util.concurrent.locks.LockSupport.parkNanos(LockSupport.java:215)         at java.util.concurrent.locks.AbstractQueuedSynchronizer.doAcquireSharedNanos(AbstractQueuedSynchronizer.java:1037)         at java.util.concurrent.locks.AbstractQueuedSynchronizer.tryAcquireSharedNanos(AbstractQueuedSynchronizer.java:1328)         at java.util.concurrent.CountDownLatch.await(CountDownLatch.java:277)         at org.apache.curator.CuratorZookeeperClient.internalBlockUntilConnectedOrTimedOut(CuratorZookeeperClient.java:323)         at org.apache.curator.RetryLoop.callWithRetry(RetryLoop.java:105)         at org.apache.curator.framework.imps.GetDataBuilderImpl.pathInForeground(GetDataBuilderImpl.java:288)         at org.apache.curator.framework.imps.GetDataBuilderImpl.forPath(GetDataBuilderImpl.java:279)         at org.apache.curator.framework.imps.GetDataBuilderImpl.forPath(GetDataBuilderImpl.java:41)         at org.apache.curator.framework.recipes.shared.SharedValue.readValue(SharedValue.java:244)         at org.apache.curator.framework.recipes.shared.SharedValue.access$100(SharedValue.java:44)         at org.apache.curator.framework.recipes.shared.SharedValue$1.process(SharedValue.java:61)         at org.apache.curator.framework.imps.NamespaceWatcher.process(NamespaceWatcher.java:67)         at org.apache.zookeeper.ClientCnxn$EventThread.processEvent(ClientCnxn.java:530)         at org.apache.zookeeper.ClientCnxn$EventThread.run(ClientCnxn.java:505)    2) Thread[id=3776, name=jetty-launcher-872-thread-2-EventThread, state=TIMED_WAITING, group=TGRP-TestSolrCloudWithSecureImpersonation]         at sun.misc.Unsafe.park(Native Method)         at java.util.concurrent.locks.LockSupport.parkNanos(LockSupport.java:215)         at java.util.concurrent.locks.AbstractQueuedSynchronizer.doAcquireSharedNanos(AbstractQueuedSynchronizer.java:1037)         at java.util.concurrent.locks.AbstractQueuedSynchronizer.tryAcquireSharedNanos(AbstractQueuedSynchronizer.java:1328)         at java.util.concurrent.CountDownLatch.await(CountDownLatch.java:277)         at org.apache.curator.CuratorZookeeperClient.internalBlockUntilConnectedOrTimedOut(CuratorZookeeperClient.java:323)         at org.apache.curator.RetryLoop.callWithRetry(RetryLoop.java:105)         at org.apache.curator.framework.imps.GetDataBuilderImpl.pathInForeground(GetDataBuilderImpl.java:288)         at org.apache.curator.framework.imps.GetDataBuilderImpl.forPath(GetDataBuilderImpl.java:279)         at org.apache.curator.framework.imps.GetDataBuilderImpl.forPath(GetDataBuilderImpl.java:41)         at org.apache.curator.framework.recipes.shared.SharedValue.readValue(SharedValue.java:244)         at org.apache.curator.framework.recipes.shared.SharedValue.access$100(SharedValue.java:44)         at org.apache.curator.framework.recipes.shared.SharedValue$1.process(SharedValue.java:61)         at org.apache.curator.framework.imps.NamespaceWatcher.process(NamespaceWatcher.java:67)         at org.apache.zookeeper.ClientCnxn$EventThread.processEvent(ClientCnxn.java:530)         at org.apache.zookeeper.ClientCnxn$EventThread.run(ClientCnxn.java:505)

Stack Trace:
com.carrotsearch.randomizedtesting.ThreadLeakError: 2 threads leaked from SUITE scope at org.apache.solr.cloud.TestSolrCloudWithSecureImpersonation: 
   1) Thread[id=3777, name=jetty-launcher-872-thread-1-EventThread, state=TIMED_WAITING, group=TGRP-TestSolrCloudWithSecureImpersonation]
        at sun.misc.Unsafe.park(Native Method)
        at java.util.concurrent.locks.LockSupport.parkNanos(LockSupport.java:215)
        at java.util.concurrent.locks.AbstractQueuedSynchronizer.doAcquireSharedNanos(AbstractQueuedSynchronizer.java:1037)
        at java.util.concurrent.locks.AbstractQueuedSynchronizer.tryAcquireSharedNanos(AbstractQueuedSynchronizer.java:1328)
        at java.util.concurrent.CountDownLatch.await(CountDownLatch.java:277)
        at org.apache.curator.CuratorZookeeperClient.internalBlockUntilConnectedOrTimedOut(CuratorZookeeperClient.java:323)
        at org.apache.curator.RetryLoop.callWithRetry(RetryLoop.java:105)
        at org.apache.curator.framework.imps.GetDataBuilderImpl.pathInForeground(GetDataBuilderImpl.java:288)
        at org.apache.curator.framework.imps.GetDataBuilderImpl.forPath(GetDataBuilderImpl.java:279)
        at org.apache.curator.framework.imps.GetDataBuilderImpl.forPath(GetDataBuilderImpl.java:41)
        at org.apache.curator.framework.recipes.shared.SharedValue.readValue(SharedValue.java:244)
        at org.apache.curator.framework.recipes.shared.SharedValue.access$100(SharedValue.java:44)
        at org.apache.curator.framework.recipes.shared.SharedValue$1.process(SharedValue.java:61)
        at org.apache.curator.framework.imps.NamespaceWatcher.process(NamespaceWatcher.java:67)
        at org.apache.zookeeper.ClientCnxn$EventThread.processEvent(ClientCnxn.java:530)
        at org.apache.zookeeper.ClientCnxn$EventThread.run(ClientCnxn.java:505)
   2) Thread[id=3776, name=jetty-launcher-872-thread-2-EventThread, state=TIMED_WAITING, group=TGRP-TestSolrCloudWithSecureImpersonation]
        at sun.misc.Unsafe.park(Native Method)
        at java.util.concurrent.locks.LockSupport.parkNanos(LockSupport.java:215)
        at java.util.concurrent.locks.AbstractQueuedSynchronizer.doAcquireSharedNanos(AbstractQueuedSynchronizer.java:1037)
        at java.util.concurrent.locks.AbstractQueuedSynchronizer.tryAcquireSharedNanos(AbstractQueuedSynchronizer.java:1328)
        at java.util.concurrent.CountDownLatch.await(CountDownLatch.java:277)
        at org.apache.curator.CuratorZookeeperClient.internalBlockUntilConnectedOrTimedOut(CuratorZookeeperClient.java:323)
        at org.apache.curator.RetryLoop.callWithRetry(RetryLoop.java:105)
        at org.apache.curator.framework.imps.GetDataBuilderImpl.pathInForeground(GetDataBuilderImpl.java:288)
        at org.apache.curator.framework.imps.GetDataBuilderImpl.forPath(GetDataBuilderImpl.java:279)
        at org.apache.curator.framework.imps.GetDataBuilderImpl.forPath(GetDataBuilderImpl.java:41)
        at org.apache.curator.framework.recipes.shared.SharedValue.readValue(SharedValue.java:244)
        at org.apache.curator.framework.recipes.shared.SharedValue.access$100(SharedValue.java:44)
        at org.apache.curator.framework.recipes.shared.SharedValue$1.process(SharedValue.java:61)
        at org.apache.curator.framework.imps.NamespaceWatcher.process(NamespaceWatcher.java:67)
        at org.apache.zookeeper.ClientCnxn$EventThread.processEvent(ClientCnxn.java:530)
        at org.apache.zookeeper.ClientCnxn$EventThread.run(ClientCnxn.java:505)
	at __randomizedtesting.SeedInfo.seed([70A943F10BDA666F]:0)


FAILED:  junit.framework.TestSuite.org.apache.solr.uninverting.TestFieldCacheVsDocValues

Error Message:
The test or suite printed 13392 bytes to stdout and stderr, even though the limit was set to 8192 bytes. Increase the limit with @Limit, ignore it completely with @SuppressSysoutChecks or run with -Dtests.verbose=true

Stack Trace:
java.lang.AssertionError: The test or suite printed 13392 bytes to stdout and stderr, even though the limit was set to 8192 bytes. Increase the limit with @Limit, ignore it completely with @SuppressSysoutChecks or run with -Dtests.verbose=true
	at __randomizedtesting.SeedInfo.seed([70A943F10BDA666F]:0)
	at org.apache.lucene.util.TestRuleLimitSysouts.afterIfSuccessful(TestRuleLimitSysouts.java:211)
	at com.carrotsearch.randomizedtesting.rules.TestRuleAdapter$1.afterIfSuccessful(TestRuleAdapter.java:36)
	at com.carrotsearch.randomizedtesting.rules.StatementAdapter.evaluate(StatementAdapter.java:37)
	at org.apache.lucene.util.TestRuleAssertionsRequired$1.evaluate(TestRuleAssertionsRequired.java:53)
	at org.apache.lucene.util.TestRuleMarkFailure$1.evaluate(TestRuleMarkFailure.java:47)
	at org.apache.lucene.util.TestRuleIgnoreAfterMaxFailures$1.evaluate(TestRuleIgnoreAfterMaxFailures.java:64)
	at org.apache.lucene.util.TestRuleIgnoreTestSuites$1.evaluate(TestRuleIgnoreTestSuites.java:54)
	at com.carrotsearch.randomizedtesting.rules.StatementAdapter.evaluate(StatementAdapter.java:36)
	at com.carrotsearch.randomizedtesting.ThreadLeakControl$StatementRunner.run(ThreadLeakControl.java:368)
	at java.lang.Thread.run(Thread.java:748)


FAILED:  junit.framework.TestSuite.org.apache.solr.uninverting.TestNumericTerms32

Error Message:
The test or suite printed 8912 bytes to stdout and stderr, even though the limit was set to 8192 bytes. Increase the limit with @Limit, ignore it completely with @SuppressSysoutChecks or run with -Dtests.verbose=true

Stack Trace:
java.lang.AssertionError: The test or suite printed 8912 bytes to stdout and stderr, even though the limit was set to 8192 bytes. Increase the limit with @Limit, ignore it completely with @SuppressSysoutChecks or run with -Dtests.verbose=true
	at __randomizedtesting.SeedInfo.seed([70A943F10BDA666F]:0)
	at org.apache.lucene.util.TestRuleLimitSysouts.afterIfSuccessful(TestRuleLimitSysouts.java:211)
	at com.carrotsearch.randomizedtesting.rules.TestRuleAdapter$1.afterIfSuccessful(TestRuleAdapter.java:36)
	at com.carrotsearch.randomizedtesting.rules.StatementAdapter.evaluate(StatementAdapter.java:37)
	at org.apache.lucene.util.TestRuleAssertionsRequired$1.evaluate(TestRuleAssertionsRequired.java:53)
	at org.apache.lucene.util.TestRuleMarkFailure$1.evaluate(TestRuleMarkFailure.java:47)
	at org.apache.lucene.util.TestRuleIgnoreAfterMaxFailures$1.evaluate(TestRuleIgnoreAfterMaxFailures.java:64)
	at org.apache.lucene.util.TestRuleIgnoreTestSuites$1.evaluate(TestRuleIgnoreTestSuites.java:54)
	at com.carrotsearch.randomizedtesting.rules.StatementAdapter.evaluate(StatementAdapter.java:36)
	at com.carrotsearch.randomizedtesting.ThreadLeakControl$StatementRunner.run(ThreadLeakControl.java:368)
	at java.lang.Thread.run(Thread.java:748)




Build Log:
[...truncated 11966 lines...]
   [junit4] Suite: org.apache.solr.cloud.TestSolrCloudWithSecureImpersonation
   [junit4]   2> 286386 INFO  (SUITE-TestSolrCloudWithSecureImpersonation-seed#[70A943F10BDA666F]-worker) [    ] o.a.s.SolrTestCaseJ4 SecureRandom sanity checks: test.solr.allowed.securerandom=null & java.security.egd=file:/dev/./urandom
   [junit4]   2> Creating dataDir: /home/jenkins/workspace/Lucene-Solr-7.x-Linux/solr/build/solr-core/test/J2/temp/solr.cloud.TestSolrCloudWithSecureImpersonation_70A943F10BDA666F-001/init-core-data-001
   [junit4]   2> 286386 WARN  (SUITE-TestSolrCloudWithSecureImpersonation-seed#[70A943F10BDA666F]-worker) [    ] o.a.s.SolrTestCaseJ4 startTrackingSearchers: numOpens=71 numCloses=71
   [junit4]   2> 286386 INFO  (SUITE-TestSolrCloudWithSecureImpersonation-seed#[70A943F10BDA666F]-worker) [    ] o.a.s.SolrTestCaseJ4 Using PointFields (NUMERIC_POINTS_SYSPROP=true) w/NUMERIC_DOCVALUES_SYSPROP=false
   [junit4]   2> 286388 INFO  (SUITE-TestSolrCloudWithSecureImpersonation-seed#[70A943F10BDA666F]-worker) [    ] o.a.s.SolrTestCaseJ4 Randomized ssl (false) and clientAuth (true) via: @org.apache.solr.util.RandomizeSSL(reason=, ssl=NaN, value=NaN, clientAuth=NaN)
   [junit4]   2> 286407 INFO  (SUITE-TestSolrCloudWithSecureImpersonation-seed#[70A943F10BDA666F]-worker) [    ] o.a.s.c.MiniSolrCloudCluster Starting cluster of 2 servers in /home/jenkins/workspace/Lucene-Solr-7.x-Linux/solr/build/solr-core/test/J2/temp/solr.cloud.TestSolrCloudWithSecureImpersonation_70A943F10BDA666F-001/tempDir-001
   [junit4]   2> 286407 INFO  (SUITE-TestSolrCloudWithSecureImpersonation-seed#[70A943F10BDA666F]-worker) [    ] o.a.s.c.ZkTestServer STARTING ZK TEST SERVER
   [junit4]   2> 286407 INFO  (Thread-856) [    ] o.a.s.c.ZkTestServer client port:0.0.0.0/0.0.0.0:0
   [junit4]   2> 286407 INFO  (Thread-856) [    ] o.a.s.c.ZkTestServer Starting server
   [junit4]   2> 286411 ERROR (Thread-856) [    ] o.a.z.s.ZooKeeperServer ZKShutdownHandler is not registered, so ZooKeeper server won't take any action on ERROR or SHUTDOWN server state changes
   [junit4]   2> 286507 INFO  (SUITE-TestSolrCloudWithSecureImpersonation-seed#[70A943F10BDA666F]-worker) [    ] o.a.s.c.ZkTestServer start zk server on port:33473
   [junit4]   2> 286509 INFO  (zkConnectionManagerCallback-875-thread-1) [    ] o.a.s.c.c.ConnectionManager zkClient has connected
   [junit4]   2> 286516 INFO  (jetty-launcher-872-thread-1) [    ] o.e.j.s.Server jetty-9.3.20.v20170531
   [junit4]   2> 286516 INFO  (jetty-launcher-872-thread-2) [    ] o.e.j.s.Server jetty-9.3.20.v20170531
   [junit4]   2> 286519 INFO  (jetty-launcher-872-thread-2) [    ] o.e.j.s.h.ContextHandler Started o.e.j.s.ServletContextHandler@5bc2c{/solr,null,AVAILABLE}
   [junit4]   2> 286520 INFO  (jetty-launcher-872-thread-1) [    ] o.e.j.s.h.ContextHandler Started o.e.j.s.ServletContextHandler@1875445{/solr,null,AVAILABLE}
   [junit4]   2> 286522 INFO  (jetty-launcher-872-thread-2) [    ] o.e.j.s.AbstractConnector Started ServerConnector@11f1670{HTTP/1.1,[http/1.1]}{127.0.0.1:38887}
   [junit4]   2> 286522 INFO  (jetty-launcher-872-thread-1) [    ] o.e.j.s.AbstractConnector Started ServerConnector@17b8a4c{HTTP/1.1,[http/1.1]}{127.0.0.1:39099}
   [junit4]   2> 286522 INFO  (jetty-launcher-872-thread-2) [    ] o.e.j.s.Server Started @288859ms
   [junit4]   2> 286522 INFO  (jetty-launcher-872-thread-1) [    ] o.e.j.s.Server Started @288859ms
   [junit4]   2> 286522 INFO  (jetty-launcher-872-thread-2) [    ] o.a.s.c.s.e.JettySolrRunner Jetty properties: {hostContext=/solr, hostPort=38887}
   [junit4]   2> 286522 INFO  (jetty-launcher-872-thread-1) [    ] o.a.s.c.s.e.JettySolrRunner Jetty properties: {hostContext=/solr, hostPort=39099}
   [junit4]   2> 286522 ERROR (jetty-launcher-872-thread-2) [    ] o.a.s.u.StartupLoggingUtils Missing Java Option solr.log.dir. Logging may be missing or incomplete.
   [junit4]   2> 286522 ERROR (jetty-launcher-872-thread-1) [    ] o.a.s.u.StartupLoggingUtils Missing Java Option solr.log.dir. Logging may be missing or incomplete.
   [junit4]   2> 286522 INFO  (jetty-launcher-872-thread-2) [    ] o.a.s.s.SolrDispatchFilter  ___      _       Welcome to Apache Solr? version 7.3.0
   [junit4]   2> 286522 INFO  (jetty-launcher-872-thread-1) [    ] o.a.s.s.SolrDispatchFilter  ___      _       Welcome to Apache Solr? version 7.3.0
   [junit4]   2> 286522 INFO  (jetty-launcher-872-thread-2) [    ] o.a.s.s.SolrDispatchFilter / __| ___| |_ _   Starting in cloud mode on port null
   [junit4]   2> 286522 INFO  (jetty-launcher-872-thread-1) [    ] o.a.s.s.SolrDispatchFilter / __| ___| |_ _   Starting in cloud mode on port null
   [junit4]   2> 286522 INFO  (jetty-launcher-872-thread-2) [    ] o.a.s.s.SolrDispatchFilter \__ \/ _ \ | '_|  Install dir: null
   [junit4]   2> 286522 INFO  (jetty-launcher-872-thread-1) [    ] o.a.s.s.SolrDispatchFilter \__ \/ _ \ | '_|  Install dir: null
   [junit4]   2> 286522 INFO  (jetty-launcher-872-thread-2) [    ] o.a.s.s.SolrDispatchFilter |___/\___/_|_|    Start time: 2017-12-18T17:11:27.523Z
   [junit4]   2> 286522 INFO  (jetty-launcher-872-thread-1) [    ] o.a.s.s.SolrDispatchFilter |___/\___/_|_|    Start time: 2017-12-18T17:11:27.523Z
   [junit4]   2> 286527 INFO  (zkConnectionManagerCallback-879-thread-1) [    ] o.a.s.c.c.ConnectionManager zkClient has connected
   [junit4]   2> 286527 INFO  (zkConnectionManagerCallback-877-thread-1) [    ] o.a.s.c.c.ConnectionManager zkClient has connected
   [junit4]   2> 286528 INFO  (jetty-launcher-872-thread-1) [    ] o.a.s.s.SolrDispatchFilter solr.xml found in ZooKeeper. Loading...
   [junit4]   2> 286528 INFO  (jetty-launcher-872-thread-2) [    ] o.a.s.s.SolrDispatchFilter solr.xml found in ZooKeeper. Loading...
   [junit4]   2> 286532 WARN  (NIOServerCxn.Factory:0.0.0.0/0.0.0.0:0) [    ] o.a.z.s.NIOServerCnxn caught end of stream exception
   [junit4]   2> EndOfStreamException: Unable to read additional data from client sessionid 0x1606a9bdbb10001, likely client has closed socket
   [junit4]   2> 	at org.apache.zookeeper.server.NIOServerCnxn.doIO(NIOServerCnxn.java:239)
   [junit4]   2> 	at org.apache.zookeeper.server.NIOServerCnxnFactory.run(NIOServerCnxnFactory.java:203)
   [junit4]   2> 	at java.lang.Thread.run(Thread.java:748)
   [junit4]   2> 286540 INFO  (jetty-launcher-872-thread-1) [    ] o.a.s.c.ZkContainer Zookeeper client=127.0.0.1:33473/solr
   [junit4]   2> 286543 INFO  (jetty-launcher-872-thread-2) [    ] o.a.s.c.ZkContainer Zookeeper client=127.0.0.1:33473/solr
   [junit4]   2> 286565 INFO  (zkConnectionManagerCallback-884-thread-1) [    ] o.a.s.c.c.ConnectionManager zkClient has connected
   [junit4]   2> 286565 INFO  (zkConnectionManagerCallback-887-thread-1) [    ] o.a.s.c.c.ConnectionManager zkClient has connected
   [junit4]   2> 286575 INFO  (zkConnectionManagerCallback-889-thread-1-processing-n:127.0.0.1:38887_solr) [n:127.0.0.1:38887_solr    ] o.a.s.c.c.ConnectionManager zkClient has connected
   [junit4]   2> 286575 INFO  (zkConnectionManagerCallback-891-thread-1-processing-n:127.0.0.1:39099_solr) [n:127.0.0.1:39099_solr    ] o.a.s.c.c.ConnectionManager zkClient has connected
   [junit4]   2> 286625 INFO  (jetty-launcher-872-thread-1) [n:127.0.0.1:39099_solr    ] o.a.s.c.Overseer Overseer (id=null) closing
   [junit4]   2> 286625 INFO  (jetty-launcher-872-thread-2) [n:127.0.0.1:38887_solr    ] o.a.s.c.Overseer Overseer (id=null) closing
   [junit4]   2> 286626 INFO  (jetty-launcher-872-thread-1) [n:127.0.0.1:39099_solr    ] o.a.s.c.OverseerElectionContext I am going to be the leader 127.0.0.1:39099_solr
   [junit4]   2> 286626 INFO  (jetty-launcher-872-thread-2) [n:127.0.0.1:38887_solr    ] o.a.s.c.ZkController Register node as live in ZooKeeper:/live_nodes/127.0.0.1:38887_solr
   [junit4]   2> 286626 INFO  (jetty-launcher-872-thread-1) [n:127.0.0.1:39099_solr    ] o.a.s.c.Overseer Overseer (id=99196409440436230-127.0.0.1:39099_solr-n_0000000000) starting
   [junit4]   2> 286645 INFO  (zkCallback-888-thread-1-processing-n:127.0.0.1:38887_solr) [n:127.0.0.1:38887_solr    ] o.a.s.c.c.ZkStateReader Updated live nodes from ZooKeeper... (0) -> (1)
   [junit4]   2> 286663 INFO  (zkCallback-890-thread-1-processing-n:127.0.0.1:39099_solr) [n:127.0.0.1:39099_solr    ] o.a.s.c.c.ZkStateReader Updated live nodes from ZooKeeper... (0) -> (1)
   [junit4]   2> 286680 INFO  (jetty-launcher-872-thread-1) [n:127.0.0.1:39099_solr    ] o.a.s.c.ZkController Register node as live in ZooKeeper:/live_nodes/127.0.0.1:39099_solr
   [junit4]   2> 286683 INFO  (zkCallback-890-thread-1-processing-n:127.0.0.1:39099_solr) [n:127.0.0.1:39099_solr    ] o.a.s.c.c.ZkStateReader Updated live nodes from ZooKeeper... (1) -> (2)
   [junit4]   2> 286685 INFO  (zkCallback-888-thread-1-processing-n:127.0.0.1:38887_solr) [n:127.0.0.1:38887_solr    ] o.a.s.c.c.ZkStateReader Updated live nodes from ZooKeeper... (1) -> (2)
   [junit4]   2> 286754 INFO  (jetty-launcher-872-thread-2) [n:127.0.0.1:38887_solr    ] o.a.s.c.CoreContainer Initializing authentication plugin: org.apache.solr.security.HttpParamDelegationTokenPlugin
   [junit4]   2> 286760 WARN  (jetty-launcher-872-thread-2) [n:127.0.0.1:38887_solr    ] o.a.s.c.s.i.Krb5HttpClientBuilder org.apache.solr.client.solrj.impl.Krb5HttpClientBuilder is configured without specifying system property 'java.security.auth.login.config'
   [junit4]   2> 286765 INFO  (jetty-launcher-872-thread-2) [n:127.0.0.1:38887_solr    ] o.a.s.s.KerberosPlugin Params: {solr.kerberos.impersonator.user.noGroups.hosts=*, solr.kerberos.impersonator.user.bogusGroup.groups=__some_bogus_group, token.valid=30, cookie.domain=127.0.0.1, solr.kerberos.impersonator.user.anyHostAnyUser.groups=*, solr.kerberos.impersonator.user.bogusGroup.hosts=*, solr.kerberos.impersonator.user.anyHostAnyUser.hosts=*, token.validity=36000, solr.kerberos.impersonator.user.noHosts.groups=*, type=kerberos, solr.kerberos.impersonator.user.localHostAnyGroup.groups=*, delegation-token.token-kind=solr-dt, solr.kerberos.impersonator.user.wrongHost.hosts=1.1.1.1.1.1, cookie.path=/, zk-dt-secret-manager.znodeWorkingPath=solr/security/zkdtsm, solr.kerberos.impersonator.user.localHostAnyGroup.hosts=localhost.localdomain,localhost,127.0.0.1, signer.secret.provider.zookeeper.path=/token, solr.kerberos.impersonator.user.anyHostUsersGroup.groups=jenkins, zk-dt-secret-manager.enable=true, solr.kerberos.impersonator.user.wrongHost.groups=*, kerberos.name.rules=DEFAULT, signer.secret.provider=zookeeper, solr.kerberos.impersonator.user.anyHostUsersGroup.hosts=*}
   [junit4]   2> 286799 INFO  (jetty-launcher-872-thread-1) [n:127.0.0.1:39099_solr    ] o.a.s.c.CoreContainer Initializing authentication plugin: org.apache.solr.security.HttpParamDelegationTokenPlugin
   [junit4]   2> 286799 WARN  (jetty-launcher-872-thread-1) [n:127.0.0.1:39099_solr    ] o.a.s.c.s.i.Krb5HttpClientBuilder org.apache.solr.client.solrj.impl.Krb5HttpClientBuilder is configured without specifying system property 'java.security.auth.login.config'
   [junit4]   2> 286800 INFO  (jetty-launcher-872-thread-1) [n:127.0.0.1:39099_solr    ] o.a.s.s.KerberosPlugin Params: {solr.kerberos.impersonator.user.noGroups.hosts=*, solr.kerberos.impersonator.user.bogusGroup.groups=__some_bogus_group, token.valid=30, cookie.domain=127.0.0.1, solr.kerberos.impersonator.user.anyHostAnyUser.groups=*, solr.kerberos.impersonator.user.bogusGroup.hosts=*, solr.kerberos.impersonator.user.anyHostAnyUser.hosts=*, token.validity=36000, solr.kerberos.impersonator.user.noHosts.groups=*, type=kerberos, solr.kerberos.impersonator.user.localHostAnyGroup.groups=*, delegation-token.token-kind=solr-dt, solr.kerberos.impersonator.user.wrongHost.hosts=1.1.1.1.1.1, cookie.path=/, zk-dt-secret-manager.znodeWorkingPath=solr/security/zkdtsm, solr.kerberos.impersonator.user.localHostAnyGroup.hosts=localhost.localdomain,localhost,127.0.0.1, signer.secret.provider.zookeeper.path=/token, solr.kerberos.impersonator.user.anyHostUsersGroup.groups=jenkins, zk-dt-secret-manager.enable=true, solr.kerberos.impersonator.user.wrongHost.groups=*, kerberos.name.rules=DEFAULT, signer.secret.provider=zookeeper, solr.kerberos.impersonator.user.anyHostUsersGroup.hosts=*}
   [junit4]   2> 286830 INFO  (jetty-launcher-872-thread-2) [n:127.0.0.1:38887_solr    ] o.a.c.f.i.CuratorFrameworkImpl Starting
   [junit4]   2> 286830 INFO  (jetty-launcher-872-thread-1) [n:127.0.0.1:39099_solr    ] o.a.c.f.i.CuratorFrameworkImpl Starting
   [junit4]   2> 286859 INFO  (jetty-launcher-872-thread-1-EventThread) [n:127.0.0.1:39099_solr    ] o.a.c.f.s.ConnectionStateManager State change: CONNECTED
   [junit4]   2> 286860 INFO  (jetty-launcher-872-thread-2-EventThread) [n:127.0.0.1:38887_solr    ] o.a.c.f.s.ConnectionStateManager State change: CONNECTED
   [junit4]   2> 286950 WARN  (jetty-launcher-872-thread-2) [n:127.0.0.1:38887_solr    ] o.a.s.c.s.i.Krb5HttpClientBuilder org.apache.solr.client.solrj.impl.Krb5HttpClientBuilder is configured without specifying system property 'java.security.auth.login.config'
   [junit4]   2> 286950 WARN  (jetty-launcher-872-thread-1) [n:127.0.0.1:39099_solr    ] o.a.s.c.s.i.Krb5HttpClientBuilder org.apache.solr.client.solrj.impl.Krb5HttpClientBuilder is configured without specifying system property 'java.security.auth.login.config'
   [junit4]   2> 286995 INFO  (jetty-launcher-872-thread-2) [n:127.0.0.1:38887_solr    ] o.a.s.m.r.SolrJmxReporter JMX monitoring for 'solr_38887.solr.node' (registry 'solr.node') enabled at server: com.sun.jmx.mbeanserver.JmxMBeanServer@13c7785
   [junit4]   2> 286998 INFO  (jetty-launcher-872-thread-1) [n:127.0.0.1:39099_solr    ] o.a.s.m.r.SolrJmxReporter JMX monitoring for 'solr_39099.solr.node' (registry 'solr.node') enabled at server: com.sun.jmx.mbeanserver.JmxMBeanServer@13c7785
   [junit4]   2> 287009 INFO  (jetty-launcher-872-thread-1) [n:127.0.0.1:39099_solr    ] o.a.s.m.r.SolrJmxReporter JMX monitoring for 'solr_39099.solr.jvm' (registry 'solr.jvm') enabled at server: com.sun.jmx.mbeanserver.JmxMBeanServer@13c7785
   [junit4]   2> 287009 INFO  (jetty-launcher-872-thread-1) [n:127.0.0.1:39099_solr    ] o.a.s.m.r.SolrJmxReporter JMX monitoring for 'solr_39099.solr.jetty' (registry 'solr.jetty') enabled at server: com.sun.jmx.mbeanserver.JmxMBeanServer@13c7785
   [junit4]   2> 287010 INFO  (jetty-launcher-872-thread-2) [n:127.0.0.1:38887_solr    ] o.a.s.m.r.SolrJmxReporter JMX monitoring for 'solr_38887.solr.jvm' (registry 'solr.jvm') enabled at server: com.sun.jmx.mbeanserver.JmxMBeanServer@13c7785
   [junit4]   2> 287010 INFO  (jetty-launcher-872-thread-2) [n:127.0.0.1:38887_solr    ] o.a.s.m.r.SolrJmxReporter JMX monitoring for 'solr_38887.solr.jetty' (registry 'solr.jetty') enabled at server: com.sun.jmx.mbeanserver.JmxMBeanServer@13c7785
   [junit4]   2> 287011 INFO  (jetty-launcher-872-thread-1) [n:127.0.0.1:39099_solr    ] o.a.s.c.CorePropertiesLocator Found 0 core definitions underneath /home/jenkins/workspace/Lucene-Solr-7.x-Linux/solr/build/solr-core/test/J2/temp/solr.cloud.TestSolrCloudWithSecureImpersonation_70A943F10BDA666F-001/tempDir-001/node1/.
   [junit4]   2> 287011 INFO  (jetty-launcher-872-thread-2) [n:127.0.0.1:38887_solr    ] o.a.s.c.CorePropertiesLocator Found 0 core definitions underneath /home/jenkins/workspace/Lucene-Solr-7.x-Linux/solr/build/solr-core/test/J2/temp/solr.cloud.TestSolrCloudWithSecureImpersonation_70A943F10BDA666F-001/tempDir-001/node2/.
   [junit4]   2> 287045 INFO  (zkConnectionManagerCallback-897-thread-1) [    ] o.a.s.c.c.ConnectionManager zkClient has connected
   [junit4]   2> 287072 INFO  (TEST-TestSolrCloudWithSecureImpersonation.testProxyValidateGroup-seed#[70A943F10BDA666F]) [    ] o.a.s.SolrTestCaseJ4 ###Starting testProxyValidateGroup
   [junit4]   2> 287097 INFO  (qtp10807214-3734) [n:127.0.0.1:39099_solr    ] o.a.s.h.a.CollectionsHandler Invoked Collection Action :list with params doAs=jenkins&action=LIST&wt=javabin&version=2 and sendToOCPQueue=true
   [junit4]   2> 287098 INFO  (qtp10807214-3734) [n:127.0.0.1:39099_solr    ] o.a.s.s.HttpSolrCall [admin] webapp=null path=/admin/collections params={doAs=jenkins&action=LIST&wt=javabin&version=2} status=0 QTime=2
   [junit4]   2> 287104 WARN  (TEST-TestSolrCloudWithSecureImpersonation.testProxyValidateGroup-seed#[70A943F10BDA666F]) [    ] o.a.h.c.p.ResponseProcessCookies Invalid cookie header: "Set-Cookie: hadoop.auth="u=anyHostUsersGroup&p=anyHostUsersGroup&t=test&e=1513653088084&s=o++LYo1z3vyTa9OAKvqw+QDCpgI="; Path=/; Domain=127.0.0.1; Expires=þri., 19-des.-2017 03:11:28 GMT; HttpOnly". Invalid 'expires' attribute: þri., 19-des.-2017 03:11:28 GMT
   [junit4]   2> 287105 INFO  (TEST-TestSolrCloudWithSecureImpersonation.testProxyValidateGroup-seed#[70A943F10BDA666F]) [    ] o.a.s.SolrTestCaseJ4 ###Ending testProxyValidateGroup
   [junit4]   2> 287133 INFO  (TEST-TestSolrCloudWithSecureImpersonation.testProxyInvalidRemote-seed#[70A943F10BDA666F]) [    ] o.a.s.SolrTestCaseJ4 ###Starting testProxyInvalidRemote
   [junit4]   2> 287153 WARN  (TEST-TestSolrCloudWithSecureImpersonation.testProxyInvalidRemote-seed#[70A943F10BDA666F]) [    ] o.a.h.c.p.ResponseProcessCookies Invalid cookie header: "Set-Cookie: hadoop.auth="u=localHostAnyGroup&p=localHostAnyGroup&t=test&e=1513653088134&s=oZ8FP+k9VFd3Op/uMxxtvLqQEGY="; Path=/; Domain=127.0.0.1; Expires=þri., 19-des.-2017 03:11:28 GMT; HttpOnly". Invalid 'expires' attribute: þri., 19-des.-2017 03:11:28 GMT
   [junit4]   2> 287153 INFO  (TEST-TestSolrCloudWithSecureImpersonation.testProxyInvalidRemote-seed#[70A943F10BDA666F]) [    ] o.a.s.SolrTestCaseJ4 ###Ending testProxyInvalidRemote
   [junit4]   2> 287173 INFO  (TEST-TestSolrCloudWithSecureImpersonation.testProxyWrongHost-seed#[70A943F10BDA666F]) [    ] o.a.s.SolrTestCaseJ4 ###Starting testProxyWrongHost
   [junit4]   2> 287191 WARN  (TEST-TestSolrCloudWithSecureImpersonation.testProxyWrongHost-seed#[70A943F10BDA666F]) [    ] o.a.h.c.p.ResponseProcessCookies Invalid cookie header: "Set-Cookie: hadoop.auth="u=wrongHost&p=wrongHost&t=test&e=1513653088178&s=5hSl7vokLiBQ81gMwZ5XSBWgOTk="; Path=/; Domain=127.0.0.1; Expires=þri., 19-des.-2017 03:11:28 GMT; HttpOnly". Invalid 'expires' attribute: þri., 19-des.-2017 03:11:28 GMT
   [junit4]   2> 287192 INFO  (TEST-TestSolrCloudWithSecureImpersonation.testProxyWrongHost-seed#[70A943F10BDA666F]) [    ] o.a.s.SolrTestCaseJ4 ###Ending testProxyWrongHost
   [junit4]   2> 287222 INFO  (TEST-TestSolrCloudWithSecureImpersonation.testProxyNullProxyUser-seed#[70A943F10BDA666F]) [    ] o.a.s.SolrTestCaseJ4 ###Starting testProxyNullProxyUser
   [junit4]   2> 287222 INFO  (qtp10807214-3724) [    ] o.a.s.s.SolrDispatchFilter Error authenticating
   [junit4]   2> java.lang.IllegalArgumentException: userName is NULL, empty or contains a '&'
   [junit4]   2> 	at org.apache.hadoop.security.authentication.util.AuthToken.checkForIllegalArgument(AuthToken.java:87)
   [junit4]   2> 	at org.apache.hadoop.security.authentication.util.AuthToken.<init>(AuthToken.java:70)
   [junit4]   2> 	at org.apache.hadoop.security.authentication.server.AuthenticationToken.<init>(AuthenticationToken.java:58)
   [junit4]   2> 	at org.apache.solr.security.HttpParamDelegationTokenPlugin$HttpParamDelegationTokenAuthenticationHandler$HttpParamAuthenticationHandler.authenticate(HttpParamDelegationTokenPlugin.java:213)
   [junit4]   2> 	at org.apache.hadoop.security.token.delegation.web.DelegationTokenAuthenticationHandler.authenticate(DelegationTokenAuthenticationHandler.java:348)
   [junit4]   2> 	at org.apache.solr.security.RequestContinuesRecorderAuthenticationHandler.authenticate(RequestContinuesRecorderAuthenticationHandler.java:69)
   [junit4]   2> 	at org.apache.hadoop.security.authentication.server.AuthenticationFilter.doFilter(AuthenticationFilter.java:518)
   [junit4]   2> 	at org.apache.solr.security.DelegationTokenKerberosFilter.doFilter(DelegationTokenKerberosFilter.java:134)
   [junit4]   2> 	at org.apache.solr.security.HttpParamDelegationTokenPlugin$HttpParamToRequestFilter.doFilter(HttpParamDelegationTokenPlugin.java:245)
   [junit4]   2> 	at org.apache.solr.security.KerberosPlugin.doAuthenticate(KerberosPlugin.java:243)
   [junit4]   2> 	at org.apache.solr.servlet.SolrDispatchFilter.authenticateRequest(SolrDispatchFilter.java:451)
   [junit4]   2> 	at org.apache.solr.servlet.SolrDispatchFilter.doFilter(SolrDispatchFilter.java:347)
   [junit4]   2> 	at org.apache.solr.servlet.SolrDispatchFilter.doFilter(SolrDispatchFilter.java:326)
   [junit4]   2> 	at org.eclipse.jetty.servlet.ServletHandler$CachedChain.doFilter(ServletHandler.java:1759)
   [junit4]   2> 	at org.apache.solr.client.solrj.embedded.JettySolrRunner$DebugFilter.doFilter(JettySolrRunner.java:139)
   [junit4]   2> 	at org.eclipse.jetty.servlet.ServletHandler$CachedChain.doFilter(ServletHandler.java:1759)
   [junit4]   2> 	at org.eclipse.jetty.servlet.ServletHandler.doHandle(ServletHandler.java:582)
   [junit4]   2> 	at org.eclipse.jetty.server.session.SessionHandler.doHandle(SessionHandler.java:224)
   [junit4]   2> 	at org.eclipse.jetty.server.handler.ContextHandler.doHandle(ContextHandler.java:1180)
   [junit4]   2> 	at org.eclipse.jetty.servlet.ServletHandler.doScope(ServletHandler.java:512)
   [junit4]   2> 	at org.eclipse.jetty.server.session.SessionHandler.doScope(SessionHandler.java:185)
   [junit4]   2> 	at org.eclipse.jetty.server.handler.ContextHandler.doScope(ContextHandler.java:1112)
   [junit4]   2> 	at org.eclipse.jetty.server.handler.ScopedHandler.handle(ScopedHandler.java:141)
   [junit4]   2> 	at org.eclipse.jetty.server.handler.gzip.GzipHandler.handle(GzipHandler.java:493)
   [junit4]   2> 	at org.eclipse.jetty.server.handler.HandlerWrapper.handle(HandlerWrapper.java:134)
   [junit4]   2> 	at org.eclipse.jetty.server.Server.handle(Server.java:534)
   [junit4]   2> 	at org.eclipse.jetty.server.HttpChannel.handle(HttpChannel.java:320)
   [junit4]   2> 	at org.eclipse.jetty.server.HttpConnection.onFillable(HttpConnection.java:251)
   [junit4]   2> 	at org.eclipse.jetty.io.AbstractConnection$ReadCallback.succeeded(AbstractConnection.java:283)
   [junit4]   2> 	at org.eclipse.jetty.io.FillInterest.fillable(FillInterest.java:108)
   [junit4]   2> 	at org.eclipse.jetty.io.SelectChannelEndPoint$2.run(SelectChannelEndPoint.java:93)
   [junit4]   2> 	at org.eclipse.jetty.util.thread.strategy.ExecuteProduceConsume.executeProduceConsume(ExecuteProduceConsume.java:303)
   [junit4]   2> 	at org.eclipse.jetty.util.thread.strategy.ExecuteProduceConsume.produceConsume(ExecuteProduceConsume.java:148)
   [junit4]   2> 	at org.eclipse.jetty.util.thread.strategy.ExecuteProduceConsume.run(ExecuteProduceConsume.java:136)
   [junit4]   2> 	at org.eclipse.jetty.util.thread.QueuedThreadPool.runJob(QueuedThreadPool.java:671)
   [junit4]   2> 	at org.eclipse.jetty.util.thread.QueuedThreadPool$2.run(QueuedThreadPool.java:589)
   [junit4]   2> 	at java.lang.Thread.run(Thread.java:748)
   [junit4]   2> 287223 WARN  (qtp10807214-3724) [    ] o.e.j.s.ServletHandler /solr/admin/collections
   [junit4]   2> org.apache.solr.common.SolrException: Error during request authentication, 
   [junit4]   2> 	at org.apache.solr.servlet.SolrDispatchFilter.authenticateRequest(SolrDispatchFilter.java:457)
   [junit4]   2> 	at org.apache.solr.servlet.SolrDispatchFilter.doFilter(SolrDispatchFilter.java:347)
   [junit4]   2> 	at org.apache.solr.servlet.SolrDispatchFilter.doFilter(SolrDispatchFilter.java:326)
   [junit4]   2> 	at org.eclipse.jetty.servlet.ServletHandler$CachedChain.doFilter(ServletHandler.java:1759)
   [junit4]   2> 	at org.apache.solr.client.solrj.embedded.JettySolrRunner$DebugFilter.doFilter(JettySolrRunner.java:139)
   [junit4]   2> 	at org.eclipse.jetty.servlet.ServletHandler$CachedChain.doFilter(ServletHandler.java:1759)
   [junit4]   2> 	at org.eclipse.jetty.servlet.ServletHandler.doHandle(ServletHandler.java:582)
   [junit4]   2> 	at org.eclipse.jetty.server.session.SessionHandler.doHandle(SessionHandler.java:224)
   [junit4]   2> 	at org.eclipse.jetty.server.handler.ContextHandler.doHandle(ContextHandler.java:1180)
   [junit4]   2> 	at org.eclipse.jetty.servlet.ServletHandler.doScope(ServletHandler.java:512)
   [junit4]   2> 	at org.eclipse.jetty.server.session.SessionHandler.doScope(SessionHandler.java:185)
   [junit4]   2> 	at org.eclipse.jetty.server.handler.ContextHandler.doScope(ContextHandler.java:1112)
   [junit4]   2> 	at org.eclipse.jetty.server.handler.ScopedHandler.handle(ScopedHandler.java:141)
   [junit4]   2> 	at org.eclipse.jetty.server.handler.gzip.GzipHandler.handle(GzipHandler.java:493)
   [junit4]   2> 	at org.eclipse.jetty.server.handler.HandlerWrapper.handle(HandlerWrapper.java:134)
   [junit4]   2> 	at org.eclipse.jetty.server.Server.handle(Server.java:534)
   [junit4]   2> 	at org.eclipse.jetty.server.HttpChannel.handle(HttpChannel.java:320)
   [junit4]   2> 	at org.eclipse.jetty.server.HttpConnection.onFillable(HttpConnection.java:251)
   [junit4]   2> 	at org.eclipse.jetty.io.AbstractConnection$ReadCallback.succeeded(AbstractConnection.java:283)
   [junit4]   2> 	at org.eclipse.jetty.io.FillInterest.fillable(FillInterest.java:108)
   [junit4]   2> 	at org.eclipse.jetty.io.SelectChannelEndPoint$2.run(SelectChannelEndPoint.java:93)
   [junit4]   2> 	at org.eclipse.jetty.util.thread.strategy.ExecuteProduceConsume.executeProduceConsume(ExecuteProduceConsume.java:303)
   [junit4]   2> 	at org.eclipse.jetty.util.thread.strategy.ExecuteProduceConsume.produceConsume(ExecuteProduceConsume.java:148)
   [junit4]   2> 	at org.eclipse.jetty.util.thread.strategy.ExecuteProduceConsume.run(ExecuteProduceConsume.java:136)
   [junit4]   2> 	at org.eclipse.jetty.util.thread.QueuedThreadPool.runJob(QueuedThreadPool.java:671)
   [junit4]   2> 	at org.eclipse.jetty.util.thread.QueuedThreadPool$2.run(QueuedThreadPool.java:589)
   [junit4]   2> 	at java.lang.Thread.run(Thread.java:748)
   [junit4]   2> Caused by: java.lang.IllegalArgumentException: userName is NULL, empty or contains a '&'
   [junit4]   2> 	at org.apache.hadoop.security.authentication.util.AuthToken.checkForIllegalArgument(AuthToken.java:87)
   [junit4]   2> 	at org.apache.hadoop.security.authentication.util.AuthToken.<init>(AuthToken.java:70)
   [junit4]   2> 	at org.apache.hadoop.security.authentication.server.AuthenticationToken.<init>(AuthenticationToken.java:58)
   [junit4]   2> 	at org.apache.solr.security.HttpParamDelegationTokenPlugin$HttpParamDelegationTokenAuthenticationHandler$HttpParamAuthenticationHandler.authenticate(HttpParamDelegationTokenPlugin.java:213)
   [junit4]   2> 	at org.apache.hadoop.security.token.delegation.web.DelegationTokenAuthenticationHandler.authenticate(DelegationTokenAuthenticationHandler.java:348)
   [junit4]   2> 	at org.apache.solr.security.RequestContinuesRecorderAuthenticationHandler.authenticate(RequestContinuesRecorderAuthenticationHandler.java:69)
   [junit4]   2> 	at org.apache.hadoop.security.authentication.server.AuthenticationFilter.doFilter(AuthenticationFilter.java:518)
   [junit4]   2> 	at org.apache.solr.security.DelegationTokenKerberosFilter.doFilter(DelegationTokenKerberosFilter.java:134)
   [junit4]   2> 	at org.apache.solr.security.HttpParamDelegationTokenPlugin$HttpParamToRequestFilter.doFilter(HttpParamDelegationTokenPlugin.java:245)
   [junit4]   2> 	at org.apache.solr.security.KerberosPlugin.doAuthenticate(KerberosPlugin.java:243)
   [junit4]   2> 	at org.apache.solr.servlet.SolrDispatchFilter.authenticateRequest(SolrDispatchFilter.java:451)
   [junit4]   2> 	... 26 more
   [junit4]   2> 287229 INFO  (TEST-TestSolrCloudWithSecureImpersonation.testProxyNullProxyUser-seed#[70A943F10BDA666F]) [    ] o.a.s.SolrTestCaseJ4 ###Ending testProxyNullProxyUser
   [junit4]   2> 287246 INFO  (TEST-TestSolrCloudWithSecureImpersonation.testProxyValidateHost-seed#[70A943F10BDA666F]) [    ] o.a.s.SolrTestCaseJ4 ###Starting testProxyValidateHost
   [junit4]   2> 287248 INFO  (qtp10807214-3738) [n:127.0.0.1:39099_solr    ] o.a.s.h.a.CollectionsHandler Invoked Collection Action :list with params doAs=bar&action=LIST&wt=javabin&version=2 and sendToOCPQueue=true
   [junit4]   2> 287248 INFO  (qtp10807214-3738) [n:127.0.0.1:39099_solr    ] o.a.s.s.HttpSolrCall [admin] webapp=null path=/admin/collections params={doAs=bar&action=LIST&wt=javabin&version=2} status=0 QTime=0
   [junit4]   2> 287248 WARN  (TEST-TestSolrCloudWithSecureImpersonation.testProxyValidateHost-seed#[70A943F10BDA666F]) [    ] o.a.h.c.p.ResponseProcessCookies Invalid cookie header: "Set-Cookie: hadoop.auth="u=localHostAnyGroup&p=localHostAnyGroup&t=test&e=1513653088248&s=gmNtKT+BMpHKdyEbCldrdGvPngw="; Path=/; Domain=127.0.0.1; Expires=þri., 19-des.-2017 03:11:28 GMT; HttpOnly". Invalid 'expires' attribute: þri., 19-des.-2017 03:11:28 GMT
   [junit4]   2> 287248 INFO  (TEST-TestSolrCloudWithSecureImpersonation.testProxyValidateHost-seed#[70A943F10BDA666F]) [    ] o.a.s.SolrTestCaseJ4 ###Ending testProxyValidateHost
   [junit4]   2> 287267 INFO  (TEST-TestSolrCloudWithSecureImpersonation.testProxyInvalidGroup-seed#[70A943F10BDA666F]) [    ] o.a.s.SolrTestCaseJ4 ###Starting testProxyInvalidGroup
   [junit4]   2> 287278 WARN  (qtp10807214-3736) [    ] o.a.h.s.ShellBasedUnixGroupsMapping got exception trying to get groups for user bar: id: ‘bar’: no such user
   [junit4]   2> id: ‘bar’: no such user
   [junit4]   2> 
   [junit4]   2> 287280 WARN  (TEST-TestSolrCloudWithSecureImpersonation.testProxyInvalidGroup-seed#[70A943F10BDA666F]) [    ] o.a.h.c.p.ResponseProcessCookies Invalid cookie header: "Set-Cookie: hadoop.auth="u=bogusGroup&p=bogusGroup&t=test&e=1513653088268&s=EdzbzY8ka1K+3fSUtBrDRb+htP8="; Path=/; Domain=127.0.0.1; Expires=þri., 19-des.-2017 03:11:28 GMT; HttpOnly". Invalid 'expires' attribute: þri., 19-des.-2017 03:11:28 GMT
   [junit4]   2> 287280 INFO  (TEST-TestSolrCloudWithSecureImpersonation.testProxyInvalidGroup-seed#[70A943F10BDA666F]) [    ] o.a.s.SolrTestCaseJ4 ###Ending testProxyInvalidGroup
   [junit4]   2> 287297 INFO  (TEST-TestSolrCloudWithSecureImpersonation.testProxyValidateAnyHostAnyUser-seed#[70A943F10BDA666F]) [    ] o.a.s.SolrTestCaseJ4 ###Starting testProxyValidateAnyHostAnyUser
   [junit4]   2> 287298 INFO  (qtp10807214-3724) [n:127.0.0.1:39099_solr    ] o.a.s.h.a.CollectionsHandler Invoked Collection Action :list with params doAs=bar&action=LIST&wt=javabin&version=2 and sendToOCPQueue=true
   [junit4]   2> 287298 INFO  (qtp10807214-3724) [n:127.0.0.1:39099_solr    ] o.a.s.s.HttpSolrCall [admin] webapp=null path=/admin/collections params={doAs=bar&action=LIST&wt=javabin&version=2} status=0 QTime=0
   [junit4]   2> 287298 WARN  (TEST-TestSolrCloudWithSecureImpersonation.testProxyValidateAnyHostAnyUser-seed#[70A943F10BDA666F]) [    ] o.a.h.c.p.ResponseProcessCookies Invalid cookie header: "Set-Cookie: hadoop.auth="u=anyHostAnyUser&p=anyHostAnyUser&t=test&e=1513653088298&s=SUFGhZQF3tBrFnNPd0FBAuikL9Y="; Path=/; Domain=127.0.0.1; Expires=þri., 19-des.-2017 03:11:28 GMT; HttpOnly". Invalid 'expires' attribute: þri., 19-des.-2017 03:11:28 GMT
   [junit4]   2> 287299 INFO  (TEST-TestSolrCloudWithSecureImpersonation.testProxyValidateAnyHostAnyUser-seed#[70A943F10BDA666F]) [    ] o.a.s.SolrTestCaseJ4 ###Ending testProxyValidateAnyHostAnyUser
   [junit4]   2> 287328 INFO  (TEST-TestSolrCloudWithSecureImpersonation.testForwarding-seed#[70A943F10BDA666F]) [    ] o.a.s.SolrTestCaseJ4 ###Starting testForwarding
   [junit4]   2> 287329 INFO  (zkConnectionManagerCallback-900-thread-1) [    ] o.a.s.c.c.ConnectionManager zkClient has connected
   [junit4]   2> 287543 INFO  (zkConnectionManagerCallback-903-thread-1) [    ] o.a.s.c.c.ConnectionManager zkClient has connected
   [junit4]   2> 287544 INFO  (TEST-TestSolrCloudWithSecureImpersonation.testForwarding-seed#[70A943F10BDA666F]) [    ] o.a.s.c.c.ZkStateReader Updated live nodes from ZooKeeper... (0) -> (2)
   [junit4]   2> 287544 INFO  (TEST-TestSolrCloudWithSecureImpersonation.testForwarding-seed#[70A943F10BDA666F]) [    ] o.a.s.c.s.i.ZkClientClusterStateProvider Cluster at 127.0.0.1:33473/solr ready
   [junit4]   2> 287546 INFO  (qtp10807214-3738) [n:127.0.0.1:39099_solr    ] o.a.s.h.a.CollectionsHandler Invoked Collection Action :create with params pullReplicas=0&replicationFactor=1&collection.configName=conf1&maxShardsPerNode=1&name=forwardingCollection&nrtReplicas=1&action=CREATE&numShards=1&tlogReplicas=0&wt=javabin&version=2 and sendToOCPQueue=true
   [junit4]   2> 287551 INFO  (OverseerThreadFactory-1435-thread-1-processing-n:127.0.0.1:39099_solr) [n:127.0.0.1:39099_solr    ] o.a.s.c.CreateCollectionCmd Create collection forwardingCollection
   [junit4]   2> 287655 INFO  (OverseerStateUpdate-99196409440436230-127.0.0.1:39099_solr-n_0000000000) [n:127.0.0.1:39099_solr    ] o.a.s.c.o.SliceMutator createReplica() {
   [junit4]   2>   "operation":"ADDREPLICA",
   [junit4]   2>   "collection":"forwardingCollection",
   [junit4]   2>   "shard":"shard1",
   [junit4]   2>   "core":"forwardingCollection_shard1_replica_n1",
   [junit4]   2>   "state":"down",
   [junit4]   2>   "base_url":"http://127.0.0.1:38887/solr",
   [junit4]   2>   "type":"NRT",
   [junit4]   2>   "waitForFinalState":"false"} 
   [junit4]   2> 287857 INFO  (qtp31948827-3735) [n:127.0.0.1:38887_solr    ] o.a.s.h.a.CoreAdminOperation core create command qt=/admin/cores&coreNodeName=core_node2&collection.configName=conf1&newCollection=true&name=forwardingCollection_shard1_replica_n1&action=CREATE&numShards=1&collection=forwardingCollection&shard=shard1&wt=javabin&version=2&replicaType=NRT
   [junit4]   2> 287858 INFO  (qtp31948827-3735) [n:127.0.0.1:38887_solr    ] o.a.s.c.TransientSolrCoreCacheDefault Allocating transient cache for 2147483647 transient cores
   [junit4]   2> 287960 INFO  (zkCallback-888-thread-1-processing-n:127.0.0.1:38887_solr) [n:127.0.0.1:38887_solr    ] o.a.s.c.c.ZkStateReader A cluster state change: [WatchedEvent state:SyncConnected type:NodeDataChanged path:/collections/forwardingCollection/state.json] for collection [forwardingCollection] has occurred - updating... (live nodes size: [2])
   [junit4]   2> 287961 INFO  (zkCallback-888-thread-2-processing-n:127.0.0.1:38887_solr) [n:127.0.0.1:38887_solr    ] o.a.s.c.c.ZkStateReader A cluster state change: [WatchedEvent state:SyncConnected type:NodeDataChanged path:/collections/forwardingCollection/state.json] for collection [forwardingCollection] has occurred - updating... (live nodes size: [2])
   [junit4]   2> 288876 INFO  (qtp31948827-3735) [n:127.0.0.1:38887_solr c:forwardingCollection s:shard1 r:core_node2 x:forwardingCollection_shard1_replica_n1] o.a.s.c.SolrConfig Using Lucene MatchVersion: 7.3.0
   [junit4]   2> 288898 INFO  (qtp31948827-3735) [n:127.0.0.1:38887_solr c:forwardingCollection s:shard1 r:core_node2 x:forwardingCollection_shard1_replica_n1] o.a.s.s.IndexSchema [forwardingCollection_shard1_replica_n1] Schema name=test
   [junit4]   2> 288969 INFO  (qtp31948827-3735) [n:127.0.0.1:38887_solr c:forwardingCollection s:shard1 r:core_node2 x:forwardingCollection_shard1_replica_n1] o.a.s.s.IndexSchema Loaded schema test/1.0 with uniqueid field id
   [junit4]   2> 288978 INFO  (qtp31948827-3735) [n:127.0.0.1:38887_solr c:forwardingCollection s:shard1 r:core_node2 x:forwardingCollection_shard1_replica_n1] o.a.s.c.CoreContainer Creating SolrCore 'forwardingCollection_shard1_replica_n1' using configuration from collection forwardingCollection, trusted=true
   [junit4]   2> 288978 INFO  (qtp31948827-3735) [n:127.0.0.1:38887_solr c:forwardingCollection s:shard1 r:core_node2 x:forwardingCollection_shard1_replica_n1] o.a.s.m.r.SolrJmxReporter JMX monitoring for 'solr_38887.solr.core.forwardingCollection.shard1.replica_n1' (registry 'solr.core.forwardingCollection.shard1.replica_n1') enabled at server: com.sun.jmx.mbeanserver.JmxMBeanServer@13c7785
   [junit4]   2> 288978 INFO  (qtp31948827-3735) [n:127.0.0.1:38887_solr c:forwardingCollection s:shard1 r:core_node2 x:forwardingCollection_shard1_replica_n1] o.a.s.c.SolrCore solr.RecoveryStrategy.Builder
   [junit4]   2> 288978 INFO  (qtp31948827-3735) [n:127.0.0.1:38887_solr c:forwardingCollection s:shard1 r:core_node2 x:forwardingCollection_shard1_replica_n1] o.a.s.c.SolrCore [[forwardingCollection_shard1_replica_n1] ] Opening new SolrCore at [/home/jenkins/workspace/Lucene-Solr-7.x-Linux/solr/build/solr-core/test/J2/temp/solr.cloud.TestSolrCloudWithSecureImpersonation_70A943F10BDA666F-001/tempDir-001/node2/forwardingCollection_shard1_replica_n1], dataDir=[/home/jenkins/workspace/Lucene-Solr-7.x-Linux/solr/build/solr-core/test/J2/temp/solr.cloud.TestSolrCloudWithSecureImpersonation_70A943F10BDA666F-001/tempDir-001/node2/./forwardingCollection_shard1_replica_n1/data/]
   [junit4]   2> 288980 INFO  (qtp31948827-3735) [n:127.0.0.1:38887_solr c:forwardingCollection s:shard1 r:core_node2 x:forwardingCollection_shard1_replica_n1] o.a.s.u.RandomMergePolicy RandomMergePolicy wrapping class org.apache.lucene.index.LogByteSizeMergePolicy: [LogByteSizeMergePolicy: minMergeSize=1677721, mergeFactor=40, maxMergeSize=2147483648, maxMergeSizeForForcedMerge=9223372036854775807, calibrateSizeByDeletes=true, maxMergeDocs=2147483647, maxCFSSegmentSizeMB=8.796093022207999E12, noCFSRatio=1.0]
   [junit4]   2> 289030 INFO  (qtp31948827-3735) [n:127.0.0.1:38887_solr c:forwardingCollection s:shard1 r:core_node2 x:forwardingCollection_shard1_replica_n1] o.a.s.u.UpdateHandler Using UpdateLog implementation: org.apache.solr.update.UpdateLog
   [junit4]   2> 289030 INFO  (qtp31948827-3735) [n:127.0.0.1:38887_solr c:forwardingCollection s:shard1 r:core_node2 x:forwardingCollection_shard1_replica_n1] o.a.s.u.UpdateLog Initializing UpdateLog: dataDir= defaultSyncLevel=FLUSH numRecordsToKeep=100 maxNumLogsToKeep=10 numVersionBuckets=65536
   [junit4]   2> 289032 INFO  (qtp31948827-3735) [n:127.0.0.1:38887_solr c:forwardingCollection s:shard1 r:core_node2 x:forwardingCollection_shard1_replica_n1] o.a.s.u.CommitTracker Hard AutoCommit: disabled
   [junit4]   2> 289032 INFO  (qtp31948827-3735) [n:127.0.0.1:38887_solr c:forwardingCollection s:shard1 r:core_node2 x:forwardingCollection_shard1_replica_n1] o.a.s.u.CommitTracker Soft AutoCommit: disabled
   [junit4]   2> 289033 INFO  (qtp31948827-3735) [n:127.0.0.1:38887_solr c:forwardingCollection s:shard1 r:core_node2 x:forwardingCollection_shard1_replica_n1] o.a.s.u.RandomMergePolicy RandomMergePolicy wrapping class org.apache.lucene.index.TieredMergePolicy: [TieredMergePolicy: maxMergeAtOnce=12, maxMergeAtOnceExplicit=48, maxMergedSegmentMB=45.9970703125, floorSegmentMB=0.9794921875, forceMergeDeletesPctAllowed=23.59288150028076, segmentsPerTier=44.0, maxCFSSegmentSizeMB=8.796093022207999E12, noCFSRatio=0.0
   [junit4]   2> 289033 INFO  (qtp31948827-3735) [n:127.0.0.1:38887_solr c:forwardingCollection s:shard1 r:core_node2 x:forwardingCollection_shard1_replica_n1] o.a.s.s.SolrIndexSearcher Opening [Searcher@765ad2[forwardingCollection_shard1_replica_n1] main]
   [junit4]   2> 289035 INFO  (qtp31948827-3735) [n:127.0.0.1:38887_solr c:forwardingCollection s:shard1 r:core_node2 x:forwardingCollection_shard1_replica_n1] o.a.s.h.c.SpellCheckComponent Initializing spell checkers
   [junit4]   2> 289060 INFO  (qtp31948827-3735) [n:127.0.0.1:38887_solr c:forwardingCollection s:shard1 r:core_node2 x:forwardingCollection_shard1_replica_n1] o.a.s.s.DirectSolrSpellChecker init: {name=direct,classname=DirectSolrSpellChecker,field=lowerfilt,minQueryLength=3}
   [junit4]   2> 289149 INFO  (qtp31948827-3735) [n:127.0.0.1:38887_solr c:forwardingCollection s:shard1 r:core_node2 x:forwardingCollection_shard1_replica_n1] o.a.s.h.ReplicationHandler Commits will be reserved for 10000ms.
   [junit4]   2> 289149 INFO  (searcherExecutor-1440-thread-1-processing-n:127.0.0.1:38887_solr x:forwardingCollection_shard1_replica_n1 s:shard1 c:forwardingCollection r:core_node2) [n:127.0.0.1:38887_solr c:forwardingCollection s:shard1 r:core_node2 x:forwardingCollection_shard1_replica_n1] o.a.s.h.c.SpellCheckComponent Loading spell index for spellchecker: default
   [junit4]   2> 289150 INFO  (qtp31948827-3735) [n:127.0.0.1:38887_solr c:forwardingCollection s:shard1 r:core_node2 x:forwardingCollection_shard1_replica_n1] o.a.s.u.UpdateLog Could not find max version in index or recent updates, using new clock 1587142553922174976
   [junit4]   2> 289150 INFO  (searcherExecutor-1440-thread-1-processing-n:127.0.0.1:38887_solr x:forwardingCollection_shard1_replica_n1 s:shard1 c:forwardingCollection r:core_node2) [n:127.0.0.1:38887_solr c:forwardingCollection s:shard1 r:core_node2 x:forwardingCollection_shard1_replica_n1] o.a.s.h.c.SpellCheckComponent Loading spell index for spellchecker: direct
   [junit4]   2> 289150 INFO  (searcherExecutor-1440-thread-1-processing-n:127.0.0.1:38887_solr x:forwardingCollection_shard1_replica_n1 s:shard1 c:forwardingCollection r:core_node2) [n:127.0.0.1:38887_solr c:forwardingCollection s:shard1 r:core_node2 x:forwardingCollection_shard1_replica_n1] o.a.s.h.c.SpellCheckComponent Loading spell index for spellchecker: wordbreak
   [junit4]   2> 289150 INFO  (searcherExecutor-1440-thread-1-processing-n:127.0.0.1:38887_solr x:forwardingCollection_shard1_replica_n1 s:shard1 c:forwardingCollection r:core_node2) [n:127.0.0.1:38887_solr c:forwardingCollection s:shard1 r:core_node2 x:forwardingCollection_shard1_replica_n1] o.a.s.h.c.SpellCheckComponent Loading spell index for spellchecker: multipleFields
   [junit4]   2> 289150 INFO  (searcherExecutor-1440-thread-1-processing-n:127.0.0.1:38887_solr x:forwardingCollection_shard1_replica_n1 s:shard1 c:forwardingCollection r:core_node2) [n:127.0.0.1:38887_solr c:forwardingCollection s:shard1 r:core_node2 x:forwardingCollection_shard1_replica_n1] o.a.s.h.c.SpellCheckComponent Loading spell index for spellchecker: jarowinkler
   [junit4]   2> 289150 INFO  (searcherExecutor-1440-thread-1-processing-n:127.0.0.1:38887_solr x:forwardingCollection_shard1_replica_n1 s:shard1 c:forwardingCollection r:core_node2) [n:127.0.0.1:38887_solr c:forwardingCollection s:shard1 r:core_node2 x:forwardingCollection_shard1_replica_n1] o.a.s.h.c.SpellCheckComponent Loading spell index for spellchecker: external
   [junit4]   2> 289150 INFO  (searcherExecutor-1440-thread-1-processing-n:127.0.0.1:38887_solr x:forwardingCollection_shard1_replica_n1 s:shard1 c:forwardingCollection r:core_node2) [n:127.0.0.1:38887_solr c:forwardingCollection s:shard1 r:core_node2 x:forwardingCollection_shard1_replica_n1] o.a.s.h.c.SpellCheckComponent Loading spell index for spellchecker: freq
   [junit4]   2> 289150 INFO  (searcherExecutor-1440-thread-1-processing-n:127.0.0.1:38887_solr x:forwardingCollection_shard1_replica_n1 s:shard1 c:forwardingCollection r:core_node2) [n:127.0.0.1:38887_solr c:forwardingCollection s:shard1 r:core_node2 x:forwardingCollection_shard1_replica_n1] o.a.s.h.c.SpellCheckComponent Loading spell index for spellchecker: fqcn
   [junit4]   2> 289150 INFO  (searcherExecutor-1440-thread-1-processing-n:127.0.0.1:38887_solr x:forwardingCollection_shard1_replica_n1 s:shard1 c:forwardingCollection r:core_node2) [n:127.0.0.1:38887_solr c:forwardingCollection s:shard1 r:core_node2 x:forwardingCollection_shard1_replica_n1] o.a.s.h.c.SpellCheckComponent Loading spell index for spellchecker: perDict
   [junit4]   2> 289151 INFO  (searcherExecutor-1440-thread-1-processing-n:127.0.0.1:38887_solr x:forwardingCollection_shard1_replica_n1 s:shard1 c:forwardingCollection r:core_node2) [n:127.0.0.1:38887_solr c:forwardingCollection s:shard1 r:core_node2 x:forwardingCollection_shard1_replica_n1] o.a.s.c.SolrCore [forwardingCollection_shard1_replica_n1] Registered new searcher Searcher@765ad2[forwardingCollection_shard1_replica_n1] main{ExitableDirectoryReader(UninvertingDirectoryReader())}
   [junit4]   2> 289152 INFO  (qtp31948827-3735) [n:127.0.0.1:38887_solr c:forwardingCollection s:shard1 r:core_node2 x:forwardingCollection_shard1_replica_n1] o.a.s.c.ShardLeaderElectionContext Enough replicas found to continue.
   [junit4]   2> 289152 INFO  (qtp31948827-3735) [n:127.0.0.1:38887_solr c:forwardingCollection s:shard1 r:core_node2 x:forwardingCollection_shard1_replica_n1] o.a.s.c.ShardLeaderElectionContext I may be the new leader - try and sync
   [junit4]   2> 289152 INFO  (qtp31948827-3735) [n:127.0.0.1:38887_solr c:forwardingCollection s:shard1 r:core_node2 x:forwardingCollection_shard1_replica_n1] o.a.s.c.SyncStrategy Sync replicas to http://127.0.0.1:38887/solr/forwardingCollection_shard1_replica_n1/
   [junit4]   2> 289152 INFO  (qtp31948827-3735) [n:127.0.0.1:38887_solr c:forwardingCollection s:shard1 r:core_node2 x:forwardingCollection_shard1_replica_n1] o.a.s.c.SyncStrategy Sync Success - now sync replicas to me
   [junit4]   2> 289152 INFO  (qtp31948827-3735) [n:127.0.0.1:38887_solr c:forwardingCollection s:shard1 r:core_node2 x:forwardingCollection_shard1_replica_n1] o.a.s.c.SyncStrategy http://127.0.0.1:38887/solr/forwardingCollection_shard1_replica_n1/ has no replicas
   [junit4]   2> 289152 INFO  (qtp31948827-3735) [n:127.0.0.1:38887_solr c:forwardingCollection s:shard1 r:core_node2 x:forwardingCollection_shard1_replica_n1] o.a.s.c.ShardLeaderElectionContext Found all replicas participating in election, clear LIR
   [junit4]   2> 289154 INFO  (qtp31948827-3735) [n:127.0.0.1:38887_solr c:forwardingCollection s:shard1 r:core_node2 x:forwardingCollection_shard1_replica_n1] o.a.s.c.ShardLeaderElectionContext I am the new leader: http://127.0.0.1:38887/solr/forwardingCollection_shard1_replica_n1/ shard1
   [junit4]   2> 289254 INFO  (zkCallback-888-thread-1-processing-n:127.0.0.1:38887_solr) [n:127.0.0.1:38887_solr    ] o.a.s.c.c.ZkStateReader A cluster state change: [WatchedEvent state:SyncConnected type:NodeDataChanged path:/collections/forwardingCollection/state.json] for collection [forwardingCollection] has occurred - updating... (live nodes size: [2])
   [junit4]   2> 289254 INFO  (zkCallback-888-thread-2-processing-n:127.0.0.1:38887_solr) [n:127.0.0.1:38887_solr    ] o.a.s.c.c.ZkStateReader A cluster state change: [WatchedEvent state:SyncConnected type:NodeDataChanged path:/collections/forwardingCollection/state.json] for collection [forwardingCollection] has occurred - updating... (live nodes size: [2])
   [junit4]   2> 289304 INFO  (qtp31948827-3735) [n:127.0.0.1:38887_solr c:forwardingCollection s:shard1 r:core_node2 x:forwardingCollection_shard1_replica_n1] o.a.s.c.ZkController I am the leader, no recovery necessary
   [junit4]   2> 289305 INFO  (qtp31948827-3735) [n:127.0.0.1:38887_solr c:forwardingCollection s:shard1 r:core_node2 x:forwardingCollection_shard1_replica_n1] o.a.s.s.HttpSolrCall [admin] webapp=null path=/admin/cores params={qt=/admin/cores&coreNodeName=core_node2&collection.configName=conf1&newCollection=true&name=forwardingCollection_shard1_replica_n1&action=CREATE&numShards=1&collection=forwardingCollection&shard=shard1&wt=javabin&version=2&replicaType=NRT} status=0 QTime=1447
   [junit4]   2> 289306 WARN  (httpShardExecutor-1431-thread-1-processing-n:127.0.0.1:39099_solr [http:////127.0.0.1:38887//solr] http:////127.0.0.1:38887//solr) [n:127.0.0.1:39099_solr    ] o.a.h.c.p.ResponseProcessCookies Invalid cookie header: "Set-Cookie: hadoop.auth="u=$&p=$&t=test&e=1513653088858&s=Zng9HaAjALmr3QXf/y+WkXeHAS0="; Path=/; Domain=127.0.0.1; Expires=þri., 19-des.-2017 03:11:28 GMT; HttpOnly". Invalid 'expires' attribute: þri., 19-des.-2017 03:11:28 GMT
   [junit4]   2> 289308 INFO  (qtp10807214-3738) [n:127.0.0.1:39099_solr    ] o.a.s.h.a.CollectionsHandler Wait for new collection to be active for at most 30 seconds. Check all shard replicas
   [junit4]   2> 289408 INFO  (zkCallback-888-thread-2-processing-n:127.0.0.1:38887_solr) [n:127.0.0.1:38887_solr    ] o.a.s.c.c.ZkStateReader A cluster state change: [WatchedEvent state:SyncConnected type:NodeDataChanged path:/collections/forwardingCollection/state.json] for collection [forwardingCollection] has occurred - updating... (live nodes size: [2])
   [junit4]   2> 289408 INFO  (zkCallback-888-thread-1-processing-n:127.0.0.1:38887_solr) [n:127.0.0.1:38887_solr    ] o.a.s.c.c.ZkStateReader A cluster state change: [WatchedEvent state:SyncConnected type:NodeDataChanged path:/collections/forwardingCollection/state.json] for collection [forwardingCollection] has occurred - updating... (live nodes size: [2])
   [junit4]   2> 289553 INFO  (OverseerCollectionConfigSetProcessor-99196409440436230-127.0.0.1:39099_solr-n_0000000000) [n:127.0.0.1:39099_solr    ] o.a.s.c.OverseerTaskQueue Response ZK path: /overseer/collection-queue-work/qnr-0000000000 doesn't exist.  Requestor may have disconnected from ZooKeeper
   [junit4]   2> 290309 INFO  (qtp10807214-3738) [n:127.0.0.1:39099_solr    ] o.a.s.s.HttpSolrCall [admin] webapp=null path=/admin/collections params={pullReplicas=0&replicationFactor=1&collection.configName=conf1&maxShardsPerNode=1&name=forwardingCollection&nrtReplicas=1&action=CREATE&numShards=1&tlogReplicas=0&wt=javabin&version=2} status=0 QTime=2763
   [junit4]   2> 290310 WARN  (TEST-TestSolrCloudWithSecureImpersonation.testForwarding-seed#[70A943F10BDA666F]) [    ] o.a.h.c.p.ResponseProcessCookies Invalid cookie header: "Set-Cookie: hadoop.auth="u=user&p=user&t=test&e=1513653088546&s=CI1zg3ggLj1ARNpgOCgdeiILBTo="; Path=/; Domain=127.0.0.1; Expires=þri., 19-des.-2017 03:11:28 GMT; HttpOnly". Invalid 'expires' attribute: þri., 19-des.-2017 03:11:28 GMT
   [junit4]   2> 290310 INFO  (TEST-TestSolrCloudWithSecureImpersonation.testForwarding-seed#[70A943F10BDA666F]) [    ] o.a.s.c.AbstractDistribZkTestBase Wait for recoveries to finish - collection: forwardingCollection failOnTimeout:true timeout (sec):100
   [junit4]   2> 290310 INFO  (TEST-TestSolrCloudWithSecureImpersonation.testForwarding-seed#[70A943F10BDA666F]) [    ] o.a.s.c.AbstractDistribZkTestBase Recoveries finished - collection: forwardingCollection
   [junit4]   2> 290313 INFO  (qtp10807214-3730) [n:127.0.0.1:39099_solr    ] o.a.s.c.TransientSolrCoreCacheDefault Allocating transient cache for 2147483647 transient cores
   [junit4]   2> 290315 INFO  (qtp31948827-3739) [n:127.0.0.1:38887_solr c:forwardingCollection s:shard1 r:core_node2 x:forwardingCollection_shard1_replica_n1] o.a.s.c.S.Request [forwardingCollection_shard1_replica_n1]  webapp=/solr path=/select params={q=*:*&wt=javabin&version=2} hits=0 status=0 QTime=0
   [junit4]   2> 290316 WARN  (qtp10807214-3730) [n:127.0.0.1:39099_solr    ] o.a.h.c.p.ResponseProcessCookies Invalid cookie header: "Set-Cookie: hadoop.auth="u=$&p=$&t=test&e=1513653091315&s=x0jxP+e+UaKhQdQ6EpC4n3x21hc="; Path=/; Domain=127.0.0.1; Expires=þri., 19-des.-2017 03:11:31 GMT; HttpOnly". Invalid 'expires' attribute: þri., 19-des.-2017 03:11:31 GMT
   [junit4]   2> 290316 WARN  (TEST-TestSolrCloudWithSecureImpersonation.testForwarding-seed#[70A943F10BDA666F]) [    ] o.a.h.c.p.ResponseProcessCookies Invalid cookie header: "Set-Cookie: hadoop.auth="u=user&p=user&t=test&e=1513653091314&s=x98n5MXY/DRG4QQgpGB0xA7QfaY="; Path=/; Domain=127.0.0.1; Expires=þri., 19-des.-2017 03:11:31 GMT; HttpOnly". Invalid 'expires' attribute: þri., 19-des.-2017 03:11:31 GMT
   [junit4]   2> 290317 WARN  (TEST-TestSolrCloudWithSecureImpersonation.testForwarding-seed#[70A943F10BDA666F]) [    ] o.a.h.c.p.ResponseProcessCookies Invalid cookie header: "Set-Cookie: hadoop.auth="u=$&p=$&t=test&e=1513653091315&s=x0jxP+e+UaKhQdQ6EpC4n3x21hc="; Path=/; Domain=127.0.0.1; Expires=þri., 19-des.-2017 03:11:31 GMT; HttpOnly". Invalid 'expires' attribute: þri., 19-des.-2017 03:11:31 GMT
   [junit4]   2> 290319 INFO  (qtp31948827-3735) [n:127.0.0.1:38887_solr c:forwardingCollection s:shard1 r:core_node2 x:forwardingCollection_shard1_replica_n1] o.a.s.c.S.Request [forwardingCollection_shard1_replica_n1]  webapp=/solr path=/select params={q=*:*&wt=javabin&version=2} hits=0 status=0 QTime=0
   [junit4]   2> 290319 WARN  (TEST-TestSolrCloudWithSecureImpersonation.testForwarding-seed#[70A943F10BDA666F]) [    ] o.a.h.c.p.ResponseProcessCookies Invalid cookie header: "Set-Cookie: hadoop.auth="u=user&p=user&t=test&e=1513653091320&s=Otbvv2Ex4dvVQAv1TscljPpweSg="; Path=/; Domain=127.0.0.1; Expires=þri., 19-des.-2017 03:11:31 GMT; HttpOnly". Invalid 'expires' attribute: þri., 19-des.-2017 03:11:31 GMT
   [junit4]   2> 290320 INFO  (TEST-TestSolrCloudWithSecureImpersonation.testForwarding-seed#[70A943F10BDA666F]) [    ] o.a.s.SolrTestCaseJ4 ###Ending testForwarding
   [junit4]   2> 290343 INFO  (TEST-TestSolrCloudWithSecureImpersonation.testProxyInvalidProxyUser-seed#[70A943F10BDA666F]) [    ] o.a.s.SolrTestCaseJ4 ###Starting testProxyInvalidProxyUser
   [junit4]   2> 290347 WARN  (TEST-TestSolrCloudWithSecureImpersonation.testProxyInvalidProxyUser-seed#[70A943F10BDA666F]) [    ] o.a.h.c.p.ResponseProcessCookies Invalid cookie header: "Set-Cookie: hadoop.auth="u=bar&p=bar&t=test&e=1513653091346&s=Ct8FtP7VBGJhvuqcaJHjKdNCeKY="; Path=/; Domain=127.0.0.1; Expires=þri., 19-des.-2017 03:11:31 GMT; HttpOnly". Invalid 'expires' attribute: þri., 19-des.-2017 03:11:31 GMT
   [junit4]   2> 290347 INFO  (TEST-TestSolrCloudWithSecureImpersonation.testProxyInvalidProxyUser-seed#[70A943F10BDA666F]) [    ] o.a.s.SolrTestCaseJ4 ###Ending testProxyInvalidProxyUser
   [junit4]   2> 290364 INFO  (TEST-TestSolrCloudWithSecureImpersonation.testProxyNoConfigGroups-seed#[70A943F10BDA666F]) [    ] o.a.s.SolrTestCaseJ4 ###Starting testProxyNoConfigGroups
   [junit4]   2> 290366 WARN  (TEST-TestSolrCloudWithSecureImpersonation.testProxyNoConfigGroups-seed#[70A943F10BDA666F]) [    ] o.a.h.c.p.ResponseProcessCookies Invalid cookie header: "Set-Cookie: hadoop.auth="u=noGroups&p=noGroups&t=test&e=1513653091365&s=k13Nezi0OZ9Ox5IHIU/4Dn154MQ="; Path=/; Domain=127.0.0.1; Expires=þri., 19-des.-2017 03:11:31 GMT; HttpOnly". Invalid 'expires' attribute: þri., 19-des.-2017 03:11:31 GMT
   [junit4]   2> 290366 INFO  (TEST-TestSolrCloudWithSecureImpersonation.testProxyNoConfigGroups-seed#[70A943F10BDA666F]) [    ] o.a.s.SolrTestCaseJ4 ###Ending testProxyNoConfigGroups
   [junit4]   2> 290398 INFO  (TEST-TestSolrCloudWithSecureImpersonation.testProxyNoConfigHosts-seed#[70A943F10BDA666F]) [    ] o.a.s.SolrTestCaseJ4 ###Starting testProxyNoConfigHosts
   [junit4]   2> 290400 WARN  (TEST-TestSolrCloudWithSecureImpersonation.testProxyNoConfigHosts-seed#[70A943F10BDA666F]) [    ] o.a.h.c.p.ResponseProcessCookies Invalid cookie header: "Set-Cookie: hadoop.auth="u=noHosts&p=noHosts&t=test&e=1513653091399&s=sfivld+AVP55YwIj+sjumZ2eHB0="; Path=/; Domain=127.0.0.1; Expires=þri., 19-des.-2017 03:11:31 GMT; HttpOnly". Invalid 'expires' attribute: þri., 19-des.-2017 03:11:31 GMT
   [junit4]   2> 290400 INFO  (TEST-TestSolrCloudWithSecureImpersonation.testProxyNoConfigHosts-seed#[70A943F10BDA666F]) [    ] o.a.s.SolrTestCaseJ4 ###Ending testProxyNoConfigHosts
   [junit4]   2> 290425 INFO  (TEST-TestSolrCloudWithSecureImpersonation.testProxyUnknownRemote-seed#[70A943F10BDA666F]) [    ] o.a.s.SolrTestCaseJ4 ###Starting testProxyUnknownRemote
   [junit4]   2> 306994 WARN  (jetty-launcher-872-thread-1-SendThread(127.0.0.1:33473)) [n:127.0.0.1:39099_solr    ] o.a.z.ClientCnxn Client session timed out, have not heard from server in 20022ms for sessionid 0x1606a9bdbb10007
   [junit4]   2> 306994 WARN  (jetty-launcher-872-thread-1-SendThread(127.0.0.1:33473)) [n:127.0.0.1:39099_solr    ] o.a.z.ClientCnxn Client session timed out, have not heard from server in 16681ms for sessionid 0x1606a9bdbb10006
   [junit4]   2> 306994 WARN  (jetty-launcher-872-thread-2-SendThread(127.0.0.1:33473)) [n:127.0.0.1:38887_solr    ] o.a.z.ClientCnxn Client session timed out, have not heard from server in 20022ms for sessionid 0x1606a9bdbb10008
   [junit4]   2> 306994 WARN  (jetty-launcher-872-thread-2-SendThread(127.0.0.1:33473)) [n:127.0.0.1:38887_solr    ] o.a.z.ClientCnxn Client session timed out, have not heard from server in 17586ms for sessionid 0x1606a9bdbb10005
   [junit4]   2> 306995 WARN  (NIOServerCxn.Factory:0.0.0.0/0.0.0.0:0) [    ] o.a.z.s.NIOServerCnxn caught end of stream exception
   [junit4]   2> EndOfStreamException: Unable to read additional data from client sessionid 0x1606a9bdbb10007, likely client has closed socket
   [junit4]   2> 	at org.apache.zookeeper.server.NIOServerCnxn.doIO(NIOServerCnxn.java:239)
   [junit4]   2> 	at org.apache.zookeeper.server.NIOServerCnxnFactory.run(NIOServerCnxnFactory.java:203)
   [junit4]   2> 	at java.lang.Thread.run(Thread.java:748)
   [junit4]   2> 306996 WARN  (NIOServerCxn.Factory:0.0.0.0/0.0.0.0:0) [    ] o.a.z.s.NIOServerCnxn caught end of stream exception
   [junit4]   2> EndOfStreamException: Unable to read additional data from client sessionid 0x1606a9bdbb10008, likely client has closed socket
   [junit4]   2> 	at org.apache.zookeeper.server.NIOServerCnxn.doIO(NIOServerCnxn.java:239)
   [junit4]   2> 	at org.apache.zookeeper.server.NIOServerCnxnFactory.run(NIOServerCnxnFactory.java:203)
   [junit4]   2> 	at java.lang.Thread.run(Thread.java:748)
   [junit4]   2> 306996 WARN  (NIOServerCxn.Factory:0.0.0.0/0.0.0.0:0) [    ] o.a.z.s.NIOServerCnxn caught end of stream exception
   [junit4]   2> EndOfStreamException: Unable to read additional data from client sessionid 0x1606a9bdbb10005, likely client has closed socket
   [junit4]   2> 	at org.apache.zookeeper.server.NIOServerCnxn.doIO(NIOServerCnxn.java:239)
   [junit4]   2> 	at org.apache.zookeeper.server.NIOServerCnxnFactory.run(NIOServerCnxnFactory.java:203)
   [junit4]   2> 	at java.lang.Thread.run(Thread.java:748)
   [junit4]   2> 306996 WARN  (NIOServerCxn.Factory:0.0.0.0/0.0.0.0:0) [    ] o.a.z.s.NIOServerCnxn caught end of stream exception
   [junit4]   2> EndOfStreamException: Unable to read additional data from client sessionid 0x1606a9bdbb10006, likely client has closed socket
   [junit4]   2> 	at org.apache.zookeeper.server.NIOServerCnxn.doIO(NIOServerCnxn.java:239)
   [junit4]   2> 	at org.apache.zookeeper.server.NIOServerCnxnFactory.run(NIOServerCnxnFactory.java:203)
   [junit4]   2> 	at java.lang.Thread.run(Thread.java:748)
   [junit4]   2> 306998 WARN  (TEST-TestSolrCloudWithSecureImpersonation.testProxyUnknownRemote-seed#[70A943F10BDA666F]) [    ] o.a.h.c.p.ResponseProcessCookies Invalid cookie header: "Set-Cookie: hadoop.auth="u=localHostAnyGroup&p=localHostAnyGroup&t=test&e=1513653091426&s=vRN22RgiQSU4OP/oMmZCiHsEPNc="; Path=/; Domain=127.0.0.1; Expires=þri., 19-des.-2017 03:11:31 GMT; HttpOnly". Invalid 'expires' attribute: þri., 19-des.-2017 03:11:31 GMT
   [junit4]   2> 306998 INFO  (TEST-TestSolrCloudWithSecureImpersonation.testProxyUnknownRemote-seed#[70A943F10BDA666F]) [    ] o.a.s.SolrTestCaseJ4 ###Ending testProxyUnknownRemote
   [junit4]   2> 307095 INFO  (jetty-launcher-872-thread-1-EventThread) [n:127.0.0.1:39099_solr    ] o.a.c.f.s.ConnectionStateManager State change: SUSPENDED
   [junit4]   2> 307095 WARN  (zkConnectionManagerCallback-903-thread-1) [    ] o.a.s.c.c.ConnectionManager Watcher org.apache.solr.common.cloud.ConnectionManager@243267 name: ZooKeeperConnection Watcher:127.0.0.1:33473/solr got event WatchedEvent state:Disconnected type:None path:null path: null type: None
   [junit4]   2> 307095 WARN  (zkConnectionManagerCallback-891-thread-1-processing-n:127.0.0.1:39099_solr) [n:127.0.0.1:39099_solr    ] o.a.s.c.c.ConnectionManager Watcher org.apache.solr.common.cloud.ConnectionManager@170c71b name: ZooKeeperConnection Watcher:127.0.0.1:33473/solr got event WatchedEvent state:Disconnected type:None path:null path: null type: None
   [junit4]   2> 307095 WARN  (zkConnectionManagerCallback-891-thread-1-processing-n:127.0.0.1:39099_solr) [n:127.0.0.1:39099_solr    ] o.a.s.c.c.ConnectionManager zkClient has disconnected
   [junit4]   2> 307096 WARN  (zkConnectionManagerCallback-889-thread-1-processing-n:127.0.0.1:38887_solr) [n:127.0.0.1:38887_solr    ] o.a.s.c.c.ConnectionManager Watcher org.apache.solr.common.cloud.ConnectionManager@1edcf43 name: ZooKeeperConnection Watcher:127.0.0.1:33473/solr got event WatchedEvent state:Disconnected type:None path:null path: null type: None
   [junit4]   2> 307096 WARN  (zkConnectionManagerCallback-889-thread-1-processing-n:127.0.0.1:38887_solr) [n:127.0.0.1:38887_solr    ] o.a.s.c.c.ConnectionManager zkClient has disconnected
   [junit4]   2> 307104 INFO  (jetty-closer-873-thread-2) [    ] o.e.j.s.AbstractConnector Stopped ServerConnector@11f1670{HTTP/1.1,[http/1.1]}{127.0.0.1:0}
   [junit4]   2> 307104 INFO  (jetty-closer-873-thread-2) [    ] o.a.s.c.CoreContainer Shutting down CoreContainer instance=18945451
   [junit4]   2> 307104 INFO  (jetty-closer-873-thread-2) [    ] o.a.s.m.SolrMetricManager Closing metric reporters for registry=solr.node, tag=null
   [junit4]   2> 307105 INFO  (jetty-closer-873-thread-2) [    ] o.a.s.m.r.SolrJmxReporter Closing reporter [org.apache.solr.metrics.reporters.SolrJmxReporter@14179a3: rootName = solr_38887, domain = solr.node, service url = null, agent id = null] for registry solr.node / com.codahale.metrics.MetricRegistry@188ec18
   [junit4]   2> 307105 INFO  (jetty-closer-873-thread-1) [    ] o.e.j.s.AbstractConnector Stopped ServerConnector@17b8a4c{HTTP/1.1,[http/1.1]}{127.0.0.1:0}
   [junit4]   2> 307105 INFO  (jetty-closer-873-thread-1) [    ] o.a.s.c.CoreContainer Shutting down CoreContainer instance=28527442
   [junit4]   2> 307105 INFO  (jetty-closer-873-thread-1) [    ] o.a.s.m.SolrMetricManager Closing metric reporters for registry=solr.node, tag=null
   [junit4]   2> 307105 INFO  (jetty-closer-873-thread-1) [    ] o.a.s.m.r.SolrJmxReporter Closing reporter [org.apache.solr.metrics.reporters.SolrJmxReporter@12acd42: rootName = solr_39099, domain = solr.node, service url = null, agent id = null] for registry solr.node / com.codahale.metrics.MetricRegistry@16d4ba
   [junit4]   2> 307114 INFO  (jetty-closer-873-thread-2) [    ] o.a.s.m.SolrMetricManager Closing metric reporters for registry=solr.jvm, tag=null
   [junit4]   2> 307114 INFO  (jetty-closer-873-thread-2) [    ] o.a.s.m.r.SolrJmxReporter Closing reporter [org.apache.solr.metrics.reporters.SolrJmxReporter@7436b3: rootName = solr_38887, domain = solr.jvm, service url = null, agent id = null] for registry solr.jvm / com.codahale.metrics.MetricRegistry@13653a8
   [junit4]   2> 307115 INFO  (jetty-closer-873-thread-1) [    ] o.a.s.m.SolrMetricManager Closing metric reporters for registry=solr.jvm, tag=null
   [junit4]   2> 307115 INFO  (jetty-closer-873-thread-1) [    ] o.a.s.m.r.SolrJmxReporter Closing reporter [org.apache.solr.metrics.reporters.SolrJmxReporter@ada826: rootName = solr_39099, domain = solr.jvm, service url = null, agent id = null] for registry solr.jvm / com.codahale.metrics.MetricRegistry@13653a8
   [junit4]   2> 307120 INFO  (jetty-closer-873-thread-2) [    ] o.a.s.m.SolrMetricManager Closing metric reporters for registry=solr.jetty, tag=null
   [junit4]   2> 307120 INFO  (jetty-closer-873-thread-2) [    ] o.a.s.m.r.SolrJmxReporter Closing reporter [org.apache.solr.metrics.reporters.SolrJmxReporter@3fb8ba: rootName = solr_38887, domain = solr.jetty, service url = null, agent id = null] for registry solr.jetty / com.codahale.metrics.MetricRegistry@a4e093
   [junit4]   2> 307121 INFO  (jetty-closer-873-thread-1) [    ] o.a.s.m.SolrMetricManager Closing metric reporters for registry=solr.jetty, tag=null
   [junit4]   2> 307121 INFO  (jetty-closer-873-thread-1) [    ] o.a.s.m.r.SolrJmxReporter Closing reporter [org.apache.solr.metrics.reporters.SolrJmxReporter@4fc302: rootName = solr_39099, domain = solr.jetty, service url = null, agent id = null] for registry solr.jetty / com.codahale.metrics.MetricRegistry@a4e093
   [junit4]   2> 308309 WARN  (jetty-launcher-872-thread-2-SendThread(127.0.0.1:33473)) [n:127.0.0.1:38887_solr    ] o.a.z.ClientCnxn Unable to reconnect to ZooKeeper service, session 0x1606a9bdbb10008 has expired
   [junit4]   2> 308475 INFO  (zkConnectionManagerCallback-889-thread-1-processing-n:127.0.0.1:38887_solr) [n:127.0.0.1:38887_solr    ] o.a.s.c.c.ConnectionManager zkClient has connected
   [junit4]   2> 308477 INFO  (jetty-closer-873-thread-2) [    ] o.a.s.c.ZkController Remove node as live in ZooKeeper:/live_nodes/127.0.0.1:38887_solr
   [junit4]   2> 308477 INFO  (jetty-closer-873-thread-2) [    ] o.a.s.m.SolrMetricManager Closing metric reporters for registry=solr.cluster, tag=null
   [junit4]   2> 308478 INFO  (zkCallback-888-thread-1-processing-n:127.0.0.1:38887_solr) [n:127.0.0.1:38887_solr    ] o.a.s.c.c.ZkStateReader Updated live nodes from ZooKeeper... (2) -> (1)
   [junit4]   2> 308478 INFO  (coreCloseExecutor-1445-thread-1) [n:127.0.0.1:38887_solr c:forwardingCollection s:shard1 r:core_node2 x:forwardingCollection_shard1_replica_n1] o.a.s.c.SolrCore [forwardingCollection_shard1_replica_n1]  CLOSING SolrCore org.apache.solr.core.SolrCore@a410b9
   [junit4]   2> 308478 INFO  (coreCloseExecutor-1445-thread-1) [n:127.0.0.1:38887_solr c:forwardingCollection s:shard1 r:core_node2 x:forwardingCollection_shard1_replica_n1] o.a.s.m.SolrMetricManager Closing metric reporters for registry=solr.core.forwardingCollection.shard1.replica_n1, tag=10752185
   [junit4]   2> 308478 INFO  (coreCloseExecutor-1445-thread-1) [n:127.0.0.1:38887_solr c:forwardingCollection s:shard1 r:core_node2 x:forwardingCollection_shard1_replica_n1] o.a.s.m.r.SolrJmxReporter Closing reporter [org.apache.solr.metrics.reporters.SolrJmxReporter@123ca7b: rootName = solr_38887, domain = solr.core.forwardingCollection.shard1.replica_n1, service url = null, agent id = null] for registry solr.core.forwardingCollection.shard1.replica_n1 / com.codahale.metrics.MetricRegistry@4c477f
   [junit4]   2> 308497 INFO  (coreCloseExecutor-1445-thread-1) [n:127.0.0.1:38887_solr c:forwardingCollection s:shard1 r:core_node2 x:forwardingCollection_shard1_replica_n1] o.a.s.m.SolrMetricManager Closing metric reporters for registry=solr.collection.forwardingCollection.shard1.leader, tag=10752185
   [junit4]   2> 308503 ERROR (Thread[Thread-874,5,TGRP-TestSolrCloudWithSecureImpersonation]) [n:127.0.0.1:38887_solr    ] o.a.h.s.t.d.AbstractDelegationTokenSecretManager ExpiredTokenRemover received java.lang.InterruptedException: sleep interrupted
   [junit4]   2> 308513 INFO  (jetty-closer-873-thread-2) [    ] o.e.j.s.h.ContextHandler Stopped o.e.j.s.ServletContextHandler@5bc2c{/solr,null,UNAVAILABLE}
   [junit4]   2> 308829 WARN  (jetty-launcher-872-thread-1-SendThread(127.0.0.1:33473)) [n:127.0.0.1:39099_solr    ] o.a.z.ClientCnxn Unable to reconnect to ZooKeeper service, session 0x1606a9bdbb10007 has expired
   [junit4]   2> 308923 INFO  (zkConnectionManagerCallback-891-thread-1-processing-n:127.0.0.1:39099_solr) [n:127.0.0.1:39099_solr    ] o.a.s.c.c.ConnectionManager zkClient has connected
   [junit4]   2> 308924 INFO  (zkCallback-890-thread-1-processing-n:127.0.0.1:39099_solr) [n:127.0.0.1:39099_solr    ] o.a.s.c.c.ZkStateReader Updated live nodes from ZooKeeper... (2) -> (1)
   [junit4]   2> 308925 INFO  (jetty-closer-873-thread-1) [    ] o.a.s.c.ZkController Remove node as live in ZooKeeper:/live_nodes/127.0.0.1:39099_solr
   [junit4]   2> 308925 INFO  (jetty-closer-873-thread-1) [    ] o.a.s.m.SolrMetricManager Closing metric reporters for registry=solr.cluster, tag=null
   [junit4]   2> 308926 INFO  (zkCallback-890-thread-1-processing-n:127.0.0.1:39099_solr) [n:127.0.0.1:39099_solr    ] o.a.s.c.c.ZkStateReader Updated live nodes from ZooKeeper... (1) -> (0)
   [junit4]   2> 308926 INFO  (jetty-closer-873-thread-1) [    ] o.a.s.c.Overseer Overseer (id=99196409440436230-127.0.0.1:39099_solr-n_0000000000) closing
   [junit4]   2> 308927 INFO  (OverseerStateUpdate-99196409440436230-127.0.0.1:39099_solr-n_0000000000) [n:127.0.0.1:39099_solr    ] o.a.s.c.Overseer Overseer Loop exiting : 127.0.0.1:39099_solr
   [junit4]   2> 308927 WARN  (OverseerAutoScalingTriggerThread-99196409440436230-127.0.0.1:39099_solr-n_0000000000) [n:127.0.0.1:39099_solr    ] o.a.s.c.a.OverseerTriggerThread OverseerTriggerThread woken up but we are closed, exiting.
   [junit4]   2> 308929 ERROR (Thread[Thread-873,5,TGRP-TestSolrCloudWithSecureImpersonation]) [n:127.0.0.1:39099_solr    ] o.a.h.s.t.d.AbstractDelegationTokenSecretManager ExpiredTokenRemover received java.lang.InterruptedException: sleep interrupted
   [junit4]   2> 308930 INFO  (jetty-closer-873-thread-1) [    ] o.e.j.s.h.ContextHandler Stopped o.e.j.s.ServletContextHandler@1875445{/solr,null,UNAVAILABLE}
   [junit4]   2> 308930 ERROR (SUITE-TestSolrCloudWithSecureImpersonation-seed#[70A943F10BDA666F]-worker) [    ] o.a.z.s.ZooKeeperServer ZKShutdownHandler is not registered, so ZooKeeper server won't take any action on ERROR or SHUTDOWN server state changes
   [junit4]   2> 308931 INFO  (SUITE-TestSolrCloudWithSecureImpersonation-seed#[70A943F10BDA666F]-worker) [    ] o.a.s.c.ZkTestServer connecting to 127.0.0.1:33473 33473
   [junit4]   2> 308980 INFO  (Thread-856) [    ] o.a.s.c.ZkTestServer connecting to 127.0.0.1:33473 33473
   [junit4]   2> 308980 WARN  (Thread-856) [    ] o.a.s.c.ZkTestServer Watch limit violations: 
   [junit4]   2> Maximum concurrent create/delete watches above limit:
   [junit4]   2> 
   [junit4]   2> 	3	/solr/aliases.json
   [junit4]   2> 	3	/solr/clusterprops.json
   [junit4]   2> 	2	/solr/security.json
   [junit4]   2> 
   [junit4]   2> Maximum concurrent data watches above limit:
   [junit4]   2> 
   [junit4]   2> 	5	/solr/collections/forwardingCollection/state.json
   [junit4]   2> 	4	/solr/security/zkdtsm/ZKDTSMRoot/ZKDTSMKeyIdRoot
   [junit4]   2> 	3	/solr/clusterstate.json
   [junit4]   2> 	2	/solr/security/zkdtsm/ZKDTSMRoot/ZKDTSMMasterKeyRoot/DK_1
   [junit4]   2> 	2	/solr/security/zkdtsm/ZKDTSMRoot/ZKDTSMMasterKeyRoot/DK_3
   [junit4]   2> 	2	/solr/security/zkdtsm/ZKDTSMRoot/ZKDTSMMasterKeyRoot/DK_2
   [junit4]   2> 	2	/solr/security/zkdtsm/ZKDTSMRoot/ZKDTSMMasterKeyRoot/DK_4
   [junit4]   2> 	2	/solr/security/zkdtsm/ZKDTSMRoot/ZKDTSMSeqNumRoot
   [junit4]   2> 
   [junit4]   2> Maximum concurrent children watches above limit:
   [junit4]   2> 
   [junit4]   2> 	3	/solr/live_nodes
   [junit4]   2> 	3	/solr/collections
   [junit4]   2> 	2	/solr/security/zkdtsm/ZKDTSMRoot/ZKDTSMMasterKeyRoot
   [junit4]   2> 	2	/solr/security/zkdtsm/ZKDTSMRoot/ZKDTSMTokensRoot
   [junit4]   2> 
   [junit4]   2> 308991 INFO  (SUITE-TestSolrCloudWithSecureImpersonation-seed#[70A943F10BDA666F]-worker) [    ] o.a.s.SolrTestCaseJ4 ------------------------------------------------------- Done waiting for tracked resources to be released
   [junit4]   2> Dec 18, 2017 5:11:49 PM com.carrotsearch.randomizedtesting.ThreadLeakControl checkThreadLeaks
   [junit4]   2> WARNING: Will linger awaiting termination of 5 leaked thread(s).
   [junit4]   2> Dec 18, 2017 5:12:10 PM com.carrotsearch.randomizedtesting.ThreadLeakControl checkThreadLeaks
   [junit4]   2> SEVERE: 2 threads leaked from SUITE scope at org.apache.solr.cloud.TestSolrCloudWithSecureImpersonation: 
   [junit4]   2>    1) Thread[id=3777, name=jetty-launcher-872-thread-1-EventThread, state=TIMED_WAITING, group=TGRP-TestSolrCloudWithSecureImpersonation]
   [junit4]   2>         at sun.misc.Unsafe.park(Native Method)
   [junit4]   2>         at java.util.concurrent.locks.LockSupport.parkNanos(LockSupport.java:215)
   [junit4]   2>         at java.util.concurrent.locks.AbstractQueuedSynchronizer.doAcquireSharedNanos(AbstractQueuedSynchronizer.java:1037)
   [junit4]   2>         at java.util.concurrent.locks.AbstractQueuedSynchronizer.tryAcquireSharedNanos(AbstractQueuedSynchronizer.java:1328)
   [junit4]   2>         at java.util.concurrent.CountDownLatch.await(CountDownLatch.java:277)
   [junit4]   2>         at org.apache.curator.CuratorZookeeperClient.internalBlockUntilConnectedOrTimedOut(CuratorZookeeperClient.java:323)
   [junit4]   2>         at org.apache.curator.RetryLoop.callWithRetry(RetryLoop.java:105)
   [junit4]   2>         at org.apache.curator.framework.imps.GetDataBuilderImpl.pathInForeground(GetDataBuilderImpl.java:288)
   [junit4]   2>         at org.apache.curator.framework.imps.GetDataBuilderImpl.forPath(GetDataBuilderImpl.java:279)
   [junit4]   2>         at org.apache.curator.framework.imps.GetDataBuilderImpl.forPath(GetDataBuilderImpl.java:41)
   [junit4]   2>         at org.apache.curator.framework.recipes.shared.SharedValue.readValue(SharedValue.java:244)
   [junit4]   2>         at org.apache.curator.framework.recipes.shared.SharedValue.access$100(SharedValue.java:44)
   [junit4]   2>         at org.apache.curator.framework.recipes.shared.SharedValue$1.process(SharedValue.java:61)
   [junit4]   2>         at org.apache.curator.framework.imps.NamespaceWatcher.process(NamespaceWatcher.java:67)
   [junit4]   2>         at org.apache.zookeeper.ClientCnxn$EventThread.processEvent(ClientCnxn.java:530)
   [junit4]   2>         at org.apache.zookeeper.ClientCnxn$EventThread.run(ClientCnxn.java:505)
   [junit4]   2>    2) Thread[id=3776, name=jetty-launcher-872-thread-2-EventThread, state=TIMED_WAITING, group=TGRP-TestSolrCloudWithSecureImpersonation]
   [junit4]   2>         at sun.misc.Unsafe.park(Native Method)
   [junit4]   2>         at java.util.concurrent.locks.LockSupport.parkNanos(LockSupport.java:215)
   [junit4]   2>         at java.util.concurrent.locks.AbstractQueuedSynchronizer.doAcquireSharedNanos(AbstractQueuedSynchronizer.java:1037)
   [junit4]   2>         at java.util.concurrent.locks.AbstractQueuedSynchronizer.tryAcquireSharedNanos(AbstractQueuedSynchronizer.java:1328)
   [junit4]   2>         at java.util.concurrent.CountDownLatch.await(CountDownLatch.java:277)
   [junit4]   2>         at org.apache.curator.CuratorZookeeperClient.internalBlockUntilConnectedOrTimedOut(CuratorZookeeperClient.java:323)
   [junit4]   2>         at org.apache.curator.RetryLoop.callWithRetry(RetryLoop.java:105)
   [junit4]   2>         at org.apache.curator.framework.imps.GetDataBuilderImpl.pathInForeground(GetDataBuilderImpl.java:288)
   [junit4]   2>         at org.apache.curator.framework.imps.GetDataBuilderImpl.forPath(GetDataBuilderImpl.java:279)
   [junit4]   2>         at org.apache.curator.framework.imps.GetDataBuilderImpl.forPath(GetDataBuilderImpl.java:41)
   [junit4]   2>         at org.apache.curator.framework.recipes.shared.SharedValue.readValue(SharedValue.java:244)
   [junit4]   2>         at org.apache.curator.framework.recipes.shared.SharedValue.access$100(SharedValue.java:44)
   [junit4]   2>         at org.apache.curator.framework.recipes.shared.SharedValue$1.process(SharedValue.java:61)
   [junit4]   2>         at org.apache.curator.framework.imps.NamespaceWatcher.process(NamespaceWatcher.java:67)
   [junit4]   2>         at org.apache.zookeeper.ClientCnxn$EventThread.processEvent(ClientCnxn.java:530)
   [junit4]   2>         at org.apache.zookeeper.ClientCnxn$EventThread.run(ClientCnxn.java:505)
   [junit4]   2> Dec 18, 2017 5:12:10 PM com.carrotsearch.randomizedtesting.ThreadLeakControl tryToInterruptAll
   [junit4]   2> INFO: Starting to interrupt leaked threads:
   [junit4]   2>    1) Thread[id=3777, name=jetty-launcher-872-thread-1-EventThread, state=TIMED_WAITING, group=TGRP-TestSolrCloudWithSecureImpersonation]
   [junit4]   2>    2) Thread[id=3776, name=jetty-launcher-872-thread-2-EventThread, state=TIMED_WAITING, group=TGRP-TestSolrCloudWithSecureImpersonation]
   [junit4]   2> 329117 ERROR (jetty-launcher-872-thread-2-EventThread) [n:127.0.0.1:38887_solr    ] o.a.c.f.i.CuratorFrameworkImpl Watcher exception
   [junit4]   2> java.lang.InterruptedException
   [junit4]   2> 	at java.util.concurrent.locks.AbstractQueuedSynchronizer.doAcquireSharedNanos(AbstractQueuedSynchronizer.java:1039)
   [junit4]   2> 	at java.util.concurrent.locks.AbstractQueuedSynchronizer.tryAcquireSharedNanos(AbstractQueuedSynchronizer.java:1328)
   [junit4]   2> 	at java.util.concurrent.CountDownLatch.await(CountDownLatch.java:277)
   [junit4]   2> 	at org.apache.curator.CuratorZookeeperClient.internalBlockUntilConnectedOrTimedOut(CuratorZookeeperClient.java:323)
   [junit4]   2> 	at org.apache.curator.RetryLoop.callWithRetry(RetryLoop.java:105)
   [junit4]   2> 	at org.apache.curator.framework.imps.GetDataBuilderImpl.pathInForeground(GetDataBuilderImpl.java:288)
   [junit4]   2> 	at org.apache.curator.framework.imps.GetDataBuilderImpl.forPath(GetDataBuilderImpl.java:279)
   [junit4]   2> 	at org.apache.curator.framework.imps.GetDataBuilderImpl.forPath(GetDataBuilderImpl.java:41)
   [junit4]   2> 	at org.apache.curator.framework.recipes.shared.SharedValue.readValue(SharedValue.java:244)
   [junit4]   2> 	at org.apache.curator.framework.recipes.shared.SharedValue.access$100(SharedValue.java:44)
   [junit4]   2> 	at org.apache.curator.framework.recipes.shared.SharedValue$1.process(SharedValue.java:61)
   [junit4]   2> 	at org.apache.curator.framework.imps.NamespaceWatcher.process(NamespaceWatcher.java:67)
   [junit4]   2> 	at org.apache.zookeeper.ClientCnxn$EventThread.processEvent(ClientCnxn.java:530)
   [junit4]   2> 	at org.apache.zookeeper.ClientCnxn$EventThread.run(ClientCnxn.java:505)
   [junit4]   2> 329117 ERROR (jetty-launcher-872-thread-1-EventThread) [n:127.0.0.1:39099_solr    ] o.a.c.f.i.CuratorFrameworkImpl Watcher exception
   [junit4]   2> java.lang.InterruptedException
   [junit4]   2> 	at java.util.concurrent.locks.AbstractQueuedSynchronizer.doAcquireSharedNanos(AbstractQueuedSynchronizer.java:1039)
   [junit4]   2> 	at java.util.concurrent.locks.AbstractQueuedSynchronizer.tryAcquireSharedNanos(AbstractQueuedSynchronizer.java:1328)
   [junit4]   2> 	at java.util.concurrent.CountDownLatch.await(CountDownLatch.java:277)
   [junit4]   2> 	at org.apache.curator.CuratorZookeeperClient.internalBlockUntilConnectedOrTimedOut(CuratorZookeeperClient.java:323)
   [junit4]   2> 	at org.apache.curator.RetryLoop.callWithRetry(RetryLoop.java:105)
   [junit4]   2> 	at org.apache.curator.framework.imps.GetDataBuilderImpl.pathInForeground(GetDataBuilderImpl.java:288)
   [junit4]   2> 	at org.apache.curator.framework.imps.GetDataBuilderImpl.forPath(GetDataBuilderImpl.java:279)
   [junit4]   2> 	at org.apache.curator.framework.imps.GetDataBuilderImpl.forPath(GetDataBuilderImpl.java:41)
   [junit4]   2> 	at org.apache.curator.framework.recipes.shared.SharedValue.readValue(SharedValue.java:244)
   [junit4]   2> 	at org.apache.curator.framework.recipes.shared.SharedValue.access$100(SharedValue.java:44)
   [junit4]   2> 	at org.apache.curator.framework.recipes.shared.SharedValue$1.process(SharedValue.java:61)
   [junit4]   2> 	at org.apache.curator.framework.imps.NamespaceWatcher.process(NamespaceWatcher.java:67)
   [junit4]   2> 	at org.apache.zookeeper.ClientCnxn$EventThread.processEvent(ClientCnxn.java:530)
   [junit4]   2> 	at org.apache.zookeeper.ClientCnxn$EventThread.run(ClientCnxn.java:505)
   [junit4]   2> 329119 WARN  (jetty-launcher-872-thread-1-EventThread) [n:127.0.0.1:39099_solr    ] o.a.c.ConnectionState Session expired event received
   [junit4]   2> 329119 WARN  (jetty-launcher-872-thread-2-EventThread) [n:127.0.0.1:38887_solr    ] o.a.c.ConnectionState Session expired event received
   [junit4]   2> 329120 WARN  (jetty-launcher-872-thread-1-SendThread(127.0.0.1:33473)) [n:127.0.0.1:39099_solr    ] o.a.z.ClientCnxn Session 0x0 for server null, unexpected error, closing socket connection and attempting reconnect
   [junit4]   2> java.net.ConnectException: Connection refused
   [junit4]   2> 	at sun.nio.ch.SocketChannelImpl.checkConnect(Native Method)
   [junit4]   2> 	at sun.nio.ch.SocketChannelImpl.finishConnect(SocketChannelImpl.java:717)
   [junit4]   2> 	at org.ap

[...truncated too long message...]

o.ch.SocketChannelImpl.checkConnect(Native Method)
   [junit4]   2> 	at sun.nio.ch.SocketChannelImpl.finishConnect(SocketChannelImpl.java:717)
   [junit4]   2> 	at org.apache.zookeeper.ClientCnxnSocketNIO.doTransport(ClientCnxnSocketNIO.java:361)
   [junit4]   2> 	at org.apache.zookeeper.ClientCnxn$SendThread.run(ClientCnxn.java:1141)
   [junit4] IGNOR/A 0.00s J2 | TestFieldCacheVsDocValues.testHugeBinaryValueLimit
   [junit4]    > Assumption #1: test requires codec with limits on max binary field length
   [junit4]   2> 2476385 WARN  (jetty-launcher-872-thread-1-SendThread(127.0.0.1:33473)) [n:127.0.0.1:39099_solr    ] o.a.z.ClientCnxn Session 0x0 for server null, unexpected error, closing socket connection and attempting reconnect
   [junit4]   2> java.net.ConnectException: Connection refused
   [junit4]   2> 	at sun.nio.ch.SocketChannelImpl.checkConnect(Native Method)
   [junit4]   2> 	at sun.nio.ch.SocketChannelImpl.finishConnect(SocketChannelImpl.java:717)
   [junit4]   2> 	at org.apache.zookeeper.ClientCnxnSocketNIO.doTransport(ClientCnxnSocketNIO.java:361)
   [junit4]   2> 	at org.apache.zookeeper.ClientCnxn$SendThread.run(ClientCnxn.java:1141)
   [junit4]   2> 2476385 WARN  (jetty-launcher-872-thread-2-SendThread(127.0.0.1:33473)) [n:127.0.0.1:38887_solr    ] o.a.z.ClientCnxn Session 0x0 for server null, unexpected error, closing socket connection and attempting reconnect
   [junit4]   2> java.net.ConnectException: Connection refused
   [junit4]   2> 	at sun.nio.ch.SocketChannelImpl.checkConnect(Native Method)
   [junit4]   2> 	at sun.nio.ch.SocketChannelImpl.finishConnect(SocketChannelImpl.java:717)
   [junit4]   2> 	at org.apache.zookeeper.ClientCnxnSocketNIO.doTransport(ClientCnxnSocketNIO.java:361)
   [junit4]   2> 	at org.apache.zookeeper.ClientCnxn$SendThread.run(ClientCnxn.java:1141)
   [junit4]   2> NOTE: test params are: codec=Asserting(Lucene70), sim=RandomSimilarity(queryNorm=false): {}, locale=es-CO, timezone=Africa/Sao_Tome
   [junit4]   2> NOTE: Linux 4.10.0-40-generic i386/Oracle Corporation 1.8.0_144 (32-bit)/cpus=8,threads=1,free=121626856,total=531890176
   [junit4]   2> NOTE: All tests run in this JVM: [HdfsChaosMonkeyNothingIsSafeTest, OverseerTest, TimeRoutedAliasUpdateProcessorTest, TestCloudPivotFacet, TestSystemCollAutoCreate, TestPartialUpdateDeduplication, DistributedFacetPivotLongTailTest, SolrGraphiteReporterTest, TestCloudSchemaless, TestConfigsApi, DistributedSuggestComponentTest, AddBlockUpdateTest, TestFieldCacheReopen, DistanceFunctionTest, TestCSVResponseWriter, UUIDFieldTest, TestHdfsCloudBackupRestore, LoggingHandlerTest, TestSha256AuthenticationProvider, TestQuerySenderListener, TestPolicyCloud, BasicDistributedZk2Test, CollectionReloadTest, SpatialRPTFieldTypeTest, ReturnFieldsTest, TestReload, TestSolrCloudWithSecureImpersonation, TestExactSharedStatsCache, VersionInfoTest, TestNumericTokenStream, TestXmlQParser, TestFiltering, CdcrReplicationDistributedZkTest, TestDocBasedVersionConstraints, TestRetrieveFieldsOptimizer, ComputePlanActionTest, MergeStrategyTest, DirectSolrSpellCheckerTest, ResponseHeaderTest, CachingDirectoryFactoryTest, SuggesterWFSTTest, TestSolr4Spatial2, BadComponentTest, TestDynamicFieldResource, TestIndexSearcher, TestOverriddenPrefixQueryForCustomFieldType, CoreAdminHandlerTest, CollectionsAPIAsyncDistributedZkTest, TestMissingGroups, TestSQLHandlerNonCloud, TestConfigSetsAPIZkFailure, ReplicaListTransformerTest, TestImplicitCoreProperties, TestMiniSolrCloudClusterSSL, UnloadDistributedZkTest, TestNumericTerms32, ClusterStateTest, ConnectionReuseTest, TestStandardQParsers, HdfsRestartWhileUpdatingTest, TestLeaderInitiatedRecoveryThread, DataDrivenBlockJoinTest, WordBreakSolrSpellCheckerTest, TestDistributedMissingSort, SimplePostToolTest, TestSchemaResource, TestTolerantUpdateProcessorRandomCloud, TestUnifiedSolrHighlighter, TestGroupingSearch, TestLMJelinekMercerSimilarityFactory, TestManagedResource, TestZkChroot, TestCharFilters, ClassificationUpdateProcessorTest, TestManagedSchema, TriLevelCompositeIdRoutingTest, MigrateRouteKeyTest, GraphQueryTest, SpellPossibilityIteratorTest, TestRandomRequestDistribution, DirectoryFactoryTest, ScriptEngineTest, AsyncCallRequestStatusResponseTest, AnalyticsQueryTest, LeaderElectionContextKeyTest, MoveReplicaHDFSTest, ExplicitHLLTest, DeleteStatusTest, TestPushWriter, TestTrie, OverseerStatusTest, TestDistributedGrouping, TestLMDirichletSimilarityFactory, SuggestComponentContextFilterQueryTest, TestAnalyzeInfixSuggestions, TestDistribStateManager, TestSolrCoreProperties, TestElisionMultitermQuery, BlockDirectoryTest, TestExtendedDismaxParser, DefaultValueUpdateProcessorTest, TestSkipOverseerOperations, TestComplexPhraseQParserPlugin, TestTestInjection, AutoAddReplicasIntegrationTest, TestSerializedLuceneMatchVersion, DistanceUnitsTest, UniqFieldsUpdateProcessorFactoryTest, ZkStateWriterTest, BaseCdcrDistributedZkTest, TestExpandComponent, TestJsonFacetRefinement, AutoscalingHistoryHandlerTest, TestStressLiveNodes, TestFuzzyAnalyzedSuggestions, HLLUtilTest, TimeZoneUtilsTest, TestScoreJoinQPNoScore, EchoParamsTest, DistributedExpandComponentTest, TestGeoJSONResponseWriter, HdfsLockFactoryTest, TestPointFields, RecoveryAfterSoftCommitTest, BasicAuthIntegrationTest, FullSolrCloudDistribCmdsTest, ClusterStateUpdateTest, LeaderElectionTest, TestRandomDVFaceting, ShardRoutingCustomTest, TestFaceting, DistributedSpellCheckComponentTest, TermVectorComponentDistributedTest, TestJoin, TestCoreContainer, SimpleFacetsTest, SolrCoreTest, SolrCmdDistributorTest, QueryElevationComponentTest, BadIndexSchemaTest, ConvertedLegacyTest, TestLazyCores, TestCoreDiscovery, DocValuesTest, SortByFunctionTest, TestSolrDeletionPolicy1, DebugComponentTest, IndexBasedSpellCheckerTest, DisMaxRequestHandlerTest, TestWriterPerf, TestQueryTypes, FileBasedSpellCheckerTest, XmlUpdateRequestHandlerTest, DocumentBuilderTest, TermVectorComponentTest, RequiredFieldsTest, TestSolrQueryParser, FastVectorHighlighterTest, TestJmxIntegration, JsonLoaderTest, TestPHPSerializedResponseWriter, CSVRequestHandlerTest, TestComponentsName, SearchHandlerTest, AlternateDirectoryTest, TestQuerySenderNoQuery, CopyFieldTest, ResponseLogComponentTest, SolrIndexConfigTest, TestStressRecovery, TestSolrDeletionPolicy2, SampleTest, TestBinaryField, TestSearchPerf, NumericFieldsTest, MinimalSchemaTest, TestConfig, ExternalFileFieldSortTest, DirectSolrConnectionTest, NotRequiredUniqueKeyTest, TestLuceneMatchVersion, TestPhraseSuggestions, TestCodecSupport, SynonymTokenizerTest, TestIBSimilarityFactory, OpenExchangeRatesOrgProviderTest, PluginInfoTest, DateMathParserTest, ChaosMonkeyNothingIsSafeTest, AssignTest, CleanupOldIndexTest, CloudExitableDirectoryReaderTest, CollectionStateFormat2Test, CollectionsAPISolrJTest, DeleteShardTest, DistributedQueueTest, LeaderFailoverAfterPartitionTest, LeaderInitiatedRecoveryOnCommitTest, MissingSegmentRecoveryTest, MoveReplicaTest, NodeMutatorTest, OverriddenZkACLAndCredentialsProvidersTest, ReplaceNodeTest, ReplicationFactorTest, SSLMigrationTest, SharedFSAutoReplicaFailoverTest, SimpleCollectionCreateDeleteTest, TestCloudDeleteByQuery, TestCloudJSONFacetJoinDomain, TestConfigSetsAPI, TestPullReplicaErrorHandling, TestSegmentSorting, VMParamsZkACLAndCredentialsProvidersTest, HdfsAutoAddReplicasIntegrationTest, HdfsBasicDistributedZk2Test, HdfsChaosMonkeySafeLeaderTest, HdfsNNFailoverTest, HdfsSyncSliceTest, HdfsThreadLeakTest, TestClusterStateMutator, ImplicitSnitchTest, RuleEngineTest, RulesTest, QueryResultKeyTest, TestConfigSetImmutable, TestCorePropertiesReload, TestDynamicLoading, TestReplicationHandlerBackup, V2StandaloneTest, CoreAdminCreateDiscoverTest, CoreAdminRequestStatusTest, CoreMergeIndexesAdminHandlerTest, InfoHandlerTest, PropertiesRequestHandlerTest, SecurityConfHandlerTest, StatsReloadRaceTest, TestSlowCompositeReaderWrapper, UninvertDocValuesMergePolicyTest, WrapperMergePolicyFactoryTest, CheckHdfsIndexTest, TestMacroExpander, TestMacros, JSONWriterTest, TestBinaryResponseWriter, TestExportWriter, TestRawResponseWriter, TestSolrQueryResponse, TestChildDocTransformer, TestSubQueryTransformer, TestSubQueryTransformerCrossCore, TestSubQueryTransformerDistrib, TestDynamicFieldCollectionResource, TestFieldTypeCollectionResource, TestFieldTypeResource, TestUniqueKeyFieldResource, TestManagedStopFilterFactory, TestManagedSynonymGraphFilterFactory, DateRangeFieldTest, DocValuesMissingTest, TestBulkSchemaConcurrent, SortSpecParsingTest, TestAddFieldRealTimeGet, TestCollapseQParserPlugin, TestComplexPhraseLeadingWildcard, TestFilteredDocIdSet, TestInitQParser, TestQueryWrapperFilter, TestReRankQParserPlugin, TestReloadDeadlock, TestSearcherReuse, TestSimpleQParserPlugin, TestSolrCoreParser, TestXmlQParserPlugin, DistributedFacetSimpleRefinementLongTailTest, TestJsonFacets, TestMinMaxOnMultiValuedField, TestOrdValues, BlockJoinFacetDistribTest, TestDFISimilarityFactory, TestNonDefinedSimilarityFactory, TestLRUStatsCache, TestAuthorizationFramework, TestImpersonationWithHadoopAuth, TestDocTermOrds, TestFieldCache, TestFieldCacheSort, TestFieldCacheVsDocValues]
   [junit4]   2> NOTE: reproduce with: ant test  -Dtestcase=TestFieldCacheVsDocValues -Dtests.seed=70A943F10BDA666F -Dtests.multiplier=3 -Dtests.slow=true -Dtests.locale=es-CO -Dtests.timezone=Africa/Sao_Tome -Dtests.asserts=true -Dtests.file.encoding=ISO-8859-1
   [junit4] ERROR   0.00s J2 | TestFieldCacheVsDocValues (suite) <<<
   [junit4]    > Throwable #1: java.lang.AssertionError: The test or suite printed 13392 bytes to stdout and stderr, even though the limit was set to 8192 bytes. Increase the limit with @Limit, ignore it completely with @SuppressSysoutChecks or run with -Dtests.verbose=true
   [junit4]    > 	at __randomizedtesting.SeedInfo.seed([70A943F10BDA666F]:0)
   [junit4]    > 	at java.lang.Thread.run(Thread.java:748)
   [junit4] Completed [743/763 (3!)] on J2 in 7.53s, 10 tests, 1 failure, 1 skipped <<< FAILURES!

[...truncated 43948 lines...]

Mime
View raw message