lucene-dev mailing list archives

Site index · List index
Message view « Date » · « Thread »
Top « Date » · « Thread »
From Policeman Jenkins Server <jenk...@thetaphi.de>
Subject [JENKINS] Lucene-Solr-7.x-Windows (32bit/jdk1.8.0_144) - Build # 332 - Failure!
Date Thu, 07 Dec 2017 19:54:18 GMT
Build: https://jenkins.thetaphi.de/job/Lucene-Solr-7.x-Windows/332/
Java: 32bit/jdk1.8.0_144 -server -XX:+UseParallelGC

4 tests failed.
FAILED:  junit.framework.TestSuite.org.apache.lucene.index.TestBackwardsCompatibility

Error Message:
Could not remove the following files (in the order of attempts):    C:\Users\jenkins\workspace\Lucene-Solr-7.x-Windows\lucene\build\backward-codecs\test\J1\temp\lucene.index.TestBackwardsCompatibility_1723217F3C4726D4-001\6.2.0-cfs-002: java.nio.file.DirectoryNotEmptyException: C:\Users\jenkins\workspace\Lucene-Solr-7.x-Windows\lucene\build\backward-codecs\test\J1\temp\lucene.index.TestBackwardsCompatibility_1723217F3C4726D4-001\6.2.0-cfs-002 

Stack Trace:
java.io.IOException: Could not remove the following files (in the order of attempts):
   C:\Users\jenkins\workspace\Lucene-Solr-7.x-Windows\lucene\build\backward-codecs\test\J1\temp\lucene.index.TestBackwardsCompatibility_1723217F3C4726D4-001\6.2.0-cfs-002: java.nio.file.DirectoryNotEmptyException: C:\Users\jenkins\workspace\Lucene-Solr-7.x-Windows\lucene\build\backward-codecs\test\J1\temp\lucene.index.TestBackwardsCompatibility_1723217F3C4726D4-001\6.2.0-cfs-002

	at __randomizedtesting.SeedInfo.seed([1723217F3C4726D4]:0)
	at org.apache.lucene.util.IOUtils.rm(IOUtils.java:329)
	at org.apache.lucene.util.TestRuleTemporaryFilesCleanup.afterAlways(TestRuleTemporaryFilesCleanup.java:216)
	at com.carrotsearch.randomizedtesting.rules.TestRuleAdapter$1.afterAlways(TestRuleAdapter.java:31)
	at com.carrotsearch.randomizedtesting.rules.StatementAdapter.evaluate(StatementAdapter.java:43)
	at com.carrotsearch.randomizedtesting.rules.StatementAdapter.evaluate(StatementAdapter.java:36)
	at org.apache.lucene.util.TestRuleAssertionsRequired$1.evaluate(TestRuleAssertionsRequired.java:53)
	at org.apache.lucene.util.TestRuleMarkFailure$1.evaluate(TestRuleMarkFailure.java:47)
	at org.apache.lucene.util.TestRuleIgnoreAfterMaxFailures$1.evaluate(TestRuleIgnoreAfterMaxFailures.java:64)
	at org.apache.lucene.util.TestRuleIgnoreTestSuites$1.evaluate(TestRuleIgnoreTestSuites.java:54)
	at com.carrotsearch.randomizedtesting.rules.StatementAdapter.evaluate(StatementAdapter.java:36)
	at com.carrotsearch.randomizedtesting.ThreadLeakControl$StatementRunner.run(ThreadLeakControl.java:368)
	at java.lang.Thread.run(Thread.java:748)


FAILED:  junit.framework.TestSuite.org.apache.lucene.search.TestBoolean2

Error Message:
Could not remove the following files (in the order of attempts):    C:\Users\jenkins\workspace\Lucene-Solr-7.x-Windows\lucene\build\core\test\J0\temp\lucene.search.TestBoolean2_6F0B8F30FC7DF6A0-001\tempDir-004: java.nio.file.DirectoryNotEmptyException: C:\Users\jenkins\workspace\Lucene-Solr-7.x-Windows\lucene\build\core\test\J0\temp\lucene.search.TestBoolean2_6F0B8F30FC7DF6A0-001\tempDir-004 

Stack Trace:
java.io.IOException: Could not remove the following files (in the order of attempts):
   C:\Users\jenkins\workspace\Lucene-Solr-7.x-Windows\lucene\build\core\test\J0\temp\lucene.search.TestBoolean2_6F0B8F30FC7DF6A0-001\tempDir-004: java.nio.file.DirectoryNotEmptyException: C:\Users\jenkins\workspace\Lucene-Solr-7.x-Windows\lucene\build\core\test\J0\temp\lucene.search.TestBoolean2_6F0B8F30FC7DF6A0-001\tempDir-004

	at __randomizedtesting.SeedInfo.seed([6F0B8F30FC7DF6A0]:0)
	at org.apache.lucene.util.IOUtils.rm(IOUtils.java:329)
	at org.apache.lucene.util.TestRuleTemporaryFilesCleanup.afterAlways(TestRuleTemporaryFilesCleanup.java:216)
	at com.carrotsearch.randomizedtesting.rules.TestRuleAdapter$1.afterAlways(TestRuleAdapter.java:31)
	at com.carrotsearch.randomizedtesting.rules.StatementAdapter.evaluate(StatementAdapter.java:43)
	at com.carrotsearch.randomizedtesting.rules.StatementAdapter.evaluate(StatementAdapter.java:36)
	at org.apache.lucene.util.TestRuleAssertionsRequired$1.evaluate(TestRuleAssertionsRequired.java:53)
	at org.apache.lucene.util.TestRuleMarkFailure$1.evaluate(TestRuleMarkFailure.java:47)
	at org.apache.lucene.util.TestRuleIgnoreAfterMaxFailures$1.evaluate(TestRuleIgnoreAfterMaxFailures.java:64)
	at org.apache.lucene.util.TestRuleIgnoreTestSuites$1.evaluate(TestRuleIgnoreTestSuites.java:54)
	at com.carrotsearch.randomizedtesting.rules.StatementAdapter.evaluate(StatementAdapter.java:36)
	at com.carrotsearch.randomizedtesting.ThreadLeakControl$StatementRunner.run(ThreadLeakControl.java:368)
	at java.lang.Thread.run(Thread.java:748)


FAILED:  junit.framework.TestSuite.org.apache.solr.TestDistributedMissingSort

Error Message:
Could not remove the following files (in the order of attempts):    C:\Users\jenkins\workspace\Lucene-Solr-7.x-Windows\solr\build\solr-core\test\J1\temp\solr.TestDistributedMissingSort_162E5A1B42F6CFAC-001\tempDir-001\shard0\cores\collection1\data\spellchecker3: java.nio.file.DirectoryNotEmptyException: C:\Users\jenkins\workspace\Lucene-Solr-7.x-Windows\solr\build\solr-core\test\J1\temp\solr.TestDistributedMissingSort_162E5A1B42F6CFAC-001\tempDir-001\shard0\cores\collection1\data\spellchecker3    C:\Users\jenkins\workspace\Lucene-Solr-7.x-Windows\solr\build\solr-core\test\J1\temp\solr.TestDistributedMissingSort_162E5A1B42F6CFAC-001\tempDir-001\shard0\cores\collection1\data: java.nio.file.DirectoryNotEmptyException: C:\Users\jenkins\workspace\Lucene-Solr-7.x-Windows\solr\build\solr-core\test\J1\temp\solr.TestDistributedMissingSort_162E5A1B42F6CFAC-001\tempDir-001\shard0\cores\collection1\data    C:\Users\jenkins\workspace\Lucene-Solr-7.x-Windows\solr\build\solr-core\test\J1\temp\solr.TestDistributedMissingSort_162E5A1B42F6CFAC-001\tempDir-001\shard0\cores\collection1: java.nio.file.DirectoryNotEmptyException: C:\Users\jenkins\workspace\Lucene-Solr-7.x-Windows\solr\build\solr-core\test\J1\temp\solr.TestDistributedMissingSort_162E5A1B42F6CFAC-001\tempDir-001\shard0\cores\collection1    C:\Users\jenkins\workspace\Lucene-Solr-7.x-Windows\solr\build\solr-core\test\J1\temp\solr.TestDistributedMissingSort_162E5A1B42F6CFAC-001\tempDir-001\shard0\cores: java.nio.file.DirectoryNotEmptyException: C:\Users\jenkins\workspace\Lucene-Solr-7.x-Windows\solr\build\solr-core\test\J1\temp\solr.TestDistributedMissingSort_162E5A1B42F6CFAC-001\tempDir-001\shard0\cores    C:\Users\jenkins\workspace\Lucene-Solr-7.x-Windows\solr\build\solr-core\test\J1\temp\solr.TestDistributedMissingSort_162E5A1B42F6CFAC-001\tempDir-001\shard0: java.nio.file.DirectoryNotEmptyException: C:\Users\jenkins\workspace\Lucene-Solr-7.x-Windows\solr\build\solr-core\test\J1\temp\solr.TestDistributedMissingSort_162E5A1B42F6CFAC-001\tempDir-001\shard0    C:\Users\jenkins\workspace\Lucene-Solr-7.x-Windows\solr\build\solr-core\test\J1\temp\solr.TestDistributedMissingSort_162E5A1B42F6CFAC-001\tempDir-001: java.nio.file.DirectoryNotEmptyException: C:\Users\jenkins\workspace\Lucene-Solr-7.x-Windows\solr\build\solr-core\test\J1\temp\solr.TestDistributedMissingSort_162E5A1B42F6CFAC-001\tempDir-001 

Stack Trace:
java.io.IOException: Could not remove the following files (in the order of attempts):
   C:\Users\jenkins\workspace\Lucene-Solr-7.x-Windows\solr\build\solr-core\test\J1\temp\solr.TestDistributedMissingSort_162E5A1B42F6CFAC-001\tempDir-001\shard0\cores\collection1\data\spellchecker3: java.nio.file.DirectoryNotEmptyException: C:\Users\jenkins\workspace\Lucene-Solr-7.x-Windows\solr\build\solr-core\test\J1\temp\solr.TestDistributedMissingSort_162E5A1B42F6CFAC-001\tempDir-001\shard0\cores\collection1\data\spellchecker3
   C:\Users\jenkins\workspace\Lucene-Solr-7.x-Windows\solr\build\solr-core\test\J1\temp\solr.TestDistributedMissingSort_162E5A1B42F6CFAC-001\tempDir-001\shard0\cores\collection1\data: java.nio.file.DirectoryNotEmptyException: C:\Users\jenkins\workspace\Lucene-Solr-7.x-Windows\solr\build\solr-core\test\J1\temp\solr.TestDistributedMissingSort_162E5A1B42F6CFAC-001\tempDir-001\shard0\cores\collection1\data
   C:\Users\jenkins\workspace\Lucene-Solr-7.x-Windows\solr\build\solr-core\test\J1\temp\solr.TestDistributedMissingSort_162E5A1B42F6CFAC-001\tempDir-001\shard0\cores\collection1: java.nio.file.DirectoryNotEmptyException: C:\Users\jenkins\workspace\Lucene-Solr-7.x-Windows\solr\build\solr-core\test\J1\temp\solr.TestDistributedMissingSort_162E5A1B42F6CFAC-001\tempDir-001\shard0\cores\collection1
   C:\Users\jenkins\workspace\Lucene-Solr-7.x-Windows\solr\build\solr-core\test\J1\temp\solr.TestDistributedMissingSort_162E5A1B42F6CFAC-001\tempDir-001\shard0\cores: java.nio.file.DirectoryNotEmptyException: C:\Users\jenkins\workspace\Lucene-Solr-7.x-Windows\solr\build\solr-core\test\J1\temp\solr.TestDistributedMissingSort_162E5A1B42F6CFAC-001\tempDir-001\shard0\cores
   C:\Users\jenkins\workspace\Lucene-Solr-7.x-Windows\solr\build\solr-core\test\J1\temp\solr.TestDistributedMissingSort_162E5A1B42F6CFAC-001\tempDir-001\shard0: java.nio.file.DirectoryNotEmptyException: C:\Users\jenkins\workspace\Lucene-Solr-7.x-Windows\solr\build\solr-core\test\J1\temp\solr.TestDistributedMissingSort_162E5A1B42F6CFAC-001\tempDir-001\shard0
   C:\Users\jenkins\workspace\Lucene-Solr-7.x-Windows\solr\build\solr-core\test\J1\temp\solr.TestDistributedMissingSort_162E5A1B42F6CFAC-001\tempDir-001: java.nio.file.DirectoryNotEmptyException: C:\Users\jenkins\workspace\Lucene-Solr-7.x-Windows\solr\build\solr-core\test\J1\temp\solr.TestDistributedMissingSort_162E5A1B42F6CFAC-001\tempDir-001

	at __randomizedtesting.SeedInfo.seed([162E5A1B42F6CFAC]:0)
	at org.apache.lucene.util.IOUtils.rm(IOUtils.java:329)
	at org.apache.lucene.util.TestRuleTemporaryFilesCleanup.afterAlways(TestRuleTemporaryFilesCleanup.java:216)
	at com.carrotsearch.randomizedtesting.rules.TestRuleAdapter$1.afterAlways(TestRuleAdapter.java:31)
	at com.carrotsearch.randomizedtesting.rules.StatementAdapter.evaluate(StatementAdapter.java:43)
	at com.carrotsearch.randomizedtesting.rules.StatementAdapter.evaluate(StatementAdapter.java:36)
	at org.apache.lucene.util.TestRuleAssertionsRequired$1.evaluate(TestRuleAssertionsRequired.java:53)
	at org.apache.lucene.util.TestRuleMarkFailure$1.evaluate(TestRuleMarkFailure.java:47)
	at org.apache.lucene.util.TestRuleIgnoreAfterMaxFailures$1.evaluate(TestRuleIgnoreAfterMaxFailures.java:64)
	at org.apache.lucene.util.TestRuleIgnoreTestSuites$1.evaluate(TestRuleIgnoreTestSuites.java:54)
	at com.carrotsearch.randomizedtesting.rules.StatementAdapter.evaluate(StatementAdapter.java:36)
	at com.carrotsearch.randomizedtesting.ThreadLeakControl$StatementRunner.run(ThreadLeakControl.java:368)
	at java.lang.Thread.run(Thread.java:748)


FAILED:  junit.framework.TestSuite.org.apache.solr.update.SolrCmdDistributorTest

Error Message:
Could not remove the following files (in the order of attempts):    C:\Users\jenkins\workspace\Lucene-Solr-7.x-Windows\solr\build\solr-core\test\J0\temp\solr.update.SolrCmdDistributorTest_162E5A1B42F6CFAC-001\tempDir-001\shard1\collection1: java.nio.file.DirectoryNotEmptyException: C:\Users\jenkins\workspace\Lucene-Solr-7.x-Windows\solr\build\solr-core\test\J0\temp\solr.update.SolrCmdDistributorTest_162E5A1B42F6CFAC-001\tempDir-001\shard1\collection1    C:\Users\jenkins\workspace\Lucene-Solr-7.x-Windows\solr\build\solr-core\test\J0\temp\solr.update.SolrCmdDistributorTest_162E5A1B42F6CFAC-001\tempDir-001\shard1: java.nio.file.DirectoryNotEmptyException: C:\Users\jenkins\workspace\Lucene-Solr-7.x-Windows\solr\build\solr-core\test\J0\temp\solr.update.SolrCmdDistributorTest_162E5A1B42F6CFAC-001\tempDir-001\shard1    C:\Users\jenkins\workspace\Lucene-Solr-7.x-Windows\solr\build\solr-core\test\J0\temp\solr.update.SolrCmdDistributorTest_162E5A1B42F6CFAC-001\tempDir-001: java.nio.file.DirectoryNotEmptyException: C:\Users\jenkins\workspace\Lucene-Solr-7.x-Windows\solr\build\solr-core\test\J0\temp\solr.update.SolrCmdDistributorTest_162E5A1B42F6CFAC-001\tempDir-001 

Stack Trace:
java.io.IOException: Could not remove the following files (in the order of attempts):
   C:\Users\jenkins\workspace\Lucene-Solr-7.x-Windows\solr\build\solr-core\test\J0\temp\solr.update.SolrCmdDistributorTest_162E5A1B42F6CFAC-001\tempDir-001\shard1\collection1: java.nio.file.DirectoryNotEmptyException: C:\Users\jenkins\workspace\Lucene-Solr-7.x-Windows\solr\build\solr-core\test\J0\temp\solr.update.SolrCmdDistributorTest_162E5A1B42F6CFAC-001\tempDir-001\shard1\collection1
   C:\Users\jenkins\workspace\Lucene-Solr-7.x-Windows\solr\build\solr-core\test\J0\temp\solr.update.SolrCmdDistributorTest_162E5A1B42F6CFAC-001\tempDir-001\shard1: java.nio.file.DirectoryNotEmptyException: C:\Users\jenkins\workspace\Lucene-Solr-7.x-Windows\solr\build\solr-core\test\J0\temp\solr.update.SolrCmdDistributorTest_162E5A1B42F6CFAC-001\tempDir-001\shard1
   C:\Users\jenkins\workspace\Lucene-Solr-7.x-Windows\solr\build\solr-core\test\J0\temp\solr.update.SolrCmdDistributorTest_162E5A1B42F6CFAC-001\tempDir-001: java.nio.file.DirectoryNotEmptyException: C:\Users\jenkins\workspace\Lucene-Solr-7.x-Windows\solr\build\solr-core\test\J0\temp\solr.update.SolrCmdDistributorTest_162E5A1B42F6CFAC-001\tempDir-001

	at __randomizedtesting.SeedInfo.seed([162E5A1B42F6CFAC]:0)
	at org.apache.lucene.util.IOUtils.rm(IOUtils.java:329)
	at org.apache.lucene.util.TestRuleTemporaryFilesCleanup.afterAlways(TestRuleTemporaryFilesCleanup.java:216)
	at com.carrotsearch.randomizedtesting.rules.TestRuleAdapter$1.afterAlways(TestRuleAdapter.java:31)
	at com.carrotsearch.randomizedtesting.rules.StatementAdapter.evaluate(StatementAdapter.java:43)
	at com.carrotsearch.randomizedtesting.rules.StatementAdapter.evaluate(StatementAdapter.java:36)
	at org.apache.lucene.util.TestRuleAssertionsRequired$1.evaluate(TestRuleAssertionsRequired.java:53)
	at org.apache.lucene.util.TestRuleMarkFailure$1.evaluate(TestRuleMarkFailure.java:47)
	at org.apache.lucene.util.TestRuleIgnoreAfterMaxFailures$1.evaluate(TestRuleIgnoreAfterMaxFailures.java:64)
	at org.apache.lucene.util.TestRuleIgnoreTestSuites$1.evaluate(TestRuleIgnoreTestSuites.java:54)
	at com.carrotsearch.randomizedtesting.rules.StatementAdapter.evaluate(StatementAdapter.java:36)
	at com.carrotsearch.randomizedtesting.ThreadLeakControl$StatementRunner.run(ThreadLeakControl.java:368)
	at java.lang.Thread.run(Thread.java:748)




Build Log:
[...truncated 911 lines...]
   [junit4] Suite: org.apache.lucene.search.TestBoolean2
   [junit4]   2> NOTE: test params are: codec=Asserting(Lucene70): {}, docValues:{}, maxPointsInLeafNode=1144, maxMBSortInHeap=5.786453604294183, sim=RandomSimilarity(queryNorm=true): {field=DFR I(F)BZ(0.3)}, locale=ru-RU, timezone=Europe/Berlin
   [junit4]   2> NOTE: Windows 10 10.0 x86/Oracle Corporation 1.8.0_144 (32-bit)/cpus=3,threads=1,free=109150824,total=384827392
   [junit4]   2> NOTE: All tests run in this JVM: [TestVirtualMethod, TestFixedBitDocIdSet, TestLevenshteinAutomata, TestTopDocsMerge, TestToken, TestSegmentTermEnum, TestDirectoryReader, TestSpanExplanations, TestIndexManyDocuments, TestIndexSorting, TestMultiset, TestLucene50TermVectorsFormat, TestMixedDocValuesUpdates, TestBooleanQueryVisitSubscorers, TestGeoEncodingUtils, TestDirectPacked, TestCodecHoldsOpenFiles, TestIndexWriterOnVMError, TestPolygon, TestSpanOrQuery, TestSameTokenSamePosition, TestThreadedForceMerge, TestRecyclingIntBlockAllocator, TestExceedMaxTermLength, TestTermScorer, TestFilterWeight, TestOneMergeWrappingMergePolicy, TestDeterminizeLexicon, TestSparseFixedBitDocIdSet, TestDocument, TestForceMergeForever, TestOfflineSorter, TestTopFieldCollectorEarlyTermination, TestAssertions, TestDocCount, TestDocInverterPerFieldErrorInfo, TestTimeLimitingCollector, TestDemoParallelLeafReader, TestParallelLeafReader, TestCodecUtil, TestIntRangeFieldQueries, TestTerm, TestSort, TestFilterCodecReader, TestLucene50StoredFieldsFormat, TestFilterDirectory, TestIndexWriter, TestIndexableField, TestHugeRamFile, TestParallelReaderEmptyIndex, TestNoMergePolicy, TestReusableStringReader, TestMathUtil, TestSynonymQuery, Test2BSortedDocValuesOrds, MultiCollectorTest, TestEarlyTermination, Test2BPositions, TestCloseableThreadLocal, TestSearchWithThreads, TestMultiThreadTermVectors, TestRamUsageEstimator, TestHighCompressionMode, TestPositionIncrement, TestPayloadsOnVectors, TestExternalCodecs, TestSpans, TestMixedCodecs, TestCharacterUtils, TestDoc, TestSpanSearchEquivalence, TestLockFactory, TestScorerPerf, TestRecyclingByteBlockAllocator, TestNotDocIdSet, TestIOUtils, TestBKD, TestNewestSegment, TestSortRescorer, TestBinaryDocument, TestInfoStream, TestAtomicUpdate, TestMultiMMap, TestFlushByRamOrCountsPolicy, TestSloppyPhraseQuery, TestWildcardRandom, TestIndexWriterExceptions, TestDocValuesRewriteMethod, FuzzyTermOnShortTermsTest, TestMatchNoDocsQuery, TestBinaryDocValuesUpdates, TestSameScoresWithThreads, TestMultiCollector, TestWordlistLoader, TestApproximationSearchEquivalence, TestAllFilesHaveCodecHeader, TestNormsFieldExistsQuery, TestDateSort, TestMinimize, FiniteStringsIteratorTest, TestCrash, TestTimSorter, TestSearchForDuplicates, TestIndexOrDocValuesQuery, TestSpansEnum, TestPrefixQuery, TestCharFilter, TestIndexWriterUnicode, TestUnicodeUtil, TestSimilarity2, TestIndexWriterMergePolicy, TestFieldsReader, TestLucene70SegmentInfoFormat, TestCharArrayMap, TestPerFieldDocValuesFormat, TestIndexWriterMerging, TestFSTs, TestIndexWriterWithThreads, TestGraphTokenizers, TestAddIndexes, TestBooleanOr, TestDuelingCodecs, TestBoolean2]
   [junit4]   2> NOTE: reproduce with: ant test  -Dtestcase=TestBoolean2 -Dtests.seed=6F0B8F30FC7DF6A0 -Dtests.slow=true -Dtests.locale=ru-RU -Dtests.timezone=Europe/Berlin -Dtests.asserts=true -Dtests.file.encoding=Cp1252
   [junit4] ERROR   0.00s J0 | TestBoolean2 (suite) <<<
   [junit4]    > Throwable #1: java.io.IOException: Could not remove the following files (in the order of attempts):
   [junit4]    >    C:\Users\jenkins\workspace\Lucene-Solr-7.x-Windows\lucene\build\core\test\J0\temp\lucene.search.TestBoolean2_6F0B8F30FC7DF6A0-001\tempDir-004: java.nio.file.DirectoryNotEmptyException: C:\Users\jenkins\workspace\Lucene-Solr-7.x-Windows\lucene\build\core\test\J0\temp\lucene.search.TestBoolean2_6F0B8F30FC7DF6A0-001\tempDir-004
   [junit4]    > 	at __randomizedtesting.SeedInfo.seed([6F0B8F30FC7DF6A0]:0)
   [junit4]    > 	at org.apache.lucene.util.IOUtils.rm(IOUtils.java:329)
   [junit4]    > 	at java.lang.Thread.run(Thread.java:748)
   [junit4] Completed [207/458 (1!)] on J0 in 16.44s, 10 tests, 1 error <<< FAILURES!

[...truncated 3686 lines...]
   [junit4] Suite: org.apache.lucene.index.TestBackwardsCompatibility
   [junit4] IGNOR/A 0.00s J1 | TestBackwardsCompatibility.testCreateNoCFS
   [junit4]    > Assumption #1: backcompat creation tests must be run with -Dtests.bwcdir=/path/to/write/indexes
   [junit4] IGNOR/A 0.00s J1 | TestBackwardsCompatibility.testCreateSingleSegmentNoCFS
   [junit4]    > Assumption #1: backcompat creation tests must be run with -Dtests.bwcdir=/path/to/write/indexes
   [junit4] IGNOR/A 0.00s J1 | TestBackwardsCompatibility.testCreateCFS
   [junit4]    > Assumption #1: backcompat creation tests must be run with -Dtests.bwcdir=/path/to/write/indexes
   [junit4] IGNOR/A 0.00s J1 | TestBackwardsCompatibility.testCreateIndexWithDocValuesUpdates
   [junit4]    > Assumption #1: backcompat creation tests must be run with -Dtests.bwcdir=/path/to/write/indexes
   [junit4] IGNOR/A 0.00s J1 | TestBackwardsCompatibility.testCreateMoreTermsIndex
   [junit4]    > Assumption #1: backcompat creation tests must be run with -Dtests.bwcdir=/path/to/write/indexes
   [junit4] IGNOR/A 0.00s J1 | TestBackwardsCompatibility.testCreateSingleSegmentCFS
   [junit4]    > Assumption #1: backcompat creation tests must be run with -Dtests.bwcdir=/path/to/write/indexes
   [junit4] IGNOR/A 0.01s J1 | TestBackwardsCompatibility.testCreateSortedIndex
   [junit4]    > Assumption #1: backcompat creation tests must be run with -Dtests.bwcdir=/path/to/write/indexes
   [junit4] IGNOR/A 0.00s J1 | TestBackwardsCompatibility.testCreateEmptyIndex
   [junit4]    > Assumption #1: backcompat creation tests must be run with -Dtests.bwcdir=/path/to/write/indexes
   [junit4]   2> NOTE: test params are: codec=Asserting(Lucene70): {content6=PostingsFormat(name=Memory), content5=PostingsFormat(name=Memory), content4=TestBloomFilteredLucenePostings(BloomFilteringPostingsFormat(Lucene50(blocksize=128))), trieInt=PostingsFormat(name=Memory), content3=Lucene50(blocksize=128), content2=PostingsFormat(name=Memory), fie?ld=PostingsFormat(name=Memory), utf8=PostingsFormat(name=Memory), trieLong=PostingsFormat(name=Memory), id=TestBloomFilteredLucenePostings(BloomFilteringPostingsFormat(Lucene50(blocksize=128))), content=PostingsFormat(name=Memory), autf8=PostingsFormat(name=Memory)}, docValues:{utf8=DocValuesFormat(name=Direct), fie?ld=DocValuesFormat(name=Direct), dvShort=DocValuesFormat(name=Asserting), dvInt=DocValuesFormat(name=Direct), longPoint2d=DocValuesFormat(name=Lucene70), dvBytesSortedVar=DocValuesFormat(name=Direct), dvSortedSet=DocValuesFormat(name=Memory), content=DocValuesFormat(name=Direct), floatPoint1d=DocValuesFormat(name=Memory), intPoint1d=DocValuesFormat(name=Lucene70), doublePoint2d=DocValuesFormat(name=Direct), trieLong=DocValuesFormat(name=Asserting), dvBytesDerefVar=DocValuesFormat(name=Asserting), id=DocValuesFormat(name=Memory), binaryPoint2d=DocValuesFormat(name=Direct), dvSortedNumeric=DocValuesFormat(name=Lucene70), dvBytesDerefFixed=DocValuesFormat(name=Memory), autf8=DocValuesFormat(name=Asserting), dvBytesSortedFixed=DocValuesFormat(name=Asserting), trieInt=DocValuesFormat(name=Direct), dvBytesStraightVar=DocValuesFormat(name=Lucene70), dvBytesStraightFixed=DocValuesFormat(name=Direct), dvLong=DocValuesFormat(name=Lucene70), longPoint1d=DocValuesFormat(name=Memory), floatPoint2d=DocValuesFormat(name=Asserting), dvDouble=DocValuesFormat(name=Memory), dvFloat=DocValuesFormat(name=Asserting), content6=DocValuesFormat(name=Direct), content5=DocValuesFormat(name=Asserting), dvPacked=DocValuesFormat(name=Lucene70), intPoint2d=DocValuesFormat(name=Memory), content4=DocValuesFormat(name=Memory), content3=DocValuesFormat(name=Lucene70), content2=DocValuesFormat(name=Direct), doublePoint1d=DocValuesFormat(name=Lucene70), dvByte=DocValuesFormat(name=Lucene70), binaryPoint1d=DocValuesFormat(name=Asserting)}, maxPointsInLeafNode=521, maxMBSortInHeap=5.412596468968219, sim=RandomSimilarity(queryNorm=false): {content6=DFR I(n)LZ(0.3), content5=DFR I(n)Z(0.3), content2=DFR I(F)L3(800.0), utf8=DFR I(F)1, fie?ld=IB LL-D3(800.0), content=DFR I(n)BZ(0.3), autf8=DFR I(ne)LZ(0.3)}, locale=ko, timezone=MST7MDT
   [junit4]   2> NOTE: Windows 10 10.0 x86/Oracle Corporation 1.8.0_144 (32-bit)/cpus=3,threads=1,free=71792088,total=111673344
   [junit4]   2> NOTE: All tests run in this JVM: [TestLucene53NormsFormat, TestIndexWriterOnOldIndex, TestBackwardsCompatibility]
   [junit4]   2> NOTE: reproduce with: ant test  -Dtestcase=TestBackwardsCompatibility -Dtests.seed=1723217F3C4726D4 -Dtests.slow=true -Dtests.locale=ko -Dtests.timezone=MST7MDT -Dtests.asserts=true -Dtests.file.encoding=Cp1252
   [junit4] ERROR   0.00s J1 | TestBackwardsCompatibility (suite) <<<
   [junit4]    > Throwable #1: java.io.IOException: Could not remove the following files (in the order of attempts):
   [junit4]    >    C:\Users\jenkins\workspace\Lucene-Solr-7.x-Windows\lucene\build\backward-codecs\test\J1\temp\lucene.index.TestBackwardsCompatibility_1723217F3C4726D4-001\6.2.0-cfs-002: java.nio.file.DirectoryNotEmptyException: C:\Users\jenkins\workspace\Lucene-Solr-7.x-Windows\lucene\build\backward-codecs\test\J1\temp\lucene.index.TestBackwardsCompatibility_1723217F3C4726D4-001\6.2.0-cfs-002
   [junit4]    > 	at __randomizedtesting.SeedInfo.seed([1723217F3C4726D4]:0)
   [junit4]    > 	at org.apache.lucene.util.IOUtils.rm(IOUtils.java:329)
   [junit4]    > 	at java.lang.Thread.run(Thread.java:748)
   [junit4] Completed [5/8 (1!)] on J1 in 29.27s, 30 tests, 1 error, 8 skipped <<< FAILURES!

[...truncated 8075 lines...]
   [junit4] Suite: org.apache.solr.TestDistributedMissingSort
   [junit4]   2> 1508707 INFO  (SUITE-TestDistributedMissingSort-seed#[162E5A1B42F6CFAC]-worker) [    ] o.a.s.SolrTestCaseJ4 SecureRandom sanity checks: test.solr.allowed.securerandom=null & java.security.egd=file:/dev/./urandom
   [junit4]   2> Creating dataDir: C:\Users\jenkins\workspace\Lucene-Solr-7.x-Windows\solr\build\solr-core\test\J1\temp\solr.TestDistributedMissingSort_162E5A1B42F6CFAC-001\init-core-data-001
   [junit4]   2> 1508709 WARN  (SUITE-TestDistributedMissingSort-seed#[162E5A1B42F6CFAC]-worker) [    ] o.a.s.SolrTestCaseJ4 startTrackingSearchers: numOpens=7 numCloses=7
   [junit4]   2> 1508709 INFO  (SUITE-TestDistributedMissingSort-seed#[162E5A1B42F6CFAC]-worker) [    ] o.a.s.SolrTestCaseJ4 Using PointFields (NUMERIC_POINTS_SYSPROP=true) w/NUMERIC_DOCVALUES_SYSPROP=false
   [junit4]   2> 1508714 INFO  (SUITE-TestDistributedMissingSort-seed#[162E5A1B42F6CFAC]-worker) [    ] o.a.s.SolrTestCaseJ4 Randomized ssl (false) and clientAuth (false) via: @org.apache.solr.util.RandomizeSSL(reason=, value=NaN, ssl=NaN, clientAuth=NaN)
   [junit4]   2> 1508714 INFO  (SUITE-TestDistributedMissingSort-seed#[162E5A1B42F6CFAC]-worker) [    ] o.a.s.BaseDistributedSearchTestCase Setting hostContext system property: /ywh/zv
   [junit4]   2> 1509195 INFO  (TEST-TestDistributedMissingSort.test-seed#[162E5A1B42F6CFAC]) [    ] o.a.s.SolrTestCaseJ4 Writing core.properties file to C:\Users\jenkins\workspace\Lucene-Solr-7.x-Windows\solr\build\solr-core\test\J1\temp\solr.TestDistributedMissingSort_162E5A1B42F6CFAC-001\tempDir-001\control\cores\collection1
   [junit4]   2> 1509198 INFO  (TEST-TestDistributedMissingSort.test-seed#[162E5A1B42F6CFAC]) [    ] o.e.j.s.Server jetty-9.3.20.v20170531
   [junit4]   2> 1509199 INFO  (TEST-TestDistributedMissingSort.test-seed#[162E5A1B42F6CFAC]) [    ] o.e.j.s.h.ContextHandler Started o.e.j.s.ServletContextHandler@83cf61{/ywh/zv,null,AVAILABLE}
   [junit4]   2> 1509199 INFO  (TEST-TestDistributedMissingSort.test-seed#[162E5A1B42F6CFAC]) [    ] o.e.j.s.AbstractConnector Started ServerConnector@32ced4{HTTP/1.1,[http/1.1]}{127.0.0.1:64047}
   [junit4]   2> 1509199 INFO  (TEST-TestDistributedMissingSort.test-seed#[162E5A1B42F6CFAC]) [    ] o.e.j.s.Server Started @1516913ms
   [junit4]   2> 1509199 INFO  (TEST-TestDistributedMissingSort.test-seed#[162E5A1B42F6CFAC]) [    ] o.a.s.c.s.e.JettySolrRunner Jetty properties: {schema=schema-distributed-missing-sort.xml, hostContext=/ywh/zv, hostPort=64047, coreRootDirectory=C:\Users\jenkins\workspace\Lucene-Solr-7.x-Windows\solr\build\solr-core\test\J1\temp\solr.TestDistributedMissingSort_162E5A1B42F6CFAC-001\tempDir-001\control\cores}
   [junit4]   2> 1509200 ERROR (TEST-TestDistributedMissingSort.test-seed#[162E5A1B42F6CFAC]) [    ] o.a.s.u.StartupLoggingUtils Missing Java Option solr.log.dir. Logging may be missing or incomplete.
   [junit4]   2> 1509200 INFO  (TEST-TestDistributedMissingSort.test-seed#[162E5A1B42F6CFAC]) [    ] o.a.s.s.SolrDispatchFilter  ___      _       Welcome to Apache Solr? version 7.3.0
   [junit4]   2> 1509200 INFO  (TEST-TestDistributedMissingSort.test-seed#[162E5A1B42F6CFAC]) [    ] o.a.s.s.SolrDispatchFilter / __| ___| |_ _   Starting in standalone mode on port null
   [junit4]   2> 1509200 INFO  (TEST-TestDistributedMissingSort.test-seed#[162E5A1B42F6CFAC]) [    ] o.a.s.s.SolrDispatchFilter \__ \/ _ \ | '_|  Install dir: null
   [junit4]   2> 1509200 INFO  (TEST-TestDistributedMissingSort.test-seed#[162E5A1B42F6CFAC]) [    ] o.a.s.s.SolrDispatchFilter |___/\___/_|_|    Start time: 2017-12-07T19:05:28.529Z
   [junit4]   2> 1509203 INFO  (TEST-TestDistributedMissingSort.test-seed#[162E5A1B42F6CFAC]) [    ] o.a.s.c.SolrXmlConfig Loading container configuration from C:\Users\jenkins\workspace\Lucene-Solr-7.x-Windows\solr\build\solr-core\test\J1\temp\solr.TestDistributedMissingSort_162E5A1B42F6CFAC-001\tempDir-001\control\solr.xml
   [junit4]   2> 1509210 INFO  (TEST-TestDistributedMissingSort.test-seed#[162E5A1B42F6CFAC]) [    ] o.a.s.c.SolrXmlConfig Configuration parameter autoReplicaFailoverWorkLoopDelay is ignored
   [junit4]   2> 1509210 INFO  (TEST-TestDistributedMissingSort.test-seed#[162E5A1B42F6CFAC]) [    ] o.a.s.c.SolrXmlConfig Configuration parameter autoReplicaFailoverBadNodeExpiration is ignored
   [junit4]   2> 1509211 INFO  (TEST-TestDistributedMissingSort.test-seed#[162E5A1B42F6CFAC]) [    ] o.a.s.c.SolrXmlConfig MBean server found: com.sun.jmx.mbeanserver.JmxMBeanServer@1b4daaf, but no JMX reporters were configured - adding default JMX reporter.
   [junit4]   2> 1509297 INFO  (TEST-TestDistributedMissingSort.test-seed#[162E5A1B42F6CFAC]) [    ] o.a.s.m.r.SolrJmxReporter JMX monitoring for 'solr.node' (registry 'solr.node') enabled at server: com.sun.jmx.mbeanserver.JmxMBeanServer@1b4daaf
   [junit4]   2> 1509304 INFO  (TEST-TestDistributedMissingSort.test-seed#[162E5A1B42F6CFAC]) [    ] o.a.s.m.r.SolrJmxReporter JMX monitoring for 'solr.jvm' (registry 'solr.jvm') enabled at server: com.sun.jmx.mbeanserver.JmxMBeanServer@1b4daaf
   [junit4]   2> 1509305 INFO  (TEST-TestDistributedMissingSort.test-seed#[162E5A1B42F6CFAC]) [    ] o.a.s.m.r.SolrJmxReporter JMX monitoring for 'solr.jetty' (registry 'solr.jetty') enabled at server: com.sun.jmx.mbeanserver.JmxMBeanServer@1b4daaf
   [junit4]   2> 1509308 INFO  (TEST-TestDistributedMissingSort.test-seed#[162E5A1B42F6CFAC]) [    ] o.a.s.c.CorePropertiesLocator Found 1 core definitions underneath C:\Users\jenkins\workspace\Lucene-Solr-7.x-Windows\solr\build\solr-core\test\J1\temp\solr.TestDistributedMissingSort_162E5A1B42F6CFAC-001\tempDir-001\control\cores
   [junit4]   2> 1509308 INFO  (TEST-TestDistributedMissingSort.test-seed#[162E5A1B42F6CFAC]) [    ] o.a.s.c.CorePropertiesLocator Cores are: [collection1]
   [junit4]   2> 1509309 INFO  (coreLoadExecutor-6456-thread-1) [    ] o.a.s.c.TransientSolrCoreCacheDefault Allocating transient cache for 4 transient cores
   [junit4]   2> 1509310 INFO  (coreLoadExecutor-6456-thread-1) [    x:collection1] o.a.s.c.SolrResourceLoader [null] Added 2 libs to classloader, from paths: [/C:/Users/jenkins/workspace/Lucene-Solr-7.x-Windows/solr/core/src/test-files/solr/collection1/lib, /C:/Users/jenkins/workspace/Lucene-Solr-7.x-Windows/solr/core/src/test-files/solr/collection1/lib/classes]
   [junit4]   2> 1509375 INFO  (coreLoadExecutor-6456-thread-1) [    x:collection1] o.a.s.c.SolrConfig Using Lucene MatchVersion: 7.3.0
   [junit4]   2> 1509401 INFO  (coreLoadExecutor-6456-thread-1) [    x:collection1] o.a.s.s.IndexSchema [collection1] Schema name=test-distributed-missing-sort
   [junit4]   2> 1509409 INFO  (coreLoadExecutor-6456-thread-1) [    x:collection1] o.a.s.s.IndexSchema Loaded schema test-distributed-missing-sort/1.6 with uniqueid field id
   [junit4]   2> 1509409 INFO  (coreLoadExecutor-6456-thread-1) [    x:collection1] o.a.s.c.CoreContainer Creating SolrCore 'collection1' using configuration from configset C:\Users\jenkins\workspace\Lucene-Solr-7.x-Windows\solr\core\src\test-files\solr\collection1, trusted=true
   [junit4]   2> 1509409 INFO  (coreLoadExecutor-6456-thread-1) [    x:collection1] o.a.s.m.r.SolrJmxReporter JMX monitoring for 'solr.core.collection1' (registry 'solr.core.collection1') enabled at server: com.sun.jmx.mbeanserver.JmxMBeanServer@1b4daaf
   [junit4]   2> 1509409 INFO  (coreLoadExecutor-6456-thread-1) [    x:collection1] o.a.s.c.SolrCore solr.RecoveryStrategy.Builder
   [junit4]   2> 1509409 INFO  (coreLoadExecutor-6456-thread-1) [    x:collection1] o.a.s.c.SolrCore [[collection1] ] Opening new SolrCore at [C:\Users\jenkins\workspace\Lucene-Solr-7.x-Windows\solr\core\src\test-files\solr\collection1], dataDir=[C:\Users\jenkins\workspace\Lucene-Solr-7.x-Windows\solr\build\solr-core\test\J1\temp\solr.TestDistributedMissingSort_162E5A1B42F6CFAC-001\tempDir-001\control\cores\collection1\data\]
   [junit4]   2> 1509410 INFO  (coreLoadExecutor-6456-thread-1) [    x:collection1] o.a.s.u.RandomMergePolicy RandomMergePolicy wrapping class org.apache.lucene.index.LogByteSizeMergePolicy: [LogByteSizeMergePolicy: minMergeSize=1677721, mergeFactor=38, maxMergeSize=2147483648, maxMergeSizeForForcedMerge=9223372036854775807, calibrateSizeByDeletes=true, maxMergeDocs=2147483647, maxCFSSegmentSizeMB=8.796093022207999E12, noCFSRatio=0.3076998182376961]
   [junit4]   2> 1509533 INFO  (coreLoadExecutor-6456-thread-1) [    x:collection1] o.a.s.u.UpdateHandler Using UpdateLog implementation: org.apache.solr.update.UpdateLog
   [junit4]   2> 1509533 INFO  (coreLoadExecutor-6456-thread-1) [    x:collection1] o.a.s.u.UpdateLog Initializing UpdateLog: dataDir= defaultSyncLevel=FLUSH numRecordsToKeep=100 maxNumLogsToKeep=10 numVersionBuckets=65536
   [junit4]   2> 1509534 INFO  (coreLoadExecutor-6456-thread-1) [    x:collection1] o.a.s.u.CommitTracker Hard AutoCommit: disabled
   [junit4]   2> 1509534 INFO  (coreLoadExecutor-6456-thread-1) [    x:collection1] o.a.s.u.CommitTracker Soft AutoCommit: disabled
   [junit4]   2> 1509535 INFO  (coreLoadExecutor-6456-thread-1) [    x:collection1] o.a.s.u.RandomMergePolicy RandomMergePolicy wrapping class org.apache.lucene.index.TieredMergePolicy: [TieredMergePolicy: maxMergeAtOnce=48, maxMergeAtOnceExplicit=17, maxMergedSegmentMB=68.21484375, floorSegmentMB=2.1201171875, forceMergeDeletesPctAllowed=14.370773259207228, segmentsPerTier=27.0, maxCFSSegmentSizeMB=8.796093022207999E12, noCFSRatio=0.5554185781747235
   [junit4]   2> 1509535 INFO  (coreLoadExecutor-6456-thread-1) [    x:collection1] o.a.s.s.SolrIndexSearcher Opening [Searcher@b88ea1[collection1] main]
   [junit4]   2> 1509536 INFO  (coreLoadExecutor-6456-thread-1) [    x:collection1] o.a.s.h.c.SpellCheckComponent Initializing spell checkers
   [junit4]   2> 1509543 INFO  (coreLoadExecutor-6456-thread-1) [    x:collection1] o.a.s.s.DirectSolrSpellChecker init: {name=direct,classname=DirectSolrSpellChecker,field=lowerfilt,minQueryLength=3}
   [junit4]   2> 1509576 INFO  (coreLoadExecutor-6456-thread-1) [    x:collection1] o.a.s.h.ReplicationHandler Commits will be reserved for 10000ms.
   [junit4]   2> 1509576 INFO  (searcherExecutor-6457-thread-1-processing-x:collection1) [    x:collection1] o.a.s.h.c.SpellCheckComponent Loading spell index for spellchecker: default
   [junit4]   2> 1509576 INFO  (coreLoadExecutor-6456-thread-1) [    x:collection1] o.a.s.u.UpdateLog Could not find max version in index or recent updates, using new clock 1586153158245089280
   [junit4]   2> 1509576 INFO  (searcherExecutor-6457-thread-1-processing-x:collection1) [    x:collection1] o.a.s.h.c.SpellCheckComponent Loading spell index for spellchecker: direct
   [junit4]   2> 1509576 INFO  (searcherExecutor-6457-thread-1-processing-x:collection1) [    x:collection1] o.a.s.h.c.SpellCheckComponent Loading spell index for spellchecker: wordbreak
   [junit4]   2> 1509576 INFO  (searcherExecutor-6457-thread-1-processing-x:collection1) [    x:collection1] o.a.s.h.c.SpellCheckComponent Loading spell index for spellchecker: multipleFields
   [junit4]   2> 1509576 INFO  (searcherExecutor-6457-thread-1-processing-x:collection1) [    x:collection1] o.a.s.h.c.SpellCheckComponent Loading spell index for spellchecker: jarowinkler
   [junit4]   2> 1509576 INFO  (searcherExecutor-6457-thread-1-processing-x:collection1) [    x:collection1] o.a.s.h.c.SpellCheckComponent Loading spell index for spellchecker: external
   [junit4]   2> 1509576 INFO  (searcherExecutor-6457-thread-1-processing-x:collection1) [    x:collection1] o.a.s.h.c.SpellCheckComponent Loading spell index for spellchecker: freq
   [junit4]   2> 1509576 INFO  (searcherExecutor-6457-thread-1-processing-x:collection1) [    x:collection1] o.a.s.h.c.SpellCheckComponent Loading spell index for spellchecker: fqcn
   [junit4]   2> 1509576 INFO  (searcherExecutor-6457-thread-1-processing-x:collection1) [    x:collection1] o.a.s.h.c.SpellCheckComponent Loading spell index for spellchecker: perDict
   [junit4]   2> 1509576 INFO  (searcherExecutor-6457-thread-1-processing-x:collection1) [    x:collection1] o.a.s.c.SolrCore [collection1] Registered new searcher Searcher@b88ea1[collection1] main{ExitableDirectoryReader(UninvertingDirectoryReader())}
   [junit4]   2> 1510220 INFO  (TEST-TestDistributedMissingSort.test-seed#[162E5A1B42F6CFAC]) [    ] o.a.s.SolrTestCaseJ4 Writing core.properties file to C:\Users\jenkins\workspace\Lucene-Solr-7.x-Windows\solr\build\solr-core\test\J1\temp\solr.TestDistributedMissingSort_162E5A1B42F6CFAC-001\tempDir-001\shard0\cores\collection1
   [junit4]   2> 1510223 INFO  (TEST-TestDistributedMissingSort.test-seed#[162E5A1B42F6CFAC]) [    ] o.e.j.s.Server jetty-9.3.20.v20170531
   [junit4]   2> 1510223 INFO  (TEST-TestDistributedMissingSort.test-seed#[162E5A1B42F6CFAC]) [    ] o.e.j.s.h.ContextHandler Started o.e.j.s.ServletContextHandler@b22e12{/ywh/zv,null,AVAILABLE}
   [junit4]   2> 1510224 INFO  (TEST-TestDistributedMissingSort.test-seed#[162E5A1B42F6CFAC]) [    ] o.e.j.s.AbstractConnector Started ServerConnector@15c19a4{HTTP/1.1,[http/1.1]}{127.0.0.1:64050}
   [junit4]   2> 1510224 INFO  (TEST-TestDistributedMissingSort.test-seed#[162E5A1B42F6CFAC]) [    ] o.e.j.s.Server Started @1517937ms
   [junit4]   2> 1510224 INFO  (TEST-TestDistributedMissingSort.test-seed#[162E5A1B42F6CFAC]) [    ] o.a.s.c.s.e.JettySolrRunner Jetty properties: {schema=schema-distributed-missing-sort.xml, hostContext=/ywh/zv, hostPort=64050, coreRootDirectory=C:\Users\jenkins\workspace\Lucene-Solr-7.x-Windows\solr\build\solr-core\test\J1\temp\solr.TestDistributedMissingSort_162E5A1B42F6CFAC-001\tempDir-001\shard0\cores}
   [junit4]   2> 1510224 ERROR (TEST-TestDistributedMissingSort.test-seed#[162E5A1B42F6CFAC]) [    ] o.a.s.u.StartupLoggingUtils Missing Java Option solr.log.dir. Logging may be missing or incomplete.
   [junit4]   2> 1510226 INFO  (TEST-TestDistributedMissingSort.test-seed#[162E5A1B42F6CFAC]) [    ] o.a.s.s.SolrDispatchFilter  ___      _       Welcome to Apache Solr? version 7.3.0
   [junit4]   2> 1510226 INFO  (TEST-TestDistributedMissingSort.test-seed#[162E5A1B42F6CFAC]) [    ] o.a.s.s.SolrDispatchFilter / __| ___| |_ _   Starting in standalone mode on port null
   [junit4]   2> 1510226 INFO  (TEST-TestDistributedMissingSort.test-seed#[162E5A1B42F6CFAC]) [    ] o.a.s.s.SolrDispatchFilter \__ \/ _ \ | '_|  Install dir: null
   [junit4]   2> 1510226 INFO  (TEST-TestDistributedMissingSort.test-seed#[162E5A1B42F6CFAC]) [    ] o.a.s.s.SolrDispatchFilter |___/\___/_|_|    Start time: 2017-12-07T19:05:29.555Z
   [junit4]   2> 1510227 INFO  (TEST-TestDistributedMissingSort.test-seed#[162E5A1B42F6CFAC]) [    ] o.a.s.c.SolrXmlConfig Loading container configuration from C:\Users\jenkins\workspace\Lucene-Solr-7.x-Windows\solr\build\solr-core\test\J1\temp\solr.TestDistributedMissingSort_162E5A1B42F6CFAC-001\tempDir-001\shard0\solr.xml
   [junit4]   2> 1510235 INFO  (TEST-TestDistributedMissingSort.test-seed#[162E5A1B42F6CFAC]) [    ] o.a.s.c.SolrXmlConfig Configuration parameter autoReplicaFailoverWorkLoopDelay is ignored
   [junit4]   2> 1510235 INFO  (TEST-TestDistributedMissingSort.test-seed#[162E5A1B42F6CFAC]) [    ] o.a.s.c.SolrXmlConfig Configuration parameter autoReplicaFailoverBadNodeExpiration is ignored
   [junit4]   2> 1510237 INFO  (TEST-TestDistributedMissingSort.test-seed#[162E5A1B42F6CFAC]) [    ] o.a.s.c.SolrXmlConfig MBean server found: com.sun.jmx.mbeanserver.JmxMBeanServer@1b4daaf, but no JMX reporters were configured - adding default JMX reporter.
   [junit4]   2> 1510349 INFO  (TEST-TestDistributedMissingSort.test-seed#[162E5A1B42F6CFAC]) [    ] o.a.s.m.r.SolrJmxReporter JMX monitoring for 'solr.node' (registry 'solr.node') enabled at server: com.sun.jmx.mbeanserver.JmxMBeanServer@1b4daaf
   [junit4]   2> 1510365 INFO  (TEST-TestDistributedMissingSort.test-seed#[162E5A1B42F6CFAC]) [    ] o.a.s.m.r.SolrJmxReporter JMX monitoring for 'solr.jvm' (registry 'solr.jvm') enabled at server: com.sun.jmx.mbeanserver.JmxMBeanServer@1b4daaf
   [junit4]   2> 1510365 INFO  (TEST-TestDistributedMissingSort.test-seed#[162E5A1B42F6CFAC]) [    ] o.a.s.m.r.SolrJmxReporter JMX monitoring for 'solr.jetty' (registry 'solr.jetty') enabled at server: com.sun.jmx.mbeanserver.JmxMBeanServer@1b4daaf
   [junit4]   2> 1510374 INFO  (TEST-TestDistributedMissingSort.test-seed#[162E5A1B42F6CFAC]) [    ] o.a.s.c.CorePropertiesLocator Found 1 core definitions underneath C:\Users\jenkins\workspace\Lucene-Solr-7.x-Windows\solr\build\solr-core\test\J1\temp\solr.TestDistributedMissingSort_162E5A1B42F6CFAC-001\tempDir-001\shard0\cores
   [junit4]   2> 1510374 INFO  (TEST-TestDistributedMissingSort.test-seed#[162E5A1B42F6CFAC]) [    ] o.a.s.c.CorePropertiesLocator Cores are: [collection1]
   [junit4]   2> 1510409 INFO  (coreLoadExecutor-6467-thread-1) [    ] o.a.s.c.TransientSolrCoreCacheDefault Allocating transient cache for 4 transient cores
   [junit4]   2> 1510410 INFO  (coreLoadExecutor-6467-thread-1) [    x:collection1] o.a.s.c.SolrResourceLoader [null] Added 2 libs to classloader, from paths: [/C:/Users/jenkins/workspace/Lucene-Solr-7.x-Windows/solr/core/src/test-files/solr/collection1/lib, /C:/Users/jenkins/workspace/Lucene-Solr-7.x-Windows/solr/core/src/test-files/solr/collection1/lib/classes]
   [junit4]   2> 1510501 INFO  (coreLoadExecutor-6467-thread-1) [    x:collection1] o.a.s.c.SolrConfig Using Lucene MatchVersion: 7.3.0
   [junit4]   2> 1510518 INFO  (coreLoadExecutor-6467-thread-1) [    x:collection1] o.a.s.s.IndexSchema [collection1] Schema name=test-distributed-missing-sort
   [junit4]   2> 1510524 INFO  (coreLoadExecutor-6467-thread-1) [    x:collection1] o.a.s.s.IndexSchema Loaded schema test-distributed-missing-sort/1.6 with uniqueid field id
   [junit4]   2> 1510525 INFO  (coreLoadExecutor-6467-thread-1) [    x:collection1] o.a.s.c.CoreContainer Creating SolrCore 'collection1' using configuration from configset C:\Users\jenkins\workspace\Lucene-Solr-7.x-Windows\solr\core\src\test-files\solr\collection1, trusted=true
   [junit4]   2> 1510525 INFO  (coreLoadExecutor-6467-thread-1) [    x:collection1] o.a.s.m.r.SolrJmxReporter JMX monitoring for 'solr.core.collection1' (registry 'solr.core.collection1') enabled at server: com.sun.jmx.mbeanserver.JmxMBeanServer@1b4daaf
   [junit4]   2> 1510525 INFO  (coreLoadExecutor-6467-thread-1) [    x:collection1] o.a.s.c.SolrCore solr.RecoveryStrategy.Builder
   [junit4]   2> 1510525 INFO  (coreLoadExecutor-6467-thread-1) [    x:collection1] o.a.s.c.SolrCore [[collection1] ] Opening new SolrCore at [C:\Users\jenkins\workspace\Lucene-Solr-7.x-Windows\solr\core\src\test-files\solr\collection1], dataDir=[C:\Users\jenkins\workspace\Lucene-Solr-7.x-Windows\solr\build\solr-core\test\J1\temp\solr.TestDistributedMissingSort_162E5A1B42F6CFAC-001\tempDir-001\shard0\cores\collection1\data\]
   [junit4]   2> 1510527 INFO  (coreLoadExecutor-6467-thread-1) [    x:collection1] o.a.s.u.RandomMergePolicy RandomMergePolicy wrapping class org.apache.lucene.index.LogByteSizeMergePolicy: [LogByteSizeMergePolicy: minMergeSize=1677721, mergeFactor=38, maxMergeSize=2147483648, maxMergeSizeForForcedMerge=9223372036854775807, calibrateSizeByDeletes=true, maxMergeDocs=2147483647, maxCFSSegmentSizeMB=8.796093022207999E12, noCFSRatio=0.3076998182376961]
   [junit4]   2> 1510639 INFO  (coreLoadExecutor-6467-thread-1) [    x:collection1] o.a.s.u.UpdateHandler Using UpdateLog implementation: org.apache.solr.update.UpdateLog
   [junit4]   2> 1510640 INFO  (coreLoadExecutor-6467-thread-1) [    x:collection1] o.a.s.u.UpdateLog Initializing UpdateLog: dataDir= defaultSyncLevel=FLUSH numRecordsToKeep=100 maxNumLogsToKeep=10 numVersionBuckets=65536
   [junit4]   2> 1510641 INFO  (coreLoadExecutor-6467-thread-1) [    x:collection1] o.a.s.u.CommitTracker Hard AutoCommit: disabled
   [junit4]   2> 1510641 INFO  (coreLoadExecutor-6467-thread-1) [    x:collection1] o.a.s.u.CommitTracker Soft AutoCommit: disabled
   [junit4]   2> 1510642 INFO  (coreLoadExecutor-6467-thread-1) [    x:collection1] o.a.s.u.RandomMergePolicy RandomMergePolicy wrapping class org.apache.lucene.index.TieredMergePolicy: [TieredMergePolicy: maxMergeAtOnce=48, maxMergeAtOnceExplicit=17, maxMergedSegmentMB=68.21484375, floorSegmentMB=2.1201171875, forceMergeDeletesPctAllowed=14.370773259207228, segmentsPerTier=27.0, maxCFSSegmentSizeMB=8.796093022207999E12, noCFSRatio=0.5554185781747235
   [junit4]   2> 1510642 INFO  (coreLoadExecutor-6467-thread-1) [    x:collection1] o.a.s.s.SolrIndexSearcher Opening [Searcher@3a9b93[collection1] main]
   [junit4]   2> 1510643 INFO  (coreLoadExecutor-6467-thread-1) [    x:collection1] o.a.s.h.c.SpellCheckComponent Initializing spell checkers
   [junit4]   2> 1510650 INFO  (coreLoadExecutor-6467-thread-1) [    x:collection1] o.a.s.s.DirectSolrSpellChecker init: {name=direct,classname=DirectSolrSpellChecker,field=lowerfilt,minQueryLength=3}
   [junit4]   2> 1510680 INFO  (coreLoadExecutor-6467-thread-1) [    x:collection1] o.a.s.h.ReplicationHandler Commits will be reserved for 10000ms.
   [junit4]   2> 1510680 INFO  (coreLoadExecutor-6467-thread-1) [    x:collection1] o.a.s.u.UpdateLog Could not find max version in index or recent updates, using new clock 1586153159402717184
   [junit4]   2> 1510684 INFO  (searcherExecutor-6468-thread-1-processing-x:collection1) [    x:collection1] o.a.s.h.c.SpellCheckComponent Loading spell index for spellchecker: default
   [junit4]   2> 1510684 INFO  (searcherExecutor-6468-thread-1-processing-x:collection1) [    x:collection1] o.a.s.h.c.SpellCheckComponent Loading spell index for spellchecker: direct
   [junit4]   2> 1510684 INFO  (searcherExecutor-6468-thread-1-processing-x:collection1) [    x:collection1] o.a.s.h.c.SpellCheckComponent Loading spell index for spellchecker: wordbreak
   [junit4]   2> 1510684 INFO  (searcherExecutor-6468-thread-1-processing-x:collection1) [    x:collection1] o.a.s.h.c.SpellCheckComponent Loading spell index for spellchecker: multipleFields
   [junit4]   2> 1510684 INFO  (searcherExecutor-6468-thread-1-processing-x:collection1) [    x:collection1] o.a.s.h.c.SpellCheckComponent Loading spell index for spellchecker: jarowinkler
   [junit4]   2> 1510684 INFO  (searcherExecutor-6468-thread-1-processing-x:collection1) [    x:collection1] o.a.s.h.c.SpellCheckComponent Loading spell index for spellchecker: external
   [junit4]   2> 1510685 INFO  (searcherExecutor-6468-thread-1-processing-x:collection1) [    x:collection1] o.a.s.h.c.SpellCheckComponent Loading spell index for spellchecker: freq
   [junit4]   2> 1510685 INFO  (searcherExecutor-6468-thread-1-processing-x:collection1) [    x:collection1] o.a.s.h.c.SpellCheckComponent Loading spell index for spellchecker: fqcn
   [junit4]   2> 1510685 INFO  (searcherExecutor-6468-thread-1-processing-x:collection1) [    x:collection1] o.a.s.h.c.SpellCheckComponent Loading spell index for spellchecker: perDict
   [junit4]   2> 1510687 INFO  (searcherExecutor-6468-thread-1-processing-x:collection1) [    x:collection1] o.a.s.c.SolrCore [collection1] Registered new searcher Searcher@3a9b93[collection1] main{ExitableDirectoryReader(UninvertingDirectoryReader())}
   [junit4]   2> 1510688 INFO  (TEST-TestDistributedMissingSort.test-seed#[162E5A1B42F6CFAC]) [    ] o.a.s.SolrTestCaseJ4 ###Starting test
   [junit4]   2> 1510711 INFO  (qtp10078827-15707) [    x:collection1] o.a.s.u.p.LogUpdateProcessorFactory [collection1]  webapp=/ywh/zv path=/update params={wt=javabin&version=2}{deleteByQuery=*:* (-1586153159422640128)} 0 12
   [junit4]   2> 1510720 INFO  (qtp18115770-15717) [    x:collection1] o.a.s.u.p.LogUpdateProcessorFactory [collection1]  webapp=/ywh/zv path=/update params={wt=javabin&version=2}{deleteByQuery=*:* (-1586153159437320192)} 0 7
   [junit4]   2> 1510722 INFO  (qtp10078827-15704) [    x:collection1] o.a.s.u.p.LogUpdateProcessorFactory [collection1]  webapp=/ywh/zv path=/update params={wt=javabin&version=2}{add=[1 (1586153159445708800)]} 0 0
   [junit4]   2> 1510724 INFO  (qtp18115770-15726) [    x:collection1] o.a.s.u.p.LogUpdateProcessorFactory [collection1]  webapp=/ywh/zv path=/update params={wt=javabin&version=2}{add=[1 (1586153159446757376)]} 0 1
   [junit4]   2> 1510725 INFO  (qtp10078827-15703) [    x:collection1] o.a.s.u.p.LogUpdateProcessorFactory [collection1]  webapp=/ywh/zv path=/update params={wt=javabin&version=2}{add=[2 (1586153159448854528)]} 0 0
   [junit4]   2> 1510725 INFO  (qtp18115770-15724) [    x:collection1] o.a.s.u.p.LogUpdateProcessorFactory [collection1]  webapp=/ywh/zv path=/update params={wt=javabin&version=2}{add=[2 (1586153159449903104)]} 0 0
   [junit4]   2> 1510726 INFO  (qtp10078827-15702) [    x:collection1] o.a.s.u.p.LogUpdateProcessorFactory [collection1]  webapp=/ywh/zv path=/update params={wt=javabin&version=2}{add=[3 (1586153159449903104)]} 0 0
   [junit4]   2> 1510726 INFO  (qtp18115770-15723) [    x:collection1] o.a.s.u.p.LogUpdateProcessorFactory [collection1]  webapp=/ywh/zv path=/update params={wt=javabin&version=2}{add=[3 (1586153159450951680)]} 0 0
   [junit4]   2> 1510727 INFO  (qtp10078827-15701) [    x:collection1] o.a.s.u.p.LogUpdateProcessorFactory [collection1]  webapp=/ywh/zv path=/update params={wt=javabin&version=2}{add=[4 (1586153159450951680)]} 0 0
   [junit4]   2> 1510727 INFO  (qtp18115770-15722) [    x:collection1] o.a.s.u.p.LogUpdateProcessorFactory [collection1]  webapp=/ywh/zv path=/update params={wt=javabin&version=2}{add=[4 (1586153159452000256)]} 0 0
   [junit4]   2> 1510727 INFO  (qtp10078827-15700) [    x:collection1] o.a.s.u.p.LogUpdateProcessorFactory [collection1]  webapp=/ywh/zv path=/update params={wt=javabin&version=2}{add=[5 (1586153159452000256)]} 0 0
   [junit4]   2> 1510728 INFO  (qtp18115770-15721) [    x:collection1] o.a.s.u.p.LogUpdateProcessorFactory [collection1]  webapp=/ywh/zv path=/update params={wt=javabin&version=2}{add=[5 (1586153159453048832)]} 0 0
   [junit4]   2> 1510728 INFO  (qtp10078827-15699) [    x:collection1] o.a.s.u.p.LogUpdateProcessorFactory [collection1]  webapp=/ywh/zv path=/update params={wt=javabin&version=2}{add=[6 (1586153159453048832)]} 0 0
   [junit4]   2> 1510729 INFO  (qtp18115770-15720) [    x:collection1] o.a.s.u.p.LogUpdateProcessorFactory [collection1]  webapp=/ywh/zv path=/update params={wt=javabin&version=2}{add=[6 (1586153159454097408)]} 0 0
   [junit4]   2> 1510729 INFO  (qtp10078827-15708) [    x:collection1] o.a.s.u.p.LogUpdateProcessorFactory [collection1]  webapp=/ywh/zv path=/update params={wt=javabin&version=2}{add=[7 (1586153159454097408)]} 0 0
   [junit4]   2> 1510730 INFO  (qtp18115770-15719) [    x:collection1] o.a.s.u.p.LogUpdateProcessorFactory [collection1]  webapp=/ywh/zv path=/update params={wt=javabin&version=2}{add=[7 (1586153159455145984)]} 0 0
   [junit4]   2> 1510730 INFO  (qtp10078827-15697) [    x:collection1] o.a.s.u.p.LogUpdateProcessorFactory [collection1]  webapp=/ywh/zv path=/update params={wt=javabin&version=2}{add=[8 (1586153159455145984)]} 0 0
   [junit4]   2> 1510730 INFO  (qtp18115770-15728) [    x:collection1] o.a.s.u.p.LogUpdateProcessorFactory [collection1]  webapp=/ywh/zv path=/update params={wt=javabin&version=2}{add=[8 (1586153159455145985)]} 0 0
   [junit4]   2> 1510731 INFO  (qtp10078827-15697) [    x:collection1] o.a.s.u.p.LogUpdateProcessorFactory [collection1]  webapp=/ywh/zv path=/update params={wt=javabin&version=2}{add=[9 (1586153159456194560)]} 0 0
   [junit4]   2> 1510731 INFO  (qtp18115770-15728) [    x:collection1] o.a.s.u.p.LogUpdateProcessorFactory [collection1]  webapp=/ywh/zv path=/update params={wt=javabin&version=2}{add=[9 (1586153159456194560)]} 0 0
   [junit4]   2> 1510731 INFO  (qtp10078827-15697) [    x:collection1] o.a.s.u.DirectUpdateHandler2 start commit{_version_=1586153159456194561,optimize=false,openSearcher=true,waitSearcher=true,expungeDeletes=false,softCommit=false,prepareCommit=false}
   [junit4]   2> 1510731 INFO  (qtp10078827-15697) [    x:collection1] o.a.s.u.SolrIndexWriter Calling setCommitData with IW:org.apache.solr.update.SolrIndexWriter@1807b56 commitCommandVersion:1586153159456194561
   [junit4]   2> 1510738 INFO  (qtp10078827-15697) [    x:collection1] o.a.s.s.SolrIndexSearcher Opening [Searcher@1347de9[collection1] main]
   [junit4]   2> 1510740 INFO  (searcherExecutor-6457-thread-1-processing-x:collection1) [    x:collection1] o.a.s.c.SolrCore [collection1] Registered new searcher Searcher@1347de9[collection1] main{ExitableDirectoryReader(UninvertingDirectoryReader(Uninverting(_0(7.3.0):c9)))}
   [junit4]   2> 1510740 INFO  (qtp10078827-15697) [    x:collection1] o.a.s.u.DirectUpdateHandler2 end_commit_flush
   [junit4]   2> 1510740 INFO  (qtp10078827-15697) [    x:collection1] o.a.s.u.p.LogUpdateProcessorFactory [collection1]  webapp=/ywh/zv path=/update params={waitSearcher=true&commit=true&softCommit=false&wt=javabin&version=2}{commit=} 0 8
   [junit4]   2> 1510740 INFO  (qtp18115770-15728) [    x:collection1] o.a.s.u.DirectUpdateHandler2 start commit{_version_=1586153159465631744,optimize=false,openSearcher=true,waitSearcher=true,expungeDeletes=false,softCommit=false,prepareCommit=false}
   [junit4]   2> 1510740 INFO  (qtp18115770-15728) [    x:collection1] o.a.s.u.SolrIndexWriter Calling setCommitData with IW:org.apache.solr.update.SolrIndexWriter@81f83 commitCommandVersion:1586153159465631744
   [junit4]   2> 1510751 INFO  (qtp18115770-15728) [    x:collection1] o.a.s.s.SolrIndexSearcher Opening [Searcher@1ea3a6e[collection1] main]
   [junit4]   2> 1510752 INFO  (searcherExecutor-6468-thread-1-processing-x:collection1) [    x:collection1] o.a.s.c.SolrCore [collection1] Registered new searcher Searcher@1ea3a6e[collection1] main{ExitableDirectoryReader(UninvertingDirectoryReader(Uninverting(_0(7.3.0):c9)))}
   [junit4]   2> 1510752 INFO  (qtp18115770-15728) [    x:collection1] o.a.s.u.DirectUpdateHandler2 end_commit_flush
   [junit4]   2> 1510752 INFO  (qtp18115770-15728) [    x:collection1] o.a.s.u.p.LogUpdateProcessorFactory [collection1]  webapp=/ywh/zv path=/update params={waitSearcher=true&commit=true&softCommit=false&wt=javabin&version=2}{commit=} 0 11
   [junit4]   2> 1510756 INFO  (qtp10078827-15707) [    x:collection1] o.a.s.u.p.LogUpdateProcessorFactory [collection1]  webapp=/ywh/zv path=/update params={wt=javabin&version=2}{add=[10 (1586153159479263232)]} 0 2
   [junit4]   2> 1510759 INFO  (qtp18115770-15728) [    x:collection1] o.a.s.u.p.LogUpdateProcessorFactory [collection1]  webapp=/ywh/zv path=/update params={wt=javabin&version=2}{add=[10 (1586153159483457536)]} 0 2
   [junit4]   2> 1510760 INFO  (qtp10078827-15704) [    x:collection1] o.a.s.u.p.LogUpdateProcessorFactory [collection1]  webapp=/ywh/zv path=/update params={wt=javabin&version=2}{add=[11 (1586153159486603264)]} 0 0
   [junit4]   2> 1510760 INFO  (qtp18115770-15728) [    x:collection1] o.a.s.u.p.LogUpdateProcessorFactory [collection1]  webapp=/ywh/zv path=/update params={wt=javabin&version=2}{add=[11 (1586153159486603264)]} 0 0
   [junit4]   2> 1510761 INFO  (qtp10078827-15704) [    x:collection1] o.a.s.u.p.LogUpdateProcessorFactory [collection1]  webapp=/ywh/zv path=/update params={wt=javabin&version=2}{add=[12 (1586153159486603265)]} 0 0
   [junit4]   2> 1510762 INFO  (qtp18115770-15726) [    x:collection1] o.a.s.u.p.LogUpdateProcessorFactory [collection1]  webapp=/ywh/zv path=/update params={wt=javabin&version=2}{add=[12 (1586153159487651840)]} 0 0
   [junit4]   2> 1510762 INFO  (qtp10078827-15702) [    x:collection1] o.a.s.u.p.LogUpdateProcessorFactory [collection1]  webapp=/ywh/zv path=/update params={wt=javabin&version=2}{add=[13 (1586153159488700416)]} 0 0
   [junit4]   2> 1510762 INFO  (qtp18115770-15724) [    x:collection1] o.a.s.u.p.LogUpdateProcessorFactory [collection1]  webapp=/ywh/zv path=/update params={wt=javabin&version=2}{add=[13 (1586153159488700416)]} 0 0
   [junit4]   2> 1510763 INFO  (qtp10078827-15702) [    x:collection1] o.a.s.u.p.LogUpdateProcessorFactory [collection1]  webapp=/ywh/zv path=/update params={wt=javabin&version=2}{add=[14 (1586153159489748992)]} 0 0
   [junit4]   2> 1510763 INFO  (qtp18115770-15724) [    x:collection1] o.a.s.u.p.LogUpdateProcessorFactory [collection1]  webapp=/ywh/zv path=/update params={wt=javabin&version=2}{add=[14 (1586153159489748992)]} 0 0
   [junit4]   2> 1510763 INFO  (qtp10078827-15702) [    x:collection1] o.a.s.u.p.LogUpdateProcessorFactory [collection1]  webapp=/ywh/zv path=/update params={wt=javabin&version=2}{add=[15 (1586153159489748993)]} 0 0
   [junit4]   2> 1510764 INFO  (qtp18115770-15724) [    x:collection1] o.a.s.u.p.LogUpdateProcessorFactory [collection1]  webapp=/ywh/zv path=/update params={wt=javabin&version=2}{add=[15 (1586153159490797568)]} 0 0
   [junit4]   2> 1510766 INFO  (qtp10078827-15702) [    x:collection1] o.a.s.u.p.LogUpdateProcessorFactory [collection1]  webapp=/ywh/zv path=/update params={wt=javabin&version=2}{add=[16 (1586153159490797568)]} 0 2
   [junit4]   2> 1510767 INFO  (qtp18115770-15724) [    x:collection1] o.a.s.u.p.LogUpdateProcessorFactory [collection1]  webapp=/ywh/zv path=/update params={wt=javabin&version=2}{add=[16 (1586153159493943296)]} 0 0
   [junit4]   2> 1510767 INFO  (qtp10078827-15701) [    x:collection1] o.a.s.u.p.LogUpdateProcessorFactory [collection1]  webapp=/ywh/zv path=/update params={wt=javabin&version=2}{add=[17 (1586153159493943296)]} 0 0
   [junit4]   2> 1510768 INFO  (qtp18115770-15724) [    x:collection1] o.a.s.u.p.LogUpdateProcessorFactory [collection1]  webapp=/ywh/zv path=/update params={wt=javabin&version=2}{add=[17 (1586153159494991872)]} 0 0
   [junit4]   2> 1510768 INFO  (qtp10078827-15701) [    x:collection1] o.a.s.u.p.LogUpdateProcessorFactory [collection1]  webapp=/ywh/zv path=/update params={wt=javabin&version=2}{add=[100 (1586153159494991872)]} 0 0
   [junit4]   2> 1510769 INFO  (qtp18115770-15724) [    x:collection1] o.a.s.u.p.LogUpdateProcessorFactory [collection1]  webapp=/ywh/zv path=/update params={wt=javabin&version=2}{add=[100 (1586153159494991873)]} 0 0
   [junit4]   2> 1510769 INFO  (qtp10078827-15701) [    x:collection1] o.a.s.u.p.LogUpdateProcessorFactory [collection1]  webapp=/ywh/zv path=/update params={wt=javabin&version=2}{add=[101 (1586153159496040448)]} 0 0
   [junit4]   2> 1510770 INFO  (qtp18115770-15724) [    x:collection1] o.a.s.u.p.LogUpdateProcessorFactory [collection1]  webapp=/ywh/zv path=/update params={wt=javabin&version=2}{add=[101 (1586153159496040448)]} 0 0
   [junit4]   2> 1510770 INFO  (qtp10078827-15701) [    x:collection1] o.a.s.u.p.LogUpdateProcessorFactory [collection1]  webapp=/ywh/zv path=/update params={wt=javabin&version=2}{add=[102 (1586153159497089024)]} 0 0
   [junit4]   2> 1510770 INFO  (qtp18115770-15722) [    x:collection1] o.a.s.u.p.LogUpdateProcessorFactory [collection1]  webapp=/ywh/zv path=/update params={wt=javabin&version=2}{add=[102 (1586153159497089024)]} 0 0
   [junit4]   2> 1510770 INFO  (qtp10078827-15701) [    x:collection1] o.a.s.u.p.LogUpdateProcessorFactory [collection1]  webapp=/ywh/zv path=/update params={wt=javabin&version=2}{add=[103 (1586153159497089025)]} 0 0
   [junit4]   2> 1510771 INFO  (qtp18115770-15722) [    x:collection1] o.a.s.u.p.LogUpdateProcessorFactory [collection1]  webapp=/ywh/zv path=/update params={wt=javabin&version=2}{add=[103 (1586153159498137600)]} 0 0
   [junit4]   2> 1510771 INFO  (qtp10078827-15701) [    x:collection1] o.a.s.u.p.LogUpdateProcessorFactory [collection1]  webapp=/ywh/zv path=/update params={wt=javabin&version=2}{add=[104 (1586153159498137600)]} 0 0
   [junit4]   2> 1510771 INFO  (qtp18115770-15722) [    x:collection1] o.a.s.u.p.LogUpdateProcessorFactory [collection1]  webapp=/ywh/zv path=/update params={wt=javabin&version=2}{add=[104 (1586153159498137601)]} 0 0
   [junit4]   2> 1510772 INFO  (qtp10078827-15701) [    x:collection1] o.a.s.u.p.LogUpdateProcessorFactory [collection1]  webapp=/ywh/zv path=/update params={wt=javabin&version=2}{add=[105 (1586153159499186176)]} 0 0
   [junit4]   2> 1510772 INFO  (qtp18115770-15722) [    x:collection1] o.a.s.u.p.LogUpdateProcessorFactory [collection1]  webapp=/ywh/zv path=/update params={wt=javabin&version=2}{add=[105 (1586153159499186176)]} 0 0
   [junit4]   2> 1510772 INFO  (qtp10078827-15701) [    x:collection1] o.a.s.u.p.LogUpdateProcessorFactory [collection1]  webapp=/ywh/zv path=/update params={wt=javabin&version=2}{add=[106 (1586153159499186177)]} 0 0
   [junit4]   2> 1510773 INFO  (qtp18115770-15722) [    x:collection1] o.a.s.u.p.LogUpdateProcessorFactory [collection1]  webapp=/ywh/zv path=/update params={wt=javabin&version=2}{add=[106 (1586153159499186177)]} 0 0
   [junit4]   2> 1510773 INFO  (qtp10078827-15701) [    x:collection1] o.a.s.u.p.LogUpdateProcessorFactory [collection1]  webapp=/ywh/zv path=/update params={wt=javabin&version=2}{add=[107 (1586153159500234752)]} 0 0
   [junit4]   2> 1510773 INFO  (qtp18115770-15722) [    x:collection1] o.a.s.u.p.LogUpdateProcessorFactory [collection1]  webapp=/ywh/zv path=/update params={wt=javabin&version=2}{add=[107 (1586153159500234752)]} 0 0
   [junit4]   2> 1510774 INFO  (qtp10078827-15701) [    x:collection1] o.a.s.u.p.LogUpdateProcessorFactory [collection1]  webapp=/ywh/zv path=/update params={wt=javabin&version=2}{add=[108 (1586153159501283328)]} 0 0
   [junit4]   2> 1510774 INFO  (qtp18115770-15721) [    x:collection1] o.a.s.u.p.LogUpdateProcessorFactory [collection1]  webapp=/ywh/zv path=/update params={wt=javabin&version=2}{add=[108 (1586153159501283328)]} 0 0
   [junit4]   2> 1510774 INFO  (qtp10078827-15701) [    x:collection1] o.a.s.u.p.LogUpdateProcessorFactory [collection1]  webapp=/ywh/zv path=/update params={wt=javabin&version=2}{add=[109 (1586153159501283329)]} 0 0
   [junit4]   2> 1510775 INFO  (qtp18115770-15721) [    x:collection1] o.a.s.u.p.LogUpdateProcessorFactory [collection1]  webapp=/ywh/zv path=/update params={wt=javabin&version=2}{add=[109 (1586153159501283329)]} 0 0
   [junit4]   2> 1510775 INFO  (qtp10078827-15701) [    x:collection1] o.a.s.u.p.LogUpdateProcessorFactory [collection1]  webapp=/ywh/zv path=/update params={wt=javabin&version=2}{add=[110 (1586153159502331904)]} 0 0
   [junit4]   2> 1510775 INFO  (qtp18115770-15721) [    x:collection1] o.a.s.u.p.LogUpdateProcessorFactory [collection1]  webapp=/ywh/zv path=/update params={wt=javabin&version=2}{add=[110 (1586153159502331904)]} 0 0
   [junit4]   2> 1510775 INFO  (qtp10078827-15701) [    x:collection1] o.a.s.u.p.LogUpdateProcessorFactory [collection1]  webapp=/ywh/zv path=/update params={wt=javabin&version=2}{add=[111 (1586153159502331905)]} 0 0
   [junit4]   2> 1510775 INFO  (qtp18115770-15721) [    x:collection1] o.a.s.u.p.LogUpdateProcessorFactory [collection1]  webapp=/ywh/zv path=/update params={wt=javabin&version=2}{add=[111 (1586153159502331905)]} 0 0
   [junit4]   2> 1510775 INFO  (qtp10078827-15701) [    x:collection1] o.a.s.u.p.LogUpdateProcessorFactory [collection1]  webapp=/ywh/zv path=/update params={wt=javabin&version=2}{add=[112 (1586153159502331906)]} 0 0
   [junit4]   2> 1510776 INFO  (qtp18115770-15721) [    x:collection1] o.a.s.u.p.LogUpdateProcessorFactory [collection1]  webapp=/ywh/zv path=/update params={wt=javabin&version=2}{add=[112 (1586153159503380480)]} 0 0
   [junit4]   2> 1510776 INFO  (qtp10078827-15701) [    x:collection1] o.a.s.u.p.LogUpdateProcessorFactory [collection1]  webapp=/ywh/zv path=/update params={wt=javabin&version=2}{add=[113 (1586153159503380480)]} 0 0
   [junit4]   2> 1510777 INFO  (qtp18115770-15721) [    x:collection1] o.a.s.u.p.LogUpdateProcessorFactory [collection1]  webapp=/ywh/zv path=/update params={wt=javabin&version=2}{add=[113 (1586153159503380481)]} 0 0
   [junit4]   2> 1510777 INFO  (qtp10078827-15701) [    x:collection1] o.a.s.u.p.LogUpdateProcessorFactory [collection1]  webapp=/ywh/zv path=/update params={wt=javabin&version=2}{add=[114 (1586153159504429056)]} 0 0
   [junit4]   2> 1510777 INFO  (qtp18115770-15720) [    x:collection1] o.a.s.u.p.LogUpdateProcessorFactory [collection1]  webapp=/ywh/zv path=/update params={wt=javabin&version=2}{add=[114 (1586153159504429056)]} 0 0
   [junit4]   2> 1510778 INFO  (qtp10078827-15701) [    x:collection1] o.a.s.u.p.LogUpdateProcessorFactory [collection1]  webapp=/ywh/zv path=/update params={wt=javabin&version=2}{add=[115 (1586153159505477632)]} 0 0
   [junit4]   2> 1510778 INFO  (qtp18115770-15720) [    x:collection1] o.a.s.u.p.LogUpdateProcessorFactory [collection1]  webapp=/ywh/zv path=/update params={wt=javabin&version=2}{add=[115 (1586153159505477632)]} 0 0
   [junit4]   2> 1510778 INFO  (qtp10078827-15701) [    x:collection1] o.a.s.u.p.LogUpdateProcessorFactory [collection1]  webapp=/ywh/zv path=/update params={wt=javabin&version=2}{add=[116 (1586153159505477633)]} 0 0
   [junit4]   2> 1510779 INFO  (qtp18115770-15720) [    x:collection1] o.a.s.u.p.LogUpdateProcessorFactory [collection1]  webapp=/ywh/zv path=/update params={wt=javabin&version=2}{add=[116 (1586153159506526208)]} 0 0
   [junit4]   2> 1510779 INFO  (qtp10078827-15701) [    x:collection1] o.a.s.u.p.LogUpdateProcessorFactory [collection1]  webapp=/ywh/zv path=/update params={wt=javabin&version=2}{add=[117 (1586153159506526208)]} 0 0
   [junit4]   2> 1510779 INFO  (qtp18115770-15720) [    x:collection1] o.a.s.u.p.LogUpdateProcessorFactory [collection1]  webapp=/ywh/zv path=/update params={wt=javabin&version=2}{add=[117 (1586153159506526209)]} 0 0
   [junit4]   2> 1510780 INFO  (qtp10078827-15701) [    x:collection1] o.a.s.u.p.LogUpdateProcessorFactory [collection1]  webapp=/ywh/zv path=/update params={wt=javabin&version=2}{add=[118 (1586153159507574784)]} 0 0
   [junit4]   2> 1510780 INFO  (qtp18115770-15720) [    x:collection1] o.a.s.u.p.LogUpdateProcessorFactory [collection1]  webapp=/ywh/zv path=/update params={wt=javabin&version=2}{add=[118 (1586153159507574784)]} 0 0
   [junit4]   2> 1510780 INFO  (qtp10078827-15701) [    x:collection1] o.a.s.u.p.LogUpdateProcessorFactory [collection1]  webapp=/ywh/zv path=/update params={wt=javabin&version=2}{add=[119 (1586153159507574785)]} 0 0
   [junit4]   2> 1510783 INFO  (qtp18115770-15720) [    x:collection1] o.a.s.u.p.LogUpdateProcessorFactory [collection1]  webapp=/ywh/zv path=/update params={wt=javabin&version=2}{add=[119 (1586153159510720512)]} 0 0
   [junit4]   2> 1510783 INFO  (qtp10078827-15701) [    x:collection1] o.a.s.u.p.LogUpdateProcessorFactory [collection1]  webapp=/ywh/zv path=/update params={wt=javabin&version=2}{add=[120 (1586153159510720512)]} 0 0
   [junit4]   2> 1510784 INFO  (qtp18115770-15720) [    x:collection1] o.a.s.u.p.LogUpdateProcessorFactory [collection1]  webapp=/ywh/zv path=/update params={wt=javabin&version=2}{add=[120 (1586153159511769088)]} 0 0
   [junit4]   2> 1510784 INFO  (qtp10078827-15697) [    x:collection1] o.a.s.u.p.LogUpdateProcessorFactory [collection1]  webapp=/ywh/zv path=/update params={wt=javabin&version=2}{add=[121 (1586153159511769088)]} 0 0
   [junit4]   2> 1510785 INFO  (qtp18115770-15717) [    x:collection1] o.a.s.u.p.LogUpdateProcessorFactory [collection1]  webapp=/ywh/zv path=/update params={wt=javabin&version=2}{add=[121 (1586153159512817664)]} 0 0
   [junit4]   2> 1510785 INFO  (qtp10078827-15707) [    x:collection1] o.a.s.u.p.LogUpdateProcessorFactory [collection1]  webapp=/ywh/zv path=/update params={wt=javabin&version=2}{add=[122 (1586153159512817664)]} 0 0
   [junit4]   2> 1510785 INFO  (qtp18115770-15728) [    x:collection1] o.a.s.u.p.LogUpdateProcessorFactory [collection1]  webapp=/ywh/zv path=/update params={wt=javabin&version=2}{add=[122 (1586153159512817665)]} 0 0
   [junit4]   2> 1510786 INFO  (qtp10078827-15703) [    x:collection1] o.a.s.u.p.LogUpdateProcessorFactory [collection1]  webapp=/ywh/zv path=/update params={wt=javabin&version=2}{add=[123 (1586153159513866240)]} 0 0
   [junit4]   2> 1510786 INFO  (qtp18115770-15728) [    x:collection1] o.a.s.u.p.LogUpdateProcessorFactory [collection1]  webapp=/ywh/zv path=/update params={wt=javabin&version=2}{add=[123 (1586153159513866240)]} 0 0
   [junit4]   2> 1510786 INFO  (qtp10078827-15703) [    x:collection1] o.a.s.u.p.LogUpdateProcessorFactory [collection1]  webapp=/ywh/zv path=/update params={wt=javabin&version=2}{add=[124 (1586153159513866241)]} 0 0
   [junit4]   2> 1510787 INFO  (qtp18115770-15728) [    x:collection1] o.a.s.u.p.LogUpdateProcessorFactory [collection1]  webapp=/ywh/zv path=/update params={wt=javabin&version=2}{add=[124 (1586153159514914816)]} 0 0
   [junit4]   2> 1510788 INFO  (qtp10078827-15703) [    x:collection1] o.a.s.u.p.LogUpdateProcessorFactory [collection1]  webapp=/ywh/zv path=/update params={wt=javabin&version=2}{add=[125 (1586153159514914816)]} 0 0
   [junit4]   2> 1510788 INFO  (qtp18115770-15724) [    x:collection1] o.a.s.u.p.LogUpdateProcessorFactory [collection1]  webapp=/ywh/zv path=/update params={wt=javabin&version=2}{add=[125 (1586153159515963392)]} 0 0
   [junit4]   2> 1510788 INFO  (qtp10078827-15703) [    x:collection1] o.a.s.u.p.LogUpdateProcessorFactory [collection1]  webapp=/ywh/zv path=/update params={wt=javabin&version=2}{add=[126 (1586153159515963392)]} 0 0
   [junit4]   2> 1510789 INFO  (qtp18115770-15724) [    x:collection1] o.a.s.u.p.LogUpdateProcessorFactory [collection1]  webapp=/ywh/zv path=/update params={wt=javabin&version=2}{add=[126 (1586153159515963393)]} 0 0
   [junit4]   2> 1510789 INFO  (qtp10078827-15703) [    x:collection1] o.a.s.u.p.LogUpdateProcessorFactory [collection1]  webapp=/ywh/zv path=/update params={wt=javabin&version=2}{add=[127 (1586153159517011968)]} 0 0
   [junit4]   2> 1510789 INFO  (qtp18115770-15724) [    x:collection1] o.a.s.u.p.LogUpdateProcessorFactory [collection1]  webapp=/ywh/zv path=/update params={wt=javabin&version=2}{add=[127 (1586153159517011968)]} 0 0
   [junit4]   2> 1510789 INFO  (qtp10078827-15703) [    x:collection1] o.a.s.u.p.LogUpdateProcessorFactory [collection1]  webapp=/ywh/zv path=/update params={wt=javabin&version=2}{add=[128 (1586153159517011969)]} 0 0
   [junit4]   2> 1510790 INFO  (qtp18115770-15724) [    x:collection1] o.a.s.u.p.LogUpdateProcessorFactory [collection1]  webapp=/ywh/zv path=/update params={wt=javabin&version=2}{add=[128 (1586153159518060544)]} 0 0
   [junit4]   2> 1510790 INFO  (qtp10078827-15703) [    x:collection1] o.a.s.u.p.LogUpdateProcessorFactory [collection1]  webapp=/ywh/zv path=/update params={wt=javabin&version=2}{add=[129 (1586153159518060544)]} 0 0
   [junit4]   2> 1510790 INFO  (qtp18115770-15724) [    x:collection1] o.a.s.u.p.LogUpdateProcessorFactory [collection1]  webapp=/ywh/zv path=/update params={wt=javabin&version=2}{add=[129 (1586153159518060545)]} 0 0
   [junit4]   2> 1510790 INFO  (qtp10078827-15703) [    x:collection1] o.a.s.u.p.LogUpdateProcessorFactory [collection1]  webapp=/ywh/zv path=/update params={wt=javabin&version=2}{add=[130 (1586153159518060545)]} 0 0
   [junit4]   2> 1510791 INFO  (qtp18115770-15724) [    x:collection1] o.a.s.u.p.LogUpdateProcessorFactory [collection1]  webapp=/ywh/zv path=/update params={wt=javabin&version=2}{add=[130 (1586153159519109120)]} 0 0
   [junit4]   2> 1510791 INFO  (qtp10078827-15703) [    x:collection1] o.a.s.u.p.LogUpdateProcessorFactory [collection1]  webapp=/ywh/zv path=/update params={wt=javabin&version=2}{add=[131 (1586153159519109120)]} 0 0
   [junit4]   2> 1510791 INFO  (qtp18115770-15724) [    x:collection1] o.a.s.u.p.LogUpdateProcessorFactory [collection1]  webapp=/ywh/zv path=/update params={wt=javabin&version=2}{add=[131 (1586153159519109121)]} 0 0
   [junit4]   2> 1510792 INFO  (qtp10078827-15703) [    x:collection1] o.a.s.u.p.LogUpdateProcessorFactory [collection1]  webapp=/ywh/zv path=/update params={wt=javabin&version=2}{add=[132 (1586153159520157696)]} 0 0
   [junit4]   2> 1510792 INFO  (qtp18115770-15724) [    x:collection1] o.a.s.u.p.LogUpdateProcessorFactory [collection1]  webapp=/ywh/zv path=/update params={wt=javabin&version=2}{add=[132 (1586153159520157696)]} 0 0
   [junit4]   2> 1510792 INFO  (qtp10078827-15703) [    x:collection1] o.a.s.u.p.LogUpdateProcessorFactory [collection1]  webapp=/ywh/zv path=/update params={wt=javabin&version=2}{add=[133 (1586153159520157697)]} 0 0
   [junit4]   2> 1510793 INFO  (qtp18115770-15724) [    x:collection1] o.a.s.u.p.LogUpdateProcessorFactory [collection1]  webapp=/ywh/zv path=/update params={wt=javabin&version=2}{add=[133 (1586153159521206272)]} 0 0
   [junit4]   2> 1510793 INFO  (qtp10078827-15703) [    x:collection1] o.a.s.u.p.LogUpdateProcessorFactory [collection1]  webapp=/ywh/zv path=/update params={wt=javabin&version=2}{add=[134 (1586153159521206272)]} 0 0
   [junit4]   2> 1510793 INFO  (qtp18115770-15724) [    x:collection1] o.a.s.u.p.LogUpdateProcessorFactory [collection1]  webapp=/ywh/zv path=/update params={wt=javabin&version=2}{add=[134 (1586153159521206273)]} 0 0
   [junit4]   2> 1510794 INFO  (qtp10078827-15703) [    x:collection1] o.a.s.u.p.LogUpdateProcessorFactory [collection1]  webapp=/ywh/zv path=/update params={wt=javabin&version=2}{add=[135 (1586153159521206273)]} 0 0
   [junit4]   2> 1510794 INFO  (qtp18115770-15724) [    x:collection1] o.a.s.u.p.LogUpdateProcessorFactory [collection1]  webapp=/ywh/zv path=/update params={wt=javabin&version=2}{add=[135 (1586153159522254848)]} 0 0
   [junit4]   2> 1510794 INFO  (qtp10078827-15703) [    x:collection1] o.a.s.u.p.LogUpdateProcessorFactory [collection1]  webapp=/ywh/zv path=/update params={wt=javabin&version=2}{add=[136 (1586153159522254848)]} 0 0
   [junit4]   2> 1510794 INFO  (qtp18115770-15724) [    x:collection1] o.a.s.u.p.LogUpdateProcessorFactory [collection1]  webapp=/ywh/zv path=/update params={wt=javabin&version=2}{add=[136 (1586153159522254849)]} 0 0
   [junit4]   2> 1510795 INFO  (qtp10078827-15703) [    x:collection1] o.a.s.u.p.LogUpdateProcessorFactory [collection1]  webapp=/ywh/zv path=/update params={wt=javabin&version=2}{add=[137 (1586153159523303424)]} 0 0
   [junit4]   2> 1510795 INFO  (qtp18115770-15724) [    x:collection1] o.a.s.u.p.LogUpdateProcessorFactory [collection1]  webapp=/ywh/zv path=/update params={wt=javabin&version=2}{add=[137 (1586153159523303424)]} 0 0
   [junit4]   2> 1510795 INFO  (qtp10078827-15703) [    x:collection1] o.a.s.u.p.LogUpdateProcessorFactory [collection1]  webapp=/ywh/zv path=/update params={wt=javabin&version=2}{add=[138 (1586153159523303425)]} 0 0
   [junit4]   2> 1510796 INFO  (qtp18115770-15724) [    x:collection1] o.a.s.u.p.LogUpdateProcessorFactory [collection1]  webapp=/ywh/zv path=/update params={wt=javabin&version=2}{add=[138 (1586153159523303425)]} 0 0
   [junit4]   2> 1510796 INFO  (qtp10078827-15703) [    x:collection1] o.a.s.u.p.LogUpdateProcessorFactory [collection1]  webapp=/ywh/zv path=/update params={wt=javabin&version=2}{add=[139 (1586153159524352000)]} 0 0
   [junit4]   2> 1510796 INFO  (qtp18115770-15724) [    x:collection1] o.a.s.u.p.LogUpdateProcessorFactory [collection1]  webapp=/ywh/zv path=/update params={wt=javabin&version=2}{add=[139 (1586153159524352000)]} 0 0
   [junit4]   2> 1510796 INFO  (qtp10078827-15703) [    x:collection1] o.a.s.u.p.LogUpdateProcessorFactory [collection1]  webapp=/ywh/zv path=/update params={wt=javabin&version=2}{add=[140 (1586153159524352001)]} 0 0
   [junit4]   2> 1510797 INFO  (qtp18115770-15724) [    x:collection1] o.a.s.u.p.LogUpdateProcessorFactory [collection1]  webapp=/ywh/zv path=/update params={wt=javabin&version=2}{add=[140 (1586153159525400576)]} 0 0
   [junit4]   2> 1510797 INFO  (qtp10078827-15703) [    x:collection1] o.a.s.u.p.LogUpdateProcessorFactory [collection1]  webapp=/ywh/zv path=/update params={wt=javabin&version=2}{add=[141 (1586153159525400576)]} 0 0
   [junit4]   2> 1510797 INFO  (qtp18115770-15724) [    x:collection1] o.a.s.u.p.LogUpdateProcessorFactory [collection1]  webapp=/ywh/zv path=/update params={wt=javabin&version=2}{add=[141 (1586153159525400577)]} 0 0
   [junit4]   2> 1510798 INFO  (qtp10078827-15703) [    x:collection1] o.a.s.u.p.LogUpdateProcessorFactory [collection1]  webapp=/ywh/zv path=/update params={wt=javabin&version=2}{add=[142 (1586153159526449152)]} 0 0
   [junit4]   2> 1510798 INFO  (qtp18115770-15724) [    x:collection1] o.a.s.u.p.LogUpdateProcessorFactory [collection1]  webapp=/ywh/zv path=/update params={wt=javabin&version=2}{add=[142 (1586153159526449152)]} 0 0
   [junit4]   2> 1510798 INFO  (qtp10078827-15703) [    x:collection1] o.a.s.u.p.LogUpdateProcessorFactory [collection1]  webapp=/ywh/zv path=/update params={wt=javabin&version=2}{add=[143 (1586153159526449153)]} 0 0
   [junit4]   2> 1510798 INFO  (qtp18115770-15724) [    x:collection1] o.a.s.u.p.LogUpdateProcessorFactory [collection1]  webapp=/ywh/zv path=/update params={wt=javabin&version=2}{add=[143 (1586153159526449153)]} 0 0
   [junit4]   2> 1510799 INFO  (qtp10078827-15703) [    x:collection1] o.a.s.u.p.LogUpdateProcessorFactory [collection1]  webapp=/ywh/zv path=/update params={wt=javabin&version=2}{add=[144 (1586153159527497728)]} 0 0
   [junit4]   2> 1510799 INFO  (qtp18115770-15724) [    x:collection1] o.a.s.u.p.LogUpdateProcessorFactory [collection1]  webapp=/ywh/zv path=/update params={wt=javabin&version=2}{add=[144 (1586153159527497728)]} 0 0
   [junit4]   2> 1510799 INFO  (qtp10078827-15703) [    x:collection1] o.a.s.u.p.LogUpdateProcessorFactory [collection1]  webapp=/ywh/zv path=/update params={wt=javabin&version=2}{add=[145 (1586153159527497729)]} 0 0
   [junit4]   2> 1510799 INFO  (qtp18115770-15724) [    x:collection1] o.a.s.u.p.LogUpdateProcessorFactory [collection1]  webapp=/ywh/zv path=/update params={wt=javabin&version=2}{add=[145 (1586153159527497729)]} 0 0
   [junit4]   2> 1510800 INFO  (qtp10078827-15703) [    x:collection1] o.a.s.u.p.LogUpdateProcessorFactory [collection1]  webapp=/ywh/zv path=/update params={wt=javabin&version=2}{add=[146 (1586153159528546304)]} 0 0
   [junit4]   2> 1510800 INFO  (qtp18115770-15724) [    x:collection1] o.a.s.u.p.LogUpdateProcessorFactory [collection1]  webapp=/ywh/zv path=/update params={wt=javabin&version=2}{add=[146 (1586153159528546304)]} 0 0
   [junit4]   2> 1510800 INFO  (qtp10078827-15703) [    x:collection1] o.a.s.u.p.LogUpdateProcessorFactory [collection1]  webapp=/ywh/zv path=/update params={wt=javabin&version=2}{add=[147 (1586153159528546305)]} 0 0
   [junit4]   2> 1510800 INFO  (qtp18115770-15724) [    x:collection1] o.a.s.u.p.LogUpdateProcessorFactory [collection1]  webapp=/ywh/zv path=/update params={wt=javabin&version=2}{add=[147 (1586153159528546305)]} 0 0
   [junit4]   2> 1510800 INFO  (qtp10078827-15703) [    x:collection1] o.a.s.u.p.LogUpdateProcessorFactory [collection1]  webapp=/ywh/zv path=/update params={wt=javabin&version=2}{add=[148 (1586153159528546306)]} 0 0
   [junit4]   2> 1510800 INFO  (qtp18115770-15724) [    x:collection1] o.a.s.u.p.LogUpdateProcessorFactory [collection1]  webapp=/ywh/zv path=/update params={wt=javabin&version=2}{add=[148 (1586153159528546306)]} 0 0
   [junit4]   2> 1510801 INFO  (qtp10078827-15703) [    x:collection1] o.a.s.u.p.LogUpdateProcessorFactory [collection1]  webapp=/ywh/zv path=/update params={wt=javabin&version=2}{add=[149 (1586153159529594880)]} 0 0
   [junit4]   2> 1510801 INFO  (qtp18115770-15724) [    x:collection1] o.a.s.u.p.LogUpdateProcessorFactory [collection1]  webapp=/ywh/zv path=/update params={wt=javabin&version=2}{add=[149 (1586153159529594880)]} 0 0
   [junit4]   2> 1510801 INFO  (qtp10078827-15703) [    x:collection1] o.a.s.u.DirectUpdateHandler2 start commit{_version_=1586153159529594881,optimize=false,openSearcher=true,waitSearcher=true,expungeDeletes=false,softCommit=false,prepareCommit=false}
   [junit4]   2> 1510801 INFO  (qtp10078827-15703) [    x:collection1] o.a.s.u.SolrIndexWriter Calling setCommitData with IW:org.apache.solr.update.SolrIndexWriter@1807b56 commitCommandVersion:1586153159529594881
   [junit4]   2> 1510839 INFO  (qtp10078827-15703) [    x:collection1] o.a.s.s.SolrIndexSearcher Opening [Searcher@51d6ce[collection1] main]
   [junit4]   2> 1510840 INFO  (searcherExecutor-6457-thread-1-processing-x:collection1) [    x:collection1] o.a.s.c.SolrCore [collection1] Registered new searcher Searcher@51d6ce[collection1] main{ExitableDirectoryReader(UninvertingDirectoryReader(Uninverting(_0(7.3.0):c9) Uninverting(_1(7.3.0):c58)))}
   [junit4]   2> 1510840 INFO  (qtp10078827-15703) [    x:collection1] o.a.s.u.DirectUpdateHandler2 end_commit_flush
   [junit4]   2> 1510840 INFO  (qtp10078827-15703) [    x:collection1] o.a.s.u.p.LogUpdateProcessorFactory [collection1]  webapp=/ywh/zv path=/update params={waitSearcher=true&commit=true&softCommit=false&wt=javabin&version=2}{commit=} 0 38
   [junit4]   2> 1510841 INFO  (qtp18115770-15724) [    x:collection1] o.a.s.u.DirectUpdateHandler2 start commit{_version_=1586153159571537920,optimize=false,openSearcher=true,waitSearcher=true,expungeDeletes=false,softCommit=false,prepareCommit=false}
   [junit4]   2> 1510841 INFO  (qtp18115770-15724) [    x:collection1] o.a.s.u.SolrIndexWriter Calling setCommitData with IW:org.apache.solr.update.SolrIndexWriter@81f83 commitCommandVersion:1586153159571537920
   [junit4]   2> 1510850 INFO  (qtp18115770-15724) [    x:collection1] o.a.s.s.SolrIndexSearcher Opening [Searcher@1c72ce2[collection1] main]
   [junit4]   2> 1510851 INFO  (searcherExecutor-6468-thread-1-processing-x:collection1) [    x:collection1] o.a.s.c.SolrCore [collection1] Registered new searcher Searcher@1c72ce2[collection1] main{ExitableDirectoryReader(UninvertingDirectoryReader(Uninverting(_0(7.3.0):c9) Uninverting(_1(7.3.0):c58)))}
   [junit4]   2> 1510851 INFO  (qtp18115770-15724) [    x:collection1] o.a.s.u.DirectUpdateHandler2 end_commit_flush
   [junit4]   2> 1510851 INFO  (qtp18115770-15724) [    x:collection1] o.a.s.u.p.LogUpdateProcessorFactory [collection1]  webapp=/ywh/zv path=/update params={waitSearcher=true&commit=true&softCommit=false&wt=javabin&version=2}{commit=} 0 10
   [junit4]   2> 1510852 INFO  (qtp10078827-15700) [    x:collection1] o.a.s.c.S.Request [collection1]  webapp=/ywh/zv path=/select params={q=*:*&distrib=false&sort=one_i1_ml+desc&rows=13&wt=javabin&version=2} hits=67 status=0 QTime=0
   [junit4]   2> 1510858 INFO  (qtp18115770-15720) [    x:collection1] o.a.s.c.S.Request [collection1]  webapp=/ywh/zv path=/select params={df=text&distrib=false&fl=id&shards.purpose=4&start=0&fsv=true&sort=one_i1_ml+desc&shard.url=[ff01::114]:33332/ywh/zv|[ff01::083]:33332/ywh/zv|http://127.0.0.1:64050/ywh/zv/collection1&rows=13&version=2&q=*:*&NOW=1512673530182&isShard=true&wt=javabin} hits=67 status=0 QTime=0
   [junit4]   2> 1510859 INFO  (qtp18115770-15726) [    x:collection1] o.a.s.c.S.Request [collection1]  webapp=/ywh/zv path=/select params={q=*:*&df=text&distrib=false&shards.purpose=64&NOW=1512673530182&ids=11,12,13,1,2,3,4,5,6,7,8,9,10&isShard=true&shard.url=[ff01::114]:33332/ywh/zv|[ff01::083]:33332/ywh/zv|http://127.0.0.1:64050/ywh/zv/collection1&rows=13&wt=javabin&version=2} status=0 QTime=0
   [junit4]   2> 1510860 INFO  (qtp18115770-15724) [    x:collection1] o.a.s.c.S.Request [collection1]  webapp=/ywh/zv path=/select params={q=*:*&shards=[ff01::114]:33332/ywh/zv|[ff01::083]:33332/ywh/zv|http://127.0.0.1:64050/ywh/zv/collection1&sort=one_i1_ml+desc&rows=13&wt=javabin&version=2} hits=67 status=0 QTime=6
   [junit4]   2> 1510861 INFO  (qtp10078827-15700) [    x:collection1] o.a.s.c.S.Request [collection1]  webapp=/ywh/zv path=/select params={q=*:*&distrib=false&sort=one_i1_ml+asc&rows=13&wt=javabin&version=2} hits=67 status=0 QTime=0
   [junit4]   2> 1510862 INFO  (qtp18115770-15728) [    x:collection1] o.a.s.c.S.Request [collection1]  webapp=/ywh/zv path=/select params={df=text&distrib=false&fl=id&shards.purpose=4&start=0&fsv=true&sort=one_i1_ml+asc&shard.url=[ff01::213]:33332/ywh/zv|http://127.0.0.1:64050/ywh/zv/collection1&rows=13&version=2&q=*:*&NOW=1512673530190&isShard=true&wt=javabin} hits=67 status=0 QTime=0
   [junit4]   2> 1510863 INFO  (qtp18115770-15722) [    x:collection1] o.a.s.c.S.Request [collection1]  webapp=/ywh/zv path=/select params={q=*:*&df=text&distrib=false&shards.purpose=64&NOW=1512673530190&ids=11,12,13,1,2,3,4,5,6,7,8,9,10&isShard=true&shard.url=[ff01::213]:33332/ywh/zv|http://127.0.0.1:64050/ywh/zv/collection1&rows=13&wt=javabin&version=2} status=0 QTime=0
   [junit4]   2> 1510863 INFO  (qtp18115770-15723) [    x:collection1] o.a.s.c.S.Request [collection1]  webapp=/ywh/zv path=/select params={q=*:*&shards=[ff01::213]:33332/ywh/zv|http://127.0.0.1:64050/ywh/zv/collection1&sort=one_i1_ml+asc&rows=13&wt=javabin&version=2} hits=67 status=0 QTime=2
   [junit4]   2> 1510864 INFO  (qtp10078827-15700) [    x:collection1] o.a.s.c.S.Request [collection1]  webapp=/ywh/zv path=/select params={q=*:*&distrib=false&sort=one_i1_ml+desc,+id_i+asc&rows=200&wt=javabin&version=2} hits=67 status=0 QTime=0
   [junit4]   2> 1510866 INFO  (qtp18115770-15719) [    x:collection1] o.a.s.c.S.Request [collection1]  webapp=/ywh/zv path=/select params={df=text&distrib=false&fl=id&shards.purpose=4&start=0&fsv=true&sort=one_i1_ml+desc,+id_i+asc&shard.url=[ff01::083]:33332/ywh/zv|http://127.0.0.1:64050/ywh/zv/collection1&rows=200&version=2&q=*:*&NOW=1512673530195&isShard=true&wt=javabin} hits=67 status=0 QTime=0
   [junit4]   2> 1510868 INFO  (qtp18115770-15717) [    x:collection1] o.a.s.c.S.Request [collection1]  webapp=/ywh/zv path=/select params={q=*:*&df=text&distrib=false&shards.purpose=64&NOW=1512673530195&ids=110,111,112,113,114,115,116,117,118,119,10,11,12,13,14,15,16,17,120,121,122,1,123,2,124,3,125,4,126,5,127,6,128,7,129,8,9,130,131,132,133,134,135,136,137,138,139,140,141,142,143,144,100,145,101,146,102,147,103,148,104,149,105,106,107,108,109&isShard=true&shard.url=[ff01::083]:33332/ywh/zv|http://127.0.0.1:64050/ywh/zv/collection1&rows=200&wt=javabin&version=2} status=0 QTime=0
   [junit4]   2> 1510870 INFO  (qtp18115770-15721) [    x:collection1] o.a.s.c.S.Request [collection1]  webapp=/ywh/zv path=/select params={q=*:*&shards=[ff01::083]:33332/ywh/zv|http://127.0.0.1:64050/ywh/zv/collection1&sort=one_i1_ml+desc,+id_i+asc&rows=200&wt=javabin&version=2} hits=67 status=0 QTime=3
   [junit4]   2> 1510870 INFO  (qtp10078827-15701) [    x:collection1] o.a.s.c.S.Request [collection1]  webapp=/ywh/zv path=/select params={q=*:*&distrib=false&sort=one_i1_ml+asc,+id_i+desc&rows=200&wt=javabin&version=2} hits=67 status=0 QTime=0
   [junit4]   2> 1510872 INFO  (qtp18115770-15726) [    x:collection1] o.a.s.c.S.Request [collection1]  webapp=/ywh/zv path=/select params={df=text&distrib=false&fl=id&shards.purpose=4&start=0&fsv=true&sort=one_i1_ml+asc,+id_i+desc&shard.url=[ff01::114]:33332/ywh/zv|[ff01::213]:33332/ywh/zv|http://127.0.0.1:64050/ywh/zv/collection1&rows=200&version=2&q=*:*&NOW=1512673530200&isShard=true&wt=javabin} hits=67 status=0 QTime=0
   [junit4]   2> 1510873 INFO  (qtp18115770-15726) [    x:collection1] o.a.s.c.S.Request [collection1]  webapp=/ywh/zv path=/select params={q=*:*&df=text&distrib=false&shards.purpose=64&NOW=1512673530200&ids=110,111,112,113,114,115,116,117,118,119,10,11,12,13,14,15,16,17,120,121,122,1,123,2,124,3,125,4,126,5,127,6,128,7,129,8,9,130,131,132,133,134,135,136,137,138,139,140,141,142,143,100,144,101,145,102,146,103,147,104,148,105,149,106,107,108,109&isShard=true&shard.url=[ff01::114]:33332/ywh/zv|[ff01::213]:33332/ywh/zv|http://127.0.0.1:64050/ywh/zv/collection1&rows=200&wt=javabin&version=2} status=0 QTime=0
   [junit4]   2> 1510875 INFO  (qtp18115770-15720) [    x:collection1] o.a.s.c.S.Request [collection1]  webapp=/ywh/zv path=/select params={q=*:*&shards=[ff01::114]:33332/ywh/zv|[ff01::213]:33332/ywh/zv|http://127.0.0.1:64050/ywh/zv/collection1&sort=one_i1_ml+asc,+id_i+desc&rows=200&wt=javabin&version=2} hits=67 status=0 QTime=2
   [junit4]   2> 1510876 INFO  (qtp10078827-15701) [    x:collection1] o.a.s.c.S.Request [collection1]  webapp=/ywh/zv path=/select params={q=*:*&distrib=false&sort=three_l1_ml+desc&rows=13&wt=javabin&version=2} hits=67 status=0 QTime=0
   [junit4]   2> 1510877 INFO  (qtp18115770-15724) [    x:collection1] o.a.s.c.S.Request [collection1]  webapp=/ywh/zv path=/select params={df=text&distrib=false&fl=id&shards.purpose=4&start=0&fsv=true&sort=three_l1_ml+desc&shard.url=[ff01::114]:33332/ywh/zv|[ff01::213]:33332/ywh/zv|http://127.0.0.1:64050/ywh/zv/collection1|[ff01::083]:33332/ywh/zv&rows=13&version=2&q=*:*&NOW=1512673530205&isShard=true&wt=javabin} hits=67 status=0 QTime=0
   [junit4]   2> 1510877 INFO  (qtp18115770-15724) [    x:collection1] o.a.s.c.S.Request [collection1]  webapp=/ywh/zv path=/select params={q=*:*&df=text&distrib=false&shards.purpose=64&NOW=1512673530205&ids=11,12,13,1,2,3,4,5,6,7,8,9,10&isShard=true&shard.url=[ff01::114]:33332/ywh/zv|[ff01::213]:33332/ywh/zv|http://127.0.0.1:64050/ywh/zv/collection1|[ff01::083]:33332/ywh/zv&rows=13&wt=javabin&version=2} status=0 QTime=0
   [junit4]   2> 1510878 INFO  (qtp18115770-15726) [    x:collection1] o.a.s.c.S.Request [collection1]  webapp=/ywh/zv path=/select params={q=*:*&shards=[ff01::114]:33332/ywh/zv|[ff01::213]:33332/ywh/zv|http://127.0.0.1:64050/ywh/zv/collection1|[ff01::083]:33332/ywh/zv&sort=three_l1_ml+desc&rows=13&wt=javabin&version=2} hits=67 status=0 QTime=1
   [junit4]   2> 1510878 INFO  (qtp10078827-15701) [    x:collection1] o.a.s.c.S.Request [collection1]  webapp=/ywh/zv path=/select params={q=*:*&distrib=false&sort=three_l1_ml+asc&rows=13&wt=javabin&version=2} hits=67 status=0 QTime=0
   [junit4]   2> 1510879 INFO  (qtp18115770-15724) [    x:collection1] o.a.s.c.S.Request [collection1]  webapp=/ywh/zv path=/select params={df=text&distrib=false&fl=id&shards.purpose=4&start=0&fsv=true&sort=three_l1_ml+asc&shard.url=[ff01::213]:33332/ywh/zv|http://127.0.0.1:64050/ywh/zv/collection1&rows=13&version=2&q=*:*&NOW=1512673530208&isShard=true&wt=javabin} hits=67 status=0 QTime=0
   [junit4]   2> 1510880 INFO  (qtp18115770-15724) [    x:collection1] o.a

[...truncated too long message...]

at java.lang.Thread.run(Thread.java:748)
   [junit4] Completed [394/751 (2!)] on J0 in 7.06s, 1 test, 1 error <<< FAILURES!

[...truncated 35751 lines...]
-ecj-javadoc-lint-src:
    [mkdir] Created dir: C:\Users\jenkins\AppData\Local\Temp\ecj1065845816
 [ecj-lint] Compiling 188 source files to C:\Users\jenkins\AppData\Local\Temp\ecj1065845816
 [ecj-lint] ----------
 [ecj-lint] 1. WARNING in C:\Users\jenkins\workspace\Lucene-Solr-7.x-Windows\lucene\test-framework\src\java\org\apache\lucene\analysis\BaseTokenStreamTestCase.java (at line 801)
 [ecj-lint] 	ts = a.tokenStream("dummy", useCharFilter ? new MockCharFilter(reader, remainder) : reader);
 [ecj-lint] 	^^^^^^^^^^^^^^^^^^^^^^^^^^^^^^^^^^^^^^^^^^^^^^^^^^^^^^^^^^^^^^^^^^^^^^^^^^^^^^^^^^^^^^^^^^^
 [ecj-lint] Resource leak: 'ts' is not closed at this location
 [ecj-lint] ----------
 [ecj-lint] 2. WARNING in C:\Users\jenkins\workspace\Lucene-Solr-7.x-Windows\lucene\test-framework\src\java\org\apache\lucene\analysis\BaseTokenStreamTestCase.java (at line 837)
 [ecj-lint] 	reader = new MockReaderWrapper(random, reader);
 [ecj-lint] 	^^^^^^^^^^^^^^^^^^^^^^^^^^^^^^^^^^^^^^^^^^^^^^
 [ecj-lint] Resource leak: 'reader' is not closed at this location
 [ecj-lint] ----------
 [ecj-lint] 3. WARNING in C:\Users\jenkins\workspace\Lucene-Solr-7.x-Windows\lucene\test-framework\src\java\org\apache\lucene\analysis\BaseTokenStreamTestCase.java (at line 913)
 [ecj-lint] 	reader = new MockReaderWrapper(random, reader);
 [ecj-lint] 	^^^^^^^^^^^^^^^^^^^^^^^^^^^^^^^^^^^^^^^^^^^^^^
 [ecj-lint] Resource leak: 'reader' is not closed at this location
 [ecj-lint] ----------
 [ecj-lint] ----------
 [ecj-lint] 4. WARNING in C:\Users\jenkins\workspace\Lucene-Solr-7.x-Windows\lucene\test-framework\src\java\org\apache\lucene\codecs\mockrandom\MockRandomPostingsFormat.java (at line 260)
 [ecj-lint] 	throw new AssertionError();
 [ecj-lint] 	^^^^^^^^^^^^^^^^^^^^^^^^^^^
 [ecj-lint] Resource leak: 'postingsWriter' is not closed at this location
 [ecj-lint] ----------
 [ecj-lint] 5. WARNING in C:\Users\jenkins\workspace\Lucene-Solr-7.x-Windows\lucene\test-framework\src\java\org\apache\lucene\codecs\mockrandom\MockRandomPostingsFormat.java (at line 393)
 [ecj-lint] 	throw new AssertionError();
 [ecj-lint] 	^^^^^^^^^^^^^^^^^^^^^^^^^^^
 [ecj-lint] Resource leak: 'postingsReader' is not closed at this location
 [ecj-lint] ----------
 [ecj-lint] ----------
 [ecj-lint] 6. WARNING in C:\Users\jenkins\workspace\Lucene-Solr-7.x-Windows\lucene\test-framework\src\java\org\apache\lucene\geo\BaseGeoPointTestCase.java (at line 1271)
 [ecj-lint] 	RandomIndexWriter writer = new RandomIndexWriter(random(), dir, iwc);
 [ecj-lint] 	                  ^^^^^^
 [ecj-lint] Resource leak: 'writer' is never closed
 [ecj-lint] ----------
 [ecj-lint] ----------
 [ecj-lint] 7. WARNING in C:\Users\jenkins\workspace\Lucene-Solr-7.x-Windows\lucene\test-framework\src\java\org\apache\lucene\index\BaseCompressingDocValuesFormatTestCase.java (at line 47)
 [ecj-lint] 	final IndexWriter iwriter = new IndexWriter(dir, iwc);
 [ecj-lint] 	                  ^^^^^^^
 [ecj-lint] Resource leak: 'iwriter' is never closed
 [ecj-lint] ----------
 [ecj-lint] 8. WARNING in C:\Users\jenkins\workspace\Lucene-Solr-7.x-Windows\lucene\test-framework\src\java\org\apache\lucene\index\BaseCompressingDocValuesFormatTestCase.java (at line 81)
 [ecj-lint] 	final IndexWriter iwriter = new IndexWriter(dir, iwc);
 [ecj-lint] 	                  ^^^^^^^
 [ecj-lint] Resource leak: 'iwriter' is never closed
 [ecj-lint] ----------
 [ecj-lint] 9. WARNING in C:\Users\jenkins\workspace\Lucene-Solr-7.x-Windows\lucene\test-framework\src\java\org\apache\lucene\index\BaseCompressingDocValuesFormatTestCase.java (at line 108)
 [ecj-lint] 	final IndexWriter iwriter = new IndexWriter(dir, iwc);
 [ecj-lint] 	                  ^^^^^^^
 [ecj-lint] Resource leak: 'iwriter' is never closed
 [ecj-lint] ----------
 [ecj-lint] ----------
 [ecj-lint] 10. WARNING in C:\Users\jenkins\workspace\Lucene-Solr-7.x-Windows\lucene\test-framework\src\java\org\apache\lucene\index\BasePointsFormatTestCase.java (at line 622)
 [ecj-lint] 	w = new RandomIndexWriter(random(), dir, iwc);
 [ecj-lint] 	^^^^^^^^^^^^^^^^^^^^^^^^^^^^^^^^^^^^^^^^^^^^^
 [ecj-lint] Resource leak: 'w' is not closed at this location
 [ecj-lint] ----------
 [ecj-lint] ----------
 [ecj-lint] 11. WARNING in C:\Users\jenkins\workspace\Lucene-Solr-7.x-Windows\lucene\test-framework\src\java\org\apache\lucene\index\BasePostingsFormatTestCase.java (at line 314)
 [ecj-lint] 	Analyzer analyzer = new MockAnalyzer(random());
 [ecj-lint] 	         ^^^^^^^^
 [ecj-lint] Resource leak: 'analyzer' is never closed
 [ecj-lint] ----------
 [ecj-lint] 12. WARNING in C:\Users\jenkins\workspace\Lucene-Solr-7.x-Windows\lucene\test-framework\src\java\org\apache\lucene\index\BasePostingsFormatTestCase.java (at line 539)
 [ecj-lint] 	LineFileDocs docs = new LineFileDocs(random());
 [ecj-lint] 	             ^^^^
 [ecj-lint] Resource leak: 'docs' is never closed
 [ecj-lint] ----------
 [ecj-lint] ----------
 [ecj-lint] 13. WARNING in C:\Users\jenkins\workspace\Lucene-Solr-7.x-Windows\lucene\test-framework\src\java\org\apache\lucene\index\BaseStoredFieldsFormatTestCase.java (at line 464)
 [ecj-lint] 	throw ex.get();
 [ecj-lint] 	^^^^^^^^^^^^^^^
 [ecj-lint] Resource leak: 'iw' is not closed at this location
 [ecj-lint] ----------
 [ecj-lint] ----------
 [ecj-lint] 14. WARNING in C:\Users\jenkins\workspace\Lucene-Solr-7.x-Windows\lucene\test-framework\src\java\org\apache\lucene\search\ShardSearchingTestBase.java (at line 555)
 [ecj-lint] 	final LineFileDocs docs = new LineFileDocs(random());
 [ecj-lint] 	                   ^^^^
 [ecj-lint] Resource leak: 'docs' is never closed
 [ecj-lint] ----------
 [ecj-lint] ----------
 [ecj-lint] 15. WARNING in C:\Users\jenkins\workspace\Lucene-Solr-7.x-Windows\lucene\test-framework\src\java\org\apache\lucene\store\MockDirectoryWrapper.java (at line 881)
 [ecj-lint] 	new IndexWriter(in, iwc).rollback();
 [ecj-lint] 	^^^^^^^^^^^^^^^^^^^^^^^^
 [ecj-lint] Resource leak: '<unassigned Closeable value>' is never closed
 [ecj-lint] ----------
 [ecj-lint] ----------
 [ecj-lint] 16. ERROR in C:\Users\jenkins\workspace\Lucene-Solr-7.x-Windows\lucene\test-framework\src\java\org\apache\lucene\util\LuceneTestCase.java (at line 144)
 [ecj-lint] 	import static com.carrotsearch.randomizedtesting.RandomizedTest.frequently;
 [ecj-lint] 	              ^^^^^^^^^^^^^^^^^^^^^^^^^^^^^^^^^^^^^^^^^^^^^^^^^^^^^^^^^^^^
 [ecj-lint] The import com.carrotsearch.randomizedtesting.RandomizedTest.frequently is never used
 [ecj-lint] ----------
 [ecj-lint] ----------
 [ecj-lint] 17. WARNING in C:\Users\jenkins\workspace\Lucene-Solr-7.x-Windows\lucene\test-framework\src\java\org\apache\lucene\util\TestUtil.java (at line 1310)
 [ecj-lint] 	fs = ffs.getDelegate();
 [ecj-lint] 	^^^^^^^^^^^^^^^^^^^^^^
 [ecj-lint] Resource leak: 'fs' is not closed at this location
 [ecj-lint] ----------
 [ecj-lint] 18. WARNING in C:\Users\jenkins\workspace\Lucene-Solr-7.x-Windows\lucene\test-framework\src\java\org\apache\lucene\util\TestUtil.java (at line 1324)
 [ecj-lint] 	fs = ffs.getDelegate();
 [ecj-lint] 	^^^^^^^^^^^^^^^^^^^^^^
 [ecj-lint] Resource leak: 'fs' is not closed at this location
 [ecj-lint] ----------
 [ecj-lint] 19. WARNING in C:\Users\jenkins\workspace\Lucene-Solr-7.x-Windows\lucene\test-framework\src\java\org\apache\lucene\util\TestUtil.java (at line 1324)
 [ecj-lint] 	fs = ffs.getDelegate();
 [ecj-lint] 	^^^^^^^^^^^^^^^^^^^^^^
 [ecj-lint] Resource leak: 'fs' is not closed at this location
 [ecj-lint] ----------
 [ecj-lint] 20. WARNING in C:\Users\jenkins\workspace\Lucene-Solr-7.x-Windows\lucene\test-framework\src\java\org\apache\lucene\util\TestUtil.java (at line 1346)
 [ecj-lint] 	fs = ffs.getDelegate();
 [ecj-lint] 	^^^^^^^^^^^^^^^^^^^^^^
 [ecj-lint] Resource leak: 'fs' is not closed at this location
 [ecj-lint] ----------
 [ecj-lint] 21. WARNING in C:\Users\jenkins\workspace\Lucene-Solr-7.x-Windows\lucene\test-framework\src\java\org\apache\lucene\util\TestUtil.java (at line 1346)
 [ecj-lint] 	fs = ffs.getDelegate();
 [ecj-lint] 	^^^^^^^^^^^^^^^^^^^^^^
 [ecj-lint] Resource leak: 'fs' is not closed at this location
 [ecj-lint] ----------
 [ecj-lint] 22. WARNING in C:\Users\jenkins\workspace\Lucene-Solr-7.x-Windows\lucene\test-framework\src\java\org\apache\lucene\util\TestUtil.java (at line 1366)
 [ecj-lint] 	fs = ffs.getDelegate();
 [ecj-lint] 	^^^^^^^^^^^^^^^^^^^^^^
 [ecj-lint] Resource leak: 'fs' is not closed at this location
 [ecj-lint] ----------
 [ecj-lint] 23. WARNING in C:\Users\jenkins\workspace\Lucene-Solr-7.x-Windows\lucene\test-framework\src\java\org\apache\lucene\util\TestUtil.java (at line 1385)
 [ecj-lint] 	fs = ffs.getDelegate();
 [ecj-lint] 	^^^^^^^^^^^^^^^^^^^^^^
 [ecj-lint] Resource leak: 'fs' is not closed at this location
 [ecj-lint] ----------
 [ecj-lint] 23 problems (1 error, 22 warnings)

BUILD FAILED
C:\Users\jenkins\workspace\Lucene-Solr-7.x-Windows\build.xml:835: The following error occurred while executing this line:
C:\Users\jenkins\workspace\Lucene-Solr-7.x-Windows\build.xml:101: The following error occurred while executing this line:
C:\Users\jenkins\workspace\Lucene-Solr-7.x-Windows\lucene\build.xml:203: The following error occurred while executing this line:
C:\Users\jenkins\workspace\Lucene-Solr-7.x-Windows\lucene\common-build.xml:2105: The following error occurred while executing this line:
C:\Users\jenkins\workspace\Lucene-Solr-7.x-Windows\lucene\common-build.xml:2144: Compile failed; see the compiler error output for details.

Total time: 94 minutes 36 seconds
Build step 'Invoke Ant' marked build as failure
Archiving artifacts
[WARNINGS] Skipping publisher since build result is FAILURE
Recording test results
Email was triggered for: Failure - Any
Sending email for trigger: Failure - Any

Mime
View raw message