lucene-dev mailing list archives

Site index · List index
Message view « Date » · « Thread »
Top « Date » · « Thread »
From Apache Jenkins Server <jenk...@builds.apache.org>
Subject [JENKINS] Lucene-Solr-Tests-master - Build # 2201 - Still Failing
Date Fri, 01 Dec 2017 16:11:58 GMT
Build: https://builds.apache.org/job/Lucene-Solr-Tests-master/2201/

3 tests failed.
FAILED:  org.apache.solr.security.TestPKIAuthenticationPlugin.test

Error Message:


Stack Trace:
java.lang.NullPointerException
	at __randomizedtesting.SeedInfo.seed([5968E87503AD728D:D13CD7AFAD511F75]:0)
	at org.apache.solr.security.TestPKIAuthenticationPlugin.test(TestPKIAuthenticationPlugin.java:102)
	at sun.reflect.NativeMethodAccessorImpl.invoke0(Native Method)
	at sun.reflect.NativeMethodAccessorImpl.invoke(NativeMethodAccessorImpl.java:62)
	at sun.reflect.DelegatingMethodAccessorImpl.invoke(DelegatingMethodAccessorImpl.java:43)
	at java.lang.reflect.Method.invoke(Method.java:498)
	at com.carrotsearch.randomizedtesting.RandomizedRunner.invoke(RandomizedRunner.java:1737)
	at com.carrotsearch.randomizedtesting.RandomizedRunner$8.evaluate(RandomizedRunner.java:934)
	at com.carrotsearch.randomizedtesting.RandomizedRunner$9.evaluate(RandomizedRunner.java:970)
	at com.carrotsearch.randomizedtesting.RandomizedRunner$10.evaluate(RandomizedRunner.java:984)
	at com.carrotsearch.randomizedtesting.rules.SystemPropertiesRestoreRule$1.evaluate(SystemPropertiesRestoreRule.java:57)
	at org.apache.lucene.util.TestRuleSetupTeardownChained$1.evaluate(TestRuleSetupTeardownChained.java:49)
	at org.apache.lucene.util.AbstractBeforeAfterRule$1.evaluate(AbstractBeforeAfterRule.java:45)
	at org.apache.lucene.util.TestRuleThreadAndTestName$1.evaluate(TestRuleThreadAndTestName.java:48)
	at org.apache.lucene.util.TestRuleIgnoreAfterMaxFailures$1.evaluate(TestRuleIgnoreAfterMaxFailures.java:64)
	at org.apache.lucene.util.TestRuleMarkFailure$1.evaluate(TestRuleMarkFailure.java:47)
	at com.carrotsearch.randomizedtesting.rules.StatementAdapter.evaluate(StatementAdapter.java:36)
	at com.carrotsearch.randomizedtesting.ThreadLeakControl$StatementRunner.run(ThreadLeakControl.java:368)
	at com.carrotsearch.randomizedtesting.ThreadLeakControl.forkTimeoutingTask(ThreadLeakControl.java:817)
	at com.carrotsearch.randomizedtesting.ThreadLeakControl$3.evaluate(ThreadLeakControl.java:468)
	at com.carrotsearch.randomizedtesting.RandomizedRunner.runSingleTest(RandomizedRunner.java:943)
	at com.carrotsearch.randomizedtesting.RandomizedRunner$5.evaluate(RandomizedRunner.java:829)
	at com.carrotsearch.randomizedtesting.RandomizedRunner$6.evaluate(RandomizedRunner.java:879)
	at com.carrotsearch.randomizedtesting.RandomizedRunner$7.evaluate(RandomizedRunner.java:890)
	at com.carrotsearch.randomizedtesting.rules.StatementAdapter.evaluate(StatementAdapter.java:36)
	at com.carrotsearch.randomizedtesting.rules.SystemPropertiesRestoreRule$1.evaluate(SystemPropertiesRestoreRule.java:57)
	at org.apache.lucene.util.AbstractBeforeAfterRule$1.evaluate(AbstractBeforeAfterRule.java:45)
	at com.carrotsearch.randomizedtesting.rules.StatementAdapter.evaluate(StatementAdapter.java:36)
	at org.apache.lucene.util.TestRuleStoreClassName$1.evaluate(TestRuleStoreClassName.java:41)
	at com.carrotsearch.randomizedtesting.rules.NoShadowingOrOverridesOnMethodsRule$1.evaluate(NoShadowingOrOverridesOnMethodsRule.java:40)
	at com.carrotsearch.randomizedtesting.rules.NoShadowingOrOverridesOnMethodsRule$1.evaluate(NoShadowingOrOverridesOnMethodsRule.java:40)
	at com.carrotsearch.randomizedtesting.rules.StatementAdapter.evaluate(StatementAdapter.java:36)
	at com.carrotsearch.randomizedtesting.rules.StatementAdapter.evaluate(StatementAdapter.java:36)
	at com.carrotsearch.randomizedtesting.rules.StatementAdapter.evaluate(StatementAdapter.java:36)
	at org.apache.lucene.util.TestRuleAssertionsRequired$1.evaluate(TestRuleAssertionsRequired.java:53)
	at org.apache.lucene.util.TestRuleMarkFailure$1.evaluate(TestRuleMarkFailure.java:47)
	at org.apache.lucene.util.TestRuleIgnoreAfterMaxFailures$1.evaluate(TestRuleIgnoreAfterMaxFailures.java:64)
	at org.apache.lucene.util.TestRuleIgnoreTestSuites$1.evaluate(TestRuleIgnoreTestSuites.java:54)
	at com.carrotsearch.randomizedtesting.rules.StatementAdapter.evaluate(StatementAdapter.java:36)
	at com.carrotsearch.randomizedtesting.ThreadLeakControl$StatementRunner.run(ThreadLeakControl.java:368)
	at java.lang.Thread.run(Thread.java:748)


FAILED:  org.apache.solr.cloud.autoscaling.TriggerIntegrationTest.testTriggerThrottling

Error Message:
Both triggers should have fired by now

Stack Trace:
java.lang.AssertionError: Both triggers should have fired by now
	at __randomizedtesting.SeedInfo.seed([5968E87503AD728D:A24A4050D107911F]:0)
	at org.junit.Assert.fail(Assert.java:93)
	at org.apache.solr.cloud.autoscaling.TriggerIntegrationTest.testTriggerThrottling(TriggerIntegrationTest.java:205)
	at sun.reflect.NativeMethodAccessorImpl.invoke0(Native Method)
	at sun.reflect.NativeMethodAccessorImpl.invoke(NativeMethodAccessorImpl.java:62)
	at sun.reflect.DelegatingMethodAccessorImpl.invoke(DelegatingMethodAccessorImpl.java:43)
	at java.lang.reflect.Method.invoke(Method.java:498)
	at com.carrotsearch.randomizedtesting.RandomizedRunner.invoke(RandomizedRunner.java:1737)
	at com.carrotsearch.randomizedtesting.RandomizedRunner$8.evaluate(RandomizedRunner.java:934)
	at com.carrotsearch.randomizedtesting.RandomizedRunner$9.evaluate(RandomizedRunner.java:970)
	at com.carrotsearch.randomizedtesting.RandomizedRunner$10.evaluate(RandomizedRunner.java:984)
	at com.carrotsearch.randomizedtesting.rules.SystemPropertiesRestoreRule$1.evaluate(SystemPropertiesRestoreRule.java:57)
	at org.apache.lucene.util.TestRuleSetupTeardownChained$1.evaluate(TestRuleSetupTeardownChained.java:49)
	at org.apache.lucene.util.AbstractBeforeAfterRule$1.evaluate(AbstractBeforeAfterRule.java:45)
	at org.apache.lucene.util.TestRuleThreadAndTestName$1.evaluate(TestRuleThreadAndTestName.java:48)
	at org.apache.lucene.util.TestRuleIgnoreAfterMaxFailures$1.evaluate(TestRuleIgnoreAfterMaxFailures.java:64)
	at org.apache.lucene.util.TestRuleMarkFailure$1.evaluate(TestRuleMarkFailure.java:47)
	at com.carrotsearch.randomizedtesting.rules.StatementAdapter.evaluate(StatementAdapter.java:36)
	at com.carrotsearch.randomizedtesting.ThreadLeakControl$StatementRunner.run(ThreadLeakControl.java:368)
	at com.carrotsearch.randomizedtesting.ThreadLeakControl.forkTimeoutingTask(ThreadLeakControl.java:817)
	at com.carrotsearch.randomizedtesting.ThreadLeakControl$3.evaluate(ThreadLeakControl.java:468)
	at com.carrotsearch.randomizedtesting.RandomizedRunner.runSingleTest(RandomizedRunner.java:943)
	at com.carrotsearch.randomizedtesting.RandomizedRunner$5.evaluate(RandomizedRunner.java:829)
	at com.carrotsearch.randomizedtesting.RandomizedRunner$6.evaluate(RandomizedRunner.java:879)
	at com.carrotsearch.randomizedtesting.RandomizedRunner$7.evaluate(RandomizedRunner.java:890)
	at com.carrotsearch.randomizedtesting.rules.StatementAdapter.evaluate(StatementAdapter.java:36)
	at com.carrotsearch.randomizedtesting.rules.SystemPropertiesRestoreRule$1.evaluate(SystemPropertiesRestoreRule.java:57)
	at org.apache.lucene.util.AbstractBeforeAfterRule$1.evaluate(AbstractBeforeAfterRule.java:45)
	at com.carrotsearch.randomizedtesting.rules.StatementAdapter.evaluate(StatementAdapter.java:36)
	at org.apache.lucene.util.TestRuleStoreClassName$1.evaluate(TestRuleStoreClassName.java:41)
	at com.carrotsearch.randomizedtesting.rules.NoShadowingOrOverridesOnMethodsRule$1.evaluate(NoShadowingOrOverridesOnMethodsRule.java:40)
	at com.carrotsearch.randomizedtesting.rules.NoShadowingOrOverridesOnMethodsRule$1.evaluate(NoShadowingOrOverridesOnMethodsRule.java:40)
	at com.carrotsearch.randomizedtesting.rules.StatementAdapter.evaluate(StatementAdapter.java:36)
	at com.carrotsearch.randomizedtesting.rules.StatementAdapter.evaluate(StatementAdapter.java:36)
	at com.carrotsearch.randomizedtesting.rules.StatementAdapter.evaluate(StatementAdapter.java:36)
	at org.apache.lucene.util.TestRuleAssertionsRequired$1.evaluate(TestRuleAssertionsRequired.java:53)
	at org.apache.lucene.util.TestRuleMarkFailure$1.evaluate(TestRuleMarkFailure.java:47)
	at org.apache.lucene.util.TestRuleIgnoreAfterMaxFailures$1.evaluate(TestRuleIgnoreAfterMaxFailures.java:64)
	at org.apache.lucene.util.TestRuleIgnoreTestSuites$1.evaluate(TestRuleIgnoreTestSuites.java:54)
	at com.carrotsearch.randomizedtesting.rules.StatementAdapter.evaluate(StatementAdapter.java:36)
	at com.carrotsearch.randomizedtesting.ThreadLeakControl$StatementRunner.run(ThreadLeakControl.java:368)
	at java.lang.Thread.run(Thread.java:748)


FAILED:  org.apache.solr.client.solrj.io.stream.StreamExpressionTest.testClassifyStream

Error Message:
Error from server at http://127.0.0.1:38440/solr: KeeperErrorCode = NoNode for /overseer/collection-queue-work/qnr-0000000023

Stack Trace:
org.apache.solr.client.solrj.impl.HttpSolrClient$RemoteSolrException: Error from server at http://127.0.0.1:38440/solr: KeeperErrorCode = NoNode for /overseer/collection-queue-work/qnr-0000000023
	at __randomizedtesting.SeedInfo.seed([D867925B91B04B56:7D2F0863A8E852C2]:0)
	at org.apache.solr.client.solrj.impl.HttpSolrClient.executeMethod(HttpSolrClient.java:643)
	at org.apache.solr.client.solrj.impl.HttpSolrClient.request(HttpSolrClient.java:255)
	at org.apache.solr.client.solrj.impl.HttpSolrClient.request(HttpSolrClient.java:244)
	at org.apache.solr.client.solrj.impl.LBHttpSolrClient.doRequest(LBHttpSolrClient.java:483)
	at org.apache.solr.client.solrj.impl.LBHttpSolrClient.request(LBHttpSolrClient.java:413)
	at org.apache.solr.client.solrj.impl.CloudSolrClient.sendRequest(CloudSolrClient.java:1103)
	at org.apache.solr.client.solrj.impl.CloudSolrClient.requestWithRetryOnStaleState(CloudSolrClient.java:883)
	at org.apache.solr.client.solrj.impl.CloudSolrClient.request(CloudSolrClient.java:816)
	at org.apache.solr.client.solrj.SolrRequest.process(SolrRequest.java:194)
	at org.apache.solr.client.solrj.SolrRequest.process(SolrRequest.java:211)
	at org.apache.solr.client.solrj.io.stream.StreamExpressionTest.testClassifyStream(StreamExpressionTest.java:4869)
	at sun.reflect.NativeMethodAccessorImpl.invoke0(Native Method)
	at sun.reflect.NativeMethodAccessorImpl.invoke(NativeMethodAccessorImpl.java:62)
	at sun.reflect.DelegatingMethodAccessorImpl.invoke(DelegatingMethodAccessorImpl.java:43)
	at java.lang.reflect.Method.invoke(Method.java:498)
	at com.carrotsearch.randomizedtesting.RandomizedRunner.invoke(RandomizedRunner.java:1737)
	at com.carrotsearch.randomizedtesting.RandomizedRunner$8.evaluate(RandomizedRunner.java:934)
	at com.carrotsearch.randomizedtesting.RandomizedRunner$9.evaluate(RandomizedRunner.java:970)
	at com.carrotsearch.randomizedtesting.RandomizedRunner$10.evaluate(RandomizedRunner.java:984)
	at com.carrotsearch.randomizedtesting.rules.SystemPropertiesRestoreRule$1.evaluate(SystemPropertiesRestoreRule.java:57)
	at org.apache.lucene.util.TestRuleSetupTeardownChained$1.evaluate(TestRuleSetupTeardownChained.java:49)
	at org.apache.lucene.util.AbstractBeforeAfterRule$1.evaluate(AbstractBeforeAfterRule.java:45)
	at org.apache.lucene.util.TestRuleThreadAndTestName$1.evaluate(TestRuleThreadAndTestName.java:48)
	at org.apache.lucene.util.TestRuleIgnoreAfterMaxFailures$1.evaluate(TestRuleIgnoreAfterMaxFailures.java:64)
	at org.apache.lucene.util.TestRuleMarkFailure$1.evaluate(TestRuleMarkFailure.java:47)
	at com.carrotsearch.randomizedtesting.rules.StatementAdapter.evaluate(StatementAdapter.java:36)
	at com.carrotsearch.randomizedtesting.ThreadLeakControl$StatementRunner.run(ThreadLeakControl.java:368)
	at com.carrotsearch.randomizedtesting.ThreadLeakControl.forkTimeoutingTask(ThreadLeakControl.java:817)
	at com.carrotsearch.randomizedtesting.ThreadLeakControl$3.evaluate(ThreadLeakControl.java:468)
	at com.carrotsearch.randomizedtesting.RandomizedRunner.runSingleTest(RandomizedRunner.java:943)
	at com.carrotsearch.randomizedtesting.RandomizedRunner$5.evaluate(RandomizedRunner.java:829)
	at com.carrotsearch.randomizedtesting.RandomizedRunner$6.evaluate(RandomizedRunner.java:879)
	at com.carrotsearch.randomizedtesting.RandomizedRunner$7.evaluate(RandomizedRunner.java:890)
	at com.carrotsearch.randomizedtesting.rules.StatementAdapter.evaluate(StatementAdapter.java:36)
	at com.carrotsearch.randomizedtesting.rules.SystemPropertiesRestoreRule$1.evaluate(SystemPropertiesRestoreRule.java:57)
	at org.apache.lucene.util.AbstractBeforeAfterRule$1.evaluate(AbstractBeforeAfterRule.java:45)
	at com.carrotsearch.randomizedtesting.rules.StatementAdapter.evaluate(StatementAdapter.java:36)
	at org.apache.lucene.util.TestRuleStoreClassName$1.evaluate(TestRuleStoreClassName.java:41)
	at com.carrotsearch.randomizedtesting.rules.NoShadowingOrOverridesOnMethodsRule$1.evaluate(NoShadowingOrOverridesOnMethodsRule.java:40)
	at com.carrotsearch.randomizedtesting.rules.NoShadowingOrOverridesOnMethodsRule$1.evaluate(NoShadowingOrOverridesOnMethodsRule.java:40)
	at com.carrotsearch.randomizedtesting.rules.StatementAdapter.evaluate(StatementAdapter.java:36)
	at com.carrotsearch.randomizedtesting.rules.StatementAdapter.evaluate(StatementAdapter.java:36)
	at com.carrotsearch.randomizedtesting.rules.StatementAdapter.evaluate(StatementAdapter.java:36)
	at org.apache.lucene.util.TestRuleAssertionsRequired$1.evaluate(TestRuleAssertionsRequired.java:53)
	at org.apache.lucene.util.TestRuleMarkFailure$1.evaluate(TestRuleMarkFailure.java:47)
	at org.apache.lucene.util.TestRuleIgnoreAfterMaxFailures$1.evaluate(TestRuleIgnoreAfterMaxFailures.java:64)
	at org.apache.lucene.util.TestRuleIgnoreTestSuites$1.evaluate(TestRuleIgnoreTestSuites.java:54)
	at com.carrotsearch.randomizedtesting.rules.StatementAdapter.evaluate(StatementAdapter.java:36)
	at com.carrotsearch.randomizedtesting.ThreadLeakControl$StatementRunner.run(ThreadLeakControl.java:368)
	at java.lang.Thread.run(Thread.java:748)




Build Log:
[...truncated 11631 lines...]
   [junit4] Suite: org.apache.solr.security.TestPKIAuthenticationPlugin
   [junit4]   2> 170050 INFO  (SUITE-TestPKIAuthenticationPlugin-seed#[5968E87503AD728D]-worker) [    ] o.a.s.SolrTestCaseJ4 SecureRandom sanity checks: test.solr.allowed.securerandom=null & java.security.egd=file:/dev/./urandom
   [junit4]   2> Creating dataDir: /home/jenkins/jenkins-slave/workspace/Lucene-Solr-Tests-master/solr/build/solr-core/test/J0/temp/solr.security.TestPKIAuthenticationPlugin_5968E87503AD728D-001/init-core-data-001
   [junit4]   2> 170066 WARN  (SUITE-TestPKIAuthenticationPlugin-seed#[5968E87503AD728D]-worker) [    ] o.a.s.SolrTestCaseJ4 startTrackingSearchers: numOpens=10 numCloses=10
   [junit4]   2> 170066 INFO  (SUITE-TestPKIAuthenticationPlugin-seed#[5968E87503AD728D]-worker) [    ] o.a.s.SolrTestCaseJ4 Using TrieFields (NUMERIC_POINTS_SYSPROP=false) w/NUMERIC_DOCVALUES_SYSPROP=true
   [junit4]   2> 170068 INFO  (SUITE-TestPKIAuthenticationPlugin-seed#[5968E87503AD728D]-worker) [    ] o.a.s.SolrTestCaseJ4 Randomized ssl (true) and clientAuth (true) via: @org.apache.solr.util.RandomizeSSL(reason=, ssl=NaN, value=NaN, clientAuth=NaN)
   [junit4]   2> 170140 INFO  (TEST-TestPKIAuthenticationPlugin.test-seed#[5968E87503AD728D]) [    ] o.a.s.SolrTestCaseJ4 ###Starting test
   [junit4]   2> 181096 ERROR (TEST-TestPKIAuthenticationPlugin.test-seed#[5968E87503AD728D]) [    ] o.a.s.s.PKIAuthenticationPlugin Invalid key request timestamp: 1512135215651 , received timestamp: 1512135225842 , TTL: 10000
   [junit4]   2> 181097 INFO  (TEST-TestPKIAuthenticationPlugin.test-seed#[5968E87503AD728D]) [    ] o.a.s.SolrTestCaseJ4 ###Ending test
   [junit4]   2> NOTE: reproduce with: ant test  -Dtestcase=TestPKIAuthenticationPlugin -Dtests.method=test -Dtests.seed=5968E87503AD728D -Dtests.multiplier=2 -Dtests.slow=true -Dtests.locale=it-IT -Dtests.timezone=America/Tortola -Dtests.asserts=true -Dtests.file.encoding=US-ASCII
   [junit4] ERROR   11.1s J0 | TestPKIAuthenticationPlugin.test <<<
   [junit4]    > Throwable #1: java.lang.NullPointerException
   [junit4]    > 	at __randomizedtesting.SeedInfo.seed([5968E87503AD728D:D13CD7AFAD511F75]:0)
   [junit4]    > 	at org.apache.solr.security.TestPKIAuthenticationPlugin.test(TestPKIAuthenticationPlugin.java:102)
   [junit4]    > 	at java.lang.Thread.run(Thread.java:748)
   [junit4]   2> NOTE: leaving temporary files on disk at: /home/jenkins/jenkins-slave/workspace/Lucene-Solr-Tests-master/solr/build/solr-core/test/J0/temp/solr.security.TestPKIAuthenticationPlugin_5968E87503AD728D-001
   [junit4]   2> NOTE: test params are: codec=Asserting(Lucene70), sim=Asserting(org.apache.lucene.search.similarities.AssertingSimilarity@34a207ff), locale=it-IT, timezone=America/Tortola
   [junit4]   2> NOTE: Linux 4.4.0-83-generic amd64/Oracle Corporation 1.8.0_152 (64-bit)/cpus=4,threads=1,free=156971368,total=274726912
   [junit4]   2> NOTE: All tests run in this JVM: [ReplicaListTransformerTest, TestBinaryResponseWriter, DistributedMLTComponentTest, TestHighlightDedupGrouping, TestComponentsName, SuggestComponentContextFilterQueryTest, TestPKIAuthenticationPlugin]
   [junit4] Completed [13/751 (1!)] on J0 in 11.32s, 1 test, 1 error <<< FAILURES!

[...truncated 1251 lines...]
   [junit4] Suite: org.apache.solr.cloud.autoscaling.TriggerIntegrationTest
   [junit4]   2> 3664058 INFO  (SUITE-TriggerIntegrationTest-seed#[5968E87503AD728D]-worker) [    ] o.a.s.SolrTestCaseJ4 SecureRandom sanity checks: test.solr.allowed.securerandom=null & java.security.egd=file:/dev/./urandom
   [junit4]   2> Creating dataDir: /home/jenkins/jenkins-slave/workspace/Lucene-Solr-Tests-master/solr/build/solr-core/test/J0/temp/solr.cloud.autoscaling.TriggerIntegrationTest_5968E87503AD728D-001/init-core-data-001
   [junit4]   2> 3664059 WARN  (SUITE-TriggerIntegrationTest-seed#[5968E87503AD728D]-worker) [    ] o.a.s.SolrTestCaseJ4 startTrackingSearchers: numOpens=62 numCloses=62
   [junit4]   2> 3664059 INFO  (SUITE-TriggerIntegrationTest-seed#[5968E87503AD728D]-worker) [    ] o.a.s.SolrTestCaseJ4 Using PointFields (NUMERIC_POINTS_SYSPROP=true) w/NUMERIC_DOCVALUES_SYSPROP=false
   [junit4]   2> 3664061 INFO  (SUITE-TriggerIntegrationTest-seed#[5968E87503AD728D]-worker) [    ] o.a.s.SolrTestCaseJ4 Randomized ssl (true) and clientAuth (true) via: @org.apache.solr.util.RandomizeSSL(reason=, ssl=NaN, value=NaN, clientAuth=NaN)
   [junit4]   2> 3664074 INFO  (SUITE-TriggerIntegrationTest-seed#[5968E87503AD728D]-worker) [    ] o.a.s.c.MiniSolrCloudCluster Starting cluster of 2 servers in /home/jenkins/jenkins-slave/workspace/Lucene-Solr-Tests-master/solr/build/solr-core/test/J0/temp/solr.cloud.autoscaling.TriggerIntegrationTest_5968E87503AD728D-001/tempDir-001
   [junit4]   2> 3664074 INFO  (SUITE-TriggerIntegrationTest-seed#[5968E87503AD728D]-worker) [    ] o.a.s.c.ZkTestServer STARTING ZK TEST SERVER
   [junit4]   2> 3664094 INFO  (Thread-2914) [    ] o.a.s.c.ZkTestServer client port:0.0.0.0/0.0.0.0:0
   [junit4]   2> 3664094 INFO  (Thread-2914) [    ] o.a.s.c.ZkTestServer Starting server
   [junit4]   2> 3664184 ERROR (Thread-2914) [    ] o.a.z.s.ZooKeeperServer ZKShutdownHandler is not registered, so ZooKeeper server won't take any action on ERROR or SHUTDOWN server state changes
   [junit4]   2> 3664257 INFO  (SUITE-TriggerIntegrationTest-seed#[5968E87503AD728D]-worker) [    ] o.a.s.c.ZkTestServer start zk server on port:40497
   [junit4]   2> 3664555 INFO  (jetty-launcher-1551-thread-1) [    ] o.e.j.s.Server jetty-9.3.20.v20170531
   [junit4]   2> 3664688 INFO  (jetty-launcher-1551-thread-2) [    ] o.e.j.s.Server jetty-9.3.20.v20170531
   [junit4]   2> 3664802 INFO  (jetty-launcher-1551-thread-1) [    ] o.e.j.s.h.ContextHandler Started o.e.j.s.ServletContextHandler@3fc9272e{/solr,null,AVAILABLE}
   [junit4]   2> 3664804 INFO  (jetty-launcher-1551-thread-1) [    ] o.e.j.s.AbstractConnector Started ServerConnector@4394f1ef{SSL,[ssl, http/1.1]}{127.0.0.1:46226}
   [junit4]   2> 3664804 INFO  (jetty-launcher-1551-thread-1) [    ] o.e.j.s.Server Started @3680457ms
   [junit4]   2> 3664804 INFO  (jetty-launcher-1551-thread-1) [    ] o.a.s.c.s.e.JettySolrRunner Jetty properties: {hostContext=/solr, hostPort=46226}
   [junit4]   2> 3664804 ERROR (jetty-launcher-1551-thread-1) [    ] o.a.s.u.StartupLoggingUtils Missing Java Option solr.log.dir. Logging may be missing or incomplete.
   [junit4]   2> 3664804 INFO  (jetty-launcher-1551-thread-1) [    ] o.a.s.s.SolrDispatchFilter  ___      _       Welcome to Apache Solr? version 8.0.0
   [junit4]   2> 3664804 INFO  (jetty-launcher-1551-thread-1) [    ] o.a.s.s.SolrDispatchFilter / __| ___| |_ _   Starting in cloud mode on port null
   [junit4]   2> 3664804 INFO  (jetty-launcher-1551-thread-1) [    ] o.a.s.s.SolrDispatchFilter \__ \/ _ \ | '_|  Install dir: null
   [junit4]   2> 3664804 INFO  (jetty-launcher-1551-thread-1) [    ] o.a.s.s.SolrDispatchFilter |___/\___/_|_|    Start time: 2017-12-01T14:31:49.587Z
   [junit4]   2> 3664948 INFO  (jetty-launcher-1551-thread-1) [    ] o.a.s.s.SolrDispatchFilter solr.xml found in ZooKeeper. Loading...
   [junit4]   2> 3664968 INFO  (jetty-launcher-1551-thread-2) [    ] o.e.j.s.h.ContextHandler Started o.e.j.s.ServletContextHandler@59e0b849{/solr,null,AVAILABLE}
   [junit4]   2> 3664969 INFO  (jetty-launcher-1551-thread-2) [    ] o.e.j.s.AbstractConnector Started ServerConnector@c41aed2{SSL,[ssl, http/1.1]}{127.0.0.1:43035}
   [junit4]   2> 3664969 INFO  (jetty-launcher-1551-thread-2) [    ] o.e.j.s.Server Started @3680622ms
   [junit4]   2> 3664969 INFO  (jetty-launcher-1551-thread-2) [    ] o.a.s.c.s.e.JettySolrRunner Jetty properties: {hostContext=/solr, hostPort=43035}
   [junit4]   2> 3664969 ERROR (jetty-launcher-1551-thread-2) [    ] o.a.s.u.StartupLoggingUtils Missing Java Option solr.log.dir. Logging may be missing or incomplete.
   [junit4]   2> 3664969 INFO  (jetty-launcher-1551-thread-2) [    ] o.a.s.s.SolrDispatchFilter  ___      _       Welcome to Apache Solr? version 8.0.0
   [junit4]   2> 3664969 INFO  (jetty-launcher-1551-thread-2) [    ] o.a.s.s.SolrDispatchFilter / __| ___| |_ _   Starting in cloud mode on port null
   [junit4]   2> 3664969 INFO  (jetty-launcher-1551-thread-2) [    ] o.a.s.s.SolrDispatchFilter \__ \/ _ \ | '_|  Install dir: null
   [junit4]   2> 3664970 INFO  (jetty-launcher-1551-thread-2) [    ] o.a.s.s.SolrDispatchFilter |___/\___/_|_|    Start time: 2017-12-01T14:31:49.753Z
   [junit4]   2> 3665006 INFO  (jetty-launcher-1551-thread-2) [    ] o.a.s.s.SolrDispatchFilter solr.xml found in ZooKeeper. Loading...
   [junit4]   2> 3665063 INFO  (jetty-launcher-1551-thread-1) [    ] o.a.s.c.ZkContainer Zookeeper client=127.0.0.1:40497/solr
   [junit4]   2> 3665144 INFO  (jetty-launcher-1551-thread-2) [    ] o.a.s.c.ZkContainer Zookeeper client=127.0.0.1:40497/solr
   [junit4]   2> 3665784 INFO  (jetty-launcher-1551-thread-1) [n:127.0.0.1:46226_solr    ] o.a.s.c.Overseer Overseer (id=null) closing
   [junit4]   2> 3665819 INFO  (jetty-launcher-1551-thread-1) [n:127.0.0.1:46226_solr    ] o.a.s.c.OverseerElectionContext I am going to be the leader 127.0.0.1:46226_solr
   [junit4]   2> 3665820 INFO  (jetty-launcher-1551-thread-1) [n:127.0.0.1:46226_solr    ] o.a.s.c.Overseer Overseer (id=99099522425028613-127.0.0.1:46226_solr-n_0000000000) starting
   [junit4]   2> 3665920 INFO  (jetty-launcher-1551-thread-1) [n:127.0.0.1:46226_solr    ] o.a.s.c.ZkController Register node as live in ZooKeeper:/live_nodes/127.0.0.1:46226_solr
   [junit4]   2> 3666030 DEBUG (OverseerAutoScalingTriggerThread-99099522425028613-127.0.0.1:46226_solr-n_0000000000) [n:127.0.0.1:46226_solr    ] o.a.s.c.a.OverseerTriggerThread Adding .autoAddReplicas trigger
   [junit4]   2> 3666106 DEBUG (OverseerAutoScalingTriggerThread-99099522425028613-127.0.0.1:46226_solr-n_0000000000) [n:127.0.0.1:46226_solr    ] o.a.s.c.a.OverseerTriggerThread Refreshing /autoscaling.json with znode version 1
   [junit4]   2> 3666107 INFO  (OverseerStateUpdate-99099522425028613-127.0.0.1:46226_solr-n_0000000000) [n:127.0.0.1:46226_solr    ] o.a.s.c.c.ZkStateReader Updated live nodes from ZooKeeper... (0) -> (1)
   [junit4]   2> 3666176 DEBUG (OverseerAutoScalingTriggerThread-99099522425028613-127.0.0.1:46226_solr-n_0000000000) [n:127.0.0.1:46226_solr    ] o.a.s.c.a.NodeLostTrigger Initial livenodes: [127.0.0.1:46226_solr]
   [junit4]   2> 3666176 DEBUG (OverseerAutoScalingTriggerThread-99099522425028613-127.0.0.1:46226_solr-n_0000000000) [n:127.0.0.1:46226_solr    ] o.a.s.c.a.OverseerTriggerThread Current znodeVersion 1, lastZnodeVersion -1
   [junit4]   2> 3666176 DEBUG (OverseerAutoScalingTriggerThread-99099522425028613-127.0.0.1:46226_solr-n_0000000000) [n:127.0.0.1:46226_solr    ] o.a.s.c.a.OverseerTriggerThread Processed trigger updates upto znodeVersion 1
   [junit4]   2> 3666213 DEBUG (OverseerAutoScalingTriggerThread-99099522425028613-127.0.0.1:46226_solr-n_0000000000) [n:127.0.0.1:46226_solr    ] o.a.s.c.a.OverseerTriggerThread -- clean old nodeAdded markers
   [junit4]   2> 3666213 DEBUG (OverseerAutoScalingTriggerThread-99099522425028613-127.0.0.1:46226_solr-n_0000000000) [n:127.0.0.1:46226_solr    ] o.a.s.c.a.OverseerTriggerThread Current znodeVersion 1, lastZnodeVersion 1
   [junit4]   2> 3666257 DEBUG (ScheduledTrigger-4342-thread-1) [n:127.0.0.1:46226_solr    ] o.a.s.c.a.NodeLostTrigger Running NodeLostTrigger: .auto_add_replicas with currently live nodes: [127.0.0.1:46226_solr]
   [junit4]   2> 3666345 INFO  (jetty-launcher-1551-thread-2) [n:127.0.0.1:43035_solr    ] o.a.s.c.c.ZkStateReader Updated live nodes from ZooKeeper... (0) -> (1)
   [junit4]   2> 3666362 INFO  (jetty-launcher-1551-thread-2) [n:127.0.0.1:43035_solr    ] o.a.s.c.Overseer Overseer (id=null) closing
   [junit4]   2> 3666672 INFO  (jetty-launcher-1551-thread-2) [n:127.0.0.1:43035_solr    ] o.a.s.c.ZkController Register node as live in ZooKeeper:/live_nodes/127.0.0.1:43035_solr
   [junit4]   2> 3666753 INFO  (zkCallback-1562-thread-1-processing-n:127.0.0.1:46226_solr) [n:127.0.0.1:46226_solr    ] o.a.s.c.c.ZkStateReader Updated live nodes from ZooKeeper... (1) -> (2)
   [junit4]   2> 3666908 INFO  (zkCallback-1563-thread-1-processing-n:127.0.0.1:43035_solr) [n:127.0.0.1:43035_solr    ] o.a.s.c.c.ZkStateReader Updated live nodes from ZooKeeper... (1) -> (2)
   [junit4]   2> 3666927 INFO  (jetty-launcher-1551-thread-1) [n:127.0.0.1:46226_solr    ] o.a.s.m.r.SolrJmxReporter JMX monitoring for 'solr_46226.solr.node' (registry 'solr.node') enabled at server: com.sun.jmx.mbeanserver.JmxMBeanServer@24068114
   [junit4]   2> 3667033 INFO  (jetty-launcher-1551-thread-1) [n:127.0.0.1:46226_solr    ] o.a.s.m.r.SolrJmxReporter JMX monitoring for 'solr_46226.solr.jvm' (registry 'solr.jvm') enabled at server: com.sun.jmx.mbeanserver.JmxMBeanServer@24068114
   [junit4]   2> 3667033 INFO  (jetty-launcher-1551-thread-1) [n:127.0.0.1:46226_solr    ] o.a.s.m.r.SolrJmxReporter JMX monitoring for 'solr_46226.solr.jetty' (registry 'solr.jetty') enabled at server: com.sun.jmx.mbeanserver.JmxMBeanServer@24068114
   [junit4]   2> 3667067 INFO  (jetty-launcher-1551-thread-1) [n:127.0.0.1:46226_solr    ] o.a.s.c.CorePropertiesLocator Found 0 core definitions underneath /home/jenkins/jenkins-slave/workspace/Lucene-Solr-Tests-master/solr/build/solr-core/test/J0/temp/solr.cloud.autoscaling.TriggerIntegrationTest_5968E87503AD728D-001/tempDir-001/node1/.
   [junit4]   2> 3667109 INFO  (jetty-launcher-1551-thread-2) [n:127.0.0.1:43035_solr    ] o.a.s.m.r.SolrJmxReporter JMX monitoring for 'solr_43035.solr.node' (registry 'solr.node') enabled at server: com.sun.jmx.mbeanserver.JmxMBeanServer@24068114
   [junit4]   2> 3667146 INFO  (jetty-launcher-1551-thread-2) [n:127.0.0.1:43035_solr    ] o.a.s.m.r.SolrJmxReporter JMX monitoring for 'solr_43035.solr.jvm' (registry 'solr.jvm') enabled at server: com.sun.jmx.mbeanserver.JmxMBeanServer@24068114
   [junit4]   2> 3667160 INFO  (jetty-launcher-1551-thread-2) [n:127.0.0.1:43035_solr    ] o.a.s.m.r.SolrJmxReporter JMX monitoring for 'solr_43035.solr.jetty' (registry 'solr.jetty') enabled at server: com.sun.jmx.mbeanserver.JmxMBeanServer@24068114
   [junit4]   2> 3667161 INFO  (jetty-launcher-1551-thread-2) [n:127.0.0.1:43035_solr    ] o.a.s.c.CorePropertiesLocator Found 0 core definitions underneath /home/jenkins/jenkins-slave/workspace/Lucene-Solr-Tests-master/solr/build/solr-core/test/J0/temp/solr.cloud.autoscaling.TriggerIntegrationTest_5968E87503AD728D-001/tempDir-001/node2/.
   [junit4]   2> 3667542 DEBUG (ScheduledTrigger-4342-thread-1) [n:127.0.0.1:46226_solr    ] o.a.s.c.a.NodeLostTrigger Running NodeLostTrigger: .auto_add_replicas with currently live nodes: [127.0.0.1:46226_solr, 127.0.0.1:43035_solr]
   [junit4]   2> 3667562 INFO  (SUITE-TriggerIntegrationTest-seed#[5968E87503AD728D]-worker) [    ] o.a.s.c.c.ZkStateReader Updated live nodes from ZooKeeper... (0) -> (2)
   [junit4]   2> 3667635 INFO  (SUITE-TriggerIntegrationTest-seed#[5968E87503AD728D]-worker) [    ] o.a.s.c.s.i.ZkClientClusterStateProvider Cluster at 127.0.0.1:40497/solr ready
   [junit4]   2> 3667800 INFO  (TEST-TriggerIntegrationTest.testNodeAddedTriggerRestoreState-seed#[5968E87503AD728D]) [    ] o.a.s.SolrTestCaseJ4 ###Starting testNodeAddedTriggerRestoreState
   [junit4]   2> 3667800 INFO  (TEST-TriggerIntegrationTest.testNodeAddedTriggerRestoreState-seed#[5968E87503AD728D]) [    ] o.a.s.c.a.TriggerIntegrationTest /autoscaling.json reset, new znode version 2
   [junit4]   2> 3667800 DEBUG (zkCallback-1562-thread-1-processing-n:127.0.0.1:46226_solr) [n:127.0.0.1:46226_solr    ] o.a.s.c.a.OverseerTriggerThread Refreshing /autoscaling.json with znode version 2
   [junit4]   2> 3667801 DEBUG (OverseerAutoScalingTriggerThread-99099522425028613-127.0.0.1:46226_solr-n_0000000000) [n:127.0.0.1:46226_solr    ] o.a.s.c.a.OverseerTriggerThread Processed trigger updates upto znodeVersion 2
   [junit4]   2> 3667872 DEBUG (OverseerAutoScalingTriggerThread-99099522425028613-127.0.0.1:46226_solr-n_0000000000) [n:127.0.0.1:46226_solr    ] o.a.s.c.a.OverseerTriggerThread -- clean old nodeLost markers
   [junit4]   2> 3667892 DEBUG (OverseerAutoScalingTriggerThread-99099522425028613-127.0.0.1:46226_solr-n_0000000000) [n:127.0.0.1:46226_solr    ] o.a.s.c.a.OverseerTriggerThread -- clean old nodeAdded markers
   [junit4]   2> 3667892 DEBUG (OverseerAutoScalingTriggerThread-99099522425028613-127.0.0.1:46226_solr-n_0000000000) [n:127.0.0.1:46226_solr    ] o.a.s.c.a.OverseerTriggerThread Current znodeVersion 2, lastZnodeVersion 2
   [junit4]   2> 3668152 INFO  (qtp1929706365-10683) [n:127.0.0.1:46226_solr    ] o.a.s.c.c.ZkStateReader Updated live nodes from ZooKeeper... (0) -> (2)
   [junit4]   2> 3668153 INFO  (qtp1929706365-10683) [n:127.0.0.1:46226_solr    ] o.a.s.c.s.i.ZkClientClusterStateProvider Cluster at 127.0.0.1:40497/solr ready
   [junit4]   2> 3668167 INFO  (qtp1929706365-10678) [n:127.0.0.1:46226_solr    ] o.a.s.s.HttpSolrCall [admin] webapp=null path=/admin/metrics params={prefix=CORE.coreName&wt=javabin&version=2&group=solr.core} status=0 QTime=0
   [junit4]   2> 3668374 INFO  (qtp105013114-10696) [n:127.0.0.1:43035_solr    ] o.a.s.s.HttpSolrCall [admin] webapp=null path=/admin/metrics params={prefix=CORE.coreName&wt=javabin&version=2&group=solr.core} status=0 QTime=0
   [junit4]   2> 3668375 DEBUG (qtp1929706365-10683) [n:127.0.0.1:46226_solr    ] o.a.s.c.a.AutoScalingHandler Verified autoscaling configuration
   [junit4]   2> 3668408 INFO  (qtp1929706365-10683) [n:127.0.0.1:46226_solr    ] o.a.s.s.HttpSolrCall [admin] webapp=null path=/cluster/autoscaling params={wt=javabin&version=2} status=0 QTime=329
   [junit4]   2> 3668410 INFO  (TEST-TriggerIntegrationTest.testNodeAddedTriggerRestoreState-seed#[5968E87503AD728D]) [    ] o.e.j.s.Server jetty-9.3.20.v20170531
   [junit4]   2> 3668445 DEBUG (zkCallback-1562-thread-1-processing-n:127.0.0.1:46226_solr) [n:127.0.0.1:46226_solr    ] o.a.s.c.a.OverseerTriggerThread Refreshing /autoscaling.json with znode version 3
   [junit4]   2> 3668514 INFO  (TEST-TriggerIntegrationTest.testNodeAddedTriggerRestoreState-seed#[5968E87503AD728D]) [    ] o.e.j.s.h.ContextHandler Started o.e.j.s.ServletContextHandler@4295e54{/solr,null,AVAILABLE}
   [junit4]   2> 3668531 INFO  (TEST-TriggerIntegrationTest.testNodeAddedTriggerRestoreState-seed#[5968E87503AD728D]) [    ] o.e.j.s.AbstractConnector Started ServerConnector@c7cd8f2{SSL,[ssl, http/1.1]}{127.0.0.1:38641}
   [junit4]   2> 3668531 INFO  (TEST-TriggerIntegrationTest.testNodeAddedTriggerRestoreState-seed#[5968E87503AD728D]) [    ] o.e.j.s.Server Started @3684184ms
   [junit4]   2> 3668531 INFO  (TEST-TriggerIntegrationTest.testNodeAddedTriggerRestoreState-seed#[5968E87503AD728D]) [    ] o.a.s.c.s.e.JettySolrRunner Jetty properties: {hostContext=/solr, hostPort=38641}
   [junit4]   2> 3668531 ERROR (TEST-TriggerIntegrationTest.testNodeAddedTriggerRestoreState-seed#[5968E87503AD728D]) [    ] o.a.s.u.StartupLoggingUtils Missing Java Option solr.log.dir. Logging may be missing or incomplete.
   [junit4]   2> 3668531 INFO  (TEST-TriggerIntegrationTest.testNodeAddedTriggerRestoreState-seed#[5968E87503AD728D]) [    ] o.a.s.s.SolrDispatchFilter  ___      _       Welcome to Apache Solr? version 8.0.0
   [junit4]   2> 3668531 INFO  (TEST-TriggerIntegrationTest.testNodeAddedTriggerRestoreState-seed#[5968E87503AD728D]) [    ] o.a.s.s.SolrDispatchFilter / __| ___| |_ _   Starting in cloud mode on port null
   [junit4]   2> 3668531 INFO  (TEST-TriggerIntegrationTest.testNodeAddedTriggerRestoreState-seed#[5968E87503AD728D]) [    ] o.a.s.s.SolrDispatchFilter \__ \/ _ \ | '_|  Install dir: null
   [junit4]   2> 3668531 INFO  (TEST-TriggerIntegrationTest.testNodeAddedTriggerRestoreState-seed#[5968E87503AD728D]) [    ] o.a.s.s.SolrDispatchFilter |___/\___/_|_|    Start time: 2017-12-01T14:31:53.314Z
   [junit4]   2> 3668534 DEBUG (zkCallback-1562-thread-1-processing-n:127.0.0.1:46226_solr) [n:127.0.0.1:46226_solr    ] o.a.s.c.a.NodeAddedTrigger Initial livenodes: [127.0.0.1:46226_solr, 127.0.0.1:43035_solr]
   [junit4]   2> 3668534 DEBUG (zkCallback-1562-thread-1-processing-n:127.0.0.1:46226_solr) [n:127.0.0.1:46226_solr    ] o.a.s.c.a.NodeAddedTrigger NodeAddedTrigger node_added_restore_trigger instantiated with properties: {event=nodeAdded, waitFor=5, actions=[{name=test, class=org.apache.solr.cloud.autoscaling.TriggerIntegrationTest$TestTriggerAction}], enabled=true}
   [junit4]   2> 3668534 DEBUG (OverseerAutoScalingTriggerThread-99099522425028613-127.0.0.1:46226_solr-n_0000000000) [n:127.0.0.1:46226_solr    ] o.a.s.c.a.OverseerTriggerThread Processed trigger updates upto znodeVersion 3
   [junit4]   2> 3668535 INFO  (OverseerAutoScalingTriggerThread-99099522425028613-127.0.0.1:46226_solr-n_0000000000) [n:127.0.0.1:46226_solr    ] o.a.s.c.a.TriggerIntegrationTest TestTriggerAction init
   [junit4]   2> 3668588 DEBUG (ScheduledTrigger-4342-thread-2) [n:127.0.0.1:46226_solr    ] o.a.s.c.a.NodeAddedTrigger Running NodeAddedTrigger node_added_restore_trigger
   [junit4]   2> 3668588 DEBUG (ScheduledTrigger-4342-thread-2) [n:127.0.0.1:46226_solr    ] o.a.s.c.a.NodeAddedTrigger Found livenodes: [127.0.0.1:46226_solr, 127.0.0.1:43035_solr]
   [junit4]   2> 3668591 INFO  (TEST-TriggerIntegrationTest.testNodeAddedTriggerRestoreState-seed#[5968E87503AD728D]) [    ] o.a.s.s.SolrDispatchFilter solr.xml found in ZooKeeper. Loading...
   [junit4]   2> 3668607 DEBUG (OverseerAutoScalingTriggerThread-99099522425028613-127.0.0.1:46226_solr-n_0000000000) [n:127.0.0.1:46226_solr    ] o.a.s.c.a.OverseerTriggerThread -- clean old nodeLost markers
   [junit4]   2> 3668607 DEBUG (OverseerAutoScalingTriggerThread-99099522425028613-127.0.0.1:46226_solr-n_0000000000) [n:127.0.0.1:46226_solr    ] o.a.s.c.a.OverseerTriggerThread Current znodeVersion 3, lastZnodeVersion 3
   [junit4]   2> 3668701 INFO  (TEST-TriggerIntegrationTest.testNodeAddedTriggerRestoreState-seed#[5968E87503AD728D]) [    ] o.a.s.c.ZkContainer Zookeeper client=127.0.0.1:40497/solr
   [junit4]   2> 3669048 INFO  (TEST-TriggerIntegrationTest.testNodeAddedTriggerRestoreState-seed#[5968E87503AD728D]) [n:127.0.0.1:38641_solr    ] o.a.s.c.c.ZkStateReader Updated live nodes from ZooKeeper... (0) -> (2)
   [junit4]   2> 3669049 INFO  (TEST-TriggerIntegrationTest.testNodeAddedTriggerRestoreState-seed#[5968E87503AD728D]) [n:127.0.0.1:38641_solr    ] o.a.s.c.Overseer Overseer (id=null) closing
   [junit4]   2> 3669063 INFO  (TEST-TriggerIntegrationTest.testNodeAddedTriggerRestoreState-seed#[5968E87503AD728D]) [n:127.0.0.1:38641_solr    ] o.a.s.c.ZkController Register node as live in ZooKeeper:/live_nodes/127.0.0.1:38641_solr
   [junit4]   2> 3669100 INFO  (zkCallback-1578-thread-1-processing-n:127.0.0.1:38641_solr) [n:127.0.0.1:38641_solr    ] o.a.s.c.c.ZkStateReader Updated live nodes from ZooKeeper... (2) -> (3)
   [junit4]   2> 3669115 INFO  (zkCallback-1562-thread-2-processing-n:127.0.0.1:46226_solr) [n:127.0.0.1:46226_solr    ] o.a.s.c.c.ZkStateReader Updated live nodes from ZooKeeper... (2) -> (3)
   [junit4]   2> 3669115 INFO  (zkCallback-1563-thread-1-processing-n:127.0.0.1:43035_solr) [n:127.0.0.1:43035_solr    ] o.a.s.c.c.ZkStateReader Updated live nodes from ZooKeeper... (2) -> (3)
   [junit4]   2> 3669156 INFO  (zkCallback-1570-thread-1) [    ] o.a.s.c.c.ZkStateReader Updated live nodes from ZooKeeper... (2) -> (3)
   [junit4]   2> 3669461 INFO  (TEST-TriggerIntegrationTest.testNodeAddedTriggerRestoreState-seed#[5968E87503AD728D]) [n:127.0.0.1:38641_solr    ] o.a.s.m.r.SolrJmxReporter JMX monitoring for 'solr_38641.solr.node' (registry 'solr.node') enabled at server: com.sun.jmx.mbeanserver.JmxMBeanServer@24068114
   [junit4]   2> 3669537 INFO  (TEST-TriggerIntegrationTest.testNodeAddedTriggerRestoreState-seed#[5968E87503AD728D]) [n:127.0.0.1:38641_solr    ] o.a.s.m.r.SolrJmxReporter JMX monitoring for 'solr_38641.solr.jvm' (registry 'solr.jvm') enabled at server: com.sun.jmx.mbeanserver.JmxMBeanServer@24068114
   [junit4]   2> 3669537 INFO  (TEST-TriggerIntegrationTest.testNodeAddedTriggerRestoreState-seed#[5968E87503AD728D]) [n:127.0.0.1:38641_solr    ] o.a.s.m.r.SolrJmxReporter JMX monitoring for 'solr_38641.solr.jetty' (registry 'solr.jetty') enabled at server: com.sun.jmx.mbeanserver.JmxMBeanServer@24068114
   [junit4]   2> 3669591 DEBUG (ScheduledTrigger-4342-thread-4) [n:127.0.0.1:46226_solr    ] o.a.s.c.a.NodeAddedTrigger Running NodeAddedTrigger node_added_restore_trigger
   [junit4]   2> 3669591 DEBUG (ScheduledTrigger-4342-thread-4) [n:127.0.0.1:46226_solr    ] o.a.s.c.a.NodeAddedTrigger Found livenodes: [127.0.0.1:46226_solr, 127.0.0.1:38641_solr, 127.0.0.1:43035_solr]
   [junit4]   2> 3669591 DEBUG (ScheduledTrigger-4342-thread-4) [n:127.0.0.1:46226_solr    ] o.a.s.c.a.NodeAddedTrigger Tracking new node: 127.0.0.1:38641_solr at time 1512138714374000000
   [junit4]   2> 3669592 INFO  (TEST-TriggerIntegrationTest.testNodeAddedTriggerRestoreState-seed#[5968E87503AD728D]) [n:127.0.0.1:38641_solr    ] o.a.s.c.CorePropertiesLocator Found 0 core definitions underneath /home/jenkins/jenkins-slave/workspace/Lucene-Solr-Tests-master/solr/build/solr-core/test/J0/temp/solr.cloud.autoscaling.TriggerIntegrationTest_5968E87503AD728D-001/tempDir-001/node3/.
   [junit4]   2> 3670595 DEBUG (ScheduledTrigger-4342-thread-4) [n:127.0.0.1:46226_solr    ] o.a.s.c.a.NodeAddedTrigger Running NodeAddedTrigger node_added_restore_trigger
   [junit4]   2> 3670595 DEBUG (ScheduledTrigger-4342-thread-4) [n:127.0.0.1:46226_solr    ] o.a.s.c.a.NodeAddedTrigger Found livenodes: [127.0.0.1:46226_solr, 127.0.0.1:38641_solr, 127.0.0.1:43035_solr]
   [junit4]   2> 3671599 DEBUG (ScheduledTrigger-4342-thread-4) [n:127.0.0.1:46226_solr    ] o.a.s.c.a.NodeAddedTrigger Running NodeAddedTrigger node_added_restore_trigger
   [junit4]   2> 3671599 DEBUG (ScheduledTrigger-4342-thread-4) [n:127.0.0.1:46226_solr    ] o.a.s.c.a.NodeAddedTrigger Found livenodes: [127.0.0.1:46226_solr, 127.0.0.1:38641_solr, 127.0.0.1:43035_solr]
   [junit4]   2> 3671616 INFO  (qtp1921610573-10745) [n:127.0.0.1:38641_solr    ] o.a.s.c.c.ZkStateReader Updated live nodes from ZooKeeper... (0) -> (3)
   [junit4]   2> 3671617 INFO  (qtp1921610573-10745) [n:127.0.0.1:38641_solr    ] o.a.s.c.s.i.ZkClientClusterStateProvider Cluster at 127.0.0.1:40497/solr ready
   [junit4]   2> 3671621 INFO  (qtp1929706365-10678) [n:127.0.0.1:46226_solr    ] o.a.s.s.HttpSolrCall [admin] webapp=null path=/admin/metrics params={prefix=CORE.coreName&wt=javabin&version=2&group=solr.core} status=0 QTime=0
   [junit4]   2> 3671655 INFO  (qtp1921610573-10748) [n:127.0.0.1:38641_solr    ] o.a.s.s.HttpSolrCall [admin] webapp=null path=/admin/metrics params={prefix=CORE.coreName&wt=javabin&version=2&group=solr.core} status=0 QTime=0
   [junit4]   2> 3671726 INFO  (qtp105013114-10695) [n:127.0.0.1:43035_solr    ] o.a.s.s.HttpSolrCall [admin] webapp=null path=/admin/metrics params={prefix=CORE.coreName&wt=javabin&version=2&group=solr.core} status=0 QTime=0
   [junit4]   2> 3671726 DEBUG (qtp1921610573-10745) [n:127.0.0.1:38641_solr    ] o.a.s.c.a.AutoScalingHandler Verified autoscaling configuration
   [junit4]   2> 3671727 DEBUG (zkCallback-1562-thread-2-processing-n:127.0.0.1:46226_solr) [n:127.0.0.1:46226_solr    ] o.a.s.c.a.OverseerTriggerThread Refreshing /autoscaling.json with znode version 4
   [junit4]   2> 3671728 DEBUG (zkCallback-1562-thread-2-processing-n:127.0.0.1:46226_solr) [n:127.0.0.1:46226_solr    ] o.a.s.c.a.NodeAddedTrigger Initial livenodes: [127.0.0.1:46226_solr, 127.0.0.1:38641_solr, 127.0.0.1:43035_solr]
   [junit4]   2> 3671728 DEBUG (zkCallback-1562-thread-2-processing-n:127.0.0.1:46226_solr) [n:127.0.0.1:46226_solr    ] o.a.s.c.a.NodeAddedTrigger NodeAddedTrigger node_added_restore_trigger instantiated with properties: {event=nodeAdded, waitFor=0, actions=[{name=test, class=org.apache.solr.cloud.autoscaling.TriggerIntegrationTest$TestTriggerAction}], enabled=true}
   [junit4]   2> 3671728 INFO  (qtp1921610573-10745) [n:127.0.0.1:38641_solr    ] o.a.s.s.HttpSolrCall [admin] webapp=null path=/admin/autoscaling params={wt=javabin&version=2} status=0 QTime=169
   [junit4]   2> 3671729 DEBUG (OverseerAutoScalingTriggerThread-99099522425028613-127.0.0.1:46226_solr-n_0000000000) [n:127.0.0.1:46226_solr    ] o.a.s.c.a.OverseerTriggerThread Processed trigger updates upto znodeVersion 4
   [junit4]   2> 3671730 INFO  (OverseerAutoScalingTriggerThread-99099522425028613-127.0.0.1:46226_solr-n_0000000000) [n:127.0.0.1:46226_solr    ] o.a.s.c.a.TriggerIntegrationTest TestTriggerAction init
   [junit4]   2> 3671730 DEBUG (OverseerAutoScalingTriggerThread-99099522425028613-127.0.0.1:46226_solr-n_0000000000) [n:127.0.0.1:46226_solr    ] o.a.s.c.a.NodeAddedTrigger Adding node from marker path: 127.0.0.1:38641_solr
   [junit4]   2> 3671730 DEBUG (OverseerAutoScalingTriggerThread-99099522425028613-127.0.0.1:46226_solr-n_0000000000) [n:127.0.0.1:46226_solr    ] o.a.s.c.a.OverseerTriggerThread -- clean old nodeLost markers
   [junit4]   2> 3671731 DEBUG (ScheduledTrigger-4342-thread-3) [n:127.0.0.1:46226_solr    ] o.a.s.c.a.NodeAddedTrigger Running NodeAddedTrigger node_added_restore_trigger
   [junit4]   2> 3671731 DEBUG (ScheduledTrigger-4342-thread-3) [n:127.0.0.1:46226_solr    ] o.a.s.c.a.NodeAddedTrigger Found livenodes: [127.0.0.1:46226_solr, 127.0.0.1:38641_solr, 127.0.0.1:43035_solr]
   [junit4]   2> 3671731 DEBUG (ScheduledTrigger-4342-thread-3) [n:127.0.0.1:46226_solr    ] o.a.s.c.a.NodeAddedTrigger NodeAddedTrigger node_added_restore_trigger firing registered processor for nodes: [127.0.0.1:38641_solr] added at times [1512138716513000000], now=1512138716514000000
   [junit4]   2> 3671731 DEBUG (ScheduledTrigger-4342-thread-3) [n:127.0.0.1:46226_solr    ] o.a.s.c.a.ScheduledTriggers ++++++++ Cooldown inactive - processing event: {
   [junit4]   2>   "id":"14fc3226a8df5a40T53itg2behh40xfu020l0dyhdo",
   [junit4]   2>   "source":"node_added_restore_trigger",
   [junit4]   2>   "eventTime":1512138716513000000,
   [junit4]   2>   "eventType":"NODEADDED",
   [junit4]   2>   "properties":{
   [junit4]   2>     "eventTimes":[1512138716513000000],
   [junit4]   2>     "nodeNames":["127.0.0.1:38641_solr"]}}
   [junit4]   2> 3671731 INFO  (ScheduledTrigger-4342-thread-3) [n:127.0.0.1:46226_solr    ] o.a.s.c.a.SystemLogListener Collection .system does not exist, disabling logging.
   [junit4]   2> 3671732 DEBUG (OverseerAutoScalingTriggerThread-99099522425028613-127.0.0.1:46226_solr-n_0000000000) [n:127.0.0.1:46226_solr    ] o.a.s.c.a.OverseerTriggerThread Current znodeVersion 4, lastZnodeVersion 4
   [junit4]   2> 3671746 DEBUG (AutoscalingActionExecutor-4343-thread-1-processing-n:127.0.0.1:46226_solr) [n:127.0.0.1:46226_solr    ] o.a.s.c.a.ScheduledTriggers -- processing actions for {
   [junit4]   2>   "id":"14fc3226a8df5a40T53itg2behh40xfu020l0dyhdo",
   [junit4]   2>   "source":"node_added_restore_trigger",
   [junit4]   2>   "eventTime":1512138716513000000,
   [junit4]   2>   "eventType":"NODEADDED",
   [junit4]   2>   "properties":{
   [junit4]   2>     "eventTimes":[1512138716513000000],
   [junit4]   2>     "_enqueue_time_":1512138716514000000,
   [junit4]   2>     "nodeNames":["127.0.0.1:38641_solr"]}}
   [junit4]   2> 3671746 INFO  (TEST-TriggerIntegrationTest.testNodeAddedTriggerRestoreState-seed#[5968E87503AD728D]) [    ] o.a.s.SolrTestCaseJ4 ###Ending testNodeAddedTriggerRestoreState
   [junit4]   2> 3671837 INFO  (TEST-TriggerIntegrationTest.testEventFromRestoredState-seed#[5968E87503AD728D]) [    ] o.a.s.SolrTestCaseJ4 ###Starting testEventFromRestoredState
   [junit4]   2> 3671838 INFO  (TEST-TriggerIntegrationTest.testEventFromRestoredState-seed#[5968E87503AD728D]) [    ] o.a.s.c.a.TriggerIntegrationTest /autoscaling.json reset, new znode version 5
   [junit4]   2> 3671838 DEBUG (zkCallback-1562-thread-2-processing-n:127.0.0.1:46226_solr) [n:127.0.0.1:46226_solr    ] o.a.s.c.a.OverseerTriggerThread Refreshing /autoscaling.json with znode version 5
   [junit4]   2> 3671838 DEBUG (OverseerAutoScalingTriggerThread-99099522425028613-127.0.0.1:46226_solr-n_0000000000) [n:127.0.0.1:46226_solr    ] o.a.s.c.a.OverseerTriggerThread Processed trigger updates upto znodeVersion 5
   [junit4]   2> 3671856 DEBUG (OverseerAutoScalingTriggerThread-99099522425028613-127.0.0.1:46226_solr-n_0000000000) [n:127.0.0.1:46226_solr    ] o.a.s.c.a.OverseerTriggerThread -- clean old nodeLost markers
   [junit4]   2> 3671856 DEBUG (OverseerAutoScalingTriggerThread-99099522425028613-127.0.0.1:46226_solr-n_0000000000) [n:127.0.0.1:46226_solr    ] o.a.s.c.a.OverseerTriggerThread -- clean old nodeAdded markers
   [junit4]   2> 3671856 DEBUG (OverseerAutoScalingTriggerThread-99099522425028613-127.0.0.1:46226_solr-n_0000000000) [n:127.0.0.1:46226_solr    ] o.a.s.c.a.OverseerTriggerThread Current znodeVersion 5, lastZnodeVersion 5
   [junit4]   2> 3671868 INFO  (qtp1921610573-10747) [n:127.0.0.1:38641_solr    ] o.a.s.c.c.ZkStateReader Updated live nodes from ZooKeeper... (0) -> (3)
   [junit4]   2> 3671869 INFO  (qtp1921610573-10747) [n:127.0.0.1:38641_solr    ] o.a.s.c.s.i.ZkClientClusterStateProvider Cluster at 127.0.0.1:40497/solr ready
   [junit4]   2> 3671872 INFO  (qtp1929706365-10678) [n:127.0.0.1:46226_solr    ] o.a.s.s.HttpSolrCall [admin] webapp=null path=/admin/metrics params={prefix=CORE.coreName&wt=javabin&version=2&group=solr.core} status=0 QTime=0
   [junit4]   2> 3671872 INFO  (qtp1921610573-10741) [n:127.0.0.1:38641_solr    ] o.a.s.s.HttpSolrCall [admin] webapp=null path=/admin/metrics params={prefix=CORE.coreName&wt=javabin&version=2&group=solr.core} status=0 QTime=0
   [junit4]   2> 3671873 INFO  (qtp105013114-10694) [n:127.0.0.1:43035_solr    ] o.a.s.s.HttpSolrCall [admin] webapp=null path=/admin/metrics params={prefix=CORE.coreName&wt=javabin&version=2&group=solr.core} status=0 QTime=0
   [junit4]   2> 3671873 DEBUG (qtp1921610573-10747) [n:127.0.0.1:38641_solr    ] o.a.s.c.a.AutoScalingHandler Verified autoscaling configuration
   [junit4]   2> 3671874 DEBUG (zkCallback-1562-thread-2-processing-n:127.0.0.1:46226_solr) [n:127.0.0.1:46226_solr    ] o.a.s.c.a.OverseerTriggerThread Refreshing /autoscaling.json with znode version 6
   [junit4]   2> 3671875 DEBUG (zkCallback-1562-thread-2-processing-n:127.0.0.1:46226_solr) [n:127.0.0.1:46226_solr    ] o.a.s.c.a.NodeAddedTrigger Initial livenodes: [127.0.0.1:46226_solr, 127.0.0.1:38641_solr, 127.0.0.1:43035_solr]
   [junit4]   2> 3671875 DEBUG (zkCallback-1562-thread-2-processing-n:127.0.0.1:46226_solr) [n:127.0.0.1:46226_solr    ] o.a.s.c.a.NodeAddedTrigger NodeAddedTrigger node_added_trigger instantiated with properties: {event=nodeAdded, waitFor=10, actions=[{name=test, class=org.apache.solr.cloud.autoscaling.TriggerIntegrationTest$TestTriggerAction}], enabled=true}
   [junit4]   2> 3671875 DEBUG (OverseerAutoScalingTriggerThread-99099522425028613-127.0.0.1:46226_solr-n_0000000000) [n:127.0.0.1:46226_solr    ] o.a.s.c.a.OverseerTriggerThread Processed trigger updates upto znodeVersion 6
   [junit4]   2> 3671891 INFO  (qtp1921610573-10747) [n:127.0.0.1:38641_solr    ] o.a.s.s.HttpSolrCall [admin] webapp=null path=/admin/autoscaling params={wt=javabin&version=2} status=0 QTime=34
   [junit4]   2> 3671892 INFO  (OverseerAutoScalingTriggerThread-99099522425028613-127.0.0.1:46226_solr-n_0000000000) [n:127.0.0.1:46226_solr    ] o.a.s.c.a.TriggerIntegrationTest TestTriggerAction init
   [junit4]   2> 3671892 DEBUG (OverseerAutoScalingTriggerThread-99099522425028613-127.0.0.1:46226_solr-n_0000000000) [n:127.0.0.1:46226_solr    ] o.a.s.c.a.OverseerTriggerThread -- clean old nodeLost markers
   [junit4]   2> 3671893 INFO  (qtp1921610573-10744) [n:127.0.0.1:38641_solr    ] o.a.s.h.a.CollectionsHandler Invoked Collection Action :overseerstatus with params action=OVERSEERSTATUS&wt=javabin&version=2 and sendToOCPQueue=true
   [junit4]   2> 3671893 DEBUG (OverseerAutoScalingTriggerThread-99099522425028613-127.0.0.1:46226_solr-n_0000000000) [n:127.0.0.1:46226_solr    ] o.a.s.c.a.OverseerTriggerThread Current znodeVersion 6, lastZnodeVersion 6
   [junit4]   2> 3671893 DEBUG (ScheduledTrigger-4342-thread-4) [n:127.0.0.1:46226_solr    ] o.a.s.c.a.NodeAddedTrigger Running NodeAddedTrigger node_added_trigger
   [junit4]   2> 3671894 DEBUG (ScheduledTrigger-4342-thread-4) [n:127.0.0.1:46226_solr    ] o.a.s.c.a.NodeAddedTrigger Found livenodes: [127.0.0.1:46226_solr, 127.0.0.1:38641_solr, 127.0.0.1:43035_solr]
   [junit4]   2> 3672075 INFO  (qtp1921610573-10744) [n:127.0.0.1:38641_solr    ] o.a.s.s.HttpSolrCall [admin] webapp=null path=/admin/collections params={action=OVERSEERSTATUS&wt=javabin&version=2} status=0 QTime=182
   [junit4]   2> 3672077 INFO  (TEST-TriggerIntegrationTest.testEventFromRestoredState-seed#[5968E87503AD728D]) [    ] o.e.j.s.Server jetty-9.3.20.v20170531
   [junit4]   2> 3672143 INFO  (TEST-TriggerIntegrationTest.testEventFromRestoredState-seed#[5968E87503AD728D]) [    ] o.e.j.s.h.ContextHandler Started o.e.j.s.ServletContextHandler@1b9309e9{/solr,null,AVAILABLE}
   [junit4]   2> 3672160 INFO  (TEST-TriggerIntegrationTest.testEventFromRestoredState-seed#[5968E87503AD728D]) [    ] o.e.j.s.AbstractConnector Started ServerConnector@7a49ddee{SSL,[ssl, http/1.1]}{127.0.0.1:36216}
   [junit4]   2> 3672160 INFO  (TEST-TriggerIntegrationTest.testEventFromRestoredState-seed#[5968E87503AD728D]) [    ] o.e.j.s.Server Started @3687813ms
   [junit4]   2> 3672160 INFO  (TEST-TriggerIntegrationTest.testEventFromRestoredState-seed#[5968E87503AD728D]) [    ] o.a.s.c.s.e.JettySolrRunner Jetty properties: {hostContext=/solr, hostPort=36216}
   [junit4]   2> 3672160 ERROR (TEST-TriggerIntegrationTest.testEventFromRestoredState-seed#[5968E87503AD728D]) [    ] o.a.s.u.StartupLoggingUtils Missing Java Option solr.log.dir. Logging may be missing or incomplete.
   [junit4]   2> 3672161 INFO  (TEST-TriggerIntegrationTest.testEventFromRestoredState-seed#[5968E87503AD728D]) [    ] o.a.s.s.SolrDispatchFilter  ___      _       Welcome to Apache Solr? version 8.0.0
   [junit4]   2> 3672161 INFO  (TEST-TriggerIntegrationTest.testEventFromRestoredState-seed#[5968E87503AD728D]) [    ] o.a.s.s.SolrDispatchFilter / __| ___| |_ _   Starting in cloud mode on port null
   [junit4]   2> 3672161 INFO  (TEST-TriggerIntegrationTest.testEventFromRestoredState-seed#[5968E87503AD728D]) [    ] o.a.s.s.SolrDispatchFilter \__ \/ _ \ | '_|  Install dir: null
   [junit4]   2> 3672161 INFO  (TEST-TriggerIntegrationTest.testEventFromRestoredState-seed#[5968E87503AD728D]) [    ] o.a.s.s.SolrDispatchFilter |___/\___/_|_|    Start time: 2017-12-01T14:31:56.944Z
   [junit4]   2> 3672221 INFO  (TEST-TriggerIntegrationTest.testEventFromRestoredState-seed#[5968E87503AD728D]) [    ] o.a.s.s.SolrDispatchFilter solr.xml found in ZooKeeper. Loading...
   [junit4]   2> 3672311 INFO  (TEST-TriggerIntegrationTest.testEventFromRestoredState-seed#[5968E87503AD728D]) [    ] o.a.s.c.ZkContainer Zookeeper client=127.0.0.1:40497/solr
   [junit4]   2> 3672397 INFO  (TEST-TriggerIntegrationTest.testEventFromRestoredState-seed#[5968E87503AD728D]) [n:127.0.0.1:36216_solr    ] o.a.s.c.c.ZkStateReader Updated live nodes from ZooKeeper... (0) -> (3)
   [junit4]   2> 3672399 INFO  (TEST-TriggerIntegrationTest.testEventFromRestoredState-seed#[5968E87503AD728D]) [n:127.0.0.1:36216_solr    ] o.a.s.c.Overseer Overseer (id=null) closing
   [junit4]   2> 3672451 INFO  (TEST-TriggerIntegrationTest.testEventFromRestoredState-seed#[5968E87503AD728D]) [n:127.0.0.1:36216_solr    ] o.a.s.c.ZkController Register node as live in ZooKeeper:/live_nodes/127.0.0.1:36216_solr
   [junit4]   2> 3672472 INFO  (zkCallback-1562-thread-2-processing-n:127.0.0.1:46226_solr) [n:127.0.0.1:46226_solr    ] o.a.s.c.c.ZkStateReader Updated live nodes from ZooKeeper... (3) -> (4)
   [junit4]   2> 3672472 INFO  (zkCallback-1590-thread-1-processing-n:127.0.0.1:36216_solr) [n:127.0.0.1:36216_solr    ] o.a.s.c.c.ZkStateReader Updated live nodes from ZooKeeper... (3) -> (4)
   [junit4]   2> 3672472 INFO  (zkCallback-1570-thread-1) [    ] o.a.s.c.c.ZkStateReader Updated live nodes from ZooKeeper... (3) -> (4)
   [junit4]   2> 3672477 INFO  (zkCallback-1563-thread-1-processing-n:127.0.0.1:43035_solr) [n:127.0.0.1:43035_solr    ] o.a.s.c.c.ZkStateReader Updated live nodes from ZooKeeper... (3) -> (4)
   [junit4]   2> 3672477 INFO  (zkCallback-1578-thread-1-processing-n:127.0.0.1:38641_solr) [n:127.0.0.1:38641_solr    ] o.a.s.c.c.ZkStateReader Updated live nodes from ZooKeeper... (3) -> (4)
   [junit4]   2> 3672911 INFO  (TEST-TriggerIntegrationTest.testEventFromRestoredState-seed#[5968E87503AD728D]) [n:127.0.0.1:36216_solr    ] o.a.s.m.r.SolrJmxReporter JMX monitoring for 'solr_36216.solr.node' (registry 'solr.node') enabled at server: com.sun.jmx.mbeanserver.JmxMBeanServer@24068114
   [junit4]   2> 3672925 DEBUG (ScheduledTrigger-4342-thread-1) [n:127.0.0.1:46226_solr    ] o.a.s.c.a.NodeAddedTrigger Running NodeAddedTrigger node_added_trigger
   [junit4]   2> 3672925 DEBUG (ScheduledTrigger-4342-thread-1) [n:127.0.0.1:46226_solr    ] o.a.s.c.a.NodeAddedTrigger Found livenodes: [127.0.0.1:36216_solr, 127.0.0.1:46226_solr, 127.0.0.1:38641_solr, 127.0.0.1:43035_solr]
   [junit4]   2> 3672925 DEBUG (ScheduledTrigger-4342-thread-1) [n:127.0.0.1:46226_solr    ] o.a.s.c.a.NodeAddedTrigger Tracking new node: 127.0.0.1:36216_solr at time 1512138717708000000
   [junit4]   2> 3673058 INFO  (TEST-TriggerIntegrationTest.testEventFromRestoredState-seed#[5968E87503AD728D]) [n:127.0.0.1:36216_solr    ] o.a.s.m.r.SolrJmxReporter JMX monitoring for 'solr_36216.solr.jvm' (registry 'solr.jvm') enabled at server: com.sun.jmx.mbeanserver.JmxMBeanServer@24068114
   [junit4]   2> 3673058 INFO  (TEST-TriggerIntegrationTest.testEventFromRestoredState-seed#[5968E87503AD728D]) [n:127.0.0.1:36216_solr    ] o.a.s.m.r.SolrJmxReporter JMX monitoring for 'solr_36216.solr.jetty' (registry 'solr.jetty') enabled at server: com.sun.jmx.mbeanserver.JmxMBeanServer@24068114
   [junit4]   2> 3673059 INFO  (TEST-TriggerIntegrationTest.testEventFromRestoredState-seed#[5968E87503AD728D]) [n:127.0.0.1:36216_solr    ] o.a.s.c.CorePropertiesLocator Found 0 core definitions underneath /home/jenkins/jenkins-slave/workspace/Lucene-Solr-Tests-master/solr/build/solr-core/test/J0/temp/solr.cloud.autoscaling.TriggerIntegrationTest_5968E87503AD728D-001/tempDir-001/node4/.
   [junit4]   2> 3673928 DEBUG (ScheduledTrigger-4342-thread-1) [n:127.0.0.1:46226_solr    ] o.a.s.c.a.NodeAddedTrigger Running NodeAddedTrigger node_added_trigger
   [junit4]   2> 3673928 DEBUG (ScheduledTrigger-4342-thread-1) [n:127.0.0.1:46226_solr    ] o.a.s.c.a.NodeAddedTrigger Found livenodes: [127.0.0.1:36216_solr, 127.0.0.1:46226_solr, 127.0.0.1:38641_solr, 127.0.0.1:43035_solr]
   [junit4]   2> 3673981 INFO  (OverseerCollectionConfigSetProcessor-99099522425028613-127.0.0.1:46226_solr-n_0000000000) [n:127.0.0.1:46226_solr    ] o.a.s.c.OverseerTaskQueue Response ZK path: /overseer/collection-queue-work/qnr-0000000000 doesn't exist.  Requestor may have disconnected from ZooKeeper
   [junit4]   2> 3674940 DEBUG (ScheduledTrigger-4342-thread-1) [n:127.0.0.1:46226_solr    ] o.a.s.c.a.NodeAddedTrigger Running NodeAddedTrigger node_added_trigger
   [junit4]   2> 3674940 DEBUG (ScheduledTrigger-4342-thread-1) [n:127.0.0.1:46226_solr    ] o.a.s.c.a.NodeAddedTrigger Found livenodes: [127.0.0.1:36216_solr, 127.0.0.1:46226_solr, 127.0.0.1:38641_solr, 127.0.0.1:43035_solr]
   [junit4]   2> 3675947 DEBUG (ScheduledTrigger-4342-thread-1) [n:127.0.0.1:46226_solr    ] o.a.s.c.a.NodeAddedTrigger Running NodeAddedTrigger node_added_trigger
   [junit4]   2> 3675947 DEBUG (ScheduledTrigger-4342-thread-1) [n:127.0.0.1:46226_solr    ] o.a.s.c.a.NodeAddedTrigger Found livenodes: [127.0.0.1:36216_solr, 127.0.0.1:46226_solr, 127.0.0.1:38641_solr, 127.0.0.1:43035_solr]
   [junit4]   2> 3676962 DEBUG (ScheduledTrigger-4342-thread-1) [n:127.0.0.1:46226_solr    ] o.a.s.c.a.NodeAddedTrigger Running NodeAddedTrigger node_added_trigger
   [junit4]   2> 3676962 DEBUG (ScheduledTrigger-4342-thread-1) [n:127.0.0.1:46226_solr    ] o.a.s.c.a.NodeAddedTrigger Found livenodes: [127.0.0.1:36216_solr, 127.0.0.1:46226_solr, 127.0.0.1:38641_solr, 127.0.0.1:43035_solr]
   [junit4]   2> 3677962 DEBUG (ScheduledTrigger-4342-thread-1) [n:127.0.0.1:46226_solr    ] o.a.s.c.a.NodeAddedTrigger Running NodeAddedTrigger node_added_trigger
   [junit4]   2> 3677963 DEBUG (ScheduledTrigger-4342-thread-1) [n:127.0.0.1:46226_solr    ] o.a.s.c.a.NodeAddedTrigger Found livenodes: [127.0.0.1:36216_solr, 127.0.0.1:46226_solr, 127.0.0.1:38641_solr, 127.0.0.1:43035_solr]
   [junit4]   2> 3678968 DEBUG (ScheduledTrigger-4342-thread-1) [n:127.0.0.1:46226_solr    ] o.a.s.c.a.NodeAddedTrigger Running NodeAddedTrigger node_added_trigger
   [junit4]   2> 3678968 DEBUG (ScheduledTrigger-4342-thread-1) [n:127.0.0.1:46226_solr    ] o.a.s.c.a.NodeAddedTrigger Found livenodes: [127.0.0.1:36216_solr, 127.0.0.1:46226_solr, 127.0.0.1:38641_solr, 127.0.0.1:43035_solr]
   [junit4]   2> 3679981 DEBUG (ScheduledTrigger-4342-thread-1) [n:127.0.0.1:46226_solr    ] o.a.s.c.a.NodeAddedTrigger Running NodeAddedTrigger node_added_trigger
   [junit4]   2> 3679981 DEBUG (ScheduledTrigger-4342-thread-1) [n:127.0.0.1:46226_solr    ] o.a.s.c.a.NodeAddedTrigger Found livenodes: [127.0.0.1:36216_solr, 127.0.0.1:46226_solr, 127.0.0.1:38641_solr, 127.0.0.1:43035_solr]
   [junit4]   2> 3680982 DEBUG (ScheduledTrigger-4342-thread-1) [n:127.0.0.1:46226_solr    ] o.a.s.c.a.NodeAddedTrigger Running NodeAddedTrigger node_added_trigger
   [junit4]   2> 3680982 DEBUG (ScheduledTrigger-4342-thread-1) [n:127.0.0.1:46226_solr    ] o.a.s.c.a.NodeAddedTrigger Found livenodes: [127.0.0.1:36216_solr, 127.0.0.1:46226_solr, 127.0.0.1:38641_solr, 127.0.0.1:43035_solr]
   [junit4]   2> 3682013 DEBUG (ScheduledTrigger-4342-thread-1) [n:127.0.0.1:46226_solr    ] o.a.s.c.a.NodeAddedTrigger Running NodeAddedTrigger node_added_trigger
   [junit4]   2> 3682013 DEBUG (ScheduledTrigger-4342-thread-1) [n:127.0.0.1:46226_solr    ] o.a.s.c.a.NodeAddedTrigger Found livenodes: [127.0.0.1:36216_solr, 127.0.0.1:46226_solr, 127.0.0.1:38641_solr, 127.0.0.1:43035_solr]
   [junit4]   2> 3683022 DEBUG (ScheduledTrigger-4342-thread-1) [n:127.0.0.1:46226_solr    ] o.a.s.c.a.NodeAddedTrigger Running NodeAddedTrigger node_added_trigger
   [junit4]   2> 3683022 DEBUG (ScheduledTrigger-4342-thread-1) [n:127.0.0.1:46226_solr    ] o.a.s.c.a.NodeAddedTrigger Found livenodes: [127.0.0.1:36216_solr, 127.0.0.1:46226_solr, 127.0.0.1:38641_solr, 127.0.0.1:43035_solr]
   [junit4]   2> 3683022 DEBUG (ScheduledTrigger-4342-thread-1) [n:127.0.0.1:46226_solr    ] o.a.s.c.a.NodeAddedTrigger NodeAddedTrigger node_added_trigger firing registered processor for nodes: [127.0.0.1:36216_solr] added at times [1512138717708000000], now=1512138727805000000
   [junit4]   2> 3683022 DEBUG (ScheduledTrigger-4342-thread-1) [n:127.0.0.1:46226_solr    ] o.a.s.c.a.ScheduledTriggers ++++++++ Cooldown inactive - processing event: {
   [junit4]   2>   "id":"14fc3226f0199b00T53itg2behh40xfu020l0dyhdq",
   [junit4]   2>   "source":"node_added_trigger",
   [junit4]   2>   "eventTime":1512138717708000000,
   [junit4]   2>   "eventType":"NODEADDED",
   [junit4]   2>   "properties":{
   [junit4]   2>     "eventTimes":[1512138717708000000],
   [junit4]   2>     "nodeNames":["127.0.0.1:36216_solr"]}}
   [junit4]   2> 3683023 INFO  (ScheduledTrigger-4342-thread-1) [n:127.0.0.1:46226_solr    ] o.a.s.c.a.SystemLogListener Collection .system does not exist, disabling logging.
   [junit4]   2> 3683026 DEBUG (AutoscalingActionExecutor-4343-thread-1-processing-n:127.0.0.1:46226_solr) [n:127.0.0.1:46226_solr    ] o.a.s.c.a.ScheduledTriggers -- processing actions for {
   [junit4]   2>   "id":"14fc3226f0199b00T53itg2behh40xfu020l0dyhdq",
   [junit4]   2>   "source":"node_added_trigger",
   [junit4]   2>   "eventTime":1512138717708000000,
   [junit4]   2>   "eventType":"NODEADDED",
   [junit4]   2>   "properties":{
   [junit4]   2>     "eventTimes":[1512138717708000000],
   [junit4]   2>     "_enqueue_time_":1512138727805000000,
   [junit4]   2>     "nodeNames":["127.0.0.1:36216_solr"]}}
   [junit4]   2> 3683026 INFO  (AutoscalingActionExecutor-4343-thread-1-processing-n:127.0.0.1:46226_solr) [n:127.0.0.1:46226_solr    ] o.a.s.c.ActionThrottle The last action attempt started 11279ms ago.
   [junit4]   2> 3683039 INFO  (TEST-TriggerIntegrationTest.testEventFromRestoredState-seed#[5968E87503AD728D]) [    ] o.e.j.s.Server jetty-9.3.20.v20170531
   [junit4]   2> 3683135 INFO  (TEST-TriggerIntegrationTest.testEventFromRestoredState-seed#[5968E87503AD728D]) [    ] o.e.j.s.h.ContextHandler Started o.e.j.s.ServletContextHandler@11d40319{/solr,null,AVAILABLE}
   [junit4]   2> 3683136 INFO  (TEST-TriggerIntegrationTest.testEventFromRestoredState-seed#[5968E87503AD728D]) [    ] o.e.j.s.AbstractConnector Started ServerConnector@5b40ade3{SSL,[ssl, http/1.1]}{127.0.0.1:37267}
   [junit4]   2> 3683136 INFO  (TEST-TriggerIntegrationTest.testEventFromRestoredState-seed#[5968E87503AD728D]) [    ] o.e.j.s.Server Started @3698789ms
   [junit4]   2> 3683136 INFO  (TEST-TriggerIntegrationTest.testEventFromRestoredState-seed#[5968E87503AD728D]) [    ] o.a.s.c.s.e.JettySolrRunner Jetty properties: {hostContext=/solr, hostPort=37267}
   [junit4]   2> 3683136 ERROR (TEST-TriggerIntegrationTest.testEventFromRestoredState-seed#[5968E87503AD728D]) [    ] o.a.s.u.StartupLoggingUtils Missing Java Option solr.log.dir. Logging may be missing or incomplete.
   [junit4]   2> 3683137 INFO  (TEST-TriggerIntegrationTest.testEventFromRestoredState-seed#[5968E87503AD728D]) [    ] o.a.s.s.SolrDispatchFilter  ___      _       Welcome to Apache Solr? version 8.0.0
   [junit4]   2> 3683137 INFO  (TEST-TriggerIntegrationTest.testEventFromRestoredState-seed#[5968E87503AD728D]) [    ] o.a.s.s.SolrDispatchFilter / __| ___| |_ _   Starting in cloud mode on port null
   [junit4]   2> 3683137 INFO  (TEST-TriggerIntegrationTest.testEventFromRestoredState-seed#[5968E87503AD728D]) [    ] o.a.s.s.SolrDispatchFilter \__ \/ _ \ | '_|  Install dir: null
   [junit4]   2> 3683137 INFO  (TEST-TriggerIntegrationTest.testEventFromRestoredState-seed#[5968E87503AD728D]) [    ] o.a.s.s.SolrDispatchFilter |___/\___/_|_|    Start time: 2017-12-01T14:32:07.920Z
   [junit4]   2> 3683245 INFO  (TEST-TriggerIntegrationTest.testEventFromRestoredState-seed#[5968E87503AD728D]) [    ] o.a.s.s.SolrDispatchFilter solr.xml found in ZooKeeper. Loading...
   [junit4]   2> 3683375 INFO  (TEST-TriggerIntegrationTest.testEventFromRestoredState-seed#[5968E87503AD728D]) [    ] o.a.s.c.ZkContainer Zookeeper client=127.0.0.1:40497/solr
   [junit4]   2> 3683415 INFO  (TEST-TriggerIntegrationTest.testEventFromRestoredState-seed#[5968E87503AD728D]) [n:127.0.0.1:37267_solr    ] o.a.s.c.c.ZkStateReader Updated live nodes from ZooKeeper... (0) -> (4)
   [junit4]   2> 3683429 INFO  (TEST-TriggerIntegrationTest.testEventFromRestoredState-seed#[5968E87503AD728D]) [n:127.0.0.1:37267_solr    ] o.a.s.c.Overseer Overseer (id=null) closing
   [junit4]   2> 3683430 INFO  (TEST-TriggerIntegrationTest.testEventFromRestoredState-seed#[5968E87503AD728D]) [n:127.0.0.1:37267_solr    ] o.a.s.c.ZkController Register node as live in ZooKeeper:/live_nodes/127.0.0.1:37267_solr
   [junit4]   2> 3683465 INFO  (zkCallback-1570-thread-1) [    ] o.a.s.c.c.ZkStateReader Updated live nodes from ZooKeeper... (4) -> (5)
   [junit4]   2> 3683465 INFO  (zkCallback-1562-thread-2-processing-n:127.0.0.1:46226_solr) [n:127.0.0.1:46226_solr    ] o.a.s.c.c.ZkStateReader Updated live nodes from ZooKeeper... (4) -> (5)
   [junit4]   2> 3683546 INFO  (zkCallback-1563-thread-1-processing-n:127.0.0.1:43035_solr) [n:127.0.0.1:43035_solr    ] o.a.s.c.c.ZkStateReader Updated live nodes from ZooKeeper... (4) -> (5)
   [junit4]   2> 3683546 INFO  (zkCallback-1578-thread-1-processing-n:127.0.0.1:38641_solr) [n:127.0.0.1:38641_solr    ] o.a.s.c.c.ZkStateReader Updated live nodes from ZooKeeper... (4) -> (5)
   [junit4]   2> 3683574 INFO  (zkCallback-1590-thread-1-processing-n:127.0.0.1:36216_solr) [n:127.0.0.1:36216_solr    ] o.a.s.c.c.ZkStateReader Updated live nodes from ZooKeeper... (4) -> (5)
   [junit4]   2> 3683634 INFO  (zkCallback-1596-thread-1-processing-n:127.0.0.1:37267_solr) [n:127.0.0.1:37267_solr    ] o.a.s.c.c.ZkStateReader Updated live nodes from ZooKeeper... (4) -> (5)
   [junit4]   2> 3683850 INFO  (TEST-TriggerIntegrationTest.testEventFromRestoredState-seed#[5968E87503AD728D]) [n:127.0.0.1:37267_solr    ] o.a.s.m.r.SolrJmxReporter JMX monitoring for 'solr_37267.solr.node' (registry 'solr.node') enabled at server: com.sun.jmx.mbeanserver.JmxMBeanServer@24068114
   [junit4]   2> 3683923 INFO  (TEST-TriggerIntegrationTest.testEventFromRestoredState-seed#[5968E87503AD728D]) [n:127.0.0.1:37267_solr    ] o.a.s.m.r.SolrJmxReporter JMX monitoring for 'solr_37267.solr.jvm' (registry 'solr.jvm') enabled at server: com.sun.jmx.mbeanserver.JmxMBeanServer@24068114
   [junit4]   2> 3683923 INFO  (TEST-TriggerIntegrationTest.testEventFromRestoredState-seed#[5968E87503AD728D]) [n:127.0.0.1:37267_solr    ] o.a.s.m.r.SolrJmxReporter JMX monitoring for 'solr_37267.solr.jetty' (registry 'solr.jetty') enabled at server: com.sun.jmx.mbeanserver.JmxMBeanServer@24068114
   [junit4]   2> 3683958 INFO  (TEST-TriggerIntegrationTest.testEventFromRestoredState-seed#[5968E87503AD728D]) [n:127.0.0.1:37267_solr    ] o.a.s.c.CorePropertiesLocator Found 0 core definitions underneath /home/jenkins/jenkins-slave/workspace/Lucene-Solr-Tests-master/solr/build/solr-core/test/J0/temp/solr.cloud.autoscaling.TriggerIntegrationTest_5968E87503AD728D-001/tempDir-001/node5/.
   [junit4]   2> 3684024 DEBUG (ScheduledTrigger-4342-thread-1) [n:127.0.0.1:46226_solr    ] o.a.s.c.a.NodeAddedTrigger Running NodeAddedTrigger node_added_trigger
   [junit4]   2> 3684024 DEBUG (ScheduledTrigger-4342-thread-1) [n:127.0.0.1:46226_solr    ] o.a.s.c.a.NodeAddedTrigger Found livenodes: [127.0.0.1:36216_solr, 127.0.0.1:46226_solr, 127.0.0.1:38641_solr, 127.0.0.1:43035_solr, 127.0.0.1:37267_solr]
   [junit4]   2> 3684024 DEBUG (ScheduledTrigger-4342-thread-1) [n:127.0.0.1:46226_solr    ] o.a.s.c.a.NodeAddedTrigger Tracking new node: 127.0.0.1:37267_solr at time 1512138728807000000
   [junit4]   2> 3685024 DEBUG (ScheduledTrigger-4342-thread-1) [n:127.0.0.1:46226_solr    ] o.a.s.c.a.NodeAddedTrigger Running NodeAddedTrigger node_added_trigger
   [junit4]   2> 3685024 DEBUG (ScheduledTrigger-4342-thread-1) [n:127.0.0.1:46226_solr    ] o.a.s.c.a.NodeAddedTrigger Found livenodes: [127.0.0.1:36216_solr, 127.0.0.1:46226_solr, 127.0.0.1:38641_solr, 127.0.0.1:43035_solr, 127.0.0.1:37267_solr]
   [junit4]   2> 3686025 DEBUG (ScheduledTrigger-4342-thread-1) [n:127.0.0.1:46226_solr    ] o.a.s.c.a.NodeAddedTrigger Running NodeAddedTrigger node_added_trigger
   [junit4]   2> 3686025 DEBUG (ScheduledTrigger-4342-thread-1) [n:127.0.0.1:46226_solr    ] o.a.s.c.a.NodeAddedTrigger Found livenodes: [127.0.0.1:36216_solr, 127.0.0.1:46226_solr, 127.0.0.1:38641_solr, 127.0.0.1:43035_solr, 127.0.0.1:37267_solr]
   [junit4]   2> 3687031 DEBUG (ScheduledTrigger-4342-thread-1) [n:127.0.0.1:46226_solr    ] o.a.s.c.a.NodeAddedTrigger Running NodeAddedTrigger node_added_trigger
   [junit4]   2> 3687031 DEBUG (ScheduledTrigger-4342-thread-1) [n:127.0.0.1:46226_solr    ] o.a.s.c.a.NodeAddedTrigger Found livenodes: [127.0.0.1:36216_solr, 127.0.0.1:46226_solr, 127.0.0.1:38641_solr, 127.0.0.1:43035_solr, 127.0.0.1:37267_solr]
   [junit4]   2> 3688035 DEBUG (ScheduledTrigger-4342-thread-1) [n:127.0.0.1:46226_solr    ] o.a.s.c.a.NodeAddedTrigger Running NodeAddedTrigger node_added_trigger
   [junit4]   2> 3688035 DEBUG (ScheduledTrigger-4342-thread-1) [n:127.0.0.1:46226_solr    ] o.a.s.c.a.NodeAddedTrigger Found livenodes: [127.0.0.1:36216_solr, 127.0.0.1:46226_solr, 127.0.0.1:38641_solr, 127.0.0.1:43035_solr, 127.0.0.1:37267_solr]
   [junit4]   2> 3689036 DEBUG (ScheduledTrigger-4342-thread-1) [n:127.0.0.1:46226_solr    ] o.a.s.c.a.NodeAddedTrigger Running NodeAddedTrigger node_added_trigger
   [junit4]   2> 3689036 DEBUG (ScheduledTrigger-4342-thread-1) [n:127.0.0.1:46226_solr    ] o.a.s.c.a.NodeAddedTrigger Found livenodes: [127.0.0.1:36216_solr, 127.0.0.1:46226_solr, 127.0.0.1:38641_solr, 127.0.0.1:43035_solr, 127.0.0.1:37267_solr]
   [junit4]   2> 3690039 DEBUG (ScheduledTrigger-4342-thread-1) [n:127.0.0.1:46226_solr    ] o.a.s.c.a.NodeAddedTrigger Running NodeAddedTrigger node_added_trigger
   [junit4]   2> 3690039 DEBUG (ScheduledTrigger-4342-thread-1) [n:127.0.0.1:46226_solr    ] o.a.s.c.a.NodeAddedTrigger Found livenodes: [127.0.0.1:36216_solr, 127.0.0.1:46226_solr, 127.0.0.1:38641_solr, 127.0.0.1:43035_solr, 127.0.0.1:37267_solr]
   [junit4]   2> 3691039 DEBUG (ScheduledTrigger-4342-thread-1) [n:127.0.0.1:46226_solr    ] o.a.s.c.a.NodeAddedTrigger Running NodeAddedTrigger node_added_trigger
   [junit4]   2> 3691040 DEBUG (ScheduledTrigger-4342-thread-1) [n:127.0.0.1:46226_solr    ] o.a.s.c.a.NodeAddedTrigger Found livenodes: [127.0.0.1:36216_solr, 127.0.0.1:46226_solr, 127.0.0.1:38641_solr, 127.0.0.1:43035_solr, 127.0.0.1:37267_solr]
   [junit4]   2> 3692047 DEBUG (ScheduledTrigger-4342-thread-1) [n:127.0.0.1:46226_solr    ] o.a.s.c.a.NodeAddedTrigger Running NodeAddedTrigger node_added_trigger
   [junit4]   2> 3692047 DEBUG (ScheduledTrigger-4342-thread-1) [n:127.0.0.1:46226_solr    ] o.a.s.c.a.NodeAddedTrigger Found livenodes: [127.0.0.1:36216_solr, 127.0.0.1:46226_solr, 127.0.0.1:38641_solr, 127.0.0.1:43035_solr, 127.0.0.1:37267_solr]
   [junit4]   2> 3693063 DEBUG (ScheduledTrigger-4342-thread-1) [n:127.0.0.1:46226_solr    ] o.a.s.c.a.NodeAddedTrigger Running NodeAddedTrigger node_added_trigger
   [junit4]   2> 3693063 DEBUG (ScheduledTrigger-4342-thread-1) [n:127.0.0.1:46226_solr    ] o.a.s.c.a.NodeAddedTrigger Found livenodes: [127.0.0.1:36216_solr, 127.0.0.1:46226_solr, 127.0.0.1:38641_solr, 127.0.0.1:43035_solr, 127.0.0.1:37267_solr]
   [junit4]   2> 3694071 DEBUG (ScheduledTrigger-4342-thread-1) [n:127.0.0.1:46226_solr    ] o.a.s.c.a.NodeAddedTrigger Running NodeAddedTrigger node_added_trigger
   [junit4]   2> 3694071 DEBUG (ScheduledTrigger-4342-thread-1) [n:127.0.0.1:46226_solr    ] o.a.s.c.a.NodeAddedTrigger Found livenodes: [127.0.0.1:36216_solr, 127.0.0.1:46226_solr, 127.0.0.1:38641_solr, 127.0.0.1:43035_solr, 127.0.0.1:37267_solr]
   [junit4]   2> 3694071 DEBUG (ScheduledTrigger-4342-thread-1) [n:127.0.0.1:46226_solr    ] o.a.s.c.a.NodeAddedTrigger NodeAddedTrigger node_added_trigger firing registered processor for nodes: [127.0.0.1:37267_solr] added at times [1512138728807000000], now=1512138738854000000
   [junit4]   2> 3694071 DEBUG (ScheduledTrigger-4342-thread-1) [n:127.0.0.1:46226_solr    ] o.a.s.c.a.ScheduledTriggers ++++++++ Cooldown inactive - processing event: {
   [junit4]   2>   "id":"14fc322985a6e7c0T53itg2behh40xfu020l0dyhds",
   [junit4]   2>   "source":"node_added_trigger",
   [junit4]   2>   "eventTime":1512138728807000000,
   [junit4]   2>   "eventType":"NODEADDED",
   [junit4]   2>   "properties":{
   [junit4]   2>     "eventTimes":[1512138728807000000],
   [junit4]   2>     "nodeNames":["127.0.0.1:37267_solr"]}}
   [junit4]   2> 3694072 DEBUG (AutoscalingActionExecutor-4343-thread-1-processing-n:127.0.0.1:46226_solr) [n:127.0.0.1:46226_solr    ] o.a.s.c.a.ScheduledTriggers -- processing actions for {
   [junit4]   2>   "id":"14fc322985a6e7c0T53itg2behh40xfu020l0dyhds",
   [junit4]   2>   "source":"node_added_trigger",
   [junit4]   2>   "eventTime":1512138728807000000,
   [junit4]   2>   "eventType":"NODEADDED",
   [junit4]   2>   "properties":{
   [junit4]   2>     "eventTimes":[1512138728807000000],
   [junit4]   2>     "_enqueue_time_":1512138738855000000,
   [junit4]   2>     "nodeNames":["127.0.0.1:37267_solr"]}}
   [junit4]   2> 3694072 INFO  (AutoscalingActionExecutor-4343-thread-1-processing-n:127.0.0.1:46226_solr) [n:127.0.0.1:46226_solr    ] o.a.s.c.ActionThrottle The last action attempt started 11046ms ago.
   [junit4]   2> 3694579 INFO  (TEST-TriggerIntegrationTest.testEventFromRestoredState-seed#[5968E87503AD728D]) [    ] o.e.j.s.AbstractConnector Stopped ServerConnector@4394f1ef{SSL,[ssl, http/1.1]}{127.0.0.1:0}
   [junit4]   2> 3694580 INFO  (TEST-TriggerIntegrationTest.testEventFromRestoredState-seed#[5968E87503AD728D]) [    ] o.a.s.c.CoreContainer Shutting down CoreContainer instance=58764978
   [junit4]   2> 3694585 INFO  (TEST-TriggerIntegrationTest.testEventFromRestoredState-seed#[5968E87503AD728D]) [    ] o.a.s.m.SolrMetricManager Closing metric reporters for registry=solr.node, tag=null
   [junit4]   2> 3694585 INFO  (TEST-TriggerIntegrationTest.testEventFromRestoredState-seed#[5968E87503AD728D]) [    ] o.a.s.m.r.SolrJmxReporter Closing reporter [org.apache.solr.metrics.reporters.SolrJmxReporter@17deecc1: rootName = solr_46226, domain = solr.node, service url = null, agent id = null] for registry solr.node / com.codahale.metrics.MetricRegistry@58d5f6f4
   [junit4]   2> 3694621 INFO  (TEST-TriggerIntegrationTest.testEventFromRestoredState-seed#[5968E87503AD728D]) [    ] o.a.s.m.SolrMetricManager Closing metric reporters for registry=solr.jvm, tag=null
   [junit4]   2> 3694621 INFO  (TEST-TriggerIntegrationTest.testEventFromRestoredState-seed#[5968E87503AD728D]) [    ] o.a.s.m.r.SolrJmxReporter Closing reporter [org.apache.solr.metrics.reporters.SolrJmxReporter@7be54ff: rootName = solr_46226, domain = solr.jvm, service url = null, agent id = null] for registry solr.jvm / com.codahale.metrics.MetricRegistry@40f29ae9
   [junit4]   2> 3694642 INFO  (TEST-TriggerIntegrationTest.testEventFromRestoredState-seed#[5968E87503AD728D]) [    ] o.a.s.m.SolrMetricManager Closing metric reporters for registry=solr.jetty, tag=null
   [junit4]   2> 3694642 INFO  (TEST-TriggerIntegrationTest.testEventFromRestoredState-seed#[5968E87503AD728D]) [    ] o.a.s.m.r.SolrJmxReporter Closing reporter [org.apache.solr.metrics.reporters.SolrJmxReporter@ca000f5: rootName = solr_46226, domain = solr.jetty, service url = null, agent id = null] for registry solr.jetty / com.codahale.metrics.MetricRegistry@2622bf86
   [junit4]   2> 3694656 INFO  (TEST-TriggerIntegrationTest.testEventFromRestoredState-seed#[5968E87503AD728D]) [    ] o.a.s.c.ZkController Remove node as live in ZooKeeper:/live_nodes/127.0.0.1:46226_solr
   [junit4]   2> 3694656 INFO  (TEST-TriggerIntegrationTest.testEventFromRestoredState-seed#[5968E87503AD728D]) [    ] o.a.s.m.SolrMetricManager Closing metric reporters for registry=solr.cluster, tag=null
   [junit4]   2> 3694663 INFO  (zkCallback-1596-thread-1-processing-n:127.0.0.1:37267_solr) [n:127.0.0.1:37267_solr    ] o.a.s.c.c.ZkStateReader Updated live nodes from ZooKeeper... (5) -> (4)
   [junit4]   2> 3694663 INFO  (zkCallback-1570-thread-1) [    ] o.a.s.c.c.ZkStateReader Updated live nodes from ZooKeeper... (5) -> (4)
   [junit4]   2> 3694663 INFO  (zkCallback-1562-thread-1-processing-n:127.0.0.1:46226_solr) [n:127.0.0.1:46226_solr    ] o.a.s.c.c.ZkStateReader Updated live nodes from ZooKeeper... (5) -> (4)
   [junit4]   2> 3694663 INFO  (zkCallback-1590-thread-1-processing-n:127.0.0.1:36216_solr) [n:127.0.0.1:36216_solr    ] o.a.s.c.c.ZkStateReader Updated live nodes from ZooKeeper... (5) -> (4)
   [junit4]   2> 3694672 INFO  (zkCallback-1578-thread-1-processing-n:127.0.0.1:38641_solr) [n:127.0.0.1:38641_solr    ] o.a.s.c.c.ZkStateReader Updated live nodes from ZooKeeper... (5) -> (4)
   [junit4]   2> 3694672 INFO  (zkCallback-1563-thread-1-processing-n:127.0.0.1:43035_solr) [n:127.0.0.1:43035_solr    ] o.a.s.c.c.ZkStateReader Updated live nodes from ZooKeeper... (5) -> (4)
   [junit4]   2> 3694692 INFO  (TEST-TriggerIntegrationTest.testEventFromRestoredState-seed#[5968E87503AD728D]) [    ] o.a.s.c.TransientSolrCoreCacheDefault Allocating transient cache for 2147483647 transient cores
   [junit4]   2> 3694693 INFO  (TEST-TriggerIntegrationTest.testEventFromRestoredState-seed#[5968E87503AD728D]) [    ] o.a.s.c.Overseer Overseer (id=99099522425028613-127.0.0.1:46226_solr-n_0000000000) closing
   [junit4]   2> 3694693 INFO  (OverseerStateUpdate-99099522425028613-127.0.0.1:46226_solr-n_0000000000) [n:127.0.0.1:46226_solr    ] o.a.s.c.Overseer Overseer Loop exiting : 127.0.0.1:46226_solr
   [junit4]   2> 3694712 WARN  (OverseerAutoScalingTriggerThread-99099522425028613-127.0.0.1:46226_solr-n_0000000000) [n:127.0.0.1:46226_solr    ] o.a.s.c.a.OverseerTriggerThread OverseerTriggerThread woken up but we are closed, exiting.
   [junit4]   2> 3694714 DEBUG (TEST-TriggerIntegrationTest.testEventFromRestoredState-seed#[5968E87503AD728D]) [    ] o.a.s.c.a.OverseerTriggerThread OverseerTriggerThread has been closed explicitly
   [junit4]   2> 3694715 INFO  (zkCallback-1563-thread-1-processing-n:127.0.0.1:43035_solr) [n:127.0.0.1:43035_solr    ] o.a.s.c.OverseerElectionContext I am going to be the leader 127.0.0.1:43035_solr
   [junit4]   2> 3694715 INFO  (TEST-TriggerIntegrationTest.testEventFromRestoredState-seed#[5968E87503AD728D]) [    ] o.e.j.s.h.ContextHandler Stopped o.e.j.s.ServletContextHandler@3fc9272e{/solr,null,UNAVAILABLE}
   [junit4]   2> 3694749 INFO  (TEST-TriggerIntegrationTest.testEventFromRestoredState-seed#[5968E87503AD728D]) [    ] o.a.s.SolrTestCaseJ4 ###Ending testEventFromRestoredState
   [junit4]   2> 3694769 INFO  (zkCallback-1563-thread-1-processing-n:127.0.0.1:43035_solr) [n:127.0.0.1:43035_solr    ] o.a.s.c.Overseer Overseer (id=99099522425028614-127.0.0.1:43035_solr-n_0000000001) starting
   [junit4]   2> 3694891 DEBUG (OverseerAutoScalingTriggerThread-99099522425028614-127.0.0.1:43035_solr-n_0000000001) [n:127.0.0.1:43035_solr    ] o.a.s.c.a.OverseerTriggerThread Adding .autoAddReplicas trigger
   [junit4]   2> 3694927 DEBUG (OverseerAutoScalingTriggerThread-99099522425028614-127.0.0.1:43035_solr-n_0000000001) [n:127.0.0.1:43035_solr    ] o.a.s.c.a.OverseerTriggerThread Refreshing /autoscaling.json with znode version 7
   [junit4]   2> 3694944 DEBUG (OverseerAutoScalingTriggerThread-99099522425028614-127.0.0.1:43035_solr-n_0000000001) [n:127.0.0.1:43035_solr    ] o.a.s.c.a.NodeAddedTrigger Initial livenodes: [127.0.0.1:36216_solr, 127.0.0.1:38641_solr, 127.0.0.1:43035_solr, 127.0.0.1:37267_solr]
   [junit4]   2> 3694944 DEBUG (OverseerAutoScalingTriggerThread-99099522425028614-127.0.0.1:43035_solr-n_0000000001) [n:127.0.0.1:43035_solr    ] o.a.s.c.a.NodeAddedTrigger NodeAddedTrigger node_added_trigger instantiated with properties: {event=nodeAdded, waitFor=10, actions=[{name=test, class=org.apache.solr.cloud.autoscaling.TriggerIntegrationTest$TestTriggerAction}], enabled=true}
   [junit4]   2> 3694950 INFO  (TEST-TriggerIntegrationTest.testContinueTriggersOnOverseerRestart-seed#[5968E87503AD728D]) [    ] o.a.s.SolrTestCaseJ4 ###Starting testContinueTriggersOnOverseerRestart
   [junit4]   2> 3694951 INFO  (TEST-TriggerIntegrationTest.testContinueTriggersOnOverseerRestart-seed#[5968E87503AD728D]) [    ] o.a.s.c.a.TriggerIntegrationTest /autoscaling.json reset, new znode version 8
   [junit4]   2> 3694964 DEBUG (OverseerAutoScalingTriggerThread-99099522425028614-127.0.0.1:43035_solr-n_0000000001) [n:127.0.0.1:43035_solr    ] o.a.s.c.a.NodeLostTrigger Initial livenodes: [127.0.0.1:36216_solr, 127.0.0.1:38641_solr, 127.0.0.1:43035_solr, 127.0.0.1:37267_solr]
   [junit4]   2> 3694964 DEBUG (OverseerAutoScalingTriggerThread-99099522425028614-127.0.0.1:43035_solr-n_0000000001) [n:127.0.0.1:43035_solr    ] o.a.s.c.a.OverseerTriggerThread Current znodeVersion 7, lastZnodeVersion -1
   [junit4]   2> 3694964 DEBUG (OverseerAutoScalingTriggerThread-99099522425028614-127.0.0.1:43035_solr-n_0000000001) [n:127.0.0.1:43035_solr    ] o.a.s.c.a.OverseerTriggerThread Processed trigger updates upto znodeVersion 7
   [junit4]   2> 3694968 DEBUG (zkCallback-1563-thread-1-processing-n:127.0.0.1:43035_solr) [n:127.0.0.1:43035_solr    ] o.a.s.c.a.OverseerTriggerThread Refreshing /autoscaling.json with znode version 8
   [junit4]   2> 3695162 DEBUG (ScheduledTrigger-4369-thread-1) [n:127.0.0.1:43035_solr    ] o.a.s.c.a.NodeLostTrigger Running NodeLostTrigger: .auto_add_replicas with currently live nodes: [127.0.0.1:36216_solr, 127.0.0.1:38641_solr, 127.0.0.1:43035_solr, 127.0.0.1:37267_solr]
   [junit4]   2> 3695168 INFO  (qtp1463026123-10781) [n:127.0.0.1:36216_solr    ] o.a.s.h.a.CollectionsHandler Invoked Collection Action :overseerstatus with params action=OVERSEERSTATUS&wt=javabin&version=2 and sendToOCPQueue=true
   [junit4]   2> 3695235 INFO  (OverseerAutoScalingTriggerThread-99099522425028614-127.0.0.1:43035_solr-n_0000000001) [n:127.0.0.1:43035_solr    ] o.a.s.c.a.TriggerIntegrationTest TestTriggerAction init
   [junit4]   2> 3695256 DEBUG (OverseerAutoScalingTriggerThread-99099522425028614-127.0.0.1:43035_solr-n_0000000001) [n:127.0.0.1:43035_solr    ] o.a.s.c.a.OverseerTriggerThread Current znodeVersion 8, lastZnodeVersion 7
   [junit4]   2> 3695256 DEBUG (OverseerAutoScalingTriggerThread-99099522425028614-127.0.0.1:43035_solr-n_0000000001) [n:127.0.0.1:43035_solr    ] o.a.s.c.a.OverseerTriggerThread Processed trigger updates upto znodeVersion 8
   [junit4]   2> 3695263 INFO  (qtp1463026123-10781) [n:127.0.0.1:36216_solr    ] o.a.s.s.HttpSolrCall [admin] webapp=null path=/admin/collections params={action=OVERSEERSTATUS&wt=javabin&version=2} status=0 QTime=95
   [junit4]   2> 3695272 WARN  (ScheduledTrigger-4369-thread-1) [n:127.0.0.1:43035_solr    ] o.a.s.c.a.TriggerBase Exception getting trigger state '/autoscaling/triggerState/node_added_trigger'
   [junit4]   2> java.lang.InterruptedException
   [junit4]   2> 	at java.lang.Object.wait(Native Method)
   [junit4]   2> 	at java.lang.Object.wait(Object.java:502)
   [junit4]   2> 	at org.apache.zookeeper.ClientCnxn.submitRequest(ClientCnxn.java:1406)
   [junit4]   2> 	at org.apache.zookeeper.ZooKeeper.exists(ZooKeeper.java:1097)
   [junit4]   2> 	at org.apache.solr.common.cloud.SolrZkClient.lambda$exists$3(SolrZkClient.java:308)
   [junit4]   2> 	at org.apache.solr.common.cloud.ZkCmdExecutor.retryOperation(ZkCmdExecutor.java:60)
   [junit4]   2> 	at org.apache.solr.common.cloud.SolrZkClient.exists(SolrZkClient.java:308)
   [junit4]   2> 	at org.apache.solr.client.solrj.impl.ZkDistribStateManager.hasData(ZkDistribStateManager.java:57)
   [junit4]   2> 	at org.apache.solr.cloud.autoscaling.TriggerBase.restoreState(TriggerBase.java:221)
   [junit4]   2> 	at org.apache.solr.cloud.autoscaling.ScheduledTriggers$ScheduledTrigger.run(ScheduledTriggers.java:534)
   [junit4]   2> 	at java.util.concurrent.Executors$RunnableAdapter.call(Executors.java:511)
   [junit4]   2> 	at java.util.concurrent.FutureTask.runAndReset(FutureTask.java:308)
   [junit4]   2> 	at java.util.concurrent.ScheduledThreadPoolExecutor$ScheduledFutureTask.access$301(ScheduledThreadPoolExecutor.java:180)
   [junit4]   2> 	at java.util.concurrent.ScheduledThreadPoolExecutor$ScheduledFutureTask.run(ScheduledThreadPoolExecutor.java:294)
   [junit4]   2> 	at java.util.concurrent.ThreadPoolExecutor.runWorker(ThreadPoolExecutor.java:1149)
   [junit4]   2> 	at java.util.concurrent.ThreadPoolExecutor$Worker.run(ThreadPoolExecutor.java:624)
   [junit4]   2> 	at java.lang.Thread.run(Thread.java:748)
   [junit4]   2> 3695346 WARN  (ScheduledTrigger-4369-thread-1) [n:127.0.0.1:43035_solr    ] o.a.s.c.a.NodeAddedTrigger NodeAddedTrigger ran but was already closed
   [junit4]   2> 3695346 ERROR (ScheduledTrigger-4369-thread-1) [n:127.0.0.1:43035_solr    ] o.a.s.c.a.NodeAddedTrigger Unexpected exception in NodeAddedTrigger
   [junit4]   2> java.lang.RuntimeException: Trigger has been closed
   [junit4]   2> 	at org.apache.solr.cloud.autoscaling.NodeAddedTrigger.run(NodeAddedTrigger.java:128)
   [junit4]   2> 	at org.apache.solr.cloud.autoscaling.ScheduledTriggers$ScheduledTrigger.run(ScheduledTriggers.java:542)
   [junit4]   2> 	at java.util.concurrent.Executors$RunnableAdapter.call(Executors.java:511)
   [junit4]   2> 	at java.util.concurrent.FutureTask.runAndReset(FutureTask.java:308)
   [junit4]   2> 	at java.util.concurrent.ScheduledThreadPoolExecutor$ScheduledFutureTask.access$301(ScheduledThreadPoolExecutor.java:180)
   [junit4]   2> 	at java.util.concurrent.ScheduledThreadPoolExecutor$ScheduledFutureTask.run(ScheduledThreadPoolExecutor.java:294)
   [junit4]   2> 	at java.util.concurrent.ThreadPoolExecutor.runWorker(ThreadPoolExecutor.java:1149)
   [junit4]   2> 	at java.util.concurrent.ThreadPoolExecutor$Worker.run(ThreadPoolExecutor.java:624)
   [junit4]   2> 	at java.lang.Thread.run(Thread.java:748)
   [junit4]   2> 3695407 INFO  (qtp1463026123-10774) [n:127.0.0.1:36216_solr    ] o.a.s.c.c.ZkStateReader Updated live nodes from ZooKeeper... (0) -> (4)
   [junit4]   2> 3695407 INFO  (qtp1463026123-10774) [n:127.0.0.1:36216_solr    ] o.a.s.c.s.i.ZkClientClusterStateProvider Cluster at 127.0.0.1:40497/solr ready
   [junit4]   2> 3695471 INFO  (OverseerCollectionConfigSetProcessor-99099522425028614-127.0.0.1:43035_solr-n_0000000001) [n:127.0.0.1:43035_solr    ] o.a.s.c.OverseerTaskQueue Response ZK path: /overseer/collection-queue-work/qnr-0000000002 doesn't exist.  Requestor may have disconnected from ZooKeeper
   [junit4]   2> 3695475 DEBUG (OverseerAutoScalingTriggerThread-99099522425028614-127.0.0.1:43035_solr-n_0000000001) [n:127.0.0.1:43035_solr    ] o.a.s.c.a.OverseerTriggerThread -- clean old nodeLost markers
   [junit4]   2> 3695475 INFO  (qtp1463026123-10778) [n:127.0.0.1:36216_solr    ] o.a.s.s.HttpSolrCall [admin] webapp=null path=/admin/metrics params={prefix=CORE.coreName&wt=javabin&version=2&group=solr.core} status=0 QTime=0
   [junit4]   2> 3695495 DEBUG (OverseerAutoScalingTriggerThread-99099522425028614-127.0.0.1:43035_solr-n_0000000001) [n:127.0.0.1:43035_solr    ] o.a.s.c.a.OverseerTriggerThread -- clean old nodeAdded markers
   [junit4]   2> 3695511 DEBUG (OverseerAutoScalingTriggerThread-99099522425028614-127.0.0.1:43035_solr-n_0000000001) [n:127.0.0.1:43035_solr    ] o.a.s.c.a.OverseerTriggerThread Current znodeVersion 8, lastZnodeVersion 8
   [junit4]   2> 3695600 INFO  (qtp1921610573-10746) [n:127.0.0.1:38641_solr    ] o.a.s.s.HttpSolrCall [admin] webapp=null path=/admin/metrics params={prefix=CORE.coreName&wt=javabin&version=2&group=solr.core} status=0 QTime=0
   [junit4]   2> 3695749 INFO  (qtp1744544607-10801) [n:127.0.0.1:37267_solr    ] o.a.s.s.HttpSolrCall [admin] webapp=null path=/admin/metrics params={prefix=CORE.coreName&wt=javabin&version=2&group=solr.core} status=0 QTime=0
   [junit4]   2> 3695808 INFO  (qtp105013114-10689) [n:127.0.0.1:43035_solr    ] o.a.s.s.HttpSolrCall [admin] webapp=null path=/admin/metrics params={prefix=CORE.coreName&wt=javabin&version=2&group=solr.core} status=0 QTime=0
   [junit4]   2> 3695811 DEBUG (qtp1463026123-10774) [n:127.0.0.1:36216_solr    ] o.a.s.c.a.AutoScalingHandler Verified autoscaling configuration
   [junit4]   2> 3695813 DEBUG (zkCallback-1563-thread-1-processing-n:127.0.0.1:43035_solr) [n:127.0.0.1:43035_solr    ] o.a.s.c.a.OverseerTriggerThread Refreshing /autoscaling.json with znode version 9
   [junit4]   2> 3695814 DEBUG (zkCallback-1563-thread-1-processing-n:127.0.0.1:43035_solr) [n:127.0.0.1:43035_solr    ] o.a.s.c.a.NodeAddedTrigger Initial livenodes: [127.0.0.1:36216_solr, 127.0.0.1:38641_solr, 127.0.0.1:43035_solr, 127.0.0.1:37267_solr]
   [junit4]   2> 3695814 DEBUG (zkCallback-1563-thread-1-processing-n:127.0.0.1:43035_solr) [n:127.0.0.1:43035_solr    ] o.a.s.c.a.NodeAddedTrigger NodeAddedTrigger node_added_trigger instantiated with properties: {event=nodeAdded, waitFor=2, actions=[{name=test, class=org.apache.solr.cloud.autoscaling.TriggerIntegrationTest$TestTriggerAction}], enabled=true}
   [junit4]   2> 3695814 DEBUG (OverseerAutoScalingTriggerThread-99099522425028614-127.0.0.1:43035_solr-n_0000000001) [n:127.0.0.1:43035_solr    ] o.a.s.c.a.OverseerTriggerThread Processed trigger updates upto znodeVersion 9
   [junit4]   2> 3695815 INFO  (OverseerAutoScalingTriggerThread-99099522425028614-127.0.0.1:43035_solr-n_0000000001) [n:127.0.0.1:43035_solr    ] o.a.s.c.a.TriggerIntegrationTest TestTriggerAction init
   [junit4]   2> 3695827 INFO  (qtp1463026123-10774) [n:127.0.0.1:36216

[...truncated too long message...]

 (SUITE-StreamExpressionTest-seed#[D867925B91B04B56]-worker) [    ] o.a.z.s.ZooKeeperServer ZKShutdownHandler is not registered, so ZooKeeper server won't take any action on ERROR or SHUTDOWN server state changes
   [junit4]   2> 820418 INFO  (SUITE-StreamExpressionTest-seed#[D867925B91B04B56]-worker) [    ] o.a.s.c.ZkTestServer connecting to 127.0.0.1:40201 40201
   [junit4]   2> 820535 INFO  (Thread-80) [    ] o.a.s.c.ZkTestServer connecting to 127.0.0.1:40201 40201
   [junit4]   2> 820535 WARN  (Thread-80) [    ] o.a.s.c.ZkTestServer Watch limit violations: 
   [junit4]   2> Maximum concurrent create/delete watches above limit:
   [junit4]   2> 
   [junit4]   2> 	98	/solr/aliases.json
   [junit4]   2> 	98	/solr/clusterprops.json
   [junit4]   2> 	10	/solr/configs/conf
   [junit4]   2> 	9	/solr/configs/ml
   [junit4]   2> 	8	/solr/security.json
   [junit4]   2> 
   [junit4]   2> Maximum concurrent data watches above limit:
   [junit4]   2> 
   [junit4]   2> 	98	/solr/clusterstate.json
   [junit4]   2> 	34	/solr/collections/destinationCollection/state.json
   [junit4]   2> 	30	/solr/collections/parallelDestinationCollection1/state.json
   [junit4]   2> 	24	/solr/collections/parallelDestinationCollection/state.json
   [junit4]   2> 	14	/solr/collections/collection1/state.json
   [junit4]   2> 	14	/solr/collections/workQueue/state.json
   [junit4]   2> 	14	/solr/collections/uknownCollection/state.json
   [junit4]   2> 	14	/solr/collections/modelCollection/state.json
   [junit4]   2> 	12	/solr/collections/destination/state.json
   [junit4]   2> 	12	/solr/collections/destination1/state.json
   [junit4]   2> 	12	/solr/collections/workQueue1/state.json
   [junit4]   2> 	12	/solr/collections/mainCorpus/state.json
   [junit4]   2> 	10	/solr/collections/mainCorpus1/state.json
   [junit4]   2> 	8	/solr/collections/checkpointCollection/state.json
   [junit4]   2> 	2	/solr/overseer_elect/election/99099778161967146-127.0.0.1:35862_solr-n_0000000004
   [junit4]   2> 	2	/solr/autoscaling.json
   [junit4]   2> 
   [junit4]   2> Maximum concurrent children watches above limit:
   [junit4]   2> 
   [junit4]   2> 	98	/solr/live_nodes
   [junit4]   2> 	98	/solr/collections
   [junit4]   2> 	2	/solr/overseer/queue
   [junit4]   2> 	2	/solr/autoscaling/events/.auto_add_replicas
   [junit4]   2> 	2	/solr/overseer/collection-queue-work
   [junit4]   2> 	2	/solr/overseer/queue-work
   [junit4]   2> 
   [junit4]   2> NOTE: leaving temporary files on disk at: /home/jenkins/jenkins-slave/workspace/Lucene-Solr-Tests-master/solr/build/solr-solrj/test/J0/temp/solr.client.solrj.io.stream.StreamExpressionTest_D867925B91B04B56-001
   [junit4]   2> NOTE: test params are: codec=Asserting(Lucene70): {expr_s=PostingsFormat(name=MockRandom), name_s=PostingsFormat(name=LuceneFixedGap), terms_ss=PostingsFormat(name=Asserting), join2_s=PostingsFormat(name=Asserting), field_s=TestBloomFilteredLucenePostings(BloomFilteringPostingsFormat(Lucene50(blocksize=128))), multiDefault=PostingsFormat(name=Asserting), subject=PostingsFormat(name=Asserting), a1_s=PostingsFormat(name=Asserting), a2_s=PostingsFormat(name=LuceneFixedGap), level1_s=PostingsFormat(name=MockRandom), body_t=PostingsFormat(name=LuceneFixedGap), s_multi=PostingsFormat(name=LuceneFixedGap), a_ss=TestBloomFilteredLucenePostings(BloomFilteringPostingsFormat(Lucene50(blocksize=128))), col_s=PostingsFormat(name=Asserting), level2_s=TestBloomFilteredLucenePostings(BloomFilteringPostingsFormat(Lucene50(blocksize=128))), a_s=PostingsFormat(name=LuceneFixedGap), tv_text=TestBloomFilteredLucenePostings(BloomFilteringPostingsFormat(Lucene50(blocksize=128))), term_s=PostingsFormat(name=Asserting), a_t=TestBloomFilteredLucenePostings(BloomFilteringPostingsFormat(Lucene50(blocksize=128))), id=PostingsFormat(name=MockRandom), text=PostingsFormat(name=LuceneFixedGap), featureSet_s=PostingsFormat(name=Asserting), checkpoint_ss=PostingsFormat(name=LuceneFixedGap), test_t=PostingsFormat(name=LuceneFixedGap), ident_s=PostingsFormat(name=Asserting), whitetok=PostingsFormat(name=LuceneFixedGap), side_s=PostingsFormat(name=LuceneFixedGap)}, docValues:{expr_s=DocValuesFormat(name=Memory), name_s=DocValuesFormat(name=Asserting), iteration_i=DocValuesFormat(name=Memory), terms_ss=DocValuesFormat(name=Direct), join2_s=DocValuesFormat(name=Direct), field_s=DocValuesFormat(name=Lucene70), multiDefault=DocValuesFormat(name=Direct), price_f=DocValuesFormat(name=Direct), a1_s=DocValuesFormat(name=Direct), join1_i=DocValuesFormat(name=Memory), intDefault=DocValuesFormat(name=Lucene70), a_f=DocValuesFormat(name=Direct), a2_s=DocValuesFormat(name=Asserting), falseNegative_i=DocValuesFormat(name=Lucene70), a_i=DocValuesFormat(name=Memory), join3_i=DocValuesFormat(name=Asserting), test_i=DocValuesFormat(name=Direct), falsePositive_i=DocValuesFormat(name=Lucene70), field_i=DocValuesFormat(name=Direct), level1_s=DocValuesFormat(name=Memory), s_multi=DocValuesFormat(name=Asserting), a_ss=DocValuesFormat(name=Lucene70), col_s=DocValuesFormat(name=Direct), level2_s=DocValuesFormat(name=Lucene70), a_s=DocValuesFormat(name=Asserting), score_f=DocValuesFormat(name=Asserting), term_s=DocValuesFormat(name=Direct), id=DocValuesFormat(name=Memory), timestamp=DocValuesFormat(name=Lucene70), i_multi=DocValuesFormat(name=Memory), featureSet_s=DocValuesFormat(name=Direct), trueNegative_i=DocValuesFormat(name=Asserting), index_i=DocValuesFormat(name=Direct), b_ls=DocValuesFormat(name=Direct), test_dt=DocValuesFormat(name=Memory), out_i=DocValuesFormat(name=Direct), checkpoint_ss=DocValuesFormat(name=Asserting), ident_s=DocValuesFormat(name=Direct), order_i=DocValuesFormat(name=Direct), _version_=DocValuesFormat(name=Lucene70), side_s=DocValuesFormat(name=Asserting), truePositive_i=DocValuesFormat(name=Memory), miles_i=DocValuesFormat(name=Direct)}, maxPointsInLeafNode=1420, maxMBSortInHeap=7.768748425614042, sim=Asserting(org.apache.lucene.search.similarities.AssertingSimilarity@7908ab17), locale=es-CR, timezone=Atlantic/Madeira
   [junit4]   2> NOTE: Linux 4.4.0-83-generic amd64/Oracle Corporation 1.8.0_152 (64-bit)/cpus=4,threads=1,free=115060984,total=378011648
   [junit4]   2> NOTE: All tests run in this JVM: [SquareRootEvaluatorTest, StreamExpressionParserTest, ArcSineEvaluatorTest, EmpiricalDistributionEvaluatorTest, CubedRootEvaluatorTest, TestPolicy, TestV1toV2ApiMapper, HttpSolrClientConPoolTest, ShardParamsTest, ConcurrentUpdateSolrClientBuilderTest, UsingSolrJRefGuideExamplesTest, CloudSolrClientCacheTest, NaturalLogEvaluatorTest, SolrSchemalessExampleTest, SolrExampleStreamingTest, GreaterThanEvaluatorTest, NotEvaluatorTest, AnlysisResponseBaseTest, HyperbolicTangentEvaluatorTest, JdbcTest, StreamExpressionTest]
   [junit4] Completed [144/146 (1!)] on J0 in 523.44s, 138 tests, 1 error <<< FAILURES!

[...truncated 33091 lines...]
-ecj-javadoc-lint-src:
    [mkdir] Created dir: /tmp/ecj1985540000
 [ecj-lint] Compiling 824 source files to /tmp/ecj1985540000
 [ecj-lint] ----------
 [ecj-lint] 1. WARNING in /home/jenkins/jenkins-slave/workspace/Lucene-Solr-Tests-master/lucene/core/src/java/org/apache/lucene/codecs/CodecUtil.java (at line 523)
 [ecj-lint] 	throw new CorruptIndexException("misplaced codec footer (file truncated?): length=" + in.length() + " but footerLength==" + footerLength(), input);
 [ecj-lint] 	^^^^^^^^^^^^^^^^^^^^^^^^^^^^^^^^^^^^^^^^^^^^^^^^^^^^^^^^^^^^^^^^^^^^^^^^^^^^^^^^^^^^^^^^^^^^^^^^^^^^^^^^^^^^^^^^^^^^^^^^^^^^^^^^^^^^^^^^^^^^^^^^^^^
 [ecj-lint] Resource leak: 'in' is not closed at this location
 [ecj-lint] ----------
 [ecj-lint] ----------
 [ecj-lint] 2. ERROR in /home/jenkins/jenkins-slave/workspace/Lucene-Solr-Tests-master/lucene/core/src/java/org/apache/lucene/index/FlushPolicy.java (at line 19)
 [ecj-lint] 	import java.util.Iterator;
 [ecj-lint] 	       ^^^^^^^^^^^^^^^^^^
 [ecj-lint] The import java.util.Iterator is never used
 [ecj-lint] ----------
 [ecj-lint] ----------
 [ecj-lint] 3. WARNING in /home/jenkins/jenkins-slave/workspace/Lucene-Solr-Tests-master/lucene/core/src/java/org/apache/lucene/index/FrozenBufferedUpdates.java (at line 144)
 [ecj-lint] 	RAMOutputStream out = new RAMOutputStream();
 [ecj-lint] 	                ^^^
 [ecj-lint] Resource leak: 'out' is never closed
 [ecj-lint] ----------
 [ecj-lint] 4. WARNING in /home/jenkins/jenkins-slave/workspace/Lucene-Solr-Tests-master/lucene/core/src/java/org/apache/lucene/index/FrozenBufferedUpdates.java (at line 186)
 [ecj-lint] 	RAMOutputStream out = new RAMOutputStream();
 [ecj-lint] 	                ^^^
 [ecj-lint] Resource leak: 'out' is never closed
 [ecj-lint] ----------
 [ecj-lint] ----------
 [ecj-lint] 5. WARNING in /home/jenkins/jenkins-slave/workspace/Lucene-Solr-Tests-master/lucene/core/src/java/org/apache/lucene/index/ReadersAndUpdates.java (at line 846)
 [ecj-lint] 	SegmentReader newReader = new SegmentReader(info, reader, liveDocs, info.info.maxDoc() - delCount);
 [ecj-lint] 	              ^^^^^^^^^
 [ecj-lint] Resource leak: 'newReader' is never closed
 [ecj-lint] ----------
 [ecj-lint] 5 problems (1 error, 4 warnings)

BUILD FAILED
/home/jenkins/jenkins-slave/workspace/Lucene-Solr-Tests-master/build.xml:835: The following error occurred while executing this line:
/home/jenkins/jenkins-slave/workspace/Lucene-Solr-Tests-master/build.xml:101: The following error occurred while executing this line:
/home/jenkins/jenkins-slave/workspace/Lucene-Solr-Tests-master/lucene/build.xml:203: The following error occurred while executing this line:
/home/jenkins/jenkins-slave/workspace/Lucene-Solr-Tests-master/lucene/common-build.xml:2105: The following error occurred while executing this line:
/home/jenkins/jenkins-slave/workspace/Lucene-Solr-Tests-master/lucene/common-build.xml:2144: Compile failed; see the compiler error output for details.

Total time: 281 minutes 14 seconds
Build step 'Invoke Ant' marked build as failure
Archiving artifacts
Recording test results
Email was triggered for: Failure - Any
Sending email for trigger: Failure - Any

Mime
View raw message