lucene-dev mailing list archives

Site index · List index
Message view « Date » · « Thread »
Top « Date » · « Thread »
From Policeman Jenkins Server <jenk...@thetaphi.de>
Subject [JENKINS] Lucene-Solr-7.x-Windows (32bit/jdk1.8.0_144) - Build # 286 - Still Unstable!
Date Sat, 04 Nov 2017 12:00:48 GMT
Build: https://jenkins.thetaphi.de/job/Lucene-Solr-7.x-Windows/286/
Java: 32bit/jdk1.8.0_144 -server -XX:+UseSerialGC

7 tests failed.
FAILED:  junit.framework.TestSuite.org.apache.lucene.codecs.idversion.TestIDVersionPostingsFormat

Error Message:
Could not remove the following files (in the order of attempts):    C:\Users\jenkins\workspace\Lucene-Solr-7.x-Windows\lucene\build\sandbox\test\J0\temp\lucene.codecs.idversion.TestIDVersionPostingsFormat_78FAD1EC3934E0ED-001\index-SimpleFSDirectory-001: java.nio.file.AccessDeniedException: C:\Users\jenkins\workspace\Lucene-Solr-7.x-Windows\lucene\build\sandbox\test\J0\temp\lucene.codecs.idversion.TestIDVersionPostingsFormat_78FAD1EC3934E0ED-001\index-SimpleFSDirectory-001    C:\Users\jenkins\workspace\Lucene-Solr-7.x-Windows\lucene\build\sandbox\test\J0\temp\lucene.codecs.idversion.TestIDVersionPostingsFormat_78FAD1EC3934E0ED-001: java.nio.file.DirectoryNotEmptyException: C:\Users\jenkins\workspace\Lucene-Solr-7.x-Windows\lucene\build\sandbox\test\J0\temp\lucene.codecs.idversion.TestIDVersionPostingsFormat_78FAD1EC3934E0ED-001 

Stack Trace:
java.io.IOException: Could not remove the following files (in the order of attempts):
   C:\Users\jenkins\workspace\Lucene-Solr-7.x-Windows\lucene\build\sandbox\test\J0\temp\lucene.codecs.idversion.TestIDVersionPostingsFormat_78FAD1EC3934E0ED-001\index-SimpleFSDirectory-001: java.nio.file.AccessDeniedException: C:\Users\jenkins\workspace\Lucene-Solr-7.x-Windows\lucene\build\sandbox\test\J0\temp\lucene.codecs.idversion.TestIDVersionPostingsFormat_78FAD1EC3934E0ED-001\index-SimpleFSDirectory-001
   C:\Users\jenkins\workspace\Lucene-Solr-7.x-Windows\lucene\build\sandbox\test\J0\temp\lucene.codecs.idversion.TestIDVersionPostingsFormat_78FAD1EC3934E0ED-001: java.nio.file.DirectoryNotEmptyException: C:\Users\jenkins\workspace\Lucene-Solr-7.x-Windows\lucene\build\sandbox\test\J0\temp\lucene.codecs.idversion.TestIDVersionPostingsFormat_78FAD1EC3934E0ED-001

	at __randomizedtesting.SeedInfo.seed([78FAD1EC3934E0ED]:0)
	at org.apache.lucene.util.IOUtils.rm(IOUtils.java:329)
	at org.apache.lucene.util.TestRuleTemporaryFilesCleanup.afterAlways(TestRuleTemporaryFilesCleanup.java:216)
	at com.carrotsearch.randomizedtesting.rules.TestRuleAdapter$1.afterAlways(TestRuleAdapter.java:31)
	at com.carrotsearch.randomizedtesting.rules.StatementAdapter.evaluate(StatementAdapter.java:43)
	at com.carrotsearch.randomizedtesting.rules.StatementAdapter.evaluate(StatementAdapter.java:36)
	at org.apache.lucene.util.TestRuleAssertionsRequired$1.evaluate(TestRuleAssertionsRequired.java:53)
	at org.apache.lucene.util.TestRuleMarkFailure$1.evaluate(TestRuleMarkFailure.java:47)
	at org.apache.lucene.util.TestRuleIgnoreAfterMaxFailures$1.evaluate(TestRuleIgnoreAfterMaxFailures.java:64)
	at org.apache.lucene.util.TestRuleIgnoreTestSuites$1.evaluate(TestRuleIgnoreTestSuites.java:54)
	at com.carrotsearch.randomizedtesting.rules.StatementAdapter.evaluate(StatementAdapter.java:36)
	at com.carrotsearch.randomizedtesting.ThreadLeakControl$StatementRunner.run(ThreadLeakControl.java:368)
	at java.lang.Thread.run(Thread.java:748)


FAILED:  junit.framework.TestSuite.org.apache.lucene.spatial3d.TestGeo3DPoint

Error Message:
Could not remove the following files (in the order of attempts):    C:\Users\jenkins\workspace\Lucene-Solr-7.x-Windows\lucene\build\spatial3d\test\J1\temp\lucene.spatial3d.TestGeo3DPoint_7AC9EA7297E18A08-001\index-SimpleFSDirectory-001: java.nio.file.AccessDeniedException: C:\Users\jenkins\workspace\Lucene-Solr-7.x-Windows\lucene\build\spatial3d\test\J1\temp\lucene.spatial3d.TestGeo3DPoint_7AC9EA7297E18A08-001\index-SimpleFSDirectory-001    C:\Users\jenkins\workspace\Lucene-Solr-7.x-Windows\lucene\build\spatial3d\test\J1\temp\lucene.spatial3d.TestGeo3DPoint_7AC9EA7297E18A08-001: java.nio.file.DirectoryNotEmptyException: C:\Users\jenkins\workspace\Lucene-Solr-7.x-Windows\lucene\build\spatial3d\test\J1\temp\lucene.spatial3d.TestGeo3DPoint_7AC9EA7297E18A08-001 

Stack Trace:
java.io.IOException: Could not remove the following files (in the order of attempts):
   C:\Users\jenkins\workspace\Lucene-Solr-7.x-Windows\lucene\build\spatial3d\test\J1\temp\lucene.spatial3d.TestGeo3DPoint_7AC9EA7297E18A08-001\index-SimpleFSDirectory-001: java.nio.file.AccessDeniedException: C:\Users\jenkins\workspace\Lucene-Solr-7.x-Windows\lucene\build\spatial3d\test\J1\temp\lucene.spatial3d.TestGeo3DPoint_7AC9EA7297E18A08-001\index-SimpleFSDirectory-001
   C:\Users\jenkins\workspace\Lucene-Solr-7.x-Windows\lucene\build\spatial3d\test\J1\temp\lucene.spatial3d.TestGeo3DPoint_7AC9EA7297E18A08-001: java.nio.file.DirectoryNotEmptyException: C:\Users\jenkins\workspace\Lucene-Solr-7.x-Windows\lucene\build\spatial3d\test\J1\temp\lucene.spatial3d.TestGeo3DPoint_7AC9EA7297E18A08-001

	at __randomizedtesting.SeedInfo.seed([7AC9EA7297E18A08]:0)
	at org.apache.lucene.util.IOUtils.rm(IOUtils.java:329)
	at org.apache.lucene.util.TestRuleTemporaryFilesCleanup.afterAlways(TestRuleTemporaryFilesCleanup.java:216)
	at com.carrotsearch.randomizedtesting.rules.TestRuleAdapter$1.afterAlways(TestRuleAdapter.java:31)
	at com.carrotsearch.randomizedtesting.rules.StatementAdapter.evaluate(StatementAdapter.java:43)
	at com.carrotsearch.randomizedtesting.rules.StatementAdapter.evaluate(StatementAdapter.java:36)
	at org.apache.lucene.util.TestRuleAssertionsRequired$1.evaluate(TestRuleAssertionsRequired.java:53)
	at org.apache.lucene.util.TestRuleMarkFailure$1.evaluate(TestRuleMarkFailure.java:47)
	at org.apache.lucene.util.TestRuleIgnoreAfterMaxFailures$1.evaluate(TestRuleIgnoreAfterMaxFailures.java:64)
	at org.apache.lucene.util.TestRuleIgnoreTestSuites$1.evaluate(TestRuleIgnoreTestSuites.java:54)
	at com.carrotsearch.randomizedtesting.rules.StatementAdapter.evaluate(StatementAdapter.java:36)
	at com.carrotsearch.randomizedtesting.ThreadLeakControl$StatementRunner.run(ThreadLeakControl.java:368)
	at java.lang.Thread.run(Thread.java:748)


FAILED:  org.apache.lucene.search.suggest.analyzing.TestFreeTextSuggester.testBasic

Error Message:
Could not remove the following files (in the order of attempts):    C:\Users\jenkins\workspace\Lucene-Solr-7.x-Windows\lucene\build\suggest\test\J0\.\temp\FreeTextSuggester.index.7688975575676061248: java.nio.file.DirectoryNotEmptyException: .\temp\FreeTextSuggester.index.7688975575676061248 

Stack Trace:
java.io.IOException: Could not remove the following files (in the order of attempts):
   C:\Users\jenkins\workspace\Lucene-Solr-7.x-Windows\lucene\build\suggest\test\J0\.\temp\FreeTextSuggester.index.7688975575676061248: java.nio.file.DirectoryNotEmptyException: .\temp\FreeTextSuggester.index.7688975575676061248

	at __randomizedtesting.SeedInfo.seed([91398AB2B39565CD:3AC397A76C49E3E3]:0)
	at org.apache.lucene.util.IOUtils.rm(IOUtils.java:329)
	at org.apache.lucene.search.suggest.analyzing.FreeTextSuggester.build(FreeTextSuggester.java:351)
	at org.apache.lucene.search.suggest.analyzing.FreeTextSuggester.build(FreeTextSuggester.java:247)
	at org.apache.lucene.search.suggest.analyzing.TestFreeTextSuggester.testBasic(TestFreeTextSuggester.java:61)
	at sun.reflect.NativeMethodAccessorImpl.invoke0(Native Method)
	at sun.reflect.NativeMethodAccessorImpl.invoke(NativeMethodAccessorImpl.java:62)
	at sun.reflect.DelegatingMethodAccessorImpl.invoke(DelegatingMethodAccessorImpl.java:43)
	at java.lang.reflect.Method.invoke(Method.java:498)
	at com.carrotsearch.randomizedtesting.RandomizedRunner.invoke(RandomizedRunner.java:1737)
	at com.carrotsearch.randomizedtesting.RandomizedRunner$8.evaluate(RandomizedRunner.java:934)
	at com.carrotsearch.randomizedtesting.RandomizedRunner$9.evaluate(RandomizedRunner.java:970)
	at com.carrotsearch.randomizedtesting.RandomizedRunner$10.evaluate(RandomizedRunner.java:984)
	at org.apache.lucene.util.TestRuleSetupTeardownChained$1.evaluate(TestRuleSetupTeardownChained.java:49)
	at org.apache.lucene.util.AbstractBeforeAfterRule$1.evaluate(AbstractBeforeAfterRule.java:45)
	at org.apache.lucene.util.TestRuleThreadAndTestName$1.evaluate(TestRuleThreadAndTestName.java:48)
	at org.apache.lucene.util.TestRuleIgnoreAfterMaxFailures$1.evaluate(TestRuleIgnoreAfterMaxFailures.java:64)
	at org.apache.lucene.util.TestRuleMarkFailure$1.evaluate(TestRuleMarkFailure.java:47)
	at com.carrotsearch.randomizedtesting.rules.StatementAdapter.evaluate(StatementAdapter.java:36)
	at com.carrotsearch.randomizedtesting.ThreadLeakControl$StatementRunner.run(ThreadLeakControl.java:368)
	at com.carrotsearch.randomizedtesting.ThreadLeakControl.forkTimeoutingTask(ThreadLeakControl.java:817)
	at com.carrotsearch.randomizedtesting.ThreadLeakControl$3.evaluate(ThreadLeakControl.java:468)
	at com.carrotsearch.randomizedtesting.RandomizedRunner.runSingleTest(RandomizedRunner.java:943)
	at com.carrotsearch.randomizedtesting.RandomizedRunner$5.evaluate(RandomizedRunner.java:829)
	at com.carrotsearch.randomizedtesting.RandomizedRunner$6.evaluate(RandomizedRunner.java:879)
	at com.carrotsearch.randomizedtesting.RandomizedRunner$7.evaluate(RandomizedRunner.java:890)
	at org.apache.lucene.util.AbstractBeforeAfterRule$1.evaluate(AbstractBeforeAfterRule.java:45)
	at com.carrotsearch.randomizedtesting.rules.StatementAdapter.evaluate(StatementAdapter.java:36)
	at org.apache.lucene.util.TestRuleStoreClassName$1.evaluate(TestRuleStoreClassName.java:41)
	at com.carrotsearch.randomizedtesting.rules.NoShadowingOrOverridesOnMethodsRule$1.evaluate(NoShadowingOrOverridesOnMethodsRule.java:40)
	at com.carrotsearch.randomizedtesting.rules.NoShadowingOrOverridesOnMethodsRule$1.evaluate(NoShadowingOrOverridesOnMethodsRule.java:40)
	at com.carrotsearch.randomizedtesting.rules.StatementAdapter.evaluate(StatementAdapter.java:36)
	at com.carrotsearch.randomizedtesting.rules.StatementAdapter.evaluate(StatementAdapter.java:36)
	at com.carrotsearch.randomizedtesting.rules.StatementAdapter.evaluate(StatementAdapter.java:36)
	at org.apache.lucene.util.TestRuleAssertionsRequired$1.evaluate(TestRuleAssertionsRequired.java:53)
	at org.apache.lucene.util.TestRuleMarkFailure$1.evaluate(TestRuleMarkFailure.java:47)
	at org.apache.lucene.util.TestRuleIgnoreAfterMaxFailures$1.evaluate(TestRuleIgnoreAfterMaxFailures.java:64)
	at org.apache.lucene.util.TestRuleIgnoreTestSuites$1.evaluate(TestRuleIgnoreTestSuites.java:54)
	at com.carrotsearch.randomizedtesting.rules.StatementAdapter.evaluate(StatementAdapter.java:36)
	at com.carrotsearch.randomizedtesting.ThreadLeakControl$StatementRunner.run(ThreadLeakControl.java:368)
	at java.lang.Thread.run(Thread.java:748)


FAILED:  org.apache.solr.cloud.ChaosMonkeyNothingIsSafeTest.test

Error Message:
Timeout occured while waiting response from server at: http://127.0.0.1:61459/collection1

Stack Trace:
org.apache.solr.client.solrj.SolrServerException: Timeout occured while waiting response from server at: http://127.0.0.1:61459/collection1
	at __randomizedtesting.SeedInfo.seed([6C5A3967B9DAC95E:E40E06BD1726A4A6]:0)
	at org.apache.solr.client.solrj.impl.HttpSolrClient.executeMethod(HttpSolrClient.java:654)
	at org.apache.solr.client.solrj.impl.HttpSolrClient.request(HttpSolrClient.java:255)
	at org.apache.solr.client.solrj.impl.HttpSolrClient.request(HttpSolrClient.java:244)
	at org.apache.solr.client.solrj.impl.LBHttpSolrClient.doRequest(LBHttpSolrClient.java:483)
	at org.apache.solr.client.solrj.impl.LBHttpSolrClient.request(LBHttpSolrClient.java:413)
	at org.apache.solr.client.solrj.impl.CloudSolrClient.sendRequest(CloudSolrClient.java:1096)
	at org.apache.solr.client.solrj.impl.CloudSolrClient.requestWithRetryOnStaleState(CloudSolrClient.java:875)
	at org.apache.solr.client.solrj.impl.CloudSolrClient.request(CloudSolrClient.java:808)
	at org.apache.solr.client.solrj.SolrRequest.process(SolrRequest.java:183)
	at org.apache.solr.client.solrj.SolrClient.commit(SolrClient.java:484)
	at org.apache.solr.client.solrj.SolrClient.commit(SolrClient.java:463)
	at org.apache.solr.cloud.AbstractFullDistribZkTestBase.commit(AbstractFullDistribZkTestBase.java:1583)
	at org.apache.solr.cloud.ChaosMonkeyNothingIsSafeTest.test(ChaosMonkeyNothingIsSafeTest.java:213)
	at sun.reflect.NativeMethodAccessorImpl.invoke0(Native Method)
	at sun.reflect.NativeMethodAccessorImpl.invoke(NativeMethodAccessorImpl.java:62)
	at sun.reflect.DelegatingMethodAccessorImpl.invoke(DelegatingMethodAccessorImpl.java:43)
	at java.lang.reflect.Method.invoke(Method.java:498)
	at com.carrotsearch.randomizedtesting.RandomizedRunner.invoke(RandomizedRunner.java:1737)
	at com.carrotsearch.randomizedtesting.RandomizedRunner$8.evaluate(RandomizedRunner.java:934)
	at com.carrotsearch.randomizedtesting.RandomizedRunner$9.evaluate(RandomizedRunner.java:970)
	at com.carrotsearch.randomizedtesting.RandomizedRunner$10.evaluate(RandomizedRunner.java:984)
	at org.apache.solr.BaseDistributedSearchTestCase$ShardsRepeatRule$ShardsFixedStatement.callStatement(BaseDistributedSearchTestCase.java:993)
	at org.apache.solr.BaseDistributedSearchTestCase$ShardsRepeatRule$ShardsStatement.evaluate(BaseDistributedSearchTestCase.java:968)
	at com.carrotsearch.randomizedtesting.rules.SystemPropertiesRestoreRule$1.evaluate(SystemPropertiesRestoreRule.java:57)
	at org.apache.lucene.util.TestRuleSetupTeardownChained$1.evaluate(TestRuleSetupTeardownChained.java:49)
	at org.apache.lucene.util.AbstractBeforeAfterRule$1.evaluate(AbstractBeforeAfterRule.java:45)
	at org.apache.lucene.util.TestRuleThreadAndTestName$1.evaluate(TestRuleThreadAndTestName.java:48)
	at org.apache.lucene.util.TestRuleIgnoreAfterMaxFailures$1.evaluate(TestRuleIgnoreAfterMaxFailures.java:64)
	at org.apache.lucene.util.TestRuleMarkFailure$1.evaluate(TestRuleMarkFailure.java:47)
	at com.carrotsearch.randomizedtesting.rules.StatementAdapter.evaluate(StatementAdapter.java:36)
	at com.carrotsearch.randomizedtesting.ThreadLeakControl$StatementRunner.run(ThreadLeakControl.java:368)
	at com.carrotsearch.randomizedtesting.ThreadLeakControl.forkTimeoutingTask(ThreadLeakControl.java:817)
	at com.carrotsearch.randomizedtesting.ThreadLeakControl$3.evaluate(ThreadLeakControl.java:468)
	at com.carrotsearch.randomizedtesting.RandomizedRunner.runSingleTest(RandomizedRunner.java:943)
	at com.carrotsearch.randomizedtesting.RandomizedRunner$5.evaluate(RandomizedRunner.java:829)
	at com.carrotsearch.randomizedtesting.RandomizedRunner$6.evaluate(RandomizedRunner.java:879)
	at com.carrotsearch.randomizedtesting.RandomizedRunner$7.evaluate(RandomizedRunner.java:890)
	at com.carrotsearch.randomizedtesting.rules.StatementAdapter.evaluate(StatementAdapter.java:36)
	at com.carrotsearch.randomizedtesting.rules.SystemPropertiesRestoreRule$1.evaluate(SystemPropertiesRestoreRule.java:57)
	at org.apache.lucene.util.AbstractBeforeAfterRule$1.evaluate(AbstractBeforeAfterRule.java:45)
	at com.carrotsearch.randomizedtesting.rules.StatementAdapter.evaluate(StatementAdapter.java:36)
	at org.apache.lucene.util.TestRuleStoreClassName$1.evaluate(TestRuleStoreClassName.java:41)
	at com.carrotsearch.randomizedtesting.rules.NoShadowingOrOverridesOnMethodsRule$1.evaluate(NoShadowingOrOverridesOnMethodsRule.java:40)
	at com.carrotsearch.randomizedtesting.rules.NoShadowingOrOverridesOnMethodsRule$1.evaluate(NoShadowingOrOverridesOnMethodsRule.java:40)
	at com.carrotsearch.randomizedtesting.rules.StatementAdapter.evaluate(StatementAdapter.java:36)
	at com.carrotsearch.randomizedtesting.rules.StatementAdapter.evaluate(StatementAdapter.java:36)
	at com.carrotsearch.randomizedtesting.rules.StatementAdapter.evaluate(StatementAdapter.java:36)
	at org.apache.lucene.util.TestRuleAssertionsRequired$1.evaluate(TestRuleAssertionsRequired.java:53)
	at org.apache.lucene.util.TestRuleMarkFailure$1.evaluate(TestRuleMarkFailure.java:47)
	at org.apache.lucene.util.TestRuleIgnoreAfterMaxFailures$1.evaluate(TestRuleIgnoreAfterMaxFailures.java:64)
	at org.apache.lucene.util.TestRuleIgnoreTestSuites$1.evaluate(TestRuleIgnoreTestSuites.java:54)
	at com.carrotsearch.randomizedtesting.rules.StatementAdapter.evaluate(StatementAdapter.java:36)
	at com.carrotsearch.randomizedtesting.ThreadLeakControl$StatementRunner.run(ThreadLeakControl.java:368)
	at java.lang.Thread.run(Thread.java:748)
Caused by: java.net.SocketTimeoutException: Read timed out
	at java.net.SocketInputStream.socketRead0(Native Method)
	at java.net.SocketInputStream.socketRead(SocketInputStream.java:116)
	at java.net.SocketInputStream.read(SocketInputStream.java:171)
	at java.net.SocketInputStream.read(SocketInputStream.java:141)
	at org.apache.http.impl.io.SessionInputBufferImpl.streamRead(SessionInputBufferImpl.java:137)
	at org.apache.http.impl.io.SessionInputBufferImpl.fillBuffer(SessionInputBufferImpl.java:153)
	at org.apache.http.impl.io.SessionInputBufferImpl.readLine(SessionInputBufferImpl.java:282)
	at org.apache.http.impl.conn.DefaultHttpResponseParser.parseHead(DefaultHttpResponseParser.java:138)
	at org.apache.http.impl.conn.DefaultHttpResponseParser.parseHead(DefaultHttpResponseParser.java:56)
	at org.apache.http.impl.io.AbstractMessageParser.parse(AbstractMessageParser.java:259)
	at org.apache.http.impl.DefaultBHttpClientConnection.receiveResponseHeader(DefaultBHttpClientConnection.java:163)
	at org.apache.http.impl.conn.CPoolProxy.receiveResponseHeader(CPoolProxy.java:165)
	at org.apache.http.protocol.HttpRequestExecutor.doReceiveResponse(HttpRequestExecutor.java:273)
	at org.apache.http.protocol.HttpRequestExecutor.execute(HttpRequestExecutor.java:125)
	at org.apache.http.impl.execchain.MainClientExec.execute(MainClientExec.java:272)
	at org.apache.http.impl.execchain.ProtocolExec.execute(ProtocolExec.java:185)
	at org.apache.http.impl.execchain.RetryExec.execute(RetryExec.java:89)
	at org.apache.http.impl.execchain.RedirectExec.execute(RedirectExec.java:111)
	at org.apache.http.impl.client.InternalHttpClient.doExecute(InternalHttpClient.java:185)
	at org.apache.http.impl.client.CloseableHttpClient.execute(CloseableHttpClient.java:83)
	at org.apache.http.impl.client.CloseableHttpClient.execute(CloseableHttpClient.java:56)
	at org.apache.solr.client.solrj.impl.HttpSolrClient.executeMethod(HttpSolrClient.java:542)
	... 53 more


FAILED:  junit.framework.TestSuite.org.apache.solr.cloud.ChaosMonkeyNothingIsSafeTest

Error Message:
9 threads leaked from SUITE scope at org.apache.solr.cloud.ChaosMonkeyNothingIsSafeTest:     1) Thread[id=20374, name=zkCallback-3167-thread-1, state=TIMED_WAITING, group=TGRP-ChaosMonkeyNothingIsSafeTest]         at sun.misc.Unsafe.park(Native Method)         at java.util.concurrent.locks.LockSupport.parkNanos(LockSupport.java:215)         at java.util.concurrent.SynchronousQueue$TransferStack.awaitFulfill(SynchronousQueue.java:460)         at java.util.concurrent.SynchronousQueue$TransferStack.transfer(SynchronousQueue.java:362)         at java.util.concurrent.SynchronousQueue.poll(SynchronousQueue.java:941)         at java.util.concurrent.ThreadPoolExecutor.getTask(ThreadPoolExecutor.java:1073)         at java.util.concurrent.ThreadPoolExecutor.runWorker(ThreadPoolExecutor.java:1134)         at java.util.concurrent.ThreadPoolExecutor$Worker.run(ThreadPoolExecutor.java:624)         at java.lang.Thread.run(Thread.java:748)    2) Thread[id=20535, name=zkCallback-3167-thread-6, state=TIMED_WAITING, group=TGRP-ChaosMonkeyNothingIsSafeTest]         at sun.misc.Unsafe.park(Native Method)         at java.util.concurrent.locks.LockSupport.parkNanos(LockSupport.java:215)         at java.util.concurrent.SynchronousQueue$TransferStack.awaitFulfill(SynchronousQueue.java:460)         at java.util.concurrent.SynchronousQueue$TransferStack.transfer(SynchronousQueue.java:362)         at java.util.concurrent.SynchronousQueue.poll(SynchronousQueue.java:941)         at java.util.concurrent.ThreadPoolExecutor.getTask(ThreadPoolExecutor.java:1073)         at java.util.concurrent.ThreadPoolExecutor.runWorker(ThreadPoolExecutor.java:1134)         at java.util.concurrent.ThreadPoolExecutor$Worker.run(ThreadPoolExecutor.java:624)         at java.lang.Thread.run(Thread.java:748)    3) Thread[id=20524, name=zkCallback-3167-thread-4, state=TIMED_WAITING, group=TGRP-ChaosMonkeyNothingIsSafeTest]         at sun.misc.Unsafe.park(Native Method)         at java.util.concurrent.locks.LockSupport.parkNanos(LockSupport.java:215)         at java.util.concurrent.SynchronousQueue$TransferStack.awaitFulfill(SynchronousQueue.java:460)         at java.util.concurrent.SynchronousQueue$TransferStack.transfer(SynchronousQueue.java:362)         at java.util.concurrent.SynchronousQueue.poll(SynchronousQueue.java:941)         at java.util.concurrent.ThreadPoolExecutor.getTask(ThreadPoolExecutor.java:1073)         at java.util.concurrent.ThreadPoolExecutor.runWorker(ThreadPoolExecutor.java:1134)         at java.util.concurrent.ThreadPoolExecutor$Worker.run(ThreadPoolExecutor.java:624)         at java.lang.Thread.run(Thread.java:748)    4) Thread[id=20372, name=TEST-ChaosMonkeyNothingIsSafeTest.test-seed#[6C5A3967B9DAC95E]-SendThread(127.0.0.1:61409), state=TIMED_WAITING, group=TGRP-ChaosMonkeyNothingIsSafeTest]         at java.lang.Thread.sleep(Native Method)         at org.apache.zookeeper.client.StaticHostProvider.next(StaticHostProvider.java:101)         at org.apache.zookeeper.ClientCnxn$SendThread.startConnect(ClientCnxn.java:997)         at org.apache.zookeeper.ClientCnxn$SendThread.run(ClientCnxn.java:1060)    5) Thread[id=20513, name=zkCallback-3167-thread-3, state=TIMED_WAITING, group=TGRP-ChaosMonkeyNothingIsSafeTest]         at sun.misc.Unsafe.park(Native Method)         at java.util.concurrent.locks.LockSupport.parkNanos(LockSupport.java:215)         at java.util.concurrent.SynchronousQueue$TransferStack.awaitFulfill(SynchronousQueue.java:460)         at java.util.concurrent.SynchronousQueue$TransferStack.transfer(SynchronousQueue.java:362)         at java.util.concurrent.SynchronousQueue.poll(SynchronousQueue.java:941)         at java.util.concurrent.ThreadPoolExecutor.getTask(ThreadPoolExecutor.java:1073)         at java.util.concurrent.ThreadPoolExecutor.runWorker(ThreadPoolExecutor.java:1134)         at java.util.concurrent.ThreadPoolExecutor$Worker.run(ThreadPoolExecutor.java:624)         at java.lang.Thread.run(Thread.java:748)    6) Thread[id=20534, name=zkCallback-3167-thread-5, state=TIMED_WAITING, group=TGRP-ChaosMonkeyNothingIsSafeTest]         at sun.misc.Unsafe.park(Native Method)         at java.util.concurrent.locks.LockSupport.parkNanos(LockSupport.java:215)         at java.util.concurrent.SynchronousQueue$TransferStack.awaitFulfill(SynchronousQueue.java:460)         at java.util.concurrent.SynchronousQueue$TransferStack.transfer(SynchronousQueue.java:362)         at java.util.concurrent.SynchronousQueue.poll(SynchronousQueue.java:941)         at java.util.concurrent.ThreadPoolExecutor.getTask(ThreadPoolExecutor.java:1073)         at java.util.concurrent.ThreadPoolExecutor.runWorker(ThreadPoolExecutor.java:1134)         at java.util.concurrent.ThreadPoolExecutor$Worker.run(ThreadPoolExecutor.java:624)         at java.lang.Thread.run(Thread.java:748)    7) Thread[id=20371, name=Connection evictor, state=TIMED_WAITING, group=TGRP-ChaosMonkeyNothingIsSafeTest]         at java.lang.Thread.sleep(Native Method)         at org.apache.http.impl.client.IdleConnectionEvictor$1.run(IdleConnectionEvictor.java:66)         at java.lang.Thread.run(Thread.java:748)    8) Thread[id=20495, name=zkCallback-3167-thread-2, state=TIMED_WAITING, group=TGRP-ChaosMonkeyNothingIsSafeTest]         at sun.misc.Unsafe.park(Native Method)         at java.util.concurrent.locks.LockSupport.parkNanos(LockSupport.java:215)         at java.util.concurrent.SynchronousQueue$TransferStack.awaitFulfill(SynchronousQueue.java:460)         at java.util.concurrent.SynchronousQueue$TransferStack.transfer(SynchronousQueue.java:362)         at java.util.concurrent.SynchronousQueue.poll(SynchronousQueue.java:941)         at java.util.concurrent.ThreadPoolExecutor.getTask(ThreadPoolExecutor.java:1073)         at java.util.concurrent.ThreadPoolExecutor.runWorker(ThreadPoolExecutor.java:1134)         at java.util.concurrent.ThreadPoolExecutor$Worker.run(ThreadPoolExecutor.java:624)         at java.lang.Thread.run(Thread.java:748)    9) Thread[id=20373, name=TEST-ChaosMonkeyNothingIsSafeTest.test-seed#[6C5A3967B9DAC95E]-EventThread, state=WAITING, group=TGRP-ChaosMonkeyNothingIsSafeTest]         at sun.misc.Unsafe.park(Native Method)         at java.util.concurrent.locks.LockSupport.park(LockSupport.java:175)         at java.util.concurrent.locks.AbstractQueuedSynchronizer$ConditionObject.await(AbstractQueuedSynchronizer.java:2039)         at java.util.concurrent.LinkedBlockingQueue.take(LinkedBlockingQueue.java:442)         at org.apache.zookeeper.ClientCnxn$EventThread.run(ClientCnxn.java:501)

Stack Trace:
com.carrotsearch.randomizedtesting.ThreadLeakError: 9 threads leaked from SUITE scope at org.apache.solr.cloud.ChaosMonkeyNothingIsSafeTest: 
   1) Thread[id=20374, name=zkCallback-3167-thread-1, state=TIMED_WAITING, group=TGRP-ChaosMonkeyNothingIsSafeTest]
        at sun.misc.Unsafe.park(Native Method)
        at java.util.concurrent.locks.LockSupport.parkNanos(LockSupport.java:215)
        at java.util.concurrent.SynchronousQueue$TransferStack.awaitFulfill(SynchronousQueue.java:460)
        at java.util.concurrent.SynchronousQueue$TransferStack.transfer(SynchronousQueue.java:362)
        at java.util.concurrent.SynchronousQueue.poll(SynchronousQueue.java:941)
        at java.util.concurrent.ThreadPoolExecutor.getTask(ThreadPoolExecutor.java:1073)
        at java.util.concurrent.ThreadPoolExecutor.runWorker(ThreadPoolExecutor.java:1134)
        at java.util.concurrent.ThreadPoolExecutor$Worker.run(ThreadPoolExecutor.java:624)
        at java.lang.Thread.run(Thread.java:748)
   2) Thread[id=20535, name=zkCallback-3167-thread-6, state=TIMED_WAITING, group=TGRP-ChaosMonkeyNothingIsSafeTest]
        at sun.misc.Unsafe.park(Native Method)
        at java.util.concurrent.locks.LockSupport.parkNanos(LockSupport.java:215)
        at java.util.concurrent.SynchronousQueue$TransferStack.awaitFulfill(SynchronousQueue.java:460)
        at java.util.concurrent.SynchronousQueue$TransferStack.transfer(SynchronousQueue.java:362)
        at java.util.concurrent.SynchronousQueue.poll(SynchronousQueue.java:941)
        at java.util.concurrent.ThreadPoolExecutor.getTask(ThreadPoolExecutor.java:1073)
        at java.util.concurrent.ThreadPoolExecutor.runWorker(ThreadPoolExecutor.java:1134)
        at java.util.concurrent.ThreadPoolExecutor$Worker.run(ThreadPoolExecutor.java:624)
        at java.lang.Thread.run(Thread.java:748)
   3) Thread[id=20524, name=zkCallback-3167-thread-4, state=TIMED_WAITING, group=TGRP-ChaosMonkeyNothingIsSafeTest]
        at sun.misc.Unsafe.park(Native Method)
        at java.util.concurrent.locks.LockSupport.parkNanos(LockSupport.java:215)
        at java.util.concurrent.SynchronousQueue$TransferStack.awaitFulfill(SynchronousQueue.java:460)
        at java.util.concurrent.SynchronousQueue$TransferStack.transfer(SynchronousQueue.java:362)
        at java.util.concurrent.SynchronousQueue.poll(SynchronousQueue.java:941)
        at java.util.concurrent.ThreadPoolExecutor.getTask(ThreadPoolExecutor.java:1073)
        at java.util.concurrent.ThreadPoolExecutor.runWorker(ThreadPoolExecutor.java:1134)
        at java.util.concurrent.ThreadPoolExecutor$Worker.run(ThreadPoolExecutor.java:624)
        at java.lang.Thread.run(Thread.java:748)
   4) Thread[id=20372, name=TEST-ChaosMonkeyNothingIsSafeTest.test-seed#[6C5A3967B9DAC95E]-SendThread(127.0.0.1:61409), state=TIMED_WAITING, group=TGRP-ChaosMonkeyNothingIsSafeTest]
        at java.lang.Thread.sleep(Native Method)
        at org.apache.zookeeper.client.StaticHostProvider.next(StaticHostProvider.java:101)
        at org.apache.zookeeper.ClientCnxn$SendThread.startConnect(ClientCnxn.java:997)
        at org.apache.zookeeper.ClientCnxn$SendThread.run(ClientCnxn.java:1060)
   5) Thread[id=20513, name=zkCallback-3167-thread-3, state=TIMED_WAITING, group=TGRP-ChaosMonkeyNothingIsSafeTest]
        at sun.misc.Unsafe.park(Native Method)
        at java.util.concurrent.locks.LockSupport.parkNanos(LockSupport.java:215)
        at java.util.concurrent.SynchronousQueue$TransferStack.awaitFulfill(SynchronousQueue.java:460)
        at java.util.concurrent.SynchronousQueue$TransferStack.transfer(SynchronousQueue.java:362)
        at java.util.concurrent.SynchronousQueue.poll(SynchronousQueue.java:941)
        at java.util.concurrent.ThreadPoolExecutor.getTask(ThreadPoolExecutor.java:1073)
        at java.util.concurrent.ThreadPoolExecutor.runWorker(ThreadPoolExecutor.java:1134)
        at java.util.concurrent.ThreadPoolExecutor$Worker.run(ThreadPoolExecutor.java:624)
        at java.lang.Thread.run(Thread.java:748)
   6) Thread[id=20534, name=zkCallback-3167-thread-5, state=TIMED_WAITING, group=TGRP-ChaosMonkeyNothingIsSafeTest]
        at sun.misc.Unsafe.park(Native Method)
        at java.util.concurrent.locks.LockSupport.parkNanos(LockSupport.java:215)
        at java.util.concurrent.SynchronousQueue$TransferStack.awaitFulfill(SynchronousQueue.java:460)
        at java.util.concurrent.SynchronousQueue$TransferStack.transfer(SynchronousQueue.java:362)
        at java.util.concurrent.SynchronousQueue.poll(SynchronousQueue.java:941)
        at java.util.concurrent.ThreadPoolExecutor.getTask(ThreadPoolExecutor.java:1073)
        at java.util.concurrent.ThreadPoolExecutor.runWorker(ThreadPoolExecutor.java:1134)
        at java.util.concurrent.ThreadPoolExecutor$Worker.run(ThreadPoolExecutor.java:624)
        at java.lang.Thread.run(Thread.java:748)
   7) Thread[id=20371, name=Connection evictor, state=TIMED_WAITING, group=TGRP-ChaosMonkeyNothingIsSafeTest]
        at java.lang.Thread.sleep(Native Method)
        at org.apache.http.impl.client.IdleConnectionEvictor$1.run(IdleConnectionEvictor.java:66)
        at java.lang.Thread.run(Thread.java:748)
   8) Thread[id=20495, name=zkCallback-3167-thread-2, state=TIMED_WAITING, group=TGRP-ChaosMonkeyNothingIsSafeTest]
        at sun.misc.Unsafe.park(Native Method)
        at java.util.concurrent.locks.LockSupport.parkNanos(LockSupport.java:215)
        at java.util.concurrent.SynchronousQueue$TransferStack.awaitFulfill(SynchronousQueue.java:460)
        at java.util.concurrent.SynchronousQueue$TransferStack.transfer(SynchronousQueue.java:362)
        at java.util.concurrent.SynchronousQueue.poll(SynchronousQueue.java:941)
        at java.util.concurrent.ThreadPoolExecutor.getTask(ThreadPoolExecutor.java:1073)
        at java.util.concurrent.ThreadPoolExecutor.runWorker(ThreadPoolExecutor.java:1134)
        at java.util.concurrent.ThreadPoolExecutor$Worker.run(ThreadPoolExecutor.java:624)
        at java.lang.Thread.run(Thread.java:748)
   9) Thread[id=20373, name=TEST-ChaosMonkeyNothingIsSafeTest.test-seed#[6C5A3967B9DAC95E]-EventThread, state=WAITING, group=TGRP-ChaosMonkeyNothingIsSafeTest]
        at sun.misc.Unsafe.park(Native Method)
        at java.util.concurrent.locks.LockSupport.park(LockSupport.java:175)
        at java.util.concurrent.locks.AbstractQueuedSynchronizer$ConditionObject.await(AbstractQueuedSynchronizer.java:2039)
        at java.util.concurrent.LinkedBlockingQueue.take(LinkedBlockingQueue.java:442)
        at org.apache.zookeeper.ClientCnxn$EventThread.run(ClientCnxn.java:501)
	at __randomizedtesting.SeedInfo.seed([6C5A3967B9DAC95E]:0)


FAILED:  junit.framework.TestSuite.org.apache.solr.cloud.ChaosMonkeyNothingIsSafeTest

Error Message:
There are still zombie threads that couldn't be terminated:    1) Thread[id=20374, name=zkCallback-3167-thread-1, state=TIMED_WAITING, group=TGRP-ChaosMonkeyNothingIsSafeTest]         at sun.misc.Unsafe.park(Native Method)         at java.util.concurrent.locks.LockSupport.parkNanos(LockSupport.java:215)         at java.util.concurrent.SynchronousQueue$TransferStack.awaitFulfill(SynchronousQueue.java:460)         at java.util.concurrent.SynchronousQueue$TransferStack.transfer(SynchronousQueue.java:362)         at java.util.concurrent.SynchronousQueue.poll(SynchronousQueue.java:941)         at java.util.concurrent.ThreadPoolExecutor.getTask(ThreadPoolExecutor.java:1073)         at java.util.concurrent.ThreadPoolExecutor.runWorker(ThreadPoolExecutor.java:1134)         at java.util.concurrent.ThreadPoolExecutor$Worker.run(ThreadPoolExecutor.java:624)         at java.lang.Thread.run(Thread.java:748)    2) Thread[id=20535, name=zkCallback-3167-thread-6, state=TIMED_WAITING, group=TGRP-ChaosMonkeyNothingIsSafeTest]         at sun.misc.Unsafe.park(Native Method)         at java.util.concurrent.locks.LockSupport.parkNanos(LockSupport.java:215)         at java.util.concurrent.SynchronousQueue$TransferStack.awaitFulfill(SynchronousQueue.java:460)         at java.util.concurrent.SynchronousQueue$TransferStack.transfer(SynchronousQueue.java:362)         at java.util.concurrent.SynchronousQueue.poll(SynchronousQueue.java:941)         at java.util.concurrent.ThreadPoolExecutor.getTask(ThreadPoolExecutor.java:1073)         at java.util.concurrent.ThreadPoolExecutor.runWorker(ThreadPoolExecutor.java:1134)         at java.util.concurrent.ThreadPoolExecutor$Worker.run(ThreadPoolExecutor.java:624)         at java.lang.Thread.run(Thread.java:748)    3) Thread[id=20524, name=zkCallback-3167-thread-4, state=TIMED_WAITING, group=TGRP-ChaosMonkeyNothingIsSafeTest]         at sun.misc.Unsafe.park(Native Method)         at java.util.concurrent.locks.LockSupport.parkNanos(LockSupport.java:215)         at java.util.concurrent.SynchronousQueue$TransferStack.awaitFulfill(SynchronousQueue.java:460)         at java.util.concurrent.SynchronousQueue$TransferStack.transfer(SynchronousQueue.java:362)         at java.util.concurrent.SynchronousQueue.poll(SynchronousQueue.java:941)         at java.util.concurrent.ThreadPoolExecutor.getTask(ThreadPoolExecutor.java:1073)         at java.util.concurrent.ThreadPoolExecutor.runWorker(ThreadPoolExecutor.java:1134)         at java.util.concurrent.ThreadPoolExecutor$Worker.run(ThreadPoolExecutor.java:624)         at java.lang.Thread.run(Thread.java:748)    4) Thread[id=20372, name=TEST-ChaosMonkeyNothingIsSafeTest.test-seed#[6C5A3967B9DAC95E]-SendThread(127.0.0.1:61409), state=TIMED_WAITING, group=TGRP-ChaosMonkeyNothingIsSafeTest]         at java.lang.Thread.sleep(Native Method)         at org.apache.zookeeper.client.StaticHostProvider.next(StaticHostProvider.java:101)         at org.apache.zookeeper.ClientCnxn$SendThread.startConnect(ClientCnxn.java:997)         at org.apache.zookeeper.ClientCnxn$SendThread.run(ClientCnxn.java:1060)    5) Thread[id=20513, name=zkCallback-3167-thread-3, state=TIMED_WAITING, group=TGRP-ChaosMonkeyNothingIsSafeTest]         at sun.misc.Unsafe.park(Native Method)         at java.util.concurrent.locks.LockSupport.parkNanos(LockSupport.java:215)         at java.util.concurrent.SynchronousQueue$TransferStack.awaitFulfill(SynchronousQueue.java:460)         at java.util.concurrent.SynchronousQueue$TransferStack.transfer(SynchronousQueue.java:362)         at java.util.concurrent.SynchronousQueue.poll(SynchronousQueue.java:941)         at java.util.concurrent.ThreadPoolExecutor.getTask(ThreadPoolExecutor.java:1073)         at java.util.concurrent.ThreadPoolExecutor.runWorker(ThreadPoolExecutor.java:1134)         at java.util.concurrent.ThreadPoolExecutor$Worker.run(ThreadPoolExecutor.java:624)         at java.lang.Thread.run(Thread.java:748)    6) Thread[id=20534, name=zkCallback-3167-thread-5, state=TIMED_WAITING, group=TGRP-ChaosMonkeyNothingIsSafeTest]         at sun.misc.Unsafe.park(Native Method)         at java.util.concurrent.locks.LockSupport.parkNanos(LockSupport.java:215)         at java.util.concurrent.SynchronousQueue$TransferStack.awaitFulfill(SynchronousQueue.java:460)         at java.util.concurrent.SynchronousQueue$TransferStack.transfer(SynchronousQueue.java:362)         at java.util.concurrent.SynchronousQueue.poll(SynchronousQueue.java:941)         at java.util.concurrent.ThreadPoolExecutor.getTask(ThreadPoolExecutor.java:1073)         at java.util.concurrent.ThreadPoolExecutor.runWorker(ThreadPoolExecutor.java:1134)         at java.util.concurrent.ThreadPoolExecutor$Worker.run(ThreadPoolExecutor.java:624)         at java.lang.Thread.run(Thread.java:748)    7) Thread[id=20495, name=zkCallback-3167-thread-2, state=TIMED_WAITING, group=TGRP-ChaosMonkeyNothingIsSafeTest]         at sun.misc.Unsafe.park(Native Method)         at java.util.concurrent.locks.LockSupport.parkNanos(LockSupport.java:215)         at java.util.concurrent.SynchronousQueue$TransferStack.awaitFulfill(SynchronousQueue.java:460)         at java.util.concurrent.SynchronousQueue$TransferStack.transfer(SynchronousQueue.java:362)         at java.util.concurrent.SynchronousQueue.poll(SynchronousQueue.java:941)         at java.util.concurrent.ThreadPoolExecutor.getTask(ThreadPoolExecutor.java:1073)         at java.util.concurrent.ThreadPoolExecutor.runWorker(ThreadPoolExecutor.java:1134)         at java.util.concurrent.ThreadPoolExecutor$Worker.run(ThreadPoolExecutor.java:624)         at java.lang.Thread.run(Thread.java:748)

Stack Trace:
com.carrotsearch.randomizedtesting.ThreadLeakError: There are still zombie threads that couldn't be terminated:
   1) Thread[id=20374, name=zkCallback-3167-thread-1, state=TIMED_WAITING, group=TGRP-ChaosMonkeyNothingIsSafeTest]
        at sun.misc.Unsafe.park(Native Method)
        at java.util.concurrent.locks.LockSupport.parkNanos(LockSupport.java:215)
        at java.util.concurrent.SynchronousQueue$TransferStack.awaitFulfill(SynchronousQueue.java:460)
        at java.util.concurrent.SynchronousQueue$TransferStack.transfer(SynchronousQueue.java:362)
        at java.util.concurrent.SynchronousQueue.poll(SynchronousQueue.java:941)
        at java.util.concurrent.ThreadPoolExecutor.getTask(ThreadPoolExecutor.java:1073)
        at java.util.concurrent.ThreadPoolExecutor.runWorker(ThreadPoolExecutor.java:1134)
        at java.util.concurrent.ThreadPoolExecutor$Worker.run(ThreadPoolExecutor.java:624)
        at java.lang.Thread.run(Thread.java:748)
   2) Thread[id=20535, name=zkCallback-3167-thread-6, state=TIMED_WAITING, group=TGRP-ChaosMonkeyNothingIsSafeTest]
        at sun.misc.Unsafe.park(Native Method)
        at java.util.concurrent.locks.LockSupport.parkNanos(LockSupport.java:215)
        at java.util.concurrent.SynchronousQueue$TransferStack.awaitFulfill(SynchronousQueue.java:460)
        at java.util.concurrent.SynchronousQueue$TransferStack.transfer(SynchronousQueue.java:362)
        at java.util.concurrent.SynchronousQueue.poll(SynchronousQueue.java:941)
        at java.util.concurrent.ThreadPoolExecutor.getTask(ThreadPoolExecutor.java:1073)
        at java.util.concurrent.ThreadPoolExecutor.runWorker(ThreadPoolExecutor.java:1134)
        at java.util.concurrent.ThreadPoolExecutor$Worker.run(ThreadPoolExecutor.java:624)
        at java.lang.Thread.run(Thread.java:748)
   3) Thread[id=20524, name=zkCallback-3167-thread-4, state=TIMED_WAITING, group=TGRP-ChaosMonkeyNothingIsSafeTest]
        at sun.misc.Unsafe.park(Native Method)
        at java.util.concurrent.locks.LockSupport.parkNanos(LockSupport.java:215)
        at java.util.concurrent.SynchronousQueue$TransferStack.awaitFulfill(SynchronousQueue.java:460)
        at java.util.concurrent.SynchronousQueue$TransferStack.transfer(SynchronousQueue.java:362)
        at java.util.concurrent.SynchronousQueue.poll(SynchronousQueue.java:941)
        at java.util.concurrent.ThreadPoolExecutor.getTask(ThreadPoolExecutor.java:1073)
        at java.util.concurrent.ThreadPoolExecutor.runWorker(ThreadPoolExecutor.java:1134)
        at java.util.concurrent.ThreadPoolExecutor$Worker.run(ThreadPoolExecutor.java:624)
        at java.lang.Thread.run(Thread.java:748)
   4) Thread[id=20372, name=TEST-ChaosMonkeyNothingIsSafeTest.test-seed#[6C5A3967B9DAC95E]-SendThread(127.0.0.1:61409), state=TIMED_WAITING, group=TGRP-ChaosMonkeyNothingIsSafeTest]
        at java.lang.Thread.sleep(Native Method)
        at org.apache.zookeeper.client.StaticHostProvider.next(StaticHostProvider.java:101)
        at org.apache.zookeeper.ClientCnxn$SendThread.startConnect(ClientCnxn.java:997)
        at org.apache.zookeeper.ClientCnxn$SendThread.run(ClientCnxn.java:1060)
   5) Thread[id=20513, name=zkCallback-3167-thread-3, state=TIMED_WAITING, group=TGRP-ChaosMonkeyNothingIsSafeTest]
        at sun.misc.Unsafe.park(Native Method)
        at java.util.concurrent.locks.LockSupport.parkNanos(LockSupport.java:215)
        at java.util.concurrent.SynchronousQueue$TransferStack.awaitFulfill(SynchronousQueue.java:460)
        at java.util.concurrent.SynchronousQueue$TransferStack.transfer(SynchronousQueue.java:362)
        at java.util.concurrent.SynchronousQueue.poll(SynchronousQueue.java:941)
        at java.util.concurrent.ThreadPoolExecutor.getTask(ThreadPoolExecutor.java:1073)
        at java.util.concurrent.ThreadPoolExecutor.runWorker(ThreadPoolExecutor.java:1134)
        at java.util.concurrent.ThreadPoolExecutor$Worker.run(ThreadPoolExecutor.java:624)
        at java.lang.Thread.run(Thread.java:748)
   6) Thread[id=20534, name=zkCallback-3167-thread-5, state=TIMED_WAITING, group=TGRP-ChaosMonkeyNothingIsSafeTest]
        at sun.misc.Unsafe.park(Native Method)
        at java.util.concurrent.locks.LockSupport.parkNanos(LockSupport.java:215)
        at java.util.concurrent.SynchronousQueue$TransferStack.awaitFulfill(SynchronousQueue.java:460)
        at java.util.concurrent.SynchronousQueue$TransferStack.transfer(SynchronousQueue.java:362)
        at java.util.concurrent.SynchronousQueue.poll(SynchronousQueue.java:941)
        at java.util.concurrent.ThreadPoolExecutor.getTask(ThreadPoolExecutor.java:1073)
        at java.util.concurrent.ThreadPoolExecutor.runWorker(ThreadPoolExecutor.java:1134)
        at java.util.concurrent.ThreadPoolExecutor$Worker.run(ThreadPoolExecutor.java:624)
        at java.lang.Thread.run(Thread.java:748)
   7) Thread[id=20495, name=zkCallback-3167-thread-2, state=TIMED_WAITING, group=TGRP-ChaosMonkeyNothingIsSafeTest]
        at sun.misc.Unsafe.park(Native Method)
        at java.util.concurrent.locks.LockSupport.parkNanos(LockSupport.java:215)
        at java.util.concurrent.SynchronousQueue$TransferStack.awaitFulfill(SynchronousQueue.java:460)
        at java.util.concurrent.SynchronousQueue$TransferStack.transfer(SynchronousQueue.java:362)
        at java.util.concurrent.SynchronousQueue.poll(SynchronousQueue.java:941)
        at java.util.concurrent.ThreadPoolExecutor.getTask(ThreadPoolExecutor.java:1073)
        at java.util.concurrent.ThreadPoolExecutor.runWorker(ThreadPoolExecutor.java:1134)
        at java.util.concurrent.ThreadPoolExecutor$Worker.run(ThreadPoolExecutor.java:624)
        at java.lang.Thread.run(Thread.java:748)
	at __randomizedtesting.SeedInfo.seed([6C5A3967B9DAC95E]:0)


FAILED:  junit.framework.TestSuite.org.apache.solr.cloud.ShardRoutingCustomTest

Error Message:
Could not remove the following files (in the order of attempts):    C:\Users\jenkins\workspace\Lucene-Solr-7.x-Windows\solr\build\solr-core\test\J1\temp\solr.cloud.ShardRoutingCustomTest_6C5A3967B9DAC95E-001\jetty-001\configsets\upload: java.nio.file.DirectoryNotEmptyException: C:\Users\jenkins\workspace\Lucene-Solr-7.x-Windows\solr\build\solr-core\test\J1\temp\solr.cloud.ShardRoutingCustomTest_6C5A3967B9DAC95E-001\jetty-001\configsets\upload    C:\Users\jenkins\workspace\Lucene-Solr-7.x-Windows\solr\build\solr-core\test\J1\temp\solr.cloud.ShardRoutingCustomTest_6C5A3967B9DAC95E-001\jetty-001\configsets: java.nio.file.DirectoryNotEmptyException: C:\Users\jenkins\workspace\Lucene-Solr-7.x-Windows\solr\build\solr-core\test\J1\temp\solr.cloud.ShardRoutingCustomTest_6C5A3967B9DAC95E-001\jetty-001\configsets    C:\Users\jenkins\workspace\Lucene-Solr-7.x-Windows\solr\build\solr-core\test\J1\temp\solr.cloud.ShardRoutingCustomTest_6C5A3967B9DAC95E-001\jetty-001: java.nio.file.DirectoryNotEmptyException: C:\Users\jenkins\workspace\Lucene-Solr-7.x-Windows\solr\build\solr-core\test\J1\temp\solr.cloud.ShardRoutingCustomTest_6C5A3967B9DAC95E-001\jetty-001 

Stack Trace:
java.io.IOException: Could not remove the following files (in the order of attempts):
   C:\Users\jenkins\workspace\Lucene-Solr-7.x-Windows\solr\build\solr-core\test\J1\temp\solr.cloud.ShardRoutingCustomTest_6C5A3967B9DAC95E-001\jetty-001\configsets\upload: java.nio.file.DirectoryNotEmptyException: C:\Users\jenkins\workspace\Lucene-Solr-7.x-Windows\solr\build\solr-core\test\J1\temp\solr.cloud.ShardRoutingCustomTest_6C5A3967B9DAC95E-001\jetty-001\configsets\upload
   C:\Users\jenkins\workspace\Lucene-Solr-7.x-Windows\solr\build\solr-core\test\J1\temp\solr.cloud.ShardRoutingCustomTest_6C5A3967B9DAC95E-001\jetty-001\configsets: java.nio.file.DirectoryNotEmptyException: C:\Users\jenkins\workspace\Lucene-Solr-7.x-Windows\solr\build\solr-core\test\J1\temp\solr.cloud.ShardRoutingCustomTest_6C5A3967B9DAC95E-001\jetty-001\configsets
   C:\Users\jenkins\workspace\Lucene-Solr-7.x-Windows\solr\build\solr-core\test\J1\temp\solr.cloud.ShardRoutingCustomTest_6C5A3967B9DAC95E-001\jetty-001: java.nio.file.DirectoryNotEmptyException: C:\Users\jenkins\workspace\Lucene-Solr-7.x-Windows\solr\build\solr-core\test\J1\temp\solr.cloud.ShardRoutingCustomTest_6C5A3967B9DAC95E-001\jetty-001

	at __randomizedtesting.SeedInfo.seed([6C5A3967B9DAC95E]:0)
	at org.apache.lucene.util.IOUtils.rm(IOUtils.java:329)
	at org.apache.lucene.util.TestRuleTemporaryFilesCleanup.afterAlways(TestRuleTemporaryFilesCleanup.java:216)
	at com.carrotsearch.randomizedtesting.rules.TestRuleAdapter$1.afterAlways(TestRuleAdapter.java:31)
	at com.carrotsearch.randomizedtesting.rules.StatementAdapter.evaluate(StatementAdapter.java:43)
	at com.carrotsearch.randomizedtesting.rules.StatementAdapter.evaluate(StatementAdapter.java:36)
	at org.apache.lucene.util.TestRuleAssertionsRequired$1.evaluate(TestRuleAssertionsRequired.java:53)
	at org.apache.lucene.util.TestRuleMarkFailure$1.evaluate(TestRuleMarkFailure.java:47)
	at org.apache.lucene.util.TestRuleIgnoreAfterMaxFailures$1.evaluate(TestRuleIgnoreAfterMaxFailures.java:64)
	at org.apache.lucene.util.TestRuleIgnoreTestSuites$1.evaluate(TestRuleIgnoreTestSuites.java:54)
	at com.carrotsearch.randomizedtesting.rules.StatementAdapter.evaluate(StatementAdapter.java:36)
	at com.carrotsearch.randomizedtesting.ThreadLeakControl$StatementRunner.run(ThreadLeakControl.java:368)
	at java.lang.Thread.run(Thread.java:748)




Build Log:
[...truncated 8900 lines...]
   [junit4] Suite: org.apache.lucene.codecs.idversion.TestIDVersionPostingsFormat
   [junit4]   2> NOTE: test params are: codec=Asserting(Lucene70), sim=RandomSimilarity(queryNorm=true): {id=DFR I(ne)B1}, locale=hi-IN, timezone=Asia/Samarkand
   [junit4]   2> NOTE: Windows 10 10.0 x86/Oracle Corporation 1.8.0_144 (32-bit)/cpus=3,threads=1,free=51688576,total=64880640
   [junit4]   2> NOTE: All tests run in this JVM: [FuzzyLikeThisQueryTest, TestLatLonDocValuesQueries, TestTermAutomatonQuery, TestLatLonPoint, TestCoveringQuery, TestIDVersionPostingsFormat]
   [junit4]   2> NOTE: reproduce with: ant test  -Dtestcase=TestIDVersionPostingsFormat -Dtests.seed=78FAD1EC3934E0ED -Dtests.slow=true -Dtests.locale=hi-IN -Dtests.timezone=Asia/Samarkand -Dtests.asserts=true -Dtests.file.encoding=UTF-8
   [junit4] ERROR   0.00s J0 | TestIDVersionPostingsFormat (suite) <<<
   [junit4]    > Throwable #1: java.io.IOException: Could not remove the following files (in the order of attempts):
   [junit4]    >    C:\Users\jenkins\workspace\Lucene-Solr-7.x-Windows\lucene\build\sandbox\test\J0\temp\lucene.codecs.idversion.TestIDVersionPostingsFormat_78FAD1EC3934E0ED-001\index-SimpleFSDirectory-001: java.nio.file.AccessDeniedException: C:\Users\jenkins\workspace\Lucene-Solr-7.x-Windows\lucene\build\sandbox\test\J0\temp\lucene.codecs.idversion.TestIDVersionPostingsFormat_78FAD1EC3934E0ED-001\index-SimpleFSDirectory-001
   [junit4]    >    C:\Users\jenkins\workspace\Lucene-Solr-7.x-Windows\lucene\build\sandbox\test\J0\temp\lucene.codecs.idversion.TestIDVersionPostingsFormat_78FAD1EC3934E0ED-001: java.nio.file.DirectoryNotEmptyException: C:\Users\jenkins\workspace\Lucene-Solr-7.x-Windows\lucene\build\sandbox\test\J0\temp\lucene.codecs.idversion.TestIDVersionPostingsFormat_78FAD1EC3934E0ED-001
   [junit4]    > 	at __randomizedtesting.SeedInfo.seed([78FAD1EC3934E0ED]:0)
   [junit4]    > 	at org.apache.lucene.util.IOUtils.rm(IOUtils.java:329)
   [junit4]    > 	at java.lang.Thread.run(Thread.java:748)
   [junit4] Completed [7/19 (1!)] on J0 in 3.98s, 15 tests, 1 error <<< FAILURES!

[...truncated 626 lines...]
   [junit4] Suite: org.apache.lucene.spatial3d.TestGeo3DPoint
   [junit4] IGNOR/A 0.01s J1 | TestGeo3DPoint.testRandomBig
   [junit4]    > Assumption #1: 'nightly' test group is disabled (@Nightly())
   [junit4]   2> NOTE: test params are: codec=Asserting(Lucene70): {id=PostingsFormat(name=LuceneVarGapDocFreqInterval)}, docValues:{id=DocValuesFormat(name=Asserting), point=DocValuesFormat(name=Memory)}, maxPointsInLeafNode=2012, maxMBSortInHeap=7.206693196392233, sim=RandomSimilarity(queryNorm=true): {}, locale=sk, timezone=Asia/Ashkhabad
   [junit4]   2> NOTE: Windows 10 10.0 x86/Oracle Corporation 1.8.0_144 (32-bit)/cpus=3,threads=1,free=49263888,total=64880640
   [junit4]   2> NOTE: All tests run in this JVM: [TestGeo3DDocValues, TestGeo3DPoint]
   [junit4]   2> NOTE: reproduce with: ant test  -Dtestcase=TestGeo3DPoint -Dtests.seed=7AC9EA7297E18A08 -Dtests.slow=true -Dtests.locale=sk -Dtests.timezone=Asia/Ashkhabad -Dtests.asserts=true -Dtests.file.encoding=UTF-8
   [junit4] ERROR   0.00s J1 | TestGeo3DPoint (suite) <<<
   [junit4]    > Throwable #1: java.io.IOException: Could not remove the following files (in the order of attempts):
   [junit4]    >    C:\Users\jenkins\workspace\Lucene-Solr-7.x-Windows\lucene\build\spatial3d\test\J1\temp\lucene.spatial3d.TestGeo3DPoint_7AC9EA7297E18A08-001\index-SimpleFSDirectory-001: java.nio.file.AccessDeniedException: C:\Users\jenkins\workspace\Lucene-Solr-7.x-Windows\lucene\build\spatial3d\test\J1\temp\lucene.spatial3d.TestGeo3DPoint_7AC9EA7297E18A08-001\index-SimpleFSDirectory-001
   [junit4]    >    C:\Users\jenkins\workspace\Lucene-Solr-7.x-Windows\lucene\build\spatial3d\test\J1\temp\lucene.spatial3d.TestGeo3DPoint_7AC9EA7297E18A08-001: java.nio.file.DirectoryNotEmptyException: C:\Users\jenkins\workspace\Lucene-Solr-7.x-Windows\lucene\build\spatial3d\test\J1\temp\lucene.spatial3d.TestGeo3DPoint_7AC9EA7297E18A08-001
   [junit4]    > 	at __randomizedtesting.SeedInfo.seed([7AC9EA7297E18A08]:0)
   [junit4]    > 	at org.apache.lucene.util.IOUtils.rm(IOUtils.java:329)
   [junit4]    > 	at java.lang.Thread.run(Thread.java:748)
   [junit4] Completed [7/15 (1!)] on J1 in 20.30s, 14 tests, 1 error, 1 skipped <<< FAILURES!

[...truncated 416 lines...]
   [junit4] Suite: org.apache.lucene.search.suggest.analyzing.TestFreeTextSuggester
   [junit4]   2> NOTE: reproduce with: ant test  -Dtestcase=TestFreeTextSuggester -Dtests.method=testBasic -Dtests.seed=91398AB2B39565CD -Dtests.slow=true -Dtests.locale=nl-NL -Dtests.timezone=Australia/West -Dtests.asserts=true -Dtests.file.encoding=US-ASCII
   [junit4] ERROR   5.08s J0 | TestFreeTextSuggester.testBasic <<<
   [junit4]    > Throwable #1: java.io.IOException: Could not remove the following files (in the order of attempts):
   [junit4]    >    C:\Users\jenkins\workspace\Lucene-Solr-7.x-Windows\lucene\build\suggest\test\J0\.\temp\FreeTextSuggester.index.7688975575676061248: java.nio.file.DirectoryNotEmptyException: .\temp\FreeTextSuggester.index.7688975575676061248
   [junit4]    > 	at __randomizedtesting.SeedInfo.seed([91398AB2B39565CD:3AC397A76C49E3E3]:0)
   [junit4]    > 	at org.apache.lucene.util.IOUtils.rm(IOUtils.java:329)
   [junit4]    > 	at org.apache.lucene.search.suggest.analyzing.FreeTextSuggester.build(FreeTextSuggester.java:351)
   [junit4]    > 	at org.apache.lucene.search.suggest.analyzing.FreeTextSuggester.build(FreeTextSuggester.java:247)
   [junit4]    > 	at org.apache.lucene.search.suggest.analyzing.TestFreeTextSuggester.testBasic(TestFreeTextSuggester.java:61)
   [junit4]    > 	at java.lang.Thread.run(Thread.java:748)
   [junit4]   2> NOTE: test params are: codec=Asserting(Lucene70): {body=PostingsFormat(name=LuceneFixedGap)}, docValues:{}, maxPointsInLeafNode=979, maxMBSortInHeap=7.06705908472505, sim=RandomSimilarity(queryNorm=true): {}, locale=nl-NL, timezone=Australia/West
   [junit4]   2> NOTE: Windows 10 10.0 x86/Oracle Corporation 1.8.0_144 (32-bit)/cpus=3,threads=1,free=20666224,total=64946176
   [junit4]   2> NOTE: All tests run in this JVM: [TestContextQuery, TestSpellChecker, AnalyzingInfixSuggesterTest, TestDirectSpellChecker, FSTCompletionTest, TestWordBreakSpellChecker, TestFreeTextSuggester]
   [junit4] Completed [30/32 (1!)] on J0 in 5.23s, 10 tests, 1 error, 1 skipped <<< FAILURES!

[...truncated 1874 lines...]
   [junit4] Suite: org.apache.solr.cloud.ShardRoutingCustomTest
   [junit4]   2> 619876 INFO  (SUITE-ShardRoutingCustomTest-seed#[6C5A3967B9DAC95E]-worker) [    ] o.a.s.SolrTestCaseJ4 SecureRandom sanity checks: test.solr.allowed.securerandom=null & java.security.egd=file:/dev/./urandom
   [junit4]   2> Creating dataDir: C:\Users\jenkins\workspace\Lucene-Solr-7.x-Windows\solr\build\solr-core\test\J1\temp\solr.cloud.ShardRoutingCustomTest_6C5A3967B9DAC95E-001\init-core-data-001
   [junit4]   2> 619903 WARN  (SUITE-ShardRoutingCustomTest-seed#[6C5A3967B9DAC95E]-worker) [    ] o.a.s.SolrTestCaseJ4 startTrackingSearchers: numOpens=4 numCloses=4
   [junit4]   2> 619903 INFO  (SUITE-ShardRoutingCustomTest-seed#[6C5A3967B9DAC95E]-worker) [    ] o.a.s.SolrTestCaseJ4 Using PointFields (NUMERIC_POINTS_SYSPROP=true) w/NUMERIC_DOCVALUES_SYSPROP=true
   [junit4]   2> 619918 INFO  (SUITE-ShardRoutingCustomTest-seed#[6C5A3967B9DAC95E]-worker) [    ] o.a.s.SolrTestCaseJ4 Randomized ssl (false) and clientAuth (false) via: @org.apache.solr.util.RandomizeSSL(reason=, value=NaN, ssl=NaN, clientAuth=NaN)
   [junit4]   2> 619918 INFO  (SUITE-ShardRoutingCustomTest-seed#[6C5A3967B9DAC95E]-worker) [    ] o.a.s.BaseDistributedSearchTestCase Setting hostContext system property: /
   [junit4]   2> 619926 INFO  (TEST-ShardRoutingCustomTest.test-seed#[6C5A3967B9DAC95E]) [    ] o.a.s.c.ZkTestServer STARTING ZK TEST SERVER
   [junit4]   2> 619967 INFO  (Thread-1043) [    ] o.a.s.c.ZkTestServer client port:0.0.0.0/0.0.0.0:0
   [junit4]   2> 619967 INFO  (Thread-1043) [    ] o.a.s.c.ZkTestServer Starting server
   [junit4]   2> 619975 ERROR (Thread-1043) [    ] o.a.z.s.ZooKeeperServer ZKShutdownHandler is not registered, so ZooKeeper server won't take any action on ERROR or SHUTDOWN server state changes
   [junit4]   2> 620026 INFO  (TEST-ShardRoutingCustomTest.test-seed#[6C5A3967B9DAC95E]) [    ] o.a.s.c.ZkTestServer start zk server on port:63234
   [junit4]   2> 620087 INFO  (TEST-ShardRoutingCustomTest.test-seed#[6C5A3967B9DAC95E]) [    ] o.a.s.c.AbstractZkTestCase put C:\Users\jenkins\workspace\Lucene-Solr-7.x-Windows\solr\core\src\test-files\solr\collection1\conf\solrconfig-tlog.xml to /configs/conf1/solrconfig.xml
   [junit4]   2> 620093 INFO  (TEST-ShardRoutingCustomTest.test-seed#[6C5A3967B9DAC95E]) [    ] o.a.s.c.AbstractZkTestCase put C:\Users\jenkins\workspace\Lucene-Solr-7.x-Windows\solr\core\src\test-files\solr\collection1\conf\schema15.xml to /configs/conf1/schema.xml
   [junit4]   2> 620098 INFO  (TEST-ShardRoutingCustomTest.test-seed#[6C5A3967B9DAC95E]) [    ] o.a.s.c.AbstractZkTestCase put C:\Users\jenkins\workspace\Lucene-Solr-7.x-Windows\solr\core\src\test-files\solr\collection1\conf\solrconfig.snippet.randomindexconfig.xml to /configs/conf1/solrconfig.snippet.randomindexconfig.xml
   [junit4]   2> 620103 INFO  (TEST-ShardRoutingCustomTest.test-seed#[6C5A3967B9DAC95E]) [    ] o.a.s.c.AbstractZkTestCase put C:\Users\jenkins\workspace\Lucene-Solr-7.x-Windows\solr\core\src\test-files\solr\collection1\conf\stopwords.txt to /configs/conf1/stopwords.txt
   [junit4]   2> 620108 INFO  (TEST-ShardRoutingCustomTest.test-seed#[6C5A3967B9DAC95E]) [    ] o.a.s.c.AbstractZkTestCase put C:\Users\jenkins\workspace\Lucene-Solr-7.x-Windows\solr\core\src\test-files\solr\collection1\conf\protwords.txt to /configs/conf1/protwords.txt
   [junit4]   2> 620113 INFO  (TEST-ShardRoutingCustomTest.test-seed#[6C5A3967B9DAC95E]) [    ] o.a.s.c.AbstractZkTestCase put C:\Users\jenkins\workspace\Lucene-Solr-7.x-Windows\solr\core\src\test-files\solr\collection1\conf\currency.xml to /configs/conf1/currency.xml
   [junit4]   2> 620121 INFO  (TEST-ShardRoutingCustomTest.test-seed#[6C5A3967B9DAC95E]) [    ] o.a.s.c.AbstractZkTestCase put C:\Users\jenkins\workspace\Lucene-Solr-7.x-Windows\solr\core\src\test-files\solr\collection1\conf\enumsConfig.xml to /configs/conf1/enumsConfig.xml
   [junit4]   2> 620127 INFO  (TEST-ShardRoutingCustomTest.test-seed#[6C5A3967B9DAC95E]) [    ] o.a.s.c.AbstractZkTestCase put C:\Users\jenkins\workspace\Lucene-Solr-7.x-Windows\solr\core\src\test-files\solr\collection1\conf\open-exchange-rates.json to /configs/conf1/open-exchange-rates.json
   [junit4]   2> 620132 INFO  (TEST-ShardRoutingCustomTest.test-seed#[6C5A3967B9DAC95E]) [    ] o.a.s.c.AbstractZkTestCase put C:\Users\jenkins\workspace\Lucene-Solr-7.x-Windows\solr\core\src\test-files\solr\collection1\conf\mapping-ISOLatin1Accent.txt to /configs/conf1/mapping-ISOLatin1Accent.txt
   [junit4]   2> 620137 INFO  (TEST-ShardRoutingCustomTest.test-seed#[6C5A3967B9DAC95E]) [    ] o.a.s.c.AbstractZkTestCase put C:\Users\jenkins\workspace\Lucene-Solr-7.x-Windows\solr\core\src\test-files\solr\collection1\conf\old_synonyms.txt to /configs/conf1/old_synonyms.txt
   [junit4]   2> 620142 INFO  (TEST-ShardRoutingCustomTest.test-seed#[6C5A3967B9DAC95E]) [    ] o.a.s.c.AbstractZkTestCase put C:\Users\jenkins\workspace\Lucene-Solr-7.x-Windows\solr\core\src\test-files\solr\collection1\conf\synonyms.txt to /configs/conf1/synonyms.txt
   [junit4]   2> 620152 INFO  (TEST-ShardRoutingCustomTest.test-seed#[6C5A3967B9DAC95E]) [    ] o.a.s.c.AbstractFullDistribZkTestBase Will use NRT replicas unless explicitly asked otherwise
   [junit4]   2> 622106 INFO  (TEST-ShardRoutingCustomTest.test-seed#[6C5A3967B9DAC95E]) [    ] o.e.j.s.Server jetty-9.3.20.v20170531
   [junit4]   2> 622109 INFO  (TEST-ShardRoutingCustomTest.test-seed#[6C5A3967B9DAC95E]) [    ] o.e.j.s.h.ContextHandler Started o.e.j.s.ServletContextHandler@eded0c{/,null,AVAILABLE}
   [junit4]   2> 622111 INFO  (TEST-ShardRoutingCustomTest.test-seed#[6C5A3967B9DAC95E]) [    ] o.e.j.s.AbstractConnector Started ServerConnector@19a9b14{HTTP/1.1,[http/1.1]}{127.0.0.1:63241}
   [junit4]   2> 622111 INFO  (TEST-ShardRoutingCustomTest.test-seed#[6C5A3967B9DAC95E]) [    ] o.e.j.s.Server Started @632314ms
   [junit4]   2> 622111 INFO  (TEST-ShardRoutingCustomTest.test-seed#[6C5A3967B9DAC95E]) [    ] o.a.s.c.s.e.JettySolrRunner Jetty properties: {solr.data.dir=C:\Users\jenkins\workspace\Lucene-Solr-7.x-Windows\solr\build\solr-core\test\J1\temp\solr.cloud.ShardRoutingCustomTest_6C5A3967B9DAC95E-001\tempDir-001/control/data, replicaType=NRT, hostContext=/, hostPort=63241, coreRootDirectory=C:\Users\jenkins\workspace\Lucene-Solr-7.x-Windows\solr\build\solr-core\test\J1\..\..\..\..\..\..\..\..\..\Users\jenkins\workspace\Lucene-Solr-7.x-Windows\solr\build\solr-core\test\J1\temp\solr.cloud.ShardRoutingCustomTest_6C5A3967B9DAC95E-001\control-001\cores}
   [junit4]   2> 622112 ERROR (TEST-ShardRoutingCustomTest.test-seed#[6C5A3967B9DAC95E]) [    ] o.a.s.u.StartupLoggingUtils Missing Java Option solr.log.dir. Logging may be missing or incomplete.
   [junit4]   2> 622112 INFO  (TEST-ShardRoutingCustomTest.test-seed#[6C5A3967B9DAC95E]) [    ] o.a.s.s.SolrDispatchFilter  ___      _       Welcome to Apache Solr? version 7.2.0
   [junit4]   2> 622112 INFO  (TEST-ShardRoutingCustomTest.test-seed#[6C5A3967B9DAC95E]) [    ] o.a.s.s.SolrDispatchFilter / __| ___| |_ _   Starting in cloud mode on port null
   [junit4]   2> 622112 INFO  (TEST-ShardRoutingCustomTest.test-seed#[6C5A3967B9DAC95E]) [    ] o.a.s.s.SolrDispatchFilter \__ \/ _ \ | '_|  Install dir: null
   [junit4]   2> 622112 INFO  (TEST-ShardRoutingCustomTest.test-seed#[6C5A3967B9DAC95E]) [    ] o.a.s.s.SolrDispatchFilter |___/\___/_|_|    Start time: 2017-11-04T11:13:26.641Z
   [junit4]   2> 622130 INFO  (TEST-ShardRoutingCustomTest.test-seed#[6C5A3967B9DAC95E]) [    ] o.a.s.s.SolrDispatchFilter Loading solr.xml from SolrHome (not found in ZooKeeper)
   [junit4]   2> 622130 INFO  (TEST-ShardRoutingCustomTest.test-seed#[6C5A3967B9DAC95E]) [    ] o.a.s.c.SolrXmlConfig Loading container configuration from C:\Users\jenkins\workspace\Lucene-Solr-7.x-Windows\solr\build\solr-core\test\J1\temp\solr.cloud.ShardRoutingCustomTest_6C5A3967B9DAC95E-001\control-001\solr.xml
   [junit4]   2> 622148 INFO  (TEST-ShardRoutingCustomTest.test-seed#[6C5A3967B9DAC95E]) [    ] o.a.s.c.SolrXmlConfig Configuration parameter autoReplicaFailoverWorkLoopDelay is ignored
   [junit4]   2> 622148 INFO  (TEST-ShardRoutingCustomTest.test-seed#[6C5A3967B9DAC95E]) [    ] o.a.s.c.SolrXmlConfig Configuration parameter autoReplicaFailoverBadNodeExpiration is ignored
   [junit4]   2> 622150 INFO  (TEST-ShardRoutingCustomTest.test-seed#[6C5A3967B9DAC95E]) [    ] o.a.s.c.SolrXmlConfig MBean server found: com.sun.jmx.mbeanserver.JmxMBeanServer@108d467, but no JMX reporters were configured - adding default JMX reporter.
   [junit4]   2> 622159 INFO  (TEST-ShardRoutingCustomTest.test-seed#[6C5A3967B9DAC95E]) [    ] o.a.s.c.ZkContainer Zookeeper client=127.0.0.1:63234/solr
   [junit4]   2> 622462 INFO  (TEST-ShardRoutingCustomTest.test-seed#[6C5A3967B9DAC95E]) [n:127.0.0.1:63241_    ] o.a.s.c.Overseer Overseer (id=null) closing
   [junit4]   2> 622464 INFO  (TEST-ShardRoutingCustomTest.test-seed#[6C5A3967B9DAC95E]) [n:127.0.0.1:63241_    ] o.a.s.c.OverseerElectionContext I am going to be the leader 127.0.0.1:63241_
   [junit4]   2> 622466 INFO  (TEST-ShardRoutingCustomTest.test-seed#[6C5A3967B9DAC95E]) [n:127.0.0.1:63241_    ] o.a.s.c.Overseer Overseer (id=98945859879174148-127.0.0.1:63241_-n_0000000000) starting
   [junit4]   2> 622482 INFO  (TEST-ShardRoutingCustomTest.test-seed#[6C5A3967B9DAC95E]) [n:127.0.0.1:63241_    ] o.a.s.c.ZkController Register node as live in ZooKeeper:/live_nodes/127.0.0.1:63241_
   [junit4]   2> 622533 INFO  (zkCallback-623-thread-1-processing-n:127.0.0.1:63241_) [n:127.0.0.1:63241_    ] o.a.s.c.c.ZkStateReader Updated live nodes from ZooKeeper... (0) -> (1)
   [junit4]   2> 622834 INFO  (TEST-ShardRoutingCustomTest.test-seed#[6C5A3967B9DAC95E]) [n:127.0.0.1:63241_    ] o.a.s.m.r.SolrJmxReporter JMX monitoring for 'solr.node' (registry 'solr.node') enabled at server: com.sun.jmx.mbeanserver.JmxMBeanServer@108d467
   [junit4]   2> 622858 INFO  (TEST-ShardRoutingCustomTest.test-seed#[6C5A3967B9DAC95E]) [n:127.0.0.1:63241_    ] o.a.s.m.r.SolrJmxReporter JMX monitoring for 'solr.jvm' (registry 'solr.jvm') enabled at server: com.sun.jmx.mbeanserver.JmxMBeanServer@108d467
   [junit4]   2> 622859 INFO  (TEST-ShardRoutingCustomTest.test-seed#[6C5A3967B9DAC95E]) [n:127.0.0.1:63241_    ] o.a.s.m.r.SolrJmxReporter JMX monitoring for 'solr.jetty' (registry 'solr.jetty') enabled at server: com.sun.jmx.mbeanserver.JmxMBeanServer@108d467
   [junit4]   2> 622867 INFO  (TEST-ShardRoutingCustomTest.test-seed#[6C5A3967B9DAC95E]) [n:127.0.0.1:63241_    ] o.a.s.c.CorePropertiesLocator Found 0 core definitions underneath C:\Users\jenkins\workspace\Lucene-Solr-7.x-Windows\solr\build\solr-core\test\J1\..\..\..\..\..\..\..\..\..\Users\jenkins\workspace\Lucene-Solr-7.x-Windows\solr\build\solr-core\test\J1\temp\solr.cloud.ShardRoutingCustomTest_6C5A3967B9DAC95E-001\control-001\cores
   [junit4]   2> 622978 INFO  (TEST-ShardRoutingCustomTest.test-seed#[6C5A3967B9DAC95E]) [    ] o.a.s.c.c.ZkStateReader Updated live nodes from ZooKeeper... (0) -> (1)
   [junit4]   2> 622982 INFO  (TEST-ShardRoutingCustomTest.test-seed#[6C5A3967B9DAC95E]) [    ] o.a.s.c.s.i.ZkClientClusterStateProvider Cluster at 127.0.0.1:63234/solr ready
   [junit4]   2> 622986 INFO  (qtp1419832-5849) [n:127.0.0.1:63241_    ] o.a.s.h.a.CollectionsHandler Invoked Collection Action :create with params replicationFactor=1&collection.configName=conf1&name=control_collection&nrtReplicas=1&action=CREATE&numShards=1&createNodeSet=127.0.0.1:63241_&wt=javabin&version=2 and sendToOCPQueue=true
   [junit4]   2> 623002 INFO  (OverseerThreadFactory-1921-thread-1-processing-n:127.0.0.1:63241_) [n:127.0.0.1:63241_    ] o.a.s.c.CreateCollectionCmd Create collection control_collection
   [junit4]   2> 623135 INFO  (qtp1419832-5852) [n:127.0.0.1:63241_    ] o.a.s.h.a.CoreAdminOperation core create command qt=/admin/cores&collection.configName=conf1&newCollection=true&name=control_collection_shard1_replica_n1&action=CREATE&numShards=1&collection=control_collection&shard=shard1&wt=javabin&version=2&replicaType=NRT
   [junit4]   2> 623135 INFO  (qtp1419832-5852) [n:127.0.0.1:63241_    ] o.a.s.c.TransientSolrCoreCacheDefault Allocating transient cache for 4 transient cores
   [junit4]   2> 623253 INFO  (zkCallback-623-thread-1-processing-n:127.0.0.1:63241_) [n:127.0.0.1:63241_    ] o.a.s.c.c.ZkStateReader A cluster state change: [WatchedEvent state:SyncConnected type:NodeDataChanged path:/collections/control_collection/state.json] for collection [control_collection] has occurred - updating... (live nodes size: [1])
   [junit4]   2> 624208 INFO  (qtp1419832-5852) [n:127.0.0.1:63241_ c:control_collection s:shard1  x:control_collection_shard1_replica_n1] o.a.s.c.SolrConfig Using Lucene MatchVersion: 7.2.0
   [junit4]   2> 624266 INFO  (qtp1419832-5852) [n:127.0.0.1:63241_ c:control_collection s:shard1  x:control_collection_shard1_replica_n1] o.a.s.s.IndexSchema [control_collection_shard1_replica_n1] Schema name=test
   [junit4]   2> 624492 INFO  (qtp1419832-5852) [n:127.0.0.1:63241_ c:control_collection s:shard1  x:control_collection_shard1_replica_n1] o.a.s.s.IndexSchema Loaded schema test/1.6 with uniqueid field id
   [junit4]   2> 624567 INFO  (qtp1419832-5852) [n:127.0.0.1:63241_ c:control_collection s:shard1  x:control_collection_shard1_replica_n1] o.a.s.c.CoreContainer Creating SolrCore 'control_collection_shard1_replica_n1' using configuration from collection control_collection, trusted=true
   [junit4]   2> 624571 INFO  (qtp1419832-5852) [n:127.0.0.1:63241_ c:control_collection s:shard1  x:control_collection_shard1_replica_n1] o.a.s.m.r.SolrJmxReporter JMX monitoring for 'solr.core.control_collection.shard1.replica_n1' (registry 'solr.core.control_collection.shard1.replica_n1') enabled at server: com.sun.jmx.mbeanserver.JmxMBeanServer@108d467
   [junit4]   2> 624571 INFO  (qtp1419832-5852) [n:127.0.0.1:63241_ c:control_collection s:shard1  x:control_collection_shard1_replica_n1] o.a.s.c.SolrCore solr.RecoveryStrategy.Builder
   [junit4]   2> 624571 INFO  (qtp1419832-5852) [n:127.0.0.1:63241_ c:control_collection s:shard1  x:control_collection_shard1_replica_n1] o.a.s.c.SolrCore [[control_collection_shard1_replica_n1] ] Opening new SolrCore at [C:\Users\jenkins\workspace\Lucene-Solr-7.x-Windows\solr\build\solr-core\test\J1\temp\solr.cloud.ShardRoutingCustomTest_6C5A3967B9DAC95E-001\control-001\cores\control_collection_shard1_replica_n1], dataDir=[C:\Users\jenkins\workspace\Lucene-Solr-7.x-Windows\solr\build\solr-core\test\J1\..\..\..\..\..\..\..\..\..\Users\jenkins\workspace\Lucene-Solr-7.x-Windows\solr\build\solr-core\test\J1\temp\solr.cloud.ShardRoutingCustomTest_6C5A3967B9DAC95E-001\control-001\cores\control_collection_shard1_replica_n1\data\]
   [junit4]   2> 624606 INFO  (qtp1419832-5852) [n:127.0.0.1:63241_ c:control_collection s:shard1  x:control_collection_shard1_replica_n1] o.a.s.u.RandomMergePolicy RandomMergePolicy wrapping class org.apache.lucene.index.TieredMergePolicy: [TieredMergePolicy: maxMergeAtOnce=35, maxMergeAtOnceExplicit=15, maxMergedSegmentMB=27.599609375, floorSegmentMB=1.7119140625, forceMergeDeletesPctAllowed=17.049077423677357, segmentsPerTier=27.0, maxCFSSegmentSizeMB=8.796093022207999E12, noCFSRatio=0.4627684119222645
   [junit4]   2> 624632 WARN  (qtp1419832-5852) [n:127.0.0.1:63241_ c:control_collection s:shard1  x:control_collection_shard1_replica_n1] o.a.s.c.RequestHandlers INVALID paramSet a in requestHandler {type = requestHandler,name = /dump,class = DumpRequestHandler,attributes = {initParams=a, name=/dump, class=DumpRequestHandler},args = {defaults={a=A,b=B}}}
   [junit4]   2> 625003 INFO  (qtp1419832-5852) [n:127.0.0.1:63241_ c:control_collection s:shard1  x:control_collection_shard1_replica_n1] o.a.s.u.UpdateHandler Using UpdateLog implementation: org.apache.solr.update.UpdateLog
   [junit4]   2> 625003 INFO  (qtp1419832-5852) [n:127.0.0.1:63241_ c:control_collection s:shard1  x:control_collection_shard1_replica_n1] o.a.s.u.UpdateLog Initializing UpdateLog: dataDir= defaultSyncLevel=FLUSH numRecordsToKeep=100 maxNumLogsToKeep=10 numVersionBuckets=65536
   [junit4]   2> 625013 INFO  (qtp1419832-5852) [n:127.0.0.1:63241_ c:control_collection s:shard1  x:control_collection_shard1_replica_n1] o.a.s.u.CommitTracker Hard AutoCommit: disabled
   [junit4]   2> 625013 INFO  (qtp1419832-5852) [n:127.0.0.1:63241_ c:control_collection s:shard1  x:control_collection_shard1_replica_n1] o.a.s.u.CommitTracker Soft AutoCommit: disabled
   [junit4]   2> 625017 INFO  (qtp1419832-5852) [n:127.0.0.1:63241_ c:control_collection s:shard1  x:control_collection_shard1_replica_n1] o.a.s.u.RandomMergePolicy RandomMergePolicy wrapping class org.apache.lucene.index.AlcoholicMergePolicy: [AlcoholicMergePolicy: minMergeSize=0, mergeFactor=10, maxMergeSize=110059838, maxMergeSizeForForcedMerge=9223372036854775807, calibrateSizeByDeletes=true, maxMergeDocs=2147483647, maxCFSSegmentSizeMB=8.796093022207999E12, noCFSRatio=0.1]
   [junit4]   2> 625019 INFO  (qtp1419832-5852) [n:127.0.0.1:63241_ c:control_collection s:shard1  x:control_collection_shard1_replica_n1] o.a.s.s.SolrIndexSearcher Opening [Searcher@1d144e6[control_collection_shard1_replica_n1] main]
   [junit4]   2> 625023 INFO  (qtp1419832-5852) [n:127.0.0.1:63241_ c:control_collection s:shard1  x:control_collection_shard1_replica_n1] o.a.s.r.ManagedResourceStorage Configured ZooKeeperStorageIO with znodeBase: /configs/conf1
   [junit4]   2> 625023 INFO  (qtp1419832-5852) [n:127.0.0.1:63241_ c:control_collection s:shard1  x:control_collection_shard1_replica_n1] o.a.s.r.ManagedResourceStorage Loaded null at path _rest_managed.json using ZooKeeperStorageIO:path=/configs/conf1
   [junit4]   2> 625026 INFO  (qtp1419832-5852) [n:127.0.0.1:63241_ c:control_collection s:shard1  x:control_collection_shard1_replica_n1] o.a.s.h.ReplicationHandler Commits will be reserved for 10000ms.
   [junit4]   2> 625026 INFO  (qtp1419832-5852) [n:127.0.0.1:63241_ c:control_collection s:shard1  x:control_collection_shard1_replica_n1] o.a.s.u.UpdateLog Could not find max version in index or recent updates, using new clock 1583133763363143680
   [junit4]   2> 625036 INFO  (qtp1419832-5852) [n:127.0.0.1:63241_ c:control_collection s:shard1  x:control_collection_shard1_replica_n1] o.a.s.c.ShardLeaderElectionContext Enough replicas found to continue.
   [junit4]   2> 625036 INFO  (qtp1419832-5852) [n:127.0.0.1:63241_ c:control_collection s:shard1  x:control_collection_shard1_replica_n1] o.a.s.c.ShardLeaderElectionContext I may be the new leader - try and sync
   [junit4]   2> 625036 INFO  (qtp1419832-5852) [n:127.0.0.1:63241_ c:control_collection s:shard1  x:control_collection_shard1_replica_n1] o.a.s.c.SyncStrategy Sync replicas to http://127.0.0.1:63241/control_collection_shard1_replica_n1/
   [junit4]   2> 625036 INFO  (qtp1419832-5852) [n:127.0.0.1:63241_ c:control_collection s:shard1  x:control_collection_shard1_replica_n1] o.a.s.c.SyncStrategy Sync Success - now sync replicas to me
   [junit4]   2> 625036 INFO  (qtp1419832-5852) [n:127.0.0.1:63241_ c:control_collection s:shard1  x:control_collection_shard1_replica_n1] o.a.s.c.SyncStrategy http://127.0.0.1:63241/control_collection_shard1_replica_n1/ has no replicas
   [junit4]   2> 625036 INFO  (qtp1419832-5852) [n:127.0.0.1:63241_ c:control_collection s:shard1  x:control_collection_shard1_replica_n1] o.a.s.c.ShardLeaderElectionContext Found all replicas participating in election, clear LIR
   [junit4]   2> 625041 INFO  (searcherExecutor-1923-thread-1-processing-n:127.0.0.1:63241_ x:control_collection_shard1_replica_n1 s:shard1 c:control_collection) [n:127.0.0.1:63241_ c:control_collection s:shard1  x:control_collection_shard1_replica_n1] o.a.s.c.SolrCore [control_collection_shard1_replica_n1] Registered new searcher Searcher@1d144e6[control_collection_shard1_replica_n1] main{ExitableDirectoryReader(UninvertingDirectoryReader())}
   [junit4]   2> 625042 INFO  (qtp1419832-5852) [n:127.0.0.1:63241_ c:control_collection s:shard1  x:control_collection_shard1_replica_n1] o.a.s.c.ShardLeaderElectionContext I am the new leader: http://127.0.0.1:63241/control_collection_shard1_replica_n1/ shard1
   [junit4]   2> 625144 INFO  (zkCallback-623-thread-1-processing-n:127.0.0.1:63241_) [n:127.0.0.1:63241_    ] o.a.s.c.c.ZkStateReader A cluster state change: [WatchedEvent state:SyncConnected type:NodeDataChanged path:/collections/control_collection/state.json] for collection [control_collection] has occurred - updating... (live nodes size: [1])
   [junit4]   2> 625145 INFO  (qtp1419832-5852) [n:127.0.0.1:63241_ c:control_collection s:shard1  x:control_collection_shard1_replica_n1] o.a.s.c.ZkController I am the leader, no recovery necessary
   [junit4]   2> 625152 INFO  (qtp1419832-5852) [n:127.0.0.1:63241_ c:control_collection s:shard1  x:control_collection_shard1_replica_n1] o.a.s.s.HttpSolrCall [admin] webapp=null path=/admin/cores params={qt=/admin/cores&collection.configName=conf1&newCollection=true&name=control_collection_shard1_replica_n1&action=CREATE&numShards=1&collection=control_collection&shard=shard1&wt=javabin&version=2&replicaType=NRT} status=0 QTime=2018
   [junit4]   2> 625164 INFO  (qtp1419832-5849) [n:127.0.0.1:63241_    ] o.a.s.h.a.CollectionsHandler Wait for new collection to be active for at most 30 seconds. Check all shard replicas
   [junit4]   2> 625249 INFO  (zkCallback-623-thread-2-processing-n:127.0.0.1:63241_) [n:127.0.0.1:63241_    ] o.a.s.c.c.ZkStateReader A cluster state change: [WatchedEvent state:SyncConnected type:NodeDataChanged path:/collections/control_collection/state.json] for collection [control_collection] has occurred - updating... (live nodes size: [1])
   [junit4]   2> 626165 INFO  (qtp1419832-5849) [n:127.0.0.1:63241_    ] o.a.s.s.HttpSolrCall [admin] webapp=null path=/admin/collections params={replicationFactor=1&collection.configName=conf1&name=control_collection&nrtReplicas=1&action=CREATE&numShards=1&createNodeSet=127.0.0.1:63241_&wt=javabin&version=2} status=0 QTime=3178
   [junit4]   2> 626166 WARN  (NIOServerCxn.Factory:0.0.0.0/0.0.0.0:0) [    ] o.a.z.s.NIOServerCnxn caught end of stream exception
   [junit4]   2> EndOfStreamException: Unable to read additional data from client sessionid 0x15f86bc3e180005, likely client has closed socket
   [junit4]   2> 	at org.apache.zookeeper.server.NIOServerCnxn.doIO(NIOServerCnxn.java:239)
   [junit4]   2> 	at org.apache.zookeeper.server.NIOServerCnxnFactory.run(NIOServerCnxnFactory.java:203)
   [junit4]   2> 	at java.lang.Thread.run(Thread.java:748)
   [junit4]   2> 626191 INFO  (TEST-ShardRoutingCustomTest.test-seed#[6C5A3967B9DAC95E]) [    ] o.a.s.c.c.ZkStateReader Updated live nodes from ZooKeeper... (0) -> (1)
   [junit4]   2> 626191 INFO  (TEST-ShardRoutingCustomTest.test-seed#[6C5A3967B9DAC95E]) [    ] o.a.s.c.s.i.ZkClientClusterStateProvider Cluster at 127.0.0.1:63234/solr ready
   [junit4]   2> 626197 INFO  (TEST-ShardRoutingCustomTest.test-seed#[6C5A3967B9DAC95E]) [    ] o.a.s.SolrTestCaseJ4 ###Starting test
   [junit4]   1> / (2)
   [junit4]   1> DATA:
   [junit4]   1>     
   [junit4]   1>  /zookeeper (1)
   [junit4]   1>  DATA:
   [junit4]   1>      
   [junit4]   1>  /solr (11)
   [junit4]   1>   /solr/configs (2)
   [junit4]   1>    /solr/configs/_default (7)
   [junit4]   1>     /solr/configs/_default/managed-schema (0)
   [junit4]   1>     DATA:
   [junit4]   1>         <?xml version="1.0" encoding="UTF-8" ?>
   [junit4]   1>         <!--
   [junit4]   1>          Licensed to the Apache Software Foundation (ASF) under one or more
   [junit4]   1>          contributor license agreements.  See the NOTICE file distributed with
   [junit4]   1>          this work for additional information regarding copyright ownership.
   [junit4]   1>          The ASF licenses this file to You under the Apache License, Version 2.0
   [junit4]   1>          (the "License"); you may not use this file except in compliance with
   [junit4]   1>          the License.  You may obtain a copy of the License at
   [junit4]   1>         
   [junit4]   1>              http://www.apache.org/licenses/LICENSE-2.0
   [junit4]   1>         
   [junit4]   1>          Unless required by applicable law or agreed to in writing, software
   [junit4]   1>          distributed under the License is distributed on an "AS IS" BASIS,
   [junit4]   1>          WITHOUT WARRANTIES OR CONDITIONS OF ANY KIND, either express or implied.
   [junit4]   1>          See the License for the specific language governing permissions and
   [junit4]   1>          limitations under the License.
   [junit4]   1>         -->
   [junit4]   1>         
   [junit4]   1>         <!--
   [junit4]   1>         
   [junit4]   1>          This example schema is the recommended starting point for users.
   [junit4]   1>          It should be kept correct and concise, usable out-of-the-box.
   [junit4]   1>         
   [junit4]   1>         
   [junit4]   1>          For more information, on how to customize this file, please see
   [junit4]   1>          http://lucene.apache.org/solr/guide/documents-fields-and-schema-design.html
   [junit4]   1>         
   [junit4]   1>          PERFORMANCE NOTE: this schema includes many optional features and should not
   [junit4]   1>          be used for benchmarking.  To improve performance one could
   [junit4]   1>           - set stored="false" for all fields possible (esp large fields) when you
   [junit4]   1>             only need to search on the field but don't need to return the original
   [junit4]   1>             value.
   [junit4]   1>           - set indexed="false" if you don't need to search on the field, but only
   [junit4]   1>             return the field as a result of searching on other indexed fields.
   [junit4]   1>           - remove all unneeded copyField statements
   [junit4]   1>           - for best index size and searching performance, set "index" to false
   [junit4]   1>             for all general text fields, use copyField to copy them to the
   [junit4]   1>             catchall "text" field, and use that for searching.
   [junit4]   1>         -->
   [junit4]   1>         
   [junit4]   1>         <schema name="default-config" version="1.6">
   [junit4]   1>             <!-- attribute "name" is the name of this schema and is only used for display purposes.
   [junit4]   1>                version="x.y" is Solr's version number for the schema syntax and 
   [junit4]   1>                semantics.  It should not normally be changed by applications.
   [junit4]   1>         
   [junit4]   1>                1.0: multiValued attribute did not exist, all fields are multiValued 
   [junit4]   1>                     by nature
   [junit4]   1>                1.1: multiValued attribute introduced, false by default 
   [junit4]   1>                1.2: omitTermFreqAndPositions attribute introduced, true by default 
   [junit4]   1>                     except for text fields.
   [junit4]   1>                1.3: removed optional field compress feature
   [junit4]   1>                1.4: autoGeneratePhraseQueries attribute introduced to drive QueryParser
   [junit4]   1>                     behavior when a single string produces multiple tokens.  Defaults 
   [junit4]   1>                     to off for version >= 1.4
   [junit4]   1>                1.5: omitNorms defaults to true for primitive field types 
   [junit4]   1>                     (int, float, boolean, string...)
   [junit4]   1>                1.6: useDocValuesAsStored defaults to true.
   [junit4]   1>             -->
   [junit4]   1>         
   [junit4]   1>             <!-- Valid attributes for fields:
   [junit4]   1>              name: mandatory - the name for the field
   [junit4]   1>              type: mandatory - the name of a field type from the 
   [junit4]   1>                fieldTypes section
   [junit4]   1>              indexed: true if this field should be indexed (searchable or sortable)
   [junit4]   1>              stored: true if this field should be retrievable
   [junit4]   1>              docValues: true if this field should have doc values. Doc Values is
   [junit4]   1>                recommended (required, if you are using *Point fields) for faceting,
   [junit4]   1>                grouping, sorting and function queries. Doc Values will make the index
   [junit4]   1>                faster to load, more NRT-friendly and more memory-efficient. 
   [junit4]   1>                They are currently only supported by StrField, UUIDField, all 
   [junit4]   1>                *PointFields, and depending on the field type, they might require
   [junit4]   1>                the field to be single-valued, be required or have a default value
   [junit4]   1>                (check the documentation of the field type you're interested in for
   [junit4]   1>                more information)
   [junit4]   1>              multiValued: true if this field may contain multiple values per document
   [junit4]   1>              omitNorms: (expert) set to true to omit the norms associated with
   [junit4]   1>                this field (this disables length normalization and index-time
   [junit4]   1>                boosting for the field, and saves some memory).  Only full-text
   [junit4]   1>                fields or fields that need an index-time boost need norms.
   [junit4]   1>                Norms are omitted for primitive (non-analyzed) types by default.
   [junit4]   1>              termVectors: [false] set to true to store the term vector for a
   [junit4]   1>                given field.
   [junit4]   1>                When using MoreLikeThis, fields used for similarity should be
   [junit4]   1>                stored for best performance.
   [junit4]   1>              termPositions: Store position information with the term vector.  
   [junit4]   1>                This will increase storage costs.
   [junit4]   1>              termOffsets: Store offset information with the term vector. This 
   [junit4]   1>                will increase storage costs.
   [junit4]   1>              required: The field is required.  It will throw an error if the
   [junit4]   1>                value does not exist
   [junit4]   1>              default: a value that should be used if no value is specified
   [junit4]   1>                when adding a document.
   [junit4]   1>             -->
   [junit4]   1>         
   [junit4]   1>             <!-- field names should consist of alphanumeric or underscore characters only and
   [junit4]   1>               not start with a digit.  This is not currently strictly enforced,
   [junit4]   1>               but other field names will not have first class support from all components
   [junit4]   1>               and back compatibility is not guaranteed.  Names with both leading and
   [junit4]   1>               trailing underscores (e.g. _version_) are reserved.
   [junit4]   1>             -->
   [junit4]   1>         
   [junit4]   1>             <!-- In this _default configset, only four fields are pre-declared:
   [junit4]   1>                  id, _version_, and _text_ and _root_. All other fields will be type guessed and added via the
   [junit4]   1>                  "add-unknown-fields-to-the-schema" update request processor chain declared in solrconfig.xml.
   [junit4]   1>                  
   [junit4]   1>                  Note that many dynamic fields are also defined - you can use them to specify a 
   [junit4]   1>                  field's type via field naming conventions - see below.
   [junit4]   1>           
   [junit4]   1>                  WARNING: The _text_ catch-all field will significantly increase your index size.
   [junit4]   1>                  If you don't need it, consider removing it and the corresponding copyField directive.
   [junit4]   1>             -->
   [junit4]   1>         
   [junit4]   1>             <field name="id" type="string" indexed="true" stored="true" required="true" multiValued="false" />
   [junit4]   1>             <!-- docValues are enabled by default for long type so we don't need to index the version field  -->
   [junit4]   1>             <field name="_version_" type="plong" indexed="false" stored="false"/>
   [junit4]   1>             <field name="_root_" type="string" indexed="true" stored="false" docValues="false" />
   [junit4]   1>             <field name="_text_" type="text_general" indexed="true" stored="false" multiValued="true"/>
   [junit4]   1>         
   [junit4]   1>             <!-- This can be enabled, in case the client does not know what fields may be searched. It isn't enabled by default
   [junit4]   1>                  because it's very expensive to index everything twice. -->
   [junit4]   1>             <!-- <copyField source="*" dest="_text_"/> -->
   [junit4]   1>         
   [junit4]   1>             <!-- Dynamic field definitions allow using convention over configuration
   [junit4]   1>                for fields via the specification of patterns to match field names.
   [junit4]   1>                EXAMPLE:  name="*_i" will match any field ending in _i (like myid_i, z_i)
   [junit4]   1>                RESTRICTION: the glob-like pattern in the name attribute must have a "*" only at the start or the end.  -->
   [junit4]   1>            
   [junit4]   1>             <dynamicField name="*_i"  type="pint"    indexed="true"  stored="true"/>
   [junit4]   1>             <dynamicField name="*_is" type="pints"    indexed="true"  stored="true"/>
   [junit4]   1>             <dynamicField name="*_s"  type="string"  indexed="true"  stored="true" />
   [junit4]   1>             <dynamicField name="*_ss" type="strings"  indexed="true"  stored="true"/>
   [junit4]   1>             <dynamicField name="*_l"  type="plong"   indexed="true"  stored="true"/>
   [junit4]   1>             <dynamicField name="*_ls" type="plongs"   indexed="true"  stored="true"/>
   [junit4]   1>             <dynamicField name="*_txt" type="text_general" indexed="true" stored="true"/>
   [junit4]   1>             <dynamicField name="*_b"  type="boolean" indexed="true" stored="true"/>
   [junit4]   1>             <dynamicField name="*_bs" type="booleans" indexed="true" stored="true"/>
   [junit4]   1>             <dynamicField name="*_f"  type="pfloat"  indexed="true"  stored="true"/>
   [junit4]   1>             <dynamicField name="*_fs" type="pfloats"  indexed="true"  stored="true"/>
   [junit4]   1>             <dynamicField name="*_d"  type="pdouble" indexed="true"  stored="true"/>
   [junit4]   1>             <dynamicField name="*_ds" type="pdoubles" indexed="true"  stored="true"/>
   [junit4]   1>         
   [junit4]   1>             <!-- Type used for data-driven schema, to add a string copy for each text field -->
   [junit4]   1>             <dynamicField name="*_str" type="strings" stored="false" docValues="true" indexed="false" />
   [junit4]   1>         
   [junit4]   1>             <dynamicField name="*_dt"  type="pdate"    indexed="true"  stored="true"/>
   [junit4]   1>             <dynamicField name="*_dts" type="pdate"    indexed="true"  stored="true" multiValued="true"/>
   [junit4]   1>             <dynamicField name="*_p"  type="location" indexed="true" stored="true"/>
   [junit4]   1>             <dynamicField name="*_srpt"  type="location_rpt" indexed="true" stored="true"/>
   [junit4]   1>             
   [junit4]   1>             <!-- payloaded dynamic fields -->
   [junit4]   1>             <dynamicField name="*_dpf" type="delimited_payloads_float" indexed="true"  stored="true"/>
   [junit4]   1>             <dynamicField name="*_dpi" type="delimited_payloads_int" indexed="true"  stored="true"/>
   [junit4]   1>             <dynamicField name="*_dps" type="delimited_payloads_string" indexed="true"  stored="true"/>
   [junit4]   1>         
   [junit4]   1>             <dynamicField name="attr_*" type="text_general" indexed="true" stored="true" multiValued="true"/>
   [junit4]   1>         
   [junit4]   1>             <!-- Field to use to determine and enforce document uniqueness.
   [junit4]   1>               Unless this field is marked with required="false", it will be a required field
   [junit4]   1>             -->
   [junit4]   1>             <uniqueKey>id</uniqueKey>
   [junit4]   1>         
   [junit4]   1>             <!-- copyField commands copy one field to another at the time a document
   [junit4]   1>                is added to the index.  It's used either to index the same field differently,
   [junit4]   1>                or to add multiple fields to the same field 

[...truncated too long message...]

t.parkNanos(LockSupport.java:215)
   [junit4]    >         at java.util.concurrent.SynchronousQueue$TransferStack.awaitFulfill(SynchronousQueue.java:460)
   [junit4]    >         at java.util.concurrent.SynchronousQueue$TransferStack.transfer(SynchronousQueue.java:362)
   [junit4]    >         at java.util.concurrent.SynchronousQueue.poll(SynchronousQueue.java:941)
   [junit4]    >         at java.util.concurrent.ThreadPoolExecutor.getTask(ThreadPoolExecutor.java:1073)
   [junit4]    >         at java.util.concurrent.ThreadPoolExecutor.runWorker(ThreadPoolExecutor.java:1134)
   [junit4]    >         at java.util.concurrent.ThreadPoolExecutor$Worker.run(ThreadPoolExecutor.java:624)
   [junit4]    >         at java.lang.Thread.run(Thread.java:748)
   [junit4]    >    7) Thread[id=20371, name=Connection evictor, state=TIMED_WAITING, group=TGRP-ChaosMonkeyNothingIsSafeTest]
   [junit4]    >         at java.lang.Thread.sleep(Native Method)
   [junit4]    >         at org.apache.http.impl.client.IdleConnectionEvictor$1.run(IdleConnectionEvictor.java:66)
   [junit4]    >         at java.lang.Thread.run(Thread.java:748)
   [junit4]    >    8) Thread[id=20495, name=zkCallback-3167-thread-2, state=TIMED_WAITING, group=TGRP-ChaosMonkeyNothingIsSafeTest]
   [junit4]    >         at sun.misc.Unsafe.park(Native Method)
   [junit4]    >         at java.util.concurrent.locks.LockSupport.parkNanos(LockSupport.java:215)
   [junit4]    >         at java.util.concurrent.SynchronousQueue$TransferStack.awaitFulfill(SynchronousQueue.java:460)
   [junit4]    >         at java.util.concurrent.SynchronousQueue$TransferStack.transfer(SynchronousQueue.java:362)
   [junit4]    >         at java.util.concurrent.SynchronousQueue.poll(SynchronousQueue.java:941)
   [junit4]    >         at java.util.concurrent.ThreadPoolExecutor.getTask(ThreadPoolExecutor.java:1073)
   [junit4]    >         at java.util.concurrent.ThreadPoolExecutor.runWorker(ThreadPoolExecutor.java:1134)
   [junit4]    >         at java.util.concurrent.ThreadPoolExecutor$Worker.run(ThreadPoolExecutor.java:624)
   [junit4]    >         at java.lang.Thread.run(Thread.java:748)
   [junit4]    >    9) Thread[id=20373, name=TEST-ChaosMonkeyNothingIsSafeTest.test-seed#[6C5A3967B9DAC95E]-EventThread, state=WAITING, group=TGRP-ChaosMonkeyNothingIsSafeTest]
   [junit4]    >         at sun.misc.Unsafe.park(Native Method)
   [junit4]    >         at java.util.concurrent.locks.LockSupport.park(LockSupport.java:175)
   [junit4]    >         at java.util.concurrent.locks.AbstractQueuedSynchronizer$ConditionObject.await(AbstractQueuedSynchronizer.java:2039)
   [junit4]    >         at java.util.concurrent.LinkedBlockingQueue.take(LinkedBlockingQueue.java:442)
   [junit4]    >         at org.apache.zookeeper.ClientCnxn$EventThread.run(ClientCnxn.java:501)
   [junit4]    > 	at __randomizedtesting.SeedInfo.seed([6C5A3967B9DAC95E]:0)Throwable #2: com.carrotsearch.randomizedtesting.ThreadLeakError: There are still zombie threads that couldn't be terminated:
   [junit4]    >    1) Thread[id=20374, name=zkCallback-3167-thread-1, state=TIMED_WAITING, group=TGRP-ChaosMonkeyNothingIsSafeTest]
   [junit4]    >         at sun.misc.Unsafe.park(Native Method)
   [junit4]    >         at java.util.concurrent.locks.LockSupport.parkNanos(LockSupport.java:215)
   [junit4]    >         at java.util.concurrent.SynchronousQueue$TransferStack.awaitFulfill(SynchronousQueue.java:460)
   [junit4]    >         at java.util.concurrent.SynchronousQueue$TransferStack.transfer(SynchronousQueue.java:362)
   [junit4]    >         at java.util.concurrent.SynchronousQueue.poll(SynchronousQueue.java:941)
   [junit4]    >         at java.util.concurrent.ThreadPoolExecutor.getTask(ThreadPoolExecutor.java:1073)
   [junit4]    >         at java.util.concurrent.ThreadPoolExecutor.runWorker(ThreadPoolExecutor.java:1134)
   [junit4]    >         at java.util.concurrent.ThreadPoolExecutor$Worker.run(ThreadPoolExecutor.java:624)
   [junit4]    >         at java.lang.Thread.run(Thread.java:748)
   [junit4]    >    2) Thread[id=20535, name=zkCallback-3167-thread-6, state=TIMED_WAITING, group=TGRP-ChaosMonkeyNothingIsSafeTest]
   [junit4]    >         at sun.misc.Unsafe.park(Native Method)
   [junit4]    >         at java.util.concurrent.locks.LockSupport.parkNanos(LockSupport.java:215)
   [junit4]    >         at java.util.concurrent.SynchronousQueue$TransferStack.awaitFulfill(SynchronousQueue.java:460)
   [junit4]    >         at java.util.concurrent.SynchronousQueue$TransferStack.transfer(SynchronousQueue.java:362)
   [junit4]    >         at java.util.concurrent.SynchronousQueue.poll(SynchronousQueue.java:941)
   [junit4]    >         at java.util.concurrent.ThreadPoolExecutor.getTask(ThreadPoolExecutor.java:1073)
   [junit4]    >         at java.util.concurrent.ThreadPoolExecutor.runWorker(ThreadPoolExecutor.java:1134)
   [junit4]    >         at java.util.concurrent.ThreadPoolExecutor$Worker.run(ThreadPoolExecutor.java:624)
   [junit4]    >         at java.lang.Thread.run(Thread.java:748)
   [junit4]    >    3) Thread[id=20524, name=zkCallback-3167-thread-4, state=TIMED_WAITING, group=TGRP-ChaosMonkeyNothingIsSafeTest]
   [junit4]    >         at sun.misc.Unsafe.park(Native Method)
   [junit4]    >         at java.util.concurrent.locks.LockSupport.parkNanos(LockSupport.java:215)
   [junit4]    >         at java.util.concurrent.SynchronousQueue$TransferStack.awaitFulfill(SynchronousQueue.java:460)
   [junit4]    >         at java.util.concurrent.SynchronousQueue$TransferStack.transfer(SynchronousQueue.java:362)
   [junit4]    >         at java.util.concurrent.SynchronousQueue.poll(SynchronousQueue.java:941)
   [junit4]    >         at java.util.concurrent.ThreadPoolExecutor.getTask(ThreadPoolExecutor.java:1073)
   [junit4]    >         at java.util.concurrent.ThreadPoolExecutor.runWorker(ThreadPoolExecutor.java:1134)
   [junit4]    >         at java.util.concurrent.ThreadPoolExecutor$Worker.run(ThreadPoolExecutor.java:624)
   [junit4]    >         at java.lang.Thread.run(Thread.java:748)
   [junit4]    >    4) Thread[id=20372, name=TEST-ChaosMonkeyNothingIsSafeTest.test-seed#[6C5A3967B9DAC95E]-SendThread(127.0.0.1:61409), state=TIMED_WAITING, group=TGRP-ChaosMonkeyNothingIsSafeTest]
   [junit4]    >         at java.lang.Thread.sleep(Native Method)
   [junit4]    >         at org.apache.zookeeper.client.StaticHostProvider.next(StaticHostProvider.java:101)
   [junit4]    >         at org.apache.zookeeper.ClientCnxn$SendThread.startConnect(ClientCnxn.java:997)
   [junit4]    >         at org.apache.zookeeper.ClientCnxn$SendThread.run(ClientCnxn.java:1060)
   [junit4]    >    5) Thread[id=20513, name=zkCallback-3167-thread-3, state=TIMED_WAITING, group=TGRP-ChaosMonkeyNothingIsSafeTest]
   [junit4]    >         at sun.misc.Unsafe.park(Native Method)
   [junit4]    >         at java.util.concurrent.locks.LockSupport.parkNanos(LockSupport.java:215)
   [junit4]    >         at java.util.concurrent.SynchronousQueue$TransferStack.awaitFulfill(SynchronousQueue.java:460)
   [junit4]    >         at java.util.concurrent.SynchronousQueue$TransferStack.transfer(SynchronousQueue.java:362)
   [junit4]    >         at java.util.concurrent.SynchronousQueue.poll(SynchronousQueue.java:941)
   [junit4]    >         at java.util.concurrent.ThreadPoolExecutor.getTask(ThreadPoolExecutor.java:1073)
   [junit4]    >         at java.util.concurrent.ThreadPoolExecutor.runWorker(ThreadPoolExecutor.java:1134)
   [junit4]    >         at java.util.concurrent.ThreadPoolExecutor$Worker.run(ThreadPoolExecutor.java:624)
   [junit4]    >         at java.lang.Thread.run(Thread.java:748)
   [junit4]    >    6) Thread[id=20534, name=zkCallback-3167-thread-5, state=TIMED_WAITING, group=TGRP-ChaosMonkeyNothingIsSafeTest]
   [junit4]    >         at sun.misc.Unsafe.park(Native Method)
   [junit4]    >         at java.util.concurrent.locks.LockSupport.parkNanos(LockSupport.java:215)
   [junit4]    >         at java.util.concurrent.SynchronousQueue$TransferStack.awaitFulfill(SynchronousQueue.java:460)
   [junit4]    >         at java.util.concurrent.SynchronousQueue$TransferStack.transfer(SynchronousQueue.java:362)
   [junit4]    >         at java.util.concurrent.SynchronousQueue.poll(SynchronousQueue.java:941)
   [junit4]    >         at java.util.concurrent.ThreadPoolExecutor.getTask(ThreadPoolExecutor.java:1073)
   [junit4]    >         at java.util.concurrent.ThreadPoolExecutor.runWorker(ThreadPoolExecutor.java:1134)
   [junit4]    >         at java.util.concurrent.ThreadPoolExecutor$Worker.run(ThreadPoolExecutor.java:624)
   [junit4]    >         at java.lang.Thread.run(Thread.java:748)
   [junit4]    >    7) Thread[id=20495, name=zkCallback-3167-thread-2, state=TIMED_WAITING, group=TGRP-ChaosMonkeyNothingIsSafeTest]
   [junit4]    >         at sun.misc.Unsafe.park(Native Method)
   [junit4]    >         at java.util.concurrent.locks.LockSupport.parkNanos(LockSupport.java:215)
   [junit4]    >         at java.util.concurrent.SynchronousQueue$TransferStack.awaitFulfill(SynchronousQueue.java:460)
   [junit4]    >         at java.util.concurrent.SynchronousQueue$TransferStack.transfer(SynchronousQueue.java:362)
   [junit4]    >         at java.util.concurrent.SynchronousQueue.poll(SynchronousQueue.java:941)
   [junit4]    >         at java.util.concurrent.ThreadPoolExecutor.getTask(ThreadPoolExecutor.java:1073)
   [junit4]    >         at java.util.concurrent.ThreadPoolExecutor.runWorker(ThreadPoolExecutor.java:1134)
   [junit4]    >         at java.util.concurrent.ThreadPoolExecutor$Worker.run(ThreadPoolExecutor.java:624)
   [junit4]    >         at java.lang.Thread.run(Thread.java:748)
   [junit4]    > 	at __randomizedtesting.SeedInfo.seed([6C5A3967B9DAC95E]:0)
   [junit4] Completed [509/747 (2!)] on J0 in 78.59s, 1 test, 3 errors <<< FAILURES!

[...truncated 43825 lines...]

Mime
View raw message