lucene-dev mailing list archives

Site index · List index
Message view « Date » · « Thread »
Top « Date » · « Thread »
From Policeman Jenkins Server <jenk...@thetaphi.de>
Subject [JENKINS] Lucene-Solr-7.x-Linux (64bit/jdk-9.0.1) - Build # 894 - Unstable!
Date Fri, 24 Nov 2017 16:12:04 GMT
Build: https://jenkins.thetaphi.de/job/Lucene-Solr-7.x-Linux/894/
Java: 64bit/jdk-9.0.1 -XX:+UseCompressedOops -XX:+UseG1GC

3 tests failed.
FAILED:  junit.framework.TestSuite.org.apache.solr.client.solrj.io.stream.StreamingTest

Error Message:
Error from server at http://127.0.0.1:45823/solr: create the collection time out:180s

Stack Trace:
org.apache.solr.client.solrj.impl.HttpSolrClient$RemoteSolrException: Error from server at http://127.0.0.1:45823/solr: create the collection time out:180s
	at __randomizedtesting.SeedInfo.seed([2FEBF971BABB417B]:0)
	at org.apache.solr.client.solrj.impl.HttpSolrClient.executeMethod(HttpSolrClient.java:643)
	at org.apache.solr.client.solrj.impl.HttpSolrClient.request(HttpSolrClient.java:255)
	at org.apache.solr.client.solrj.impl.HttpSolrClient.request(HttpSolrClient.java:244)
	at org.apache.solr.client.solrj.impl.LBHttpSolrClient.doRequest(LBHttpSolrClient.java:483)
	at org.apache.solr.client.solrj.impl.LBHttpSolrClient.request(LBHttpSolrClient.java:413)
	at org.apache.solr.client.solrj.impl.CloudSolrClient.sendRequest(CloudSolrClient.java:1103)
	at org.apache.solr.client.solrj.impl.CloudSolrClient.requestWithRetryOnStaleState(CloudSolrClient.java:883)
	at org.apache.solr.client.solrj.impl.CloudSolrClient.request(CloudSolrClient.java:816)
	at org.apache.solr.client.solrj.SolrRequest.process(SolrRequest.java:194)
	at org.apache.solr.client.solrj.SolrRequest.process(SolrRequest.java:211)
	at org.apache.solr.client.solrj.io.stream.StreamingTest.configureCluster(StreamingTest.java:102)
	at java.base/jdk.internal.reflect.NativeMethodAccessorImpl.invoke0(Native Method)
	at java.base/jdk.internal.reflect.NativeMethodAccessorImpl.invoke(NativeMethodAccessorImpl.java:62)
	at java.base/jdk.internal.reflect.DelegatingMethodAccessorImpl.invoke(DelegatingMethodAccessorImpl.java:43)
	at java.base/java.lang.reflect.Method.invoke(Method.java:564)
	at com.carrotsearch.randomizedtesting.RandomizedRunner.invoke(RandomizedRunner.java:1737)
	at com.carrotsearch.randomizedtesting.RandomizedRunner$6.evaluate(RandomizedRunner.java:874)
	at com.carrotsearch.randomizedtesting.RandomizedRunner$7.evaluate(RandomizedRunner.java:890)
	at com.carrotsearch.randomizedtesting.rules.StatementAdapter.evaluate(StatementAdapter.java:36)
	at com.carrotsearch.randomizedtesting.rules.SystemPropertiesRestoreRule$1.evaluate(SystemPropertiesRestoreRule.java:57)
	at org.apache.lucene.util.AbstractBeforeAfterRule$1.evaluate(AbstractBeforeAfterRule.java:45)
	at com.carrotsearch.randomizedtesting.rules.StatementAdapter.evaluate(StatementAdapter.java:36)
	at org.apache.lucene.util.TestRuleStoreClassName$1.evaluate(TestRuleStoreClassName.java:41)
	at com.carrotsearch.randomizedtesting.rules.NoShadowingOrOverridesOnMethodsRule$1.evaluate(NoShadowingOrOverridesOnMethodsRule.java:40)
	at com.carrotsearch.randomizedtesting.rules.NoShadowingOrOverridesOnMethodsRule$1.evaluate(NoShadowingOrOverridesOnMethodsRule.java:40)
	at com.carrotsearch.randomizedtesting.rules.StatementAdapter.evaluate(StatementAdapter.java:36)
	at com.carrotsearch.randomizedtesting.rules.StatementAdapter.evaluate(StatementAdapter.java:36)
	at org.apache.lucene.util.TestRuleAssertionsRequired$1.evaluate(TestRuleAssertionsRequired.java:53)
	at org.apache.lucene.util.TestRuleMarkFailure$1.evaluate(TestRuleMarkFailure.java:47)
	at org.apache.lucene.util.TestRuleIgnoreAfterMaxFailures$1.evaluate(TestRuleIgnoreAfterMaxFailures.java:64)
	at org.apache.lucene.util.TestRuleIgnoreTestSuites$1.evaluate(TestRuleIgnoreTestSuites.java:54)
	at com.carrotsearch.randomizedtesting.rules.StatementAdapter.evaluate(StatementAdapter.java:36)
	at com.carrotsearch.randomizedtesting.ThreadLeakControl$StatementRunner.run(ThreadLeakControl.java:368)
	at java.base/java.lang.Thread.run(Thread.java:844)


FAILED:  org.apache.lucene.spatial3d.geom.RandomGeoShapeRelationshipTest.testRandom_LUCENE8054 {seed=[8B4B17B197DABEEF:3759768B13996674]}

Error Message:
circle1: GeoExactCircle: {planetmodel=PlanetModel.WGS84, center=[lat=-0.39623668217931335, lon=1.6802588301913728([X=-0.10084195931060785, Y=0.9175641884592896, Z=-0.38618737155885624])], radius=1.570084674982269(89.95922535465361), accuracy=6.513482144222941E-12} circle2: GeoExactCircle: {planetmodel=PlanetModel.WGS84, center=[lat=-0.39623668217931335, lon=1.6802588301913728([X=-0.10084195931060785, Y=0.9175641884592896, Z=-0.38618737155885624])], radius=1.5695068587445313(89.92611892289712), accuracy=1.0E-5}

Stack Trace:
java.lang.AssertionError: circle1: GeoExactCircle: {planetmodel=PlanetModel.WGS84, center=[lat=-0.39623668217931335, lon=1.6802588301913728([X=-0.10084195931060785, Y=0.9175641884592896, Z=-0.38618737155885624])], radius=1.570084674982269(89.95922535465361), accuracy=6.513482144222941E-12}
circle2: GeoExactCircle: {planetmodel=PlanetModel.WGS84, center=[lat=-0.39623668217931335, lon=1.6802588301913728([X=-0.10084195931060785, Y=0.9175641884592896, Z=-0.38618737155885624])], radius=1.5695068587445313(89.92611892289712), accuracy=1.0E-5}
	at __randomizedtesting.SeedInfo.seed([8B4B17B197DABEEF:3759768B13996674]:0)
	at org.junit.Assert.fail(Assert.java:93)
	at org.junit.Assert.assertTrue(Assert.java:43)
	at org.apache.lucene.spatial3d.geom.RandomGeoShapeRelationshipTest.testRandom_LUCENE8054(RandomGeoShapeRelationshipTest.java:311)
	at jdk.internal.reflect.GeneratedMethodAccessor3.invoke(Unknown Source)
	at java.base/jdk.internal.reflect.DelegatingMethodAccessorImpl.invoke(DelegatingMethodAccessorImpl.java:43)
	at java.base/java.lang.reflect.Method.invoke(Method.java:564)
	at com.carrotsearch.randomizedtesting.RandomizedRunner.invoke(RandomizedRunner.java:1737)
	at com.carrotsearch.randomizedtesting.RandomizedRunner$8.evaluate(RandomizedRunner.java:934)
	at com.carrotsearch.randomizedtesting.RandomizedRunner$9.evaluate(RandomizedRunner.java:970)
	at com.carrotsearch.randomizedtesting.RandomizedRunner$10.evaluate(RandomizedRunner.java:984)
	at org.apache.lucene.util.TestRuleSetupTeardownChained$1.evaluate(TestRuleSetupTeardownChained.java:49)
	at org.apache.lucene.util.AbstractBeforeAfterRule$1.evaluate(AbstractBeforeAfterRule.java:45)
	at org.apache.lucene.util.TestRuleThreadAndTestName$1.evaluate(TestRuleThreadAndTestName.java:48)
	at org.apache.lucene.util.TestRuleIgnoreAfterMaxFailures$1.evaluate(TestRuleIgnoreAfterMaxFailures.java:64)
	at org.apache.lucene.util.TestRuleMarkFailure$1.evaluate(TestRuleMarkFailure.java:47)
	at com.carrotsearch.randomizedtesting.rules.StatementAdapter.evaluate(StatementAdapter.java:36)
	at com.carrotsearch.randomizedtesting.ThreadLeakControl$StatementRunner.run(ThreadLeakControl.java:368)
	at com.carrotsearch.randomizedtesting.ThreadLeakControl.forkTimeoutingTask(ThreadLeakControl.java:817)
	at com.carrotsearch.randomizedtesting.ThreadLeakControl$3.evaluate(ThreadLeakControl.java:468)
	at com.carrotsearch.randomizedtesting.RandomizedRunner.runSingleTest(RandomizedRunner.java:943)
	at com.carrotsearch.randomizedtesting.RandomizedRunner$5.evaluate(RandomizedRunner.java:829)
	at com.carrotsearch.randomizedtesting.RandomizedRunner$6.evaluate(RandomizedRunner.java:879)
	at com.carrotsearch.randomizedtesting.RandomizedRunner$7.evaluate(RandomizedRunner.java:890)
	at org.apache.lucene.util.AbstractBeforeAfterRule$1.evaluate(AbstractBeforeAfterRule.java:45)
	at com.carrotsearch.randomizedtesting.rules.StatementAdapter.evaluate(StatementAdapter.java:36)
	at org.apache.lucene.util.TestRuleStoreClassName$1.evaluate(TestRuleStoreClassName.java:41)
	at com.carrotsearch.randomizedtesting.rules.NoShadowingOrOverridesOnMethodsRule$1.evaluate(NoShadowingOrOverridesOnMethodsRule.java:40)
	at com.carrotsearch.randomizedtesting.rules.NoShadowingOrOverridesOnMethodsRule$1.evaluate(NoShadowingOrOverridesOnMethodsRule.java:40)
	at com.carrotsearch.randomizedtesting.rules.StatementAdapter.evaluate(StatementAdapter.java:36)
	at com.carrotsearch.randomizedtesting.rules.StatementAdapter.evaluate(StatementAdapter.java:36)
	at org.apache.lucene.util.TestRuleAssertionsRequired$1.evaluate(TestRuleAssertionsRequired.java:53)
	at org.apache.lucene.util.TestRuleMarkFailure$1.evaluate(TestRuleMarkFailure.java:47)
	at org.apache.lucene.util.TestRuleIgnoreAfterMaxFailures$1.evaluate(TestRuleIgnoreAfterMaxFailures.java:64)
	at org.apache.lucene.util.TestRuleIgnoreTestSuites$1.evaluate(TestRuleIgnoreTestSuites.java:54)
	at com.carrotsearch.randomizedtesting.rules.StatementAdapter.evaluate(StatementAdapter.java:36)
	at com.carrotsearch.randomizedtesting.ThreadLeakControl$StatementRunner.run(ThreadLeakControl.java:368)
	at java.base/java.lang.Thread.run(Thread.java:844)


FAILED:  org.apache.solr.security.PKIAuthenticationIntegrationTest.testPkiAuth

Error Message:
Error from server at https://127.0.0.1:45189/solr: create the collection time out:180s

Stack Trace:
org.apache.solr.client.solrj.impl.HttpSolrClient$RemoteSolrException: Error from server at https://127.0.0.1:45189/solr: create the collection time out:180s
	at __randomizedtesting.SeedInfo.seed([A710B441DFD3EEE0:97AE2D103F656941]:0)
	at org.apache.solr.client.solrj.impl.HttpSolrClient.executeMethod(HttpSolrClient.java:643)
	at org.apache.solr.client.solrj.impl.HttpSolrClient.request(HttpSolrClient.java:255)
	at org.apache.solr.client.solrj.impl.HttpSolrClient.request(HttpSolrClient.java:244)
	at org.apache.solr.client.solrj.impl.LBHttpSolrClient.doRequest(LBHttpSolrClient.java:483)
	at org.apache.solr.client.solrj.impl.LBHttpSolrClient.request(LBHttpSolrClient.java:413)
	at org.apache.solr.client.solrj.impl.CloudSolrClient.sendRequest(CloudSolrClient.java:1103)
	at org.apache.solr.client.solrj.impl.CloudSolrClient.requestWithRetryOnStaleState(CloudSolrClient.java:883)
	at org.apache.solr.client.solrj.impl.CloudSolrClient.request(CloudSolrClient.java:816)
	at org.apache.solr.client.solrj.SolrRequest.process(SolrRequest.java:194)
	at org.apache.solr.client.solrj.SolrRequest.process(SolrRequest.java:211)
	at org.apache.solr.security.PKIAuthenticationIntegrationTest.testPkiAuth(PKIAuthenticationIntegrationTest.java:58)
	at java.base/jdk.internal.reflect.NativeMethodAccessorImpl.invoke0(Native Method)
	at java.base/jdk.internal.reflect.NativeMethodAccessorImpl.invoke(NativeMethodAccessorImpl.java:62)
	at java.base/jdk.internal.reflect.DelegatingMethodAccessorImpl.invoke(DelegatingMethodAccessorImpl.java:43)
	at java.base/java.lang.reflect.Method.invoke(Method.java:564)
	at com.carrotsearch.randomizedtesting.RandomizedRunner.invoke(RandomizedRunner.java:1737)
	at com.carrotsearch.randomizedtesting.RandomizedRunner$8.evaluate(RandomizedRunner.java:934)
	at com.carrotsearch.randomizedtesting.RandomizedRunner$9.evaluate(RandomizedRunner.java:970)
	at com.carrotsearch.randomizedtesting.RandomizedRunner$10.evaluate(RandomizedRunner.java:984)
	at com.carrotsearch.randomizedtesting.rules.SystemPropertiesRestoreRule$1.evaluate(SystemPropertiesRestoreRule.java:57)
	at org.apache.lucene.util.TestRuleSetupTeardownChained$1.evaluate(TestRuleSetupTeardownChained.java:49)
	at org.apache.lucene.util.AbstractBeforeAfterRule$1.evaluate(AbstractBeforeAfterRule.java:45)
	at org.apache.lucene.util.TestRuleThreadAndTestName$1.evaluate(TestRuleThreadAndTestName.java:48)
	at org.apache.lucene.util.TestRuleIgnoreAfterMaxFailures$1.evaluate(TestRuleIgnoreAfterMaxFailures.java:64)
	at org.apache.lucene.util.TestRuleMarkFailure$1.evaluate(TestRuleMarkFailure.java:47)
	at com.carrotsearch.randomizedtesting.rules.StatementAdapter.evaluate(StatementAdapter.java:36)
	at com.carrotsearch.randomizedtesting.ThreadLeakControl$StatementRunner.run(ThreadLeakControl.java:368)
	at com.carrotsearch.randomizedtesting.ThreadLeakControl.forkTimeoutingTask(ThreadLeakControl.java:817)
	at com.carrotsearch.randomizedtesting.ThreadLeakControl$3.evaluate(ThreadLeakControl.java:468)
	at com.carrotsearch.randomizedtesting.RandomizedRunner.runSingleTest(RandomizedRunner.java:943)
	at com.carrotsearch.randomizedtesting.RandomizedRunner$5.evaluate(RandomizedRunner.java:829)
	at com.carrotsearch.randomizedtesting.RandomizedRunner$6.evaluate(RandomizedRunner.java:879)
	at com.carrotsearch.randomizedtesting.RandomizedRunner$7.evaluate(RandomizedRunner.java:890)
	at com.carrotsearch.randomizedtesting.rules.StatementAdapter.evaluate(StatementAdapter.java:36)
	at com.carrotsearch.randomizedtesting.rules.SystemPropertiesRestoreRule$1.evaluate(SystemPropertiesRestoreRule.java:57)
	at org.apache.lucene.util.AbstractBeforeAfterRule$1.evaluate(AbstractBeforeAfterRule.java:45)
	at com.carrotsearch.randomizedtesting.rules.StatementAdapter.evaluate(StatementAdapter.java:36)
	at org.apache.lucene.util.TestRuleStoreClassName$1.evaluate(TestRuleStoreClassName.java:41)
	at com.carrotsearch.randomizedtesting.rules.NoShadowingOrOverridesOnMethodsRule$1.evaluate(NoShadowingOrOverridesOnMethodsRule.java:40)
	at com.carrotsearch.randomizedtesting.rules.NoShadowingOrOverridesOnMethodsRule$1.evaluate(NoShadowingOrOverridesOnMethodsRule.java:40)
	at com.carrotsearch.randomizedtesting.rules.StatementAdapter.evaluate(StatementAdapter.java:36)
	at com.carrotsearch.randomizedtesting.rules.StatementAdapter.evaluate(StatementAdapter.java:36)
	at org.apache.lucene.util.TestRuleAssertionsRequired$1.evaluate(TestRuleAssertionsRequired.java:53)
	at org.apache.lucene.util.TestRuleMarkFailure$1.evaluate(TestRuleMarkFailure.java:47)
	at org.apache.lucene.util.TestRuleIgnoreAfterMaxFailures$1.evaluate(TestRuleIgnoreAfterMaxFailures.java:64)
	at org.apache.lucene.util.TestRuleIgnoreTestSuites$1.evaluate(TestRuleIgnoreTestSuites.java:54)
	at com.carrotsearch.randomizedtesting.rules.StatementAdapter.evaluate(StatementAdapter.java:36)
	at com.carrotsearch.randomizedtesting.ThreadLeakControl$StatementRunner.run(ThreadLeakControl.java:368)
	at java.base/java.lang.Thread.run(Thread.java:844)




Build Log:
[...truncated 9728 lines...]
   [junit4] Suite: org.apache.lucene.spatial3d.geom.RandomGeoShapeRelationshipTest
   [junit4]   2> NOTE: reproduce with: ant test  -Dtestcase=RandomGeoShapeRelationshipTest -Dtests.method=testRandom_LUCENE8054 -Dtests.seed=8B4B17B197DABEEF -Dtests.multiplier=3 -Dtests.slow=true -Dtests.locale=sv-SE -Dtests.timezone=Europe/Tiraspol -Dtests.asserts=true -Dtests.file.encoding=UTF-8
   [junit4] FAILURE 0.02s J0 | RandomGeoShapeRelationshipTest.testRandom_LUCENE8054 {seed=[8B4B17B197DABEEF:3759768B13996674]} <<<
   [junit4]    > Throwable #1: java.lang.AssertionError: circle1: GeoExactCircle: {planetmodel=PlanetModel.WGS84, center=[lat=-0.39623668217931335, lon=1.6802588301913728([X=-0.10084195931060785, Y=0.9175641884592896, Z=-0.38618737155885624])], radius=1.570084674982269(89.95922535465361), accuracy=6.513482144222941E-12}
   [junit4]    > circle2: GeoExactCircle: {planetmodel=PlanetModel.WGS84, center=[lat=-0.39623668217931335, lon=1.6802588301913728([X=-0.10084195931060785, Y=0.9175641884592896, Z=-0.38618737155885624])], radius=1.5695068587445313(89.92611892289712), accuracy=1.0E-5}
   [junit4]    > 	at __randomizedtesting.SeedInfo.seed([8B4B17B197DABEEF:3759768B13996674]:0)
   [junit4]    > 	at org.apache.lucene.spatial3d.geom.RandomGeoShapeRelationshipTest.testRandom_LUCENE8054(RandomGeoShapeRelationshipTest.java:311)
   [junit4]    > 	at jdk.internal.reflect.GeneratedMethodAccessor3.invoke(Unknown Source)
   [junit4]    > 	at java.base/jdk.internal.reflect.DelegatingMethodAccessorImpl.invoke(DelegatingMethodAccessorImpl.java:43)
   [junit4]    > 	at java.base/java.lang.reflect.Method.invoke(Method.java:564)
   [junit4]    > 	at java.base/java.lang.Thread.run(Thread.java:844)
   [junit4]   2> NOTE: test params are: codec=CheapBastard, sim=RandomSimilarity(queryNorm=false): {}, locale=sv-SE, timezone=Europe/Tiraspol
   [junit4]   2> NOTE: Linux 4.10.0-37-generic amd64/Oracle Corporation 9.0.1 (64-bit)/cpus=8,threads=1,free=420222272,total=536870912
   [junit4]   2> NOTE: All tests run in this JVM: [RandomGeoShapeRelationshipTest]
   [junit4] Completed [14/15 (1!)] on J0 in 71.40s, 126 tests, 1 failure <<< FAILURES!

[...truncated 4399 lines...]
   [junit4] Suite: org.apache.solr.security.PKIAuthenticationIntegrationTest
   [junit4]   2> Creating dataDir: /home/jenkins/workspace/Lucene-Solr-7.x-Linux/solr/build/solr-core/test/J1/temp/solr.security.PKIAuthenticationIntegrationTest_A710B441DFD3EEE0-001/init-core-data-001
   [junit4]   2> 3041122 WARN  (SUITE-PKIAuthenticationIntegrationTest-seed#[A710B441DFD3EEE0]-worker) [    ] o.a.s.SolrTestCaseJ4 startTrackingSearchers: numOpens=1 numCloses=1
   [junit4]   2> 3041122 INFO  (SUITE-PKIAuthenticationIntegrationTest-seed#[A710B441DFD3EEE0]-worker) [    ] o.a.s.SolrTestCaseJ4 Using PointFields (NUMERIC_POINTS_SYSPROP=true) w/NUMERIC_DOCVALUES_SYSPROP=true
   [junit4]   2> 3041122 INFO  (SUITE-PKIAuthenticationIntegrationTest-seed#[A710B441DFD3EEE0]-worker) [    ] o.a.s.SolrTestCaseJ4 Randomized ssl (true) and clientAuth (true) via: @org.apache.solr.util.RandomizeSSL(reason="", ssl=0.0/0.0, value=0.0/0.0, clientAuth=0.0/0.0)
   [junit4]   2> 3041123 INFO  (SUITE-PKIAuthenticationIntegrationTest-seed#[A710B441DFD3EEE0]-worker) [    ] o.a.s.SolrTestCaseJ4 SecureRandom sanity checks: test.solr.allowed.securerandom=null & java.security.egd=file:/dev/./urandom
   [junit4]   2> 3041123 INFO  (SUITE-PKIAuthenticationIntegrationTest-seed#[A710B441DFD3EEE0]-worker) [    ] o.a.s.c.MiniSolrCloudCluster Starting cluster of 2 servers in /home/jenkins/workspace/Lucene-Solr-7.x-Linux/solr/build/solr-core/test/J1/temp/solr.security.PKIAuthenticationIntegrationTest_A710B441DFD3EEE0-001/tempDir-001
   [junit4]   2> 3041123 INFO  (SUITE-PKIAuthenticationIntegrationTest-seed#[A710B441DFD3EEE0]-worker) [    ] o.a.s.c.ZkTestServer STARTING ZK TEST SERVER
   [junit4]   2> 3041123 INFO  (Thread-7441) [    ] o.a.s.c.ZkTestServer client port:0.0.0.0/0.0.0.0:0
   [junit4]   2> 3041123 INFO  (Thread-7441) [    ] o.a.s.c.ZkTestServer Starting server
   [junit4]   2> 3041125 ERROR (Thread-7441) [    ] o.a.z.s.ZooKeeperServer ZKShutdownHandler is not registered, so ZooKeeper server won't take any action on ERROR or SHUTDOWN server state changes
   [junit4]   2> 3041223 INFO  (SUITE-PKIAuthenticationIntegrationTest-seed#[A710B441DFD3EEE0]-worker) [    ] o.a.s.c.ZkTestServer start zk server on port:32847
   [junit4]   2> 3041229 INFO  (jetty-launcher-6265-thread-2) [    ] o.e.j.s.Server jetty-9.3.20.v20170531
   [junit4]   2> 3041229 INFO  (jetty-launcher-6265-thread-1) [    ] o.e.j.s.Server jetty-9.3.20.v20170531
   [junit4]   2> 3041231 INFO  (jetty-launcher-6265-thread-2) [    ] o.e.j.s.h.ContextHandler Started o.e.j.s.ServletContextHandler@9b3e660{/solr,null,AVAILABLE}
   [junit4]   2> 3041231 INFO  (jetty-launcher-6265-thread-1) [    ] o.e.j.s.h.ContextHandler Started o.e.j.s.ServletContextHandler@92bde5a{/solr,null,AVAILABLE}
   [junit4]   2> 3041232 INFO  (jetty-launcher-6265-thread-2) [    ] o.e.j.s.AbstractConnector Started ServerConnector@6c3ae3ea{SSL,[ssl, http/1.1]}{127.0.0.1:45189}
   [junit4]   2> 3041232 INFO  (jetty-launcher-6265-thread-2) [    ] o.e.j.s.Server Started @3042881ms
   [junit4]   2> 3041232 INFO  (jetty-launcher-6265-thread-1) [    ] o.e.j.s.AbstractConnector Started ServerConnector@2e5c8e3b{SSL,[ssl, http/1.1]}{127.0.0.1:39117}
   [junit4]   2> 3041232 INFO  (jetty-launcher-6265-thread-2) [    ] o.a.s.c.s.e.JettySolrRunner Jetty properties: {hostContext=/solr, hostPort=45189}
   [junit4]   2> 3041232 INFO  (jetty-launcher-6265-thread-1) [    ] o.e.j.s.Server Started @3042881ms
   [junit4]   2> 3041232 INFO  (jetty-launcher-6265-thread-1) [    ] o.a.s.c.s.e.JettySolrRunner Jetty properties: {hostContext=/solr, hostPort=39117}
   [junit4]   2> 3041232 ERROR (jetty-launcher-6265-thread-2) [    ] o.a.s.u.StartupLoggingUtils Missing Java Option solr.log.dir. Logging may be missing or incomplete.
   [junit4]   2> 3041232 ERROR (jetty-launcher-6265-thread-1) [    ] o.a.s.u.StartupLoggingUtils Missing Java Option solr.log.dir. Logging may be missing or incomplete.
   [junit4]   2> 3041232 INFO  (jetty-launcher-6265-thread-2) [    ] o.a.s.s.SolrDispatchFilter  ___      _       Welcome to Apache Solr™ version 7.2.0
   [junit4]   2> 3041233 INFO  (jetty-launcher-6265-thread-1) [    ] o.a.s.s.SolrDispatchFilter  ___      _       Welcome to Apache Solr™ version 7.2.0
   [junit4]   2> 3041233 INFO  (jetty-launcher-6265-thread-2) [    ] o.a.s.s.SolrDispatchFilter / __| ___| |_ _   Starting in cloud mode on port null
   [junit4]   2> 3041233 INFO  (jetty-launcher-6265-thread-1) [    ] o.a.s.s.SolrDispatchFilter / __| ___| |_ _   Starting in cloud mode on port null
   [junit4]   2> 3041233 INFO  (jetty-launcher-6265-thread-2) [    ] o.a.s.s.SolrDispatchFilter \__ \/ _ \ | '_|  Install dir: null
   [junit4]   2> 3041233 INFO  (jetty-launcher-6265-thread-1) [    ] o.a.s.s.SolrDispatchFilter \__ \/ _ \ | '_|  Install dir: null
   [junit4]   2> 3041233 INFO  (jetty-launcher-6265-thread-2) [    ] o.a.s.s.SolrDispatchFilter |___/\___/_|_|    Start time: 2017-11-24T15:56:27.348424Z
   [junit4]   2> 3041233 INFO  (jetty-launcher-6265-thread-1) [    ] o.a.s.s.SolrDispatchFilter |___/\___/_|_|    Start time: 2017-11-24T15:56:27.348506Z
   [junit4]   2> 3041235 INFO  (jetty-launcher-6265-thread-2) [    ] o.a.s.s.SolrDispatchFilter solr.xml found in ZooKeeper. Loading...
   [junit4]   2> 3041235 INFO  (jetty-launcher-6265-thread-1) [    ] o.a.s.s.SolrDispatchFilter solr.xml found in ZooKeeper. Loading...
   [junit4]   2> 3041241 INFO  (jetty-launcher-6265-thread-2) [    ] o.a.s.c.ZkContainer Zookeeper client=127.0.0.1:32847/solr
   [junit4]   2> 3041241 INFO  (jetty-launcher-6265-thread-1) [    ] o.a.s.c.ZkContainer Zookeeper client=127.0.0.1:32847/solr
   [junit4]   2> 3041297 INFO  (jetty-launcher-6265-thread-1) [n:127.0.0.1:39117_solr    ] o.a.s.c.Overseer Overseer (id=null) closing
   [junit4]   2> 3041298 INFO  (jetty-launcher-6265-thread-1) [n:127.0.0.1:39117_solr    ] o.a.s.c.OverseerElectionContext I am going to be the leader 127.0.0.1:39117_solr
   [junit4]   2> 3041298 INFO  (jetty-launcher-6265-thread-1) [n:127.0.0.1:39117_solr    ] o.a.s.c.Overseer Overseer (id=99060219067695110-127.0.0.1:39117_solr-n_0000000000) starting
   [junit4]   2> 3041300 INFO  (jetty-launcher-6265-thread-2) [n:127.0.0.1:45189_solr    ] o.a.s.c.Overseer Overseer (id=null) closing
   [junit4]   2> 3041301 INFO  (jetty-launcher-6265-thread-2) [n:127.0.0.1:45189_solr    ] o.a.s.c.ZkController Register node as live in ZooKeeper:/live_nodes/127.0.0.1:45189_solr
   [junit4]   2> 3041301 INFO  (jetty-launcher-6265-thread-1) [n:127.0.0.1:39117_solr    ] o.a.s.c.ZkController Register node as live in ZooKeeper:/live_nodes/127.0.0.1:39117_solr
   [junit4]   2> 3041302 INFO  (zkCallback-6276-thread-1-processing-n:127.0.0.1:45189_solr) [n:127.0.0.1:45189_solr    ] o.a.s.c.c.ZkStateReader Updated live nodes from ZooKeeper... (0) -> (2)
   [junit4]   2> 3041302 INFO  (zkCallback-6277-thread-1-processing-n:127.0.0.1:39117_solr) [n:127.0.0.1:39117_solr    ] o.a.s.c.c.ZkStateReader Updated live nodes from ZooKeeper... (0) -> (2)
   [junit4]   2> 3041328 INFO  (jetty-launcher-6265-thread-1) [n:127.0.0.1:39117_solr    ] o.a.s.m.r.SolrJmxReporter JMX monitoring for 'solr_39117.solr.node' (registry 'solr.node') enabled at server: com.sun.jmx.mbeanserver.JmxMBeanServer@5dba8f95
   [junit4]   2> 3041330 INFO  (jetty-launcher-6265-thread-2) [n:127.0.0.1:45189_solr    ] o.a.s.m.r.SolrJmxReporter JMX monitoring for 'solr_45189.solr.node' (registry 'solr.node') enabled at server: com.sun.jmx.mbeanserver.JmxMBeanServer@5dba8f95
   [junit4]   2> 3041333 INFO  (jetty-launcher-6265-thread-1) [n:127.0.0.1:39117_solr    ] o.a.s.m.r.SolrJmxReporter JMX monitoring for 'solr_39117.solr.jvm' (registry 'solr.jvm') enabled at server: com.sun.jmx.mbeanserver.JmxMBeanServer@5dba8f95
   [junit4]   2> 3041333 INFO  (jetty-launcher-6265-thread-1) [n:127.0.0.1:39117_solr    ] o.a.s.m.r.SolrJmxReporter JMX monitoring for 'solr_39117.solr.jetty' (registry 'solr.jetty') enabled at server: com.sun.jmx.mbeanserver.JmxMBeanServer@5dba8f95
   [junit4]   2> 3041334 INFO  (jetty-launcher-6265-thread-1) [n:127.0.0.1:39117_solr    ] o.a.s.c.CorePropertiesLocator Found 0 core definitions underneath /home/jenkins/workspace/Lucene-Solr-7.x-Linux/solr/build/solr-core/test/J1/temp/solr.security.PKIAuthenticationIntegrationTest_A710B441DFD3EEE0-001/tempDir-001/node1/.
   [junit4]   2> 3041335 INFO  (jetty-launcher-6265-thread-2) [n:127.0.0.1:45189_solr    ] o.a.s.m.r.SolrJmxReporter JMX monitoring for 'solr_45189.solr.jvm' (registry 'solr.jvm') enabled at server: com.sun.jmx.mbeanserver.JmxMBeanServer@5dba8f95
   [junit4]   2> 3041335 INFO  (jetty-launcher-6265-thread-2) [n:127.0.0.1:45189_solr    ] o.a.s.m.r.SolrJmxReporter JMX monitoring for 'solr_45189.solr.jetty' (registry 'solr.jetty') enabled at server: com.sun.jmx.mbeanserver.JmxMBeanServer@5dba8f95
   [junit4]   2> 3041336 INFO  (jetty-launcher-6265-thread-2) [n:127.0.0.1:45189_solr    ] o.a.s.c.CorePropertiesLocator Found 0 core definitions underneath /home/jenkins/workspace/Lucene-Solr-7.x-Linux/solr/build/solr-core/test/J1/temp/solr.security.PKIAuthenticationIntegrationTest_A710B441DFD3EEE0-001/tempDir-001/node2/.
   [junit4]   2> 3041359 INFO  (SUITE-PKIAuthenticationIntegrationTest-seed#[A710B441DFD3EEE0]-worker) [    ] o.a.s.c.c.ZkStateReader Updated live nodes from ZooKeeper... (0) -> (2)
   [junit4]   2> 3041360 INFO  (SUITE-PKIAuthenticationIntegrationTest-seed#[A710B441DFD3EEE0]-worker) [    ] o.a.s.c.s.i.ZkClientClusterStateProvider Cluster at 127.0.0.1:32847/solr ready
   [junit4]   2> 3041365 INFO  (TEST-PKIAuthenticationIntegrationTest.testPkiAuth-seed#[A710B441DFD3EEE0]) [    ] o.a.s.SolrTestCaseJ4 ###Starting testPkiAuth
   [junit4]   2> 3041374 INFO  (qtp830337052-36478) [n:127.0.0.1:45189_solr    ] o.a.s.h.a.CollectionsHandler Invoked Collection Action :create with params replicationFactor=1&collection.configName=conf&name=collection&nrtReplicas=1&action=CREATE&numShards=2&wt=javabin&version=2 and sendToOCPQueue=true
   [junit4]   2> 3041377 INFO  (OverseerThreadFactory-12070-thread-1-processing-n:127.0.0.1:39117_solr) [n:127.0.0.1:39117_solr    ] o.a.s.c.CreateCollectionCmd Create collection collection
   [junit4]   2> 3041479 INFO  (OverseerStateUpdate-99060219067695110-127.0.0.1:39117_solr-n_0000000000) [n:127.0.0.1:39117_solr    ] o.a.s.c.o.SliceMutator createReplica() {
   [junit4]   2>   "operation":"ADDREPLICA",
   [junit4]   2>   "collection":"collection",
   [junit4]   2>   "shard":"shard1",
   [junit4]   2>   "core":"collection_shard1_replica_n1",
   [junit4]   2>   "state":"down",
   [junit4]   2>   "base_url":"https://127.0.0.1:45189/solr",
   [junit4]   2>   "type":"NRT",
   [junit4]   2>   "waitForFinalState":"false"} 
   [junit4]   2> 3041480 INFO  (OverseerStateUpdate-99060219067695110-127.0.0.1:39117_solr-n_0000000000) [n:127.0.0.1:39117_solr    ] o.a.s.c.o.SliceMutator createReplica() {
   [junit4]   2>   "operation":"ADDREPLICA",
   [junit4]   2>   "collection":"collection",
   [junit4]   2>   "shard":"shard2",
   [junit4]   2>   "core":"collection_shard2_replica_n2",
   [junit4]   2>   "state":"down",
   [junit4]   2>   "base_url":"https://127.0.0.1:39117/solr",
   [junit4]   2>   "type":"NRT",
   [junit4]   2>   "waitForFinalState":"false"} 
   [junit4]   2> 3041682 INFO  (qtp830337052-36480) [n:127.0.0.1:45189_solr    ] o.a.s.h.a.CoreAdminOperation core create command qt=/admin/cores&coreNodeName=core_node3&collection.configName=conf&newCollection=true&name=collection_shard1_replica_n1&action=CREATE&numShards=2&collection=collection&shard=shard1&wt=javabin&version=2&replicaType=NRT
   [junit4]   2> 3041683 INFO  (qtp830337052-36480) [n:127.0.0.1:45189_solr    ] o.a.s.c.TransientSolrCoreCacheDefault Allocating transient cache for 2147483647 transient cores
   [junit4]   2> 3041690 INFO  (qtp1413621076-36479) [n:127.0.0.1:39117_solr    ] o.a.s.h.a.CoreAdminOperation core create command qt=/admin/cores&coreNodeName=core_node4&collection.configName=conf&newCollection=true&name=collection_shard2_replica_n2&action=CREATE&numShards=2&collection=collection&shard=shard2&wt=javabin&version=2&replicaType=NRT
   [junit4]   2> 3041690 INFO  (qtp1413621076-36479) [n:127.0.0.1:39117_solr    ] o.a.s.c.TransientSolrCoreCacheDefault Allocating transient cache for 2147483647 transient cores
   [junit4]   2> 3041792 INFO  (zkCallback-6276-thread-1-processing-n:127.0.0.1:45189_solr) [n:127.0.0.1:45189_solr    ] o.a.s.c.c.ZkStateReader A cluster state change: [WatchedEvent state:SyncConnected type:NodeDataChanged path:/collections/collection/state.json] for collection [collection] has occurred - updating... (live nodes size: [2])
   [junit4]   2> 3041792 INFO  (zkCallback-6277-thread-1-processing-n:127.0.0.1:39117_solr) [n:127.0.0.1:39117_solr    ] o.a.s.c.c.ZkStateReader A cluster state change: [WatchedEvent state:SyncConnected type:NodeDataChanged path:/collections/collection/state.json] for collection [collection] has occurred - updating... (live nodes size: [2])
   [junit4]   2> 3041792 INFO  (zkCallback-6277-thread-2-processing-n:127.0.0.1:39117_solr) [n:127.0.0.1:39117_solr    ] o.a.s.c.c.ZkStateReader A cluster state change: [WatchedEvent state:SyncConnected type:NodeDataChanged path:/collections/collection/state.json] for collection [collection] has occurred - updating... (live nodes size: [2])
   [junit4]   2> 3041792 INFO  (zkCallback-6276-thread-2-processing-n:127.0.0.1:45189_solr) [n:127.0.0.1:45189_solr    ] o.a.s.c.c.ZkStateReader A cluster state change: [WatchedEvent state:SyncConnected type:NodeDataChanged path:/collections/collection/state.json] for collection [collection] has occurred - updating... (live nodes size: [2])
   [junit4]   2> 3042692 INFO  (qtp830337052-36480) [n:127.0.0.1:45189_solr c:collection s:shard1 r:core_node3 x:collection_shard1_replica_n1] o.a.s.c.SolrConfig Using Lucene MatchVersion: 7.2.0
   [junit4]   2> 3042696 INFO  (qtp830337052-36480) [n:127.0.0.1:45189_solr c:collection s:shard1 r:core_node3 x:collection_shard1_replica_n1] o.a.s.s.IndexSchema [collection_shard1_replica_n1] Schema name=minimal
   [junit4]   2> 3042697 INFO  (qtp830337052-36480) [n:127.0.0.1:45189_solr c:collection s:shard1 r:core_node3 x:collection_shard1_replica_n1] o.a.s.s.IndexSchema Loaded schema minimal/1.1 with uniqueid field id
   [junit4]   2> 3042697 INFO  (qtp830337052-36480) [n:127.0.0.1:45189_solr c:collection s:shard1 r:core_node3 x:collection_shard1_replica_n1] o.a.s.c.CoreContainer Creating SolrCore 'collection_shard1_replica_n1' using configuration from collection collection, trusted=true
   [junit4]   2> 3042697 INFO  (qtp830337052-36480) [n:127.0.0.1:45189_solr c:collection s:shard1 r:core_node3 x:collection_shard1_replica_n1] o.a.s.m.r.SolrJmxReporter JMX monitoring for 'solr_45189.solr.core.collection.shard1.replica_n1' (registry 'solr.core.collection.shard1.replica_n1') enabled at server: com.sun.jmx.mbeanserver.JmxMBeanServer@5dba8f95
   [junit4]   2> 3042697 INFO  (qtp830337052-36480) [n:127.0.0.1:45189_solr c:collection s:shard1 r:core_node3 x:collection_shard1_replica_n1] o.a.s.c.SolrCore solr.RecoveryStrategy.Builder
   [junit4]   2> 3042698 INFO  (qtp830337052-36480) [n:127.0.0.1:45189_solr c:collection s:shard1 r:core_node3 x:collection_shard1_replica_n1] o.a.s.c.SolrCore [[collection_shard1_replica_n1] ] Opening new SolrCore at [/home/jenkins/workspace/Lucene-Solr-7.x-Linux/solr/build/solr-core/test/J1/temp/solr.security.PKIAuthenticationIntegrationTest_A710B441DFD3EEE0-001/tempDir-001/node2/collection_shard1_replica_n1], dataDir=[/home/jenkins/workspace/Lucene-Solr-7.x-Linux/solr/build/solr-core/test/J1/temp/solr.security.PKIAuthenticationIntegrationTest_A710B441DFD3EEE0-001/tempDir-001/node2/./collection_shard1_replica_n1/data/]
   [junit4]   2> 3042698 INFO  (qtp1413621076-36479) [n:127.0.0.1:39117_solr c:collection s:shard2 r:core_node4 x:collection_shard2_replica_n2] o.a.s.c.SolrConfig Using Lucene MatchVersion: 7.2.0
   [junit4]   2> 3042703 INFO  (qtp1413621076-36479) [n:127.0.0.1:39117_solr c:collection s:shard2 r:core_node4 x:collection_shard2_replica_n2] o.a.s.s.IndexSchema [collection_shard2_replica_n2] Schema name=minimal
   [junit4]   2> 3042705 INFO  (qtp1413621076-36479) [n:127.0.0.1:39117_solr c:collection s:shard2 r:core_node4 x:collection_shard2_replica_n2] o.a.s.s.IndexSchema Loaded schema minimal/1.1 with uniqueid field id
   [junit4]   2> 3042705 INFO  (qtp1413621076-36479) [n:127.0.0.1:39117_solr c:collection s:shard2 r:core_node4 x:collection_shard2_replica_n2] o.a.s.c.CoreContainer Creating SolrCore 'collection_shard2_replica_n2' using configuration from collection collection, trusted=true
   [junit4]   2> 3042706 INFO  (qtp1413621076-36479) [n:127.0.0.1:39117_solr c:collection s:shard2 r:core_node4 x:collection_shard2_replica_n2] o.a.s.m.r.SolrJmxReporter JMX monitoring for 'solr_39117.solr.core.collection.shard2.replica_n2' (registry 'solr.core.collection.shard2.replica_n2') enabled at server: com.sun.jmx.mbeanserver.JmxMBeanServer@5dba8f95
   [junit4]   2> 3042706 INFO  (qtp1413621076-36479) [n:127.0.0.1:39117_solr c:collection s:shard2 r:core_node4 x:collection_shard2_replica_n2] o.a.s.c.SolrCore solr.RecoveryStrategy.Builder
   [junit4]   2> 3042706 INFO  (qtp1413621076-36479) [n:127.0.0.1:39117_solr c:collection s:shard2 r:core_node4 x:collection_shard2_replica_n2] o.a.s.c.SolrCore [[collection_shard2_replica_n2] ] Opening new SolrCore at [/home/jenkins/workspace/Lucene-Solr-7.x-Linux/solr/build/solr-core/test/J1/temp/solr.security.PKIAuthenticationIntegrationTest_A710B441DFD3EEE0-001/tempDir-001/node1/collection_shard2_replica_n2], dataDir=[/home/jenkins/workspace/Lucene-Solr-7.x-Linux/solr/build/solr-core/test/J1/temp/solr.security.PKIAuthenticationIntegrationTest_A710B441DFD3EEE0-001/tempDir-001/node1/./collection_shard2_replica_n2/data/]
   [junit4]   2> 3042774 INFO  (qtp830337052-36480) [n:127.0.0.1:45189_solr c:collection s:shard1 r:core_node3 x:collection_shard1_replica_n1] o.a.s.u.UpdateHandler Using UpdateLog implementation: org.apache.solr.update.UpdateLog
   [junit4]   2> 3042774 INFO  (qtp830337052-36480) [n:127.0.0.1:45189_solr c:collection s:shard1 r:core_node3 x:collection_shard1_replica_n1] o.a.s.u.UpdateLog Initializing UpdateLog: dataDir=null defaultSyncLevel=FLUSH numRecordsToKeep=100 maxNumLogsToKeep=10 numVersionBuckets=65536
   [junit4]   2> 3042775 INFO  (qtp830337052-36480) [n:127.0.0.1:45189_solr c:collection s:shard1 r:core_node3 x:collection_shard1_replica_n1] o.a.s.u.CommitTracker Hard AutoCommit: disabled
   [junit4]   2> 3042775 INFO  (qtp830337052-36480) [n:127.0.0.1:45189_solr c:collection s:shard1 r:core_node3 x:collection_shard1_replica_n1] o.a.s.u.CommitTracker Soft AutoCommit: disabled
   [junit4]   2> 3042776 INFO  (qtp830337052-36480) [n:127.0.0.1:45189_solr c:collection s:shard1 r:core_node3 x:collection_shard1_replica_n1] o.a.s.s.SolrIndexSearcher Opening [Searcher@515bd10f[collection_shard1_replica_n1] main]
   [junit4]   2> 3042777 INFO  (qtp830337052-36480) [n:127.0.0.1:45189_solr c:collection s:shard1 r:core_node3 x:collection_shard1_replica_n1] o.a.s.r.ManagedResourceStorage Configured ZooKeeperStorageIO with znodeBase: /configs/conf
   [junit4]   2> 3042777 INFO  (qtp830337052-36480) [n:127.0.0.1:45189_solr c:collection s:shard1 r:core_node3 x:collection_shard1_replica_n1] o.a.s.r.ManagedResourceStorage Loaded null at path _rest_managed.json using ZooKeeperStorageIO:path=/configs/conf
   [junit4]   2> 3042777 INFO  (qtp830337052-36480) [n:127.0.0.1:45189_solr c:collection s:shard1 r:core_node3 x:collection_shard1_replica_n1] o.a.s.h.ReplicationHandler Commits will be reserved for 10000ms.
   [junit4]   2> 3042778 INFO  (qtp830337052-36480) [n:127.0.0.1:45189_solr c:collection s:shard1 r:core_node3 x:collection_shard1_replica_n1] o.a.s.u.UpdateLog Could not find max version in index or recent updates, using new clock 1584963506817466368
   [junit4]   2> 3042778 INFO  (searcherExecutor-12075-thread-1-processing-n:127.0.0.1:45189_solr x:collection_shard1_replica_n1 s:shard1 c:collection r:core_node3) [n:127.0.0.1:45189_solr c:collection s:shard1 r:core_node3 x:collection_shard1_replica_n1] o.a.s.c.SolrCore [collection_shard1_replica_n1] Registered new searcher Searcher@515bd10f[collection_shard1_replica_n1] main{ExitableDirectoryReader(UninvertingDirectoryReader())}
   [junit4]   2> 3042780 INFO  (qtp830337052-36480) [n:127.0.0.1:45189_solr c:collection s:shard1 r:core_node3 x:collection_shard1_replica_n1] o.a.s.c.ShardLeaderElectionContext Enough replicas found to continue.
   [junit4]   2> 3042780 INFO  (qtp830337052-36480) [n:127.0.0.1:45189_solr c:collection s:shard1 r:core_node3 x:collection_shard1_replica_n1] o.a.s.c.ShardLeaderElectionContext I may be the new leader - try and sync
   [junit4]   2> 3042780 INFO  (qtp830337052-36480) [n:127.0.0.1:45189_solr c:collection s:shard1 r:core_node3 x:collection_shard1_replica_n1] o.a.s.c.SyncStrategy Sync replicas to https://127.0.0.1:45189/solr/collection_shard1_replica_n1/
   [junit4]   2> 3042780 INFO  (qtp830337052-36480) [n:127.0.0.1:45189_solr c:collection s:shard1 r:core_node3 x:collection_shard1_replica_n1] o.a.s.c.SyncStrategy Sync Success - now sync replicas to me
   [junit4]   2> 3042780 INFO  (qtp830337052-36480) [n:127.0.0.1:45189_solr c:collection s:shard1 r:core_node3 x:collection_shard1_replica_n1] o.a.s.c.SyncStrategy https://127.0.0.1:45189/solr/collection_shard1_replica_n1/ has no replicas
   [junit4]   2> 3042780 INFO  (qtp830337052-36480) [n:127.0.0.1:45189_solr c:collection s:shard1 r:core_node3 x:collection_shard1_replica_n1] o.a.s.c.ShardLeaderElectionContext Found all replicas participating in election, clear LIR
   [junit4]   2> 3042781 INFO  (qtp830337052-36480) [n:127.0.0.1:45189_solr c:collection s:shard1 r:core_node3 x:collection_shard1_replica_n1] o.a.s.c.ShardLeaderElectionContext I am the new leader: https://127.0.0.1:45189/solr/collection_shard1_replica_n1/ shard1
   [junit4]   2> 3042788 INFO  (qtp1413621076-36479) [n:127.0.0.1:39117_solr c:collection s:shard2 r:core_node4 x:collection_shard2_replica_n2] o.a.s.u.UpdateHandler Using UpdateLog implementation: org.apache.solr.update.UpdateLog
   [junit4]   2> 3042788 INFO  (qtp1413621076-36479) [n:127.0.0.1:39117_solr c:collection s:shard2 r:core_node4 x:collection_shard2_replica_n2] o.a.s.u.UpdateLog Initializing UpdateLog: dataDir=null defaultSyncLevel=FLUSH numRecordsToKeep=100 maxNumLogsToKeep=10 numVersionBuckets=65536
   [junit4]   2> 3042790 INFO  (qtp1413621076-36479) [n:127.0.0.1:39117_solr c:collection s:shard2 r:core_node4 x:collection_shard2_replica_n2] o.a.s.u.CommitTracker Hard AutoCommit: disabled
   [junit4]   2> 3042790 INFO  (qtp1413621076-36479) [n:127.0.0.1:39117_solr c:collection s:shard2 r:core_node4 x:collection_shard2_replica_n2] o.a.s.u.CommitTracker Soft AutoCommit: disabled
   [junit4]   2> 3042791 INFO  (qtp1413621076-36479) [n:127.0.0.1:39117_solr c:collection s:shard2 r:core_node4 x:collection_shard2_replica_n2] o.a.s.s.SolrIndexSearcher Opening [Searcher@2e4a06d2[collection_shard2_replica_n2] main]
   [junit4]   2> 3042791 INFO  (qtp1413621076-36479) [n:127.0.0.1:39117_solr c:collection s:shard2 r:core_node4 x:collection_shard2_replica_n2] o.a.s.r.ManagedResourceStorage Configured ZooKeeperStorageIO with znodeBase: /configs/conf
   [junit4]   2> 3042792 INFO  (qtp1413621076-36479) [n:127.0.0.1:39117_solr c:collection s:shard2 r:core_node4 x:collection_shard2_replica_n2] o.a.s.r.ManagedResourceStorage Loaded null at path _rest_managed.json using ZooKeeperStorageIO:path=/configs/conf
   [junit4]   2> 3042792 INFO  (qtp1413621076-36479) [n:127.0.0.1:39117_solr c:collection s:shard2 r:core_node4 x:collection_shard2_replica_n2] o.a.s.h.ReplicationHandler Commits will be reserved for 10000ms.
   [junit4]   2> 3042792 INFO  (searcherExecutor-12076-thread-1-processing-n:127.0.0.1:39117_solr x:collection_shard2_replica_n2 s:shard2 c:collection r:core_node4) [n:127.0.0.1:39117_solr c:collection s:shard2 r:core_node4 x:collection_shard2_replica_n2] o.a.s.c.SolrCore [collection_shard2_replica_n2] Registered new searcher Searcher@2e4a06d2[collection_shard2_replica_n2] main{ExitableDirectoryReader(UninvertingDirectoryReader())}
   [junit4]   2> 3042793 INFO  (qtp1413621076-36479) [n:127.0.0.1:39117_solr c:collection s:shard2 r:core_node4 x:collection_shard2_replica_n2] o.a.s.u.UpdateLog Could not find max version in index or recent updates, using new clock 1584963506833195008
   [junit4]   2> 3042795 INFO  (qtp1413621076-36479) [n:127.0.0.1:39117_solr c:collection s:shard2 r:core_node4 x:collection_shard2_replica_n2] o.a.s.c.ShardLeaderElectionContext Enough replicas found to continue.
   [junit4]   2> 3042795 INFO  (qtp1413621076-36479) [n:127.0.0.1:39117_solr c:collection s:shard2 r:core_node4 x:collection_shard2_replica_n2] o.a.s.c.ShardLeaderElectionContext I may be the new leader - try and sync
   [junit4]   2> 3042795 INFO  (qtp1413621076-36479) [n:127.0.0.1:39117_solr c:collection s:shard2 r:core_node4 x:collection_shard2_replica_n2] o.a.s.c.SyncStrategy Sync replicas to https://127.0.0.1:39117/solr/collection_shard2_replica_n2/
   [junit4]   2> 3042795 INFO  (qtp1413621076-36479) [n:127.0.0.1:39117_solr c:collection s:shard2 r:core_node4 x:collection_shard2_replica_n2] o.a.s.c.SyncStrategy Sync Success - now sync replicas to me
   [junit4]   2> 3042795 INFO  (qtp1413621076-36479) [n:127.0.0.1:39117_solr c:collection s:shard2 r:core_node4 x:collection_shard2_replica_n2] o.a.s.c.SyncStrategy https://127.0.0.1:39117/solr/collection_shard2_replica_n2/ has no replicas
   [junit4]   2> 3042795 INFO  (qtp1413621076-36479) [n:127.0.0.1:39117_solr c:collection s:shard2 r:core_node4 x:collection_shard2_replica_n2] o.a.s.c.ShardLeaderElectionContext Found all replicas participating in election, clear LIR
   [junit4]   2> 3042796 INFO  (qtp1413621076-36479) [n:127.0.0.1:39117_solr c:collection s:shard2 r:core_node4 x:collection_shard2_replica_n2] o.a.s.c.ShardLeaderElectionContext I am the new leader: https://127.0.0.1:39117/solr/collection_shard2_replica_n2/ shard2
   [junit4]   2> 3221377 ERROR (qtp830337052-36478) [n:127.0.0.1:45189_solr    ] o.a.s.h.RequestHandlerBase org.apache.solr.common.SolrException: create the collection time out:180s
   [junit4]   2> 	at org.apache.solr.handler.admin.CollectionsHandler.handleResponse(CollectionsHandler.java:312)
   [junit4]   2> 	at org.apache.solr.handler.admin.CollectionsHandler.invokeAction(CollectionsHandler.java:244)
   [junit4]   2> 	at org.apache.solr.handler.admin.CollectionsHandler.handleRequestBody(CollectionsHandler.java:222)
   [junit4]   2> 	at org.apache.solr.handler.RequestHandlerBase.handleRequest(RequestHandlerBase.java:177)
   [junit4]   2> 	at org.apache.solr.servlet.HttpSolrCall.handleAdmin(HttpSolrCall.java:735)
   [junit4]   2> 	at org.apache.solr.servlet.HttpSolrCall.handleAdminRequest(HttpSolrCall.java:716)
   [junit4]   2> 	at org.apache.solr.servlet.HttpSolrCall.call(HttpSolrCall.java:497)
   [junit4]   2> 	at org.apache.solr.servlet.SolrDispatchFilter.doFilter(SolrDispatchFilter.java:382)
   [junit4]   2> 	at org.apache.solr.servlet.SolrDispatchFilter.doFilter(SolrDispatchFilter.java:326)
   [junit4]   2> 	at org.eclipse.jetty.servlet.ServletHandler$CachedChain.doFilter(ServletHandler.java:1759)
   [junit4]   2> 	at org.apache.solr.client.solrj.embedded.JettySolrRunner$DebugFilter.doFilter(JettySolrRunner.java:139)
   [junit4]   2> 	at org.eclipse.jetty.servlet.ServletHandler$CachedChain.doFilter(ServletHandler.java:1759)
   [junit4]   2> 	at org.eclipse.jetty.servlet.ServletHandler.doHandle(ServletHandler.java:582)
   [junit4]   2> 	at org.eclipse.jetty.server.session.SessionHandler.doHandle(SessionHandler.java:224)
   [junit4]   2> 	at org.eclipse.jetty.server.handler.ContextHandler.doHandle(ContextHandler.java:1180)
   [junit4]   2> 	at org.eclipse.jetty.servlet.ServletHandler.doScope(ServletHandler.java:512)
   [junit4]   2> 	at org.eclipse.jetty.server.session.SessionHandler.doScope(SessionHandler.java:185)
   [junit4]   2> 	at org.eclipse.jetty.server.handler.ContextHandler.doScope(ContextHandler.java:1112)
   [junit4]   2> 	at org.eclipse.jetty.server.handler.ScopedHandler.handle(ScopedHandler.java:141)
   [junit4]   2> 	at org.eclipse.jetty.server.handler.gzip.GzipHandler.handle(GzipHandler.java:493)
   [junit4]   2> 	at org.eclipse.jetty.server.handler.HandlerWrapper.handle(HandlerWrapper.java:134)
   [junit4]   2> 	at org.eclipse.jetty.server.Server.handle(Server.java:534)
   [junit4]   2> 	at org.eclipse.jetty.server.HttpChannel.handle(HttpChannel.java:320)
   [junit4]   2> 	at org.eclipse.jetty.server.HttpConnection.onFillable(HttpConnection.java:251)
   [junit4]   2> 	at org.eclipse.jetty.io.AbstractConnection$ReadCallback.succeeded(AbstractConnection.java:283)
   [junit4]   2> 	at org.eclipse.jetty.io.FillInterest.fillable(FillInterest.java:108)
   [junit4]   2> 	at org.eclipse.jetty.io.ssl.SslConnection.onFillable(SslConnection.java:251)
   [junit4]   2> 	at org.eclipse.jetty.io.AbstractConnection$ReadCallback.succeeded(AbstractConnection.java:283)
   [junit4]   2> 	at org.eclipse.jetty.io.FillInterest.fillable(FillInterest.java:108)
   [junit4]   2> 	at org.eclipse.jetty.io.SelectChannelEndPoint$2.run(SelectChannelEndPoint.java:93)
   [junit4]   2> 	at org.eclipse.jetty.util.thread.strategy.ExecuteProduceConsume.executeProduceConsume(ExecuteProduceConsume.java:303)
   [junit4]   2> 	at org.eclipse.jetty.util.thread.strategy.ExecuteProduceConsume.produceConsume(ExecuteProduceConsume.java:148)
   [junit4]   2> 	at org.eclipse.jetty.util.thread.strategy.ExecuteProduceConsume.run(ExecuteProduceConsume.java:136)
   [junit4]   2> 	at org.eclipse.jetty.util.thread.QueuedThreadPool.runJob(QueuedThreadPool.java:671)
   [junit4]   2> 	at org.eclipse.jetty.util.thread.QueuedThreadPool$2.run(QueuedThreadPool.java:589)
   [junit4]   2> 	at java.base/java.lang.Thread.run(Thread.java:844)
   [junit4]   2> 
   [junit4]   2> 3221378 INFO  (qtp830337052-36478) [n:127.0.0.1:45189_solr    ] o.a.s.s.HttpSolrCall [admin] webapp=null path=/admin/collections params={replicationFactor=1&collection.configName=conf&name=collection&nrtReplicas=1&action=CREATE&numShards=2&wt=javabin&version=2} status=500 QTime=180003
   [junit4]   2> 3221378 ERROR (qtp830337052-36478) [n:127.0.0.1:45189_solr    ] o.a.s.s.HttpSolrCall null:org.apache.solr.common.SolrException: create the collection time out:180s
   [junit4]   2> 	at org.apache.solr.handler.admin.CollectionsHandler.handleResponse(CollectionsHandler.java:312)
   [junit4]   2> 	at org.apache.solr.handler.admin.CollectionsHandler.invokeAction(CollectionsHandler.java:244)
   [junit4]   2> 	at org.apache.solr.handler.admin.CollectionsHandler.handleRequestBody(CollectionsHandler.java:222)
   [junit4]   2> 	at org.apache.solr.handler.RequestHandlerBase.handleRequest(RequestHandlerBase.java:177)
   [junit4]   2> 	at org.apache.solr.servlet.HttpSolrCall.handleAdmin(HttpSolrCall.java:735)
   [junit4]   2> 	at org.apache.solr.servlet.HttpSolrCall.handleAdminRequest(HttpSolrCall.java:716)
   [junit4]   2> 	at org.apache.solr.servlet.HttpSolrCall.call(HttpSolrCall.java:497)
   [junit4]   2> 	at org.apache.solr.servlet.SolrDispatchFilter.doFilter(SolrDispatchFilter.java:382)
   [junit4]   2> 	at org.apache.solr.servlet.SolrDispatchFilter.doFilter(SolrDispatchFilter.java:326)
   [junit4]   2> 	at org.eclipse.jetty.servlet.ServletHandler$CachedChain.doFilter(ServletHandler.java:1759)
   [junit4]   2> 	at org.apache.solr.client.solrj.embedded.JettySolrRunner$DebugFilter.doFilter(JettySolrRunner.java:139)
   [junit4]   2> 	at org.eclipse.jetty.servlet.ServletHandler$CachedChain.doFilter(ServletHandler.java:1759)
   [junit4]   2> 	at org.eclipse.jetty.servlet.ServletHandler.doHandle(ServletHandler.java:582)
   [junit4]   2> 	at org.eclipse.jetty.server.session.SessionHandler.doHandle(SessionHandler.java:224)
   [junit4]   2> 	at org.eclipse.jetty.server.handler.ContextHandler.doHandle(ContextHandler.java:1180)
   [junit4]   2> 	at org.eclipse.jetty.servlet.ServletHandler.doScope(ServletHandler.java:512)
   [junit4]   2> 	at org.eclipse.jetty.server.session.SessionHandler.doScope(SessionHandler.java:185)
   [junit4]   2> 	at org.eclipse.jetty.server.handler.ContextHandler.doScope(ContextHandler.java:1112)
   [junit4]   2> 	at org.eclipse.jetty.server.handler.ScopedHandler.handle(ScopedHandler.java:141)
   [junit4]   2> 	at org.eclipse.jetty.server.handler.gzip.GzipHandler.handle(GzipHandler.java:493)
   [junit4]   2> 	at org.eclipse.jetty.server.handler.HandlerWrapper.handle(HandlerWrapper.java:134)
   [junit4]   2> 	at org.eclipse.jetty.server.Server.handle(Server.java:534)
   [junit4]   2> 	at org.eclipse.jetty.server.HttpChannel.handle(HttpChannel.java:320)
   [junit4]   2> 	at org.eclipse.jetty.server.HttpConnection.onFillable(HttpConnection.java:251)
   [junit4]   2> 	at org.eclipse.jetty.io.AbstractConnection$ReadCallback.succeeded(AbstractConnection.java:283)
   [junit4]   2> 	at org.eclipse.jetty.io.FillInterest.fillable(FillInterest.java:108)
   [junit4]   2> 	at org.eclipse.jetty.io.ssl.SslConnection.onFillable(SslConnection.java:251)
   [junit4]   2> 	at org.eclipse.jetty.io.AbstractConnection$ReadCallback.succeeded(AbstractConnection.java:283)
   [junit4]   2> 	at org.eclipse.jetty.io.FillInterest.fillable(FillInterest.java:108)
   [junit4]   2> 	at org.eclipse.jetty.io.SelectChannelEndPoint$2.run(SelectChannelEndPoint.java:93)
   [junit4]   2> 	at org.eclipse.jetty.util.thread.strategy.ExecuteProduceConsume.executeProduceConsume(ExecuteProduceConsume.java:303)
   [junit4]   2> 	at org.eclipse.jetty.util.thread.strategy.ExecuteProduceConsume.produceConsume(ExecuteProduceConsume.java:148)
   [junit4]   2> 	at org.eclipse.jetty.util.thread.strategy.ExecuteProduceConsume.run(ExecuteProduceConsume.java:136)
   [junit4]   2> 	at org.eclipse.jetty.util.thread.QueuedThreadPool.runJob(QueuedThreadPool.java:671)
   [junit4]   2> 	at org.eclipse.jetty.util.thread.QueuedThreadPool$2.run(QueuedThreadPool.java:589)
   [junit4]   2> 	at java.base/java.lang.Thread.run(Thread.java:844)
   [junit4]   2> 
   [junit4]   2> 3221385 INFO  (TEST-PKIAuthenticationIntegrationTest.testPkiAuth-seed#[A710B441DFD3EEE0]) [    ] o.a.s.SolrTestCaseJ4 ###Ending testPkiAuth
   [junit4]   2> NOTE: reproduce with: ant test  -Dtestcase=PKIAuthenticationIntegrationTest -Dtests.method=testPkiAuth -Dtests.seed=A710B441DFD3EEE0 -Dtests.multiplier=3 -Dtests.slow=true -Dtests.locale=gsw-CH -Dtests.timezone=America/Dawson_Creek -Dtests.asserts=true -Dtests.file.encoding=UTF-8
   [junit4] ERROR    180s J1 | PKIAuthenticationIntegrationTest.testPkiAuth <<<
   [junit4]    > Throwable #1: org.apache.solr.client.solrj.impl.HttpSolrClient$RemoteSolrException: Error from server at https://127.0.0.1:45189/solr: create the collection time out:180s
   [junit4]    > 	at __randomizedtesting.SeedInfo.seed([A710B441DFD3EEE0:97AE2D103F656941]:0)
   [junit4]    > 	at org.apache.solr.client.solrj.impl.HttpSolrClient.executeMethod(HttpSolrClient.java:643)
   [junit4]    > 	at org.apache.solr.client.solrj.impl.HttpSolrClient.request(HttpSolrClient.java:255)
   [junit4]    > 	at org.apache.solr.client.solrj.impl.HttpSolrClient.request(HttpSolrClient.java:244)
   [junit4]    > 	at org.apache.solr.client.solrj.impl.LBHttpSolrClient.doRequest(LBHttpSolrClient.java:483)
   [junit4]    > 	at org.apache.solr.client.solrj.impl.LBHttpSolrClient.request(LBHttpSolrClient.java:413)
   [junit4]    > 	at org.apache.solr.client.solrj.impl.CloudSolrClient.sendRequest(CloudSolrClient.java:1103)
   [junit4]    > 	at org.apache.solr.client.solrj.impl.CloudSolrClient.requestWithRetryOnStaleState(CloudSolrClient.java:883)
   [junit4]    > 	at org.apache.solr.client.solrj.impl.CloudSolrClient.request(CloudSolrClient.java:816)
   [junit4]    > 	at org.apache.solr.client.solrj.SolrRequest.process(SolrRequest.java:194)
   [junit4]    > 	at org.apache.solr.client.solrj.SolrRequest.process(SolrRequest.java:211)
   [junit4]    > 	at org.apache.solr.security.PKIAuthenticationIntegrationTest.testPkiAuth(PKIAuthenticationIntegrationTest.java:58)
   [junit4]    > 	at java.base/jdk.internal.reflect.NativeMethodAccessorImpl.invoke0(Native Method)
   [junit4]    > 	at java.base/jdk.internal.reflect.NativeMethodAccessorImpl.invoke(NativeMethodAccessorImpl.java:62)
   [junit4]    > 	at java.base/jdk.internal.reflect.DelegatingMethodAccessorImpl.invoke(DelegatingMethodAccessorImpl.java:43)
   [junit4]    > 	at java.base/java.lang.reflect.Method.invoke(Method.java:564)
   [junit4]    > 	at java.base/java.lang.Thread.run(Thread.java:844)
   [junit4]   2> 3221390 INFO  (jetty-closer-6266-thread-2) [    ] o.e.j.s.AbstractConnector Stopped ServerConnector@6c3ae3ea{SSL,[ssl, http/1.1]}{127.0.0.1:0}
   [junit4]   2> 3221391 INFO  (jetty-closer-6266-thread-2) [    ] o.a.s.c.CoreContainer Shutting down CoreContainer instance=4874807
   [junit4]   2> 3221391 INFO  (jetty-closer-6266-thread-1) [    ] o.e.j.s.AbstractConnector Stopped ServerConnector@2e5c8e3b{SSL,[ssl, http/1.1]}{127.0.0.1:0}
   [junit4]   2> 3221391 INFO  (jetty-closer-6266-thread-2) [    ] o.a.s.m.SolrMetricManager Closing metric reporters for registry=solr.node, tag=null
   [junit4]   2> 3221392 INFO  (jetty-closer-6266-thread-1) [    ] o.a.s.c.CoreContainer Shutting down CoreContainer instance=424950164
   [junit4]   2> 3221392 INFO  (jetty-closer-6266-thread-2) [    ] o.a.s.m.r.SolrJmxReporter Closing reporter [org.apache.solr.metrics.reporters.SolrJmxReporter@1c89bc96: rootName = solr_45189, domain = solr.node, service url = null, agent id = null] for registry solr.node / com.codahale.metrics.MetricRegistry@52f89bce
   [junit4]   2> 3221392 INFO  (jetty-closer-6266-thread-1) [    ] o.a.s.m.SolrMetricManager Closing metric reporters for registry=solr.node, tag=null
   [junit4]   2> 3221391 ERROR (OverseerThreadFactory-12070-thread-1-processing-n:127.0.0.1:39117_solr) [n:127.0.0.1:39117_solr    ] o.a.s.c.OverseerCollectionMessageHandler Error from shard: https://127.0.0.1:45189/solr
   [junit4]   2> org.apache.solr.client.solrj.SolrServerException: IOException occured when talking to server at: https://127.0.0.1:45189/solr
   [junit4]   2> 	at org.apache.solr.client.solrj.impl.HttpSolrClient.executeMethod(HttpSolrClient.java:657)
   [junit4]   2> 	at org.apache.solr.client.solrj.impl.HttpSolrClient.request(HttpSolrClient.java:255)
   [junit4]   2> 	at org.apache.solr.client.solrj.impl.HttpSolrClient.request(HttpSolrClient.java:244)
   [junit4]   2> 	at org.apache.solr.client.solrj.SolrClient.request(SolrClient.java:1219)
   [junit4]   2> 	at org.apache.solr.handler.component.HttpShardHandler.lambda$submit$0(HttpShardHandler.java:172)
   [junit4]   2> 	at java.base/java.util.concurrent.FutureTask.run(FutureTask.java:264)
   [junit4]   2> 	at java.base/java.util.concurrent.Executors$RunnableAdapter.call(Executors.java:514)
   [junit4]   2> 	at java.base/java.util.concurrent.FutureTask.run(FutureTask.java:264)
   [junit4]   2> 	at com.codahale.metrics.InstrumentedExecutorService$InstrumentedRunnable.run(InstrumentedExecutorService.java:176)
   [junit4]   2> 	at org.apache.solr.common.util.ExecutorUtil$MDCAwareThreadPoolExecutor.lambda$execute$0(ExecutorUtil.java:188)
   [junit4]   2> 	at java.base/java.util.concurrent.ThreadPoolExecutor.runWorker(ThreadPoolExecutor.java:1167)
   [junit4]   2> 	at java.base/java.util.concurrent.ThreadPoolExecutor$Worker.run(ThreadPoolExecutor.java:641)
   [junit4]   2> 	at java.base/java.lang.Thread.run(Thread.java:844)
   [junit4]   2> Caused by: org.apache.http.NoHttpResponseException: 127.0.0.1:45189 failed to respond
   [junit4]   2> 	at org.apache.http.impl.conn.DefaultHttpResponseParser.parseHead(DefaultHttpResponseParser.java:141)
   [junit4]   2> 	at org.apache.http.impl.conn.DefaultHttpResponseParser.parseHead(DefaultHttpResponseParser.java:56)
   [junit4]   2> 	at org.apache.http.impl.io.AbstractMessageParser.parse(AbstractMessageParser.java:259)
   [junit4]   2> 	at org.apache.http.impl.DefaultBHttpClientConnection.receiveResponseHeader(DefaultBHttpClientConnection.java:163)
   [junit4]   2> 	at org.apache.http.impl.conn.CPoolProxy.receiveResponseHeader(CPoolProxy.java:165)
   [junit4]   2> 	at org.apache.http.protocol.HttpRequestExecutor.doReceiveResponse(HttpRequestExecutor.java:273)
   [junit4]   2> 	at org.apache.http.protocol.HttpRequestExecutor.execute(HttpRequestExecutor.java:125)
   [junit4]   2> 	at org.apache.solr.util.stats.InstrumentedHttpRequestExecutor.execute(InstrumentedHttpRequestExecutor.java:118)
   [junit4]   2> 	at org.apache.http.impl.execchain.MainClientExec.execute(MainClientExec.java:272)
   [junit4]   2> 	at org.apache.http.impl.execchain.ProtocolExec.execute(ProtocolExec.java:185)
   [junit4]   2> 	at org.apache.http.impl.execchain.RetryExec.execute(RetryExec.java:89)
   [junit4]   2> 	at org.apache.http.impl.execchain.RedirectExec.execute(RedirectExec.java:111)
   [junit4]   2> 	at org.apache.http.impl.client.InternalHttpClient.doExecute(InternalHttpClient.java:185)
   [junit4]   2> 	at org.apache.http.impl.client.CloseableHttpClient.execute(CloseableHttpClient.java:83)
   [junit4]   2> 	at org.apache.http.impl.client.CloseableHttpClient.execute(CloseableHttpClient.java:56)
   [junit4]   2> 	at org.apache.solr.client.solrj.impl.HttpSolrClient.executeMethod(HttpSolrClient.java:542)
   [junit4]   2> 	... 12 more
   [junit4]   2> 3221392 INFO  (jetty-closer-6266-thread-1) [    ] o.a.s.m.r.SolrJmxReporter Closing reporter [org.apache.solr.metrics.reporters.SolrJmxReporter@72925596: rootName = solr_39117, domain = solr.node, service url = null, agent id = null] for registry solr.node / com.codahale.metrics.MetricRegistry@15563703
   [junit4]   2> 3221393 ERROR (OverseerThreadFactory-12070-thread-1-processing-n:127.0.0.1:39117_solr) [n:127.0.0.1:39117_solr    ] o.a.s.c.OverseerCollectionMessageHandler Error from shard: https://127.0.0.1:39117/solr
   [junit4]   2> org.apache.solr.client.solrj.SolrServerException: IOException occured when talking to server at: https://127.0.0.1:39117/solr
   [junit4]   2> 	at org.apache.solr.client.solrj.impl.HttpSolrClient.executeMethod(HttpSolrClient.java:657)
   [junit4]   2> 	at org.apache.solr.client.solrj.impl.HttpSolrClient.request(HttpSolrClient.java:255)
   [junit4]   2> 	at org.apache.solr.client.solrj.impl.HttpSolrClient.request(HttpSolrClient.java:244)
   [junit4]   2> 	at org.apache.solr.client.solrj.SolrClient.request(SolrClient.java:1219)
   [junit4]   2> 	at org.apache.solr.handler.component.HttpShardHandler.lambda$submit$0(HttpShardHandler.java:172)
   [junit4]   2> 	at java.base/java.util.concurrent.FutureTask.run(FutureTask.java:264)
   [junit4]   2> 	at java.base/java.util.concurrent.Executors$RunnableAdapter.call(Executors.java:514)
   [junit4]   2> 	at java.base/java.util.concurrent.FutureTask.run(FutureTask.java:264)
   [junit4]   2> 	at com.codahale.metrics.InstrumentedExecutorService$InstrumentedRunnable.run(InstrumentedExecutorService.java:176)
   [junit4]   2> 	at org.apache.solr.common.util.ExecutorUtil$MDCAwareThreadPoolExecutor.lambda$execute$0(ExecutorUtil.java:188)
   [junit4]   2> 	at java.base/java.util.concurrent.ThreadPoolExecutor.runWorker(ThreadPoolExecutor.java:1167)
   [junit4]   2> 	at java.base/java.util.concurrent.ThreadPoolExecutor$Worker.run(ThreadPoolExecutor.java:641)
   [junit4]   2> 	at java.base/java.lang.Thread.run(Thread.java:844)
   [junit4]   2> Caused by: org.apache.http.NoHttpResponseException: 127.0.0.1:39117 failed to respond
   [junit4]   2> 	at org.apache.http.impl.conn.DefaultHttpResponseParser.parseHead(DefaultHttpResponseParser.java:141)
   [junit4]   2> 	at org.apache.http.impl.conn.DefaultHttpResponseParser.parseHead(DefaultHttpResponseParser.java:56)
   [junit4]   2> 	at org.apache.http.impl.io.AbstractMessageParser.parse(AbstractMessageParser.java:259)
   [junit4]   2> 	at org.apache.http.impl.DefaultBHttpClientConnection.receiveResponseHeader(DefaultBHttpClientConnection.java:163)
   [junit4]   2> 	at org.apache.http.impl.conn.CPoolProxy.receiveResponseHeader(CPoolProxy.java:165)
   [junit4]   2> 	at org.apache.http.protocol.HttpRequestExecutor.doReceiveResponse(HttpRequestExecutor.java:273)
   [junit4]   2> 	at org.apache.http.protocol.HttpRequestExecutor.execute(HttpRequestExecutor.java:125)
   [junit4]   2> 	at org.apache.solr.util.stats.InstrumentedHttpRequestExecutor.execute(InstrumentedHttpRequestExecutor.java:118)
   [junit4]   2> 	at org.apache.http.impl.execchain.MainClientExec.execute(MainClientExec.java:272)
   [junit4]   2> 	at org.apache.http.impl.execchain.ProtocolExec.execute(ProtocolExec.java:185)
   [junit4]   2> 	at org.apache.http.impl.execchain.RetryExec.execute(RetryExec.java:89)
   [junit4]   2> 	at org.apache.http.impl.execchain.RedirectExec.execute(RedirectExec.java:111)
   [junit4]   2> 	at org.apache.http.impl.client.InternalHttpClient.doExecute(InternalHttpClient.java:185)
   [junit4]   2> 	at org.apache.http.impl.client.CloseableHttpClient.execute(CloseableHttpClient.java:83)
   [junit4]   2> 	at org.apache.http.impl.client.CloseableHttpClient.execute(CloseableHttpClient.java:56)
   [junit4]   2> 	at org.apache.solr.client.solrj.impl.HttpSolrClient.executeMethod(HttpSolrClient.java:542)
   [junit4]   2> 	... 12 more
   [junit4]   2> 3221395 ERROR (OverseerThreadFactory-12070-thread-1-processing-n:127.0.0.1:39117_solr) [n:127.0.0.1:39117_solr    ] o.a.s.c.OverseerCollectionMessageHandler Cleaning up collection [collection].
   [junit4]   2> 3221396 INFO  (OverseerThreadFactory-12070-thread-1-processing-n:127.0.0.1:39117_solr) [n:127.0.0.1:39117_solr    ] o.a.s.c.OverseerCollectionMessageHandler Executing Collection Cmd : action=UNLOAD&deleteInstanceDir=true&deleteDataDir=true
   [junit4]   2> 3221396 ERROR (OverseerThreadFactory-12070-thread-1-processing-n:127.0.0.1:39117_solr) [n:127.0.0.1:39117_solr    ] o.a.s.c.OverseerCollectionMessageHandler Error from shard: https://127.0.0.1:39117/solr
   [junit4]   2> org.apache.solr.client.solrj.SolrServerException: Server refused connection at: https://127.0.0.1:39117/solr
   [junit4]   2> 	at org.apache.solr.client.solrj.impl.HttpSolrClient.executeMethod(HttpSolrClient.java:650)
   [junit4]   2> 	at org.apache.solr.client.solrj.impl.HttpSolrClient.request(HttpSolrClient.java:255)
   [junit4]   2> 	at org.apache.solr.client.solrj.impl.HttpSolrClient.request(HttpSolrClient.java:244)
   [junit4]   2> 	at org.apache.solr.client.solrj.SolrClient.request(SolrClient.java:1219)
   [junit4]   2> 	at org.apache.solr.handler.component.HttpShardHandler.lambda$submit$0(HttpShardHandler.java:172)
   [junit4]   2> 	at java.base/java.util.concurrent.FutureTask.run(FutureTask.java:264)
   [junit4]   2> 	at java.base/java.util.concurrent.Executors$RunnableAdapter.call(Executors.java:514)
   [junit4]   2> 	at java.base/java.util.concurrent.FutureTask.run(FutureTask.java:264)
   [junit4]   2> 	at com.codahale.metrics.InstrumentedExecutorService$InstrumentedRunnable.run(InstrumentedExecutorService.java:176)
   [junit4]   2> 	at org.apache.solr.common.util.ExecutorUtil$MDCAwareThreadPoolExecutor.lambda$execute$0(ExecutorUtil.java:188)
   [junit4]   2> 	at java.base/java.util.concurrent.ThreadPoolExecutor.runWorker(ThreadPoolExecutor.java:1167)
   [junit4]   2> 	at java.base/java.util.concurrent.ThreadPoolExecutor$Worker.run(ThreadPoolExecutor.java:641)
   [junit4]   2> 	at java.base/java.lang.Thread.run(Thread.java:844)
   [junit4]   2> Caused by: org.apache.http.conn.HttpHostConnectException: Connect to 127.0.0.1:39117 [/127.0.0.1] failed: Connection refused (Connection refused)
   [junit4]   2> 	at org.apache.http.impl.conn.DefaultHttpClientConnectionOperator.connect(DefaultHttpClientConnectionOperator.java:159)
   [junit4]   2> 	at org.apache.http.impl.conn.PoolingHttpClientConnectionManager.connect(PoolingHttpClientConnectionManager.java:359)
   [junit4]   2> 	at org.apache.http.impl.execchain.MainClientExec.establishRoute(MainClientExec.java:381)
   [junit4]   2> 	at org.apache.http.impl.execchain.MainClientExec.execute(MainClientExec.java:237)
   [junit4]   2> 	at org.apache.http.impl.execchain.ProtocolExec.execute(ProtocolExec.java:185)
   [junit4]   2> 	at org.apache.http.impl.execchain.RetryExec.execute(RetryExec.java:89)
   [junit4]   2> 	at org.apache.http.impl.execchain.RedirectExec.execute(RedirectExec.java:111)
   [junit4]   2> 	at org.apache.http.impl.client.InternalHttpClient.doExecute(InternalHttpClient.java:185)
   [junit4]   2> 	at org.apache.http.impl.client.CloseableHttpClient.execute(CloseableHttpClient.java:83)
   [junit4]   2> 	at org.apache.http.impl.client.CloseableHttpClient.execute(CloseableHttpClient.java:56)
   [junit4]   2> 	at org.apache.solr.client.solrj.impl.HttpSolrClient.executeMethod(HttpSolrClient.java:542)
   [junit4]   2> 	... 12 more
   [junit4]   2> Caused by: java.net.ConnectException: Connection refused (Connection refused)
   [junit4]   2> 	at java.base/java.net.PlainSocketImpl.socketConnect(Native Method)
   [junit4]   2> 	at java.base/java.net.AbstractPlainSocketImpl.doConnect(AbstractPlainSocketImpl.java:400)
   [junit4]   2> 	at java.base/java.net.AbstractPlainSocketImpl.connectToAddress(AbstractPlainSocketImpl.java:243)
   [junit4]   2> 	at java.base/java.net.AbstractPlainSocketImpl.connect(AbstractPlainSocketImpl.java:225)
   [junit4]   2> 	at java.base/java.net.SocksSocketImpl.connect(SocksSocketImpl.java:402)
   [junit4]   2> 	at java.base/java.net.Socket.connect(Socket.java:591)
   [junit4]   2> 	at org.apache.http.conn.ssl.SSLConnectionSocketFactory.connectSocket(SSLConnectionSocketFactory.java:339)
   [junit4]   2> 	at org.apache.http.impl.conn.DefaultHttpClientConnectionOperator.connect(DefaultHttpClientConnectionOperator.java:142)
   [junit4]   2> 	... 22 more
   [junit4]   2> 3221398 ERROR (OverseerThreadFactory-12070-thread-1-processing-n:127.0.0.1:39117_solr) [n:127.0.0.1:39117_solr    ] o.a.s.c.OverseerCollectionMessageHandler Error from shard: https://127.0.0.1:45189/solr
   [junit4]   2> org.apache.solr.client.solrj.SolrServerException: Server refused connection at: https://127.0.0.1:45189/solr
   [junit4]   2> 	at org.apache.solr.client.solrj.impl.HttpSolrClient.executeMethod(HttpSolrClient.java:650)
   [junit4]   2> 	at org.apache.solr.client.solrj.impl.HttpSolrClient.request(HttpSolrClient.java:255)
   [junit4]   2> 	at org.apache.solr.client.solrj.impl.HttpSolrClient.request(HttpSolrClient.java:244)
   [junit4]   2> 	at org.apache.solr.client.solrj.SolrClient.request(SolrClient.java:1219)
   [junit4]   2> 	at org.apache.solr.handler.component.HttpShardHandler.lambda$submit$0(HttpShardHandler.java:172)
   [junit4]   2> 	at java.base/java.util.concurrent.FutureTask.run(FutureTask.java:264)
   [junit4]   2> 	at java.base/java.util.concurrent.Executors$RunnableAdapter.call(Executors.java:514)
   [junit4]   2> 	at java.base/java.util.concurrent.FutureTask.run(FutureTask.java:264)
   [junit4]   2> 	at com.codahale.metrics.InstrumentedExecutorService$InstrumentedRunnable.run(InstrumentedExecutorService.java:176)
   [junit4]   2> 	at org.apache.solr.common.util.ExecutorUtil$MDCAwareThreadPoolExecutor.lambda$execute$0(ExecutorUtil.java:188)
   [junit4]   2> 	at java.base/java.util.concurrent.ThreadPoolExecutor.runWorker(ThreadPoolExecutor.java:1167)
   [junit4]   2> 	at java.base/java.util.concurrent.ThreadPoolExecutor$Worker.run(ThreadPoolExecutor.java:641)
   [junit4]   2> 	at java.base/java.lang.Thread.run(Thread.java:844)
   [junit4]   2> Caused by: org.apache.http.conn.HttpHostConnectException: Connect to 127.0.0.1:45189 [/127.0.0.1] failed: Connection refused (Connection refused)
   [junit4]   2> 	at org.apache.http.impl.conn.DefaultHttpClientConnectionOperator.connect(DefaultHttpClientConnectionOperator.java:159)
   [junit4]   2> 	at org.apache.http.impl.conn.PoolingHttpClientConnectionManager.connect(PoolingHttpClientConnectionManager.java:359)
   [junit4]   2> 	at org.apache.http.impl.execchain.MainClientExec.establishRoute(MainClientExec.java:381)
   [junit4]   2> 	at org.apache.http.impl.execchain.MainClientExec.execute(MainClientExec.java:237)
   [junit4]   2> 	at org.apache.http.impl.execchain.ProtocolExec.execute(ProtocolExec.java:185)
   [junit4]   2> 	at org.apache.http.impl.execchain.RetryExec.execute(RetryExec.java:89)
   [junit4]   2> 	at org.apache.http.impl.execchain.RedirectExec.execute(RedirectExec.java:111)
   [junit4]   2> 	at org.apache.http.impl.client.InternalHttpClient.doExecute(InternalHttpClient.java:185)
   [junit4]   2> 	at org.apache.http.impl.client.CloseableHttpClient.execute(CloseableHttpClient.java:83)
   [junit4]   2> 	at org.apache.http.impl.client.CloseableHttpClient.execute(CloseableHttpClient.java:56)
   [junit4]   2> 	at org.apache.solr.client.solrj.impl.HttpSolrClient.executeMethod(HttpSolrClient.java:542)
   [junit4]   2> 	... 12 more
   [junit4]   2> Caused by: java.net.ConnectException: Connection refused (Connection refused)
   [junit4]   2> 	at java.base/java.net.PlainSocketImpl.socketConnect(Native Method)
   [junit4]   2> 	at java.base/java.net.AbstractPlainSocketImpl.doConnect(AbstractPlainSocketImpl.java:400)
   [junit4]   2> 	at java.base/java.net.AbstractPlainSocketImpl.connectToAddress(AbstractPlainSocketImpl.java:243)
   [junit4]   2> 	at java.base/java.net.AbstractPlainSocketImpl.connect(AbstractPlainSocketImpl.java:225)
   [junit4]   2> 	at java.base/java.net.SocksSocketImpl.connect(SocksSocketImpl.java:402)
   [junit4]   2> 	at java.base/java.net.Socket.connect(Socket.java:591)
   [junit4]   2> 	at org.apache.http.conn.ssl.SSLConnectionSocketFactory.connectSocket(SSLConnectionSocketFactory.java:339)
   [junit4]   2> 	at org.apache.http.impl.conn.DefaultHttpClientConnectionOperator.connect(DefaultHttpClientConnectionOperator.java:142)
   [junit4]   2> 	... 22 more
   [junit4]   2> 3221403 INFO  (jetty-closer-6266-thread-2) [    ] o.a.s.m.SolrMetricManager Closing metric reporters for registry=solr.jvm, tag=null
   [junit4]   2> 3221403 INFO  (jetty-closer-6266-thread-2) [    ] o.a.s.m.r.SolrJmxReporter Closing reporter [org.apache.solr.metrics.reporters.SolrJmxReporter@63afbe89: rootName = solr_45189, domain = solr.jvm, service url = null, agent id = null] for registry solr.jvm / com.codahale.metrics.MetricRegistry@4c42a144
   [junit4]   2> 3221406 INFO  (jetty-closer-6266-thread-1) [    ] o.a.s.m.SolrMetricManager Closing metric reporters for registry=solr.jvm, tag=null
   [junit4]   2> 3221406 INFO  (jetty-closer-6266-thread-1) [    ] o.a.s.m.r.SolrJmxReporter Closing reporter [org.apache.solr.metrics.reporters.SolrJmxReporter@3eedae1d: rootName = solr_39117, domain = solr.jvm, service url = null, agent id = null] for registry solr.jvm / com.codahale.metrics.MetricRegistry@4c42a144
   [junit4]   2> 3221410 INFO  (jetty-closer-6266-thread-2) [    ] o.a.s.m.SolrMetricManager Closing metric reporters for registry=solr.jetty, tag=null
   [junit4]   2> 3221411 INFO  (jetty-closer-6266-thread-2) [    ] o.a.s.m.r.SolrJmxReporter Closing reporter [org.apache.solr.metrics.reporters.SolrJmxReporter@59fab9b5: rootName = solr_45189, domain = solr.jetty, service url = null, agent id = null] for registry solr.jetty / com.codahale.metrics.MetricRegistry@3a0b0bb1
   [junit4]   2> 3221412 INFO  (jetty-closer-6266-thread-2) [    ] o.a.s.c.ZkController Remove node as live in ZooKeeper:/live_nodes/127.0.0.1:45189_solr
   [junit4]   2> 3221413 INFO  (jetty-closer-6266-thread-2) [    ] o.a.s.m.SolrMetricManager Closing metric reporters for registry=solr.cluster, tag=null
   [junit4]   2> 3221413 INFO  (zkCallback-6276-thread-3-processing-n:127.0.0.1:45189_solr) [n:127.0.0.1:45189_solr    ] o.a.s.c.c.ZkStateReader Updated live nodes from ZooKeeper... (2) -> (1)
   [junit4]   2> 3221413 INFO  (zkCallback-6277-thread-4-processing-n:127.0.0.1:39117_solr) [n:127.0.0.1:39117_solr    ] o.a.s.c.c.ZkStateReader Updated live nodes from ZooKeeper... (2) -> (1)
   [junit4]   2> 3221413 INFO  (coreCloseExecutor-12085-thread-1) [n:127.0.0.1:45189_solr c:collection s:shard1 r:core_node3 x:collection_shard1_replica_n1] o.a.s.c.SolrCore [collection_shard1_replica_n1]  CLOSING SolrCore org.apache.solr.core.SolrCore@4203bd79
   [junit4]   2> 3221413 INFO  (coreCloseExecutor-12085-thread-1) [n:127.0.0.1:45189_solr c:collection s:shard1 r:core_node3 x:collection_shard1_replica_n1] o.a.s.m.SolrMetricManager Closing metric reporters for registry=solr.core.collection.shard1.replica_n1, tag=1107541369
   [junit4]   2> 3221413 INFO  (jetty-closer-6266-thread-1) [    ] o.a.s.m.SolrMetricManager Closing metric reporters for registry=solr.jetty, tag=null
   [junit4]   2> 3221413 INFO  (coreCloseExecutor-12085-thread-1) [n:127.0.0.1:45189_solr c:collection s:shard1 r:core_node3 x:collection_shard1_replica_n1] o.a.s.m.r.SolrJmxReporter Closing reporter [org.apache.solr.metrics.reporters.SolrJmxReporter@5e8ac56b: rootName = solr_45189, domain = solr.core.collection.shard1.replica_n1, service url = null, agent id = null] for registry solr.core.collection.shard1.replica_n1 / com.codahale.metrics.MetricRegistry@78fe1999
   [junit4]   2> 3221414 INFO  (jetty-closer-6266-thread-1) [    ] o.a.s.m.r.SolrJmxReporter Closing reporter [org.apache.solr.metrics.reporters.SolrJmxReporter@67de76e1: rootName = solr_39117, domain = solr.jetty, service url = null, agent id = null] for registry solr.jetty / com.codahale.metrics.MetricRegistry@3a0b0bb1
   [junit4]   2> 3221415 INFO  (jetty-closer-6266-thread-1) [    ] o.a.s.c.ZkController Remove node as live in ZooKeeper:/live_nodes/127.0.0.1:39117_solr
   [junit4]   2> 3221416 INFO  (jetty-closer-6266-thread-1) [    ] o.a.s.m.SolrMetricManager Closing metric reporters for registry=solr.cluster, tag=null
   [junit4]   2> 3221416 INFO  (zkCallback-6277-thread-4-processing-n:127.0.0.1:39117_solr) [n:127.0.0.1:39117_solr    ] o.a.s.c.c.ZkStateReader Updated live nodes from ZooKeeper... (1) -> (0)
   [junit4]   2> 3221416 INFO  (zkCallback-6276-thread-3-processing-n:127.0.0.1:45189_solr) [n:127.0.0.1:45189_solr    ] o.a.s.c.c.ZkStateReader Updated live nodes from ZooKeeper... (1) -> (0)
   [junit4]   2> 3221416 INFO  (coreCloseExecutor-12086-thread-1) [n:127.0.0.1:39117_solr c:collection s:shard2 r:core_node4 x:collection_shard2_replica_n2] o.a.s.c.SolrCore [collection_shard2_replica_n2]  CLOSING SolrCore org.apache.solr.core.SolrCore@eae1b57
   [junit4]   2> 3221416 INFO  (coreCloseExecutor-12086-thread-1) [n:127.0.0.1:39117_solr c:collection s:shard2 r:core_node4 x:collection_shard2_replica_n2] o.a.s.m.SolrMetricManager Closing metric reporters for registry=solr.core.collection.shard2.replica_n2, tag=246291287
   [junit4]   2> 3221417 INFO  (coreCloseExecutor-12086-thread-1) [n:127.0.0.1:39117_solr c:collection s:shard2 r:core_node4 x:collection_shard2_replica_n2] o.a.s.m.r.SolrJmxReporter Closing reporter [org.apache.solr.metrics.reporters.SolrJmxReporter@68e1ce94: rootName = solr_39117, domain = solr.core.collection.shard2.replica_n2, service url = null, agent id = null] for registry solr.core.collection.shard2.replica_n2 / com.codahale.metrics.MetricRegistry@6dde3d07
   [junit4]   2> 3221427 INFO  (coreCloseExecutor-12085-thread-1) [n:127.0.0.1:45189_solr c:collection s:shard1 r:core_node3 x:collection_shard1_replica_n1] o.a.s.m.SolrMetricManager Closing metric reporters for registry=solr.collection.collection.shard1.leader, tag=1107541369
   [junit4]   2> 3221429 INFO  (jetty-closer-6266-thread-2) [    ] o.e.j.s.h.ContextHandler Stopped o.e.j.s.ServletContextHandler@9b3e660{/solr,null,UNAVAILABLE}
   [junit4]   2> 3221430 INFO  (coreCloseExecutor-12086-thread-1) [n:127.0.0.1:39117_solr c:collection s:shard2 r:core_node4 x:collection_shard2_replica_n2] o.a.s.m.SolrMetricManager Closing metric reporters for registry=solr.collection.collection.shard2.leader, tag=246291287
   [junit4]   2> 3221431 INFO  (jetty-closer-6266-thread-1) [    ] o.a.s.c.Overseer Overseer (id=99060219067695110-127.0.0.1:39117_solr-n_0000000000) closing
   [junit4]   2> 3221431 INFO  (OverseerStateUpdate-99060219067695110-127.0.0.1:39117_solr-n_0000000000) [n:127.0.0.1:39117_solr    ] o.a.s.c.Overseer Overseer Loop exiting : 127.0.0.1:39117_solr
   [junit4]   2> 3221437 ERROR (qtp830337052-36480) [n:127.0.0.1:45189_solr c:collection s:shard1 r:core_node3 x:collection_shard1_replica_n1] o.a.s.c.ZkController Error getting leader from zk
   [junit4]   2> org.apache.solr.common.SolrException: No registered leader was found after waiting for 1220000ms , collection: collection slice: shard1 saw state=DocCollection(collection//collections/collection/state.json/2)={
   [junit4]   2>   "pullReplicas":"0",
   [junit4]   2>   "replicationFactor":"1",
   [junit4]   2>   "shards":{
   [junit4]   2>     "shard1":{
   [junit4]   2>       "range":"80000000-ffffffff",
   [junit4]   2>       "state":"active",
   [junit4]   2>       "replicas":{"core_node3":{
   [junit4]   2>           "core":"collection_shard1_replica_n1",
   [junit4]   2>           "base_url":"https://127.0.0.1:45189/solr",
   [junit4]   2>           "node_name":"127.0.0.1:45189_solr",
   [junit4]   2>           "state":"down",
   [junit4]   2>           "type":"NRT"}}},
   [junit4]   2>     "shard2":{
   [junit4]   2>       "range":"0-7fffffff",
   [junit4]   2>       "state":"active",
   [junit4]   2>       "replicas":{"core_node4":{
   [junit4]   2>           "core":"collection_shard2_replica_n2",
   [junit4]   2>           "base_url":"https://127.0.0.1:39117/solr",
   [junit4]   2>           "node_name":"127.0.0.1:39117_solr",
   [junit4]   2>           "state":"down",
   [junit4]   2>           "type":"NRT"}}}},
   [junit4]   2>   "router":{"name":"compositeId"},
   [junit4]   2>   "maxShardsPerNode":"1",
   [junit4]   2>   "autoAddReplicas":"false",
   [junit4]   2>   "nrtReplicas":"1",
   [junit4]   2>   "tlogReplicas":"0"} with live_nodes=[]
   [junit4]   2> 	at org.apache.solr.common.cloud.ZkStateReader.getLeaderRetry(ZkStateReader.java:771)
   [junit4]   2> 	at org.apache.solr.common.cloud.ZkStateReader.getLeaderUrl(ZkStateReader.java:736)
   [junit4]   2> 	at org.apache.solr.cloud.ZkController.getLeader(ZkController.java:1178)
   [junit4]   2> 	at org.apache.solr.cloud.ZkController.register(ZkController.java:1079)
   [junit4]   2> 	at org.apache.solr.cloud.ZkController.register(ZkController.java:1014)
   [junit4]   2> 	at org.apache.solr.core.ZkContainer.lambda$registerInZk$0(ZkContainer.java:181)
   [junit4]   2> 	at org.apache.solr.core.ZkContainer.registerInZk(ZkContainer.java:208)
   [junit4]   2> 	at org.apache.solr.core.CoreContainer.registerCore(CoreContainer.java:886)
   [junit4]   2> 	at org.apache.solr.core.CoreContainer.createFromDescriptor(CoreContainer.java:1047)
   [junit4]   2> 	at org.apache.solr.core.CoreContainer.create(CoreContainer.java:948)
   [junit4]   2> 	at org.apache.solr.handler.admin.CoreAdminOperation.lambda$static$0(CoreAdminOperation.java:91)
   [junit4]   2> 	at org.apache.solr.handler.admin.CoreAdminOperation.execute(CoreAdminOperation.java:384)
   [junit4]   2> 	at org.apache.solr.handler.admin.CoreAdminHandler$CallInfo.call(CoreAdminHandler.java:389)
   [junit4]   2> 	at org.apache.solr.handler.admin.CoreAdminHandler.handleRequestBody(CoreAdminHandler.java:174)
   [junit4]   2> 	at org.apache.solr.handler.RequestHandlerBase.handleRequest(RequestHandlerBase.java:177)
   [junit4]   2> 	at org.apache.solr.servlet.HttpSolrCall.handleAdmin(HttpSolrCall.java:735)
   [junit4]   2> 	at org.apache.solr.servlet.HttpSolrCall.handleAdminRequest(HttpSolrCall.java:716)
   [junit4]   2> 	at org.apache.solr.servlet.HttpSolrCall.call(HttpSolrCall.java:497)
   [junit4]   2> 	at org.apache.solr.servlet.SolrDispatchFilter.doFilter(SolrDispatchFilter.java:382)
   [junit4]   2> 	at org.apache.solr.servlet.SolrDispatchFilter.doFilter(SolrDispatchFilter.java:326)
   [junit4]   2> 	at org.eclipse.jetty.servlet.ServletHandler$CachedChain.doFilter(ServletHandler.java:1759)
   [junit4]   2> 	at org.apache.solr.client.solrj.embedded.JettySolrRunner$DebugFilter.doFilter(JettySolrRunner.java:139)
   [junit4]   2> 	at org.eclipse.jetty.servlet.ServletHandler$CachedChain.doFilter(ServletHandler.java:1759)
   [junit4]   2> 	at org.eclipse.jetty.servlet.ServletHandler.doHandle(ServletHandler.java:582)
   [junit4]   2> 	at org.eclipse.jetty.server.session.SessionHandler.doHandle(SessionHandler.java:224)
   [junit4]   2> 	at org.eclipse.jetty.server.handler.ContextHandler.doHandle(ContextHandler.java:1180)
   [junit4]   2> 	at org.eclipse.jetty.servlet.ServletHandler.doScope(ServletHandler.java:512)
   [junit4]   2> 	at org.eclipse.jetty.server.session.SessionHandler.doScope(SessionHandler.java:185)
   [junit4]   2> 	at org.eclipse.jetty.server.handler.ContextHandler.doScope(ContextHandler.java:1112)
   [junit4]   2> 	at org.eclipse.jetty.server.handler.ScopedHandler.handle(ScopedHandler.java:141)
   [junit4]   2> 	at org.eclipse.jetty.server.handler.gzip.GzipHandler.handle(GzipHandler.java:426)
   [junit4]   2> 	at org.eclipse.jetty.server.handler.HandlerWrapper.handle(HandlerWrapper.java:134)
   [junit4]   2> 	at org.eclipse.jetty.server.Server.handle(Server.java:534)
   [junit4]   2> 	at org.eclipse.jetty.server.HttpChannel.handle(HttpChannel.java:320)
   [junit4]   2> 	at org.eclipse.jetty.server.HttpConnection.onFillable(HttpConnection.java:251)
   [junit4]   2> 	at org.eclipse.jetty.io.AbstractConnection$ReadCallback.succeeded(AbstractConnection.java:283)
   [junit4]   2> 	at org.eclipse.jetty.io.FillInterest.fillable(FillInterest.java:108)
   [junit4]   2> 	at org.eclipse.jetty.io.ssl.SslConnection.onFillable(SslConnection.java:251)
   [junit4]   2> 	at org.eclipse.jetty.io.AbstractConnection$ReadCallback.succeeded(AbstractConnection.java:283)
   [junit4]   2> 	at org.eclipse.jetty.io.FillInterest.fillable(FillInterest.java:108)
   [junit4]   2> 	at org.eclipse.jetty.io.SelectChannelEndPoint$2.run(SelectChannelEndPoint.java:93)
   [junit4]   2> 	at org.eclipse.jetty.util.thread.strategy.ExecuteProduceConsume.executeProduceConsume(ExecuteProduceConsume.java:303)
   [junit4]   2> 	at org.eclipse.jetty.util.thread.strategy.ExecuteProduceConsume.produceConsume(ExecuteProduceConsume.java:148)
   [junit4]   2> 	at org.eclipse.jetty.util.thread.strategy.ExecuteProduceConsume.run(ExecuteProduceConsume.java:136)
   [junit4]   2> 	at org.eclipse.jetty.util.thread.QueuedThreadPool.runJob(QueuedThreadPool.java:671)
   [junit4]   2> 	at org.eclipse.jetty.util.thread.QueuedThreadPool$2.run(QueuedThreadPool.java:589)
   [junit4]   2> 	at java.base/java.lang.Thread.run(Thread.java:844)
   [junit4]   2> 3221439 ERROR (qtp830337052-36480) [n:127.0.0.1:45189_solr c:collection s:shard1 r:core_node3 x:collection_shard1_replica_n1] o.a.s.c.ZkContainer :org.apache.solr.common.SolrException: Error getting leader from zk for shard shard1
   [junit4]   2> 	at org.apache.solr.cloud.ZkController.getLeader(ZkController.java:1207)
   [junit4]   2> 	at org.apache.solr.cloud.ZkController.register(ZkController.java:1079)
   [junit4]   2> 	at org.apache.solr.cloud.ZkController.register(ZkController.java:1014)
   [junit4]   2> 	at org.apache.solr.core.ZkContainer.lambda$registerInZk$0(ZkContainer.java:181)
   [junit4]   2> 	at org.apache.solr.core.ZkContainer.registerInZk(ZkContainer.java:208)
   [junit4]   2> 	at org.apache.solr.core.CoreContainer.registerCore(CoreContainer.java:886)
   [junit4]   2> 	at org.apache.solr.core.CoreContainer.createFromDescriptor(CoreContainer.java:1047)
   [junit4]   2> 	at org.apache.solr.core.CoreContainer.create(CoreContainer.java:948)
   [junit4]   2> 	at org.apache.solr.handler.admin.CoreAdminOperation.lambda$static$0(CoreAdminOperation.java:91)
   [junit4]   2> 	at org.apache.solr.handler.admin.CoreAdminOperation.execute(CoreAdminOperation.java:384)
   [junit4]   2> 	at org.apache.solr.handler.admin.CoreAdminHandler$CallInfo.call(CoreAdminHandler.java:389)
   [junit4]   2> 	at org.apache.solr.handler.admin.CoreAdminHandler.handleRequestBody(CoreAdminHandler.java:174)
   [junit4]   2> 	at org.apache.solr.handler.RequestHandlerBase.handleRequest(RequestHandlerBase.java:177)
   [junit4]   2> 	at org.apache.solr.servlet.HttpSolrCall.handleAdmin(HttpSolrCall.java:735)
   [junit4]   2> 	at org.apache.solr.servlet.HttpSolrCall.handleAdminRequest(HttpSolrCall.java:716)
   [junit4]   2> 	at org.apache.solr.servlet.HttpSolrCall.call(HttpSolrCall.java:497)
   [junit4]   2> 	at org.apache.solr.servlet.SolrDispatchFilter.doFilter(SolrDispatchFilter.java:382)
   [junit4]   2> 	at org.apache.solr.servlet.SolrDispatchFilter.doFilter(SolrDispatchFilter.java:326)
   [junit4]   2> 	at org.eclipse.jetty.servlet.ServletHandler$CachedChain.doFilter(ServletHandler.java:1759)
   [junit4]   2> 	at org.apache.solr.client.solrj.embedded.JettySolrRunner$DebugFilter.doFilter(JettySolrRunner.java:139)
   [junit4]   2> 	at org.eclipse.jetty.servlet.ServletHandler$CachedChain.doFilter(ServletHandler.java:1759)
   [junit4]   2> 	at org.eclipse.jetty.servlet.ServletHandler.doHandle(ServletHandler.java:582)
   [junit4]   2> 	at org.eclipse.jetty.server.session.SessionHandler.doHandle(SessionHandler.java:224)
   [junit4]   2> 	at org.eclipse.jetty.server.handler.ContextHandler.doHandle(ContextHandler.java:1180)
   [junit4]   2> 	at org.eclipse.jetty.servlet.ServletHandler.doScope(ServletHandler.java:512)
   [junit4]   2> 	at org.eclipse.jetty.server.session.SessionHandler.doScope(SessionHandler.java:185)
   [junit4]   2> 	at org.eclipse.jetty.server.handler.ContextHandler.doScope(ContextHandler.java:1112)
   [junit4]   2> 	at org.eclipse.jetty.server.handler.ScopedHandler.handle(ScopedHandler.java:141)
   [junit4]   2> 	at org.eclipse.jetty.server.handler.gzip.GzipHandler.handle(GzipHandler.java:426)
   [junit4]   2> 	at org.eclipse.jetty.server.handler.HandlerWrapper.handle(HandlerWrapper.java:134)
   [junit4]   2> 	at org.eclipse.jetty.server.Server.handle(Server.java:534)
   [junit4]   2> 	at org.eclipse.jetty.server.HttpChannel.handle(HttpChannel.java:320)
   [junit4]   2> 	at org.eclipse.jetty.server.HttpConnection.onFillable(HttpConnection.java:251)
   [junit4]   2> 	at org.eclipse.jetty.io.AbstractConnection$ReadCallback.succeeded(AbstractConnection.java:283)
   [junit4]   2> 	at org.eclipse.jetty.io.FillInterest.fillable(FillInterest.java:108)
   [junit4]   2> 	at org.eclipse.jetty.io.ssl.SslConnection.onFillable(SslConnection.java:251)
   [junit4]   2> 	at org.eclipse.jetty.io.AbstractConnection$ReadCallback.succeeded(AbstractConnection.java:283)
   [junit4]   2> 	at org.eclipse.jetty.io.FillInterest.fillable(FillInterest.java:108)
   [junit4]   2> 	at org.eclipse.jetty.io.SelectChannelEndPoint$2.run(SelectChannelEndPoint.java:93)
   [junit4]   2> 	at org.eclipse.jetty.util.thread.strategy.ExecuteProduceConsume.executeProduceConsume(ExecuteProduceConsume.java:303)
   [junit4]   2> 	at org.eclipse.jetty.util.thread.strategy.ExecuteProduceConsume.produceConsume(ExecuteProduceConsume.java:148)
   [junit4]   2> 	at org.eclipse.jetty.util.thread.strategy.ExecuteProduceConsume.run(ExecuteProduceConsume.java:136)
   [junit4]   2> 	at org.eclipse.jetty.util.thread.QueuedThreadPool.runJob(QueuedThreadPool.java:671)
   [junit4]   2> 	at org.eclipse.jetty.util.thread.QueuedThreadPool$2.run(QueuedThreadPool.java:589)
   [junit4]   2> 	at java.base/java.lang.Thread.run(Thread.java:844)
   [junit4]   2> Caused by: org.apache.solr.common.SolrException: No registered leader was found after waiting for 1220000ms , collection: collection slice: shard1 saw state=DocCollection(collection//collections/collection/state.json/2)={
   [junit4]   2>   "pullReplicas":"0",
   [junit4]   2>   "replicationFactor":"1",
   [junit4]   2>   "shards":{
   [junit4]   2>     "shard1":{
   [junit4]   2>       "range":"80000000-ffffffff",
   [junit4]   2>       "state":"active",
   [junit4]   2>       "replicas":{"core_node3":{
   [junit4]   2>           "core":"collection_shard1_replica_n1",
   [junit4]   2>           "base_url":"https://127.0.0.1:45189/solr",
   [junit4]   2>           "node_name":"127.0.0.1:45189_solr",
   [junit4]   2>           "state":"down",
   [junit4]   2>           "type":"NRT"}}},
   [junit4]   2>     "shard2":{
   [junit4]   2>       "range":"0-7fffffff",
   [junit4]   2>       "state":"active",
   [junit4]   2>       "replicas":{"core_node4":{
   [junit4]   2>           "core":"collection_shard2_replica_n2",
   [junit4]   2>           "base_url":"https://127.0.0.1:39117/solr",
   [junit4]   2>           "node_name":"127.0.0.1:39117_solr",
   [junit4]   2>           "state":"down",
   [junit4]   2>           "type":"NRT"}}}},
   [junit4]   2>   "router":{"name":"compositeId"},
   [junit4]   2>   "maxShardsPerNode":"1",
   [junit4]   2>   "autoAddReplicas":"false",
   [junit4]   2>   "nrtReplicas":"1",
   [junit4]   2>   "tlogReplicas":"0"} with live_nodes=[]
   [junit4]   2> 	at org.apache.solr.common.cloud.ZkStateReader.getLeaderRetry(ZkStateReader.java:771)
   [junit4]   2> 	at org.apache.solr.common.cloud.ZkStateReader.getLeaderUrl(ZkStateReader.java:736)
   [junit4]   2> 	at org.apache.solr.cloud.ZkController.getLeader(ZkController.java:1178)
   [junit4]   2> 	... 44 more
   [junit4]   2> 
   [junit4]   2> 3221450 INFO  (qtp830337052-36480) [n:127.0.0.1:45189_solr c:collection s:shard1 r:core_node3 x:collection_shard1_replica_n1] o.a.s.s.HttpSolrCall [admin] webapp=null path=/admin/cores params={qt=/admin/cores&coreNodeName=core_node3&collection.configName=conf&newCollection=true&name=collection_shard1_replica_n1&action=CREATE&numShards=2&collection=collection&shard=shard1&wt=javabin&version=2&replicaType=NRT} status=0 QTime=179768
   [junit4]   2> 3251435 INFO  (zkCallback-6277-thread-4-processing-n:127.0.0.1:39117_solr) [n:127.0.0.1:39117_solr    ] o.a.s.c.c.ZkStateReader A cluster state change: [WatchedEvent 

[...truncated too long message...]

r.registerInZk(ZkContainer.java:208)
   [junit4]   2> 	at org.apache.solr.core.CoreContainer.registerCore(CoreContainer.java:886)
   [junit4]   2> 	at org.apache.solr.core.CoreContainer.createFromDescriptor(CoreContainer.java:1047)
   [junit4]   2> 	at org.apache.solr.core.CoreContainer.create(CoreContainer.java:948)
   [junit4]   2> 	at org.apache.solr.handler.admin.CoreAdminOperation.lambda$static$0(CoreAdminOperation.java:91)
   [junit4]   2> 	at org.apache.solr.handler.admin.CoreAdminOperation.execute(CoreAdminOperation.java:384)
   [junit4]   2> 	at org.apache.solr.handler.admin.CoreAdminHandler$CallInfo.call(CoreAdminHandler.java:389)
   [junit4]   2> 	at org.apache.solr.handler.admin.CoreAdminHandler.handleRequestBody(CoreAdminHandler.java:174)
   [junit4]   2> 	at org.apache.solr.handler.RequestHandlerBase.handleRequest(RequestHandlerBase.java:177)
   [junit4]   2> 	at org.apache.solr.servlet.HttpSolrCall.handleAdmin(HttpSolrCall.java:735)
   [junit4]   2> 	at org.apache.solr.servlet.HttpSolrCall.handleAdminRequest(HttpSolrCall.java:716)
   [junit4]   2> 	at org.apache.solr.servlet.HttpSolrCall.call(HttpSolrCall.java:497)
   [junit4]   2> 	at org.apache.solr.servlet.SolrDispatchFilter.doFilter(SolrDispatchFilter.java:382)
   [junit4]   2> 	at org.apache.solr.servlet.SolrDispatchFilter.doFilter(SolrDispatchFilter.java:326)
   [junit4]   2> 	at org.eclipse.jetty.servlet.ServletHandler$CachedChain.doFilter(ServletHandler.java:1759)
   [junit4]   2> 	at org.apache.solr.client.solrj.embedded.JettySolrRunner$DebugFilter.doFilter(JettySolrRunner.java:139)
   [junit4]   2> 	at org.eclipse.jetty.servlet.ServletHandler$CachedChain.doFilter(ServletHandler.java:1759)
   [junit4]   2> 	at org.eclipse.jetty.servlet.ServletHandler.doHandle(ServletHandler.java:582)
   [junit4]   2> 	at org.eclipse.jetty.server.session.SessionHandler.doHandle(SessionHandler.java:224)
   [junit4]   2> 	at org.eclipse.jetty.server.handler.ContextHandler.doHandle(ContextHandler.java:1180)
   [junit4]   2> 	at org.eclipse.jetty.servlet.ServletHandler.doScope(ServletHandler.java:512)
   [junit4]   2> 	at org.eclipse.jetty.server.session.SessionHandler.doScope(SessionHandler.java:185)
   [junit4]   2> 	at org.eclipse.jetty.server.handler.ContextHandler.doScope(ContextHandler.java:1112)
   [junit4]   2> 	at org.eclipse.jetty.server.handler.ScopedHandler.handle(ScopedHandler.java:141)
   [junit4]   2> 	at org.eclipse.jetty.server.handler.gzip.GzipHandler.handle(GzipHandler.java:426)
   [junit4]   2> 	at org.eclipse.jetty.server.handler.HandlerWrapper.handle(HandlerWrapper.java:134)
   [junit4]   2> 	at org.eclipse.jetty.server.Server.handle(Server.java:534)
   [junit4]   2> 	at org.eclipse.jetty.server.HttpChannel.handle(HttpChannel.java:320)
   [junit4]   2> 	at org.eclipse.jetty.server.HttpConnection.onFillable(HttpConnection.java:251)
   [junit4]   2> 	at org.eclipse.jetty.io.AbstractConnection$ReadCallback.succeeded(AbstractConnection.java:283)
   [junit4]   2> 	at org.eclipse.jetty.io.FillInterest.fillable(FillInterest.java:108)
   [junit4]   2> 	at org.eclipse.jetty.io.SelectChannelEndPoint$2.run(SelectChannelEndPoint.java:93)
   [junit4]   2> 	at org.eclipse.jetty.util.thread.strategy.ExecuteProduceConsume.executeProduceConsume(ExecuteProduceConsume.java:303)
   [junit4]   2> 	at org.eclipse.jetty.util.thread.strategy.ExecuteProduceConsume.produceConsume(ExecuteProduceConsume.java:148)
   [junit4]   2> 	at org.eclipse.jetty.util.thread.strategy.ExecuteProduceConsume.run(ExecuteProduceConsume.java:136)
   [junit4]   2> 	at org.eclipse.jetty.util.thread.QueuedThreadPool.runJob(QueuedThreadPool.java:671)
   [junit4]   2> 	at org.eclipse.jetty.util.thread.QueuedThreadPool$2.run(QueuedThreadPool.java:589)
   [junit4]   2> 	at java.base/java.lang.Thread.run(Thread.java:844)
   [junit4]   2> Caused by: org.apache.solr.common.SolrException: No registered leader was found after waiting for 1220000ms , collection: streams slice: shard1 saw state=null with live_nodes=[]
   [junit4]   2> 	at org.apache.solr.common.cloud.ZkStateReader.getLeaderRetry(ZkStateReader.java:771)
   [junit4]   2> 	at org.apache.solr.common.cloud.ZkStateReader.getLeaderUrl(ZkStateReader.java:736)
   [junit4]   2> 	at org.apache.solr.cloud.ZkController.getLeader(ZkController.java:1178)
   [junit4]   2> 	... 41 more
   [junit4]   2> 
   [junit4]   2> 289168 INFO  (qtp628298908-1641) [n:127.0.0.1:38685_solr c:streams s:shard1 r:core_node3 x:streams_shard1_replica_n1] o.a.s.s.HttpSolrCall [admin] webapp=null path=/admin/cores params={qt=/admin/cores&coreNodeName=core_node3&collection.configName=conf&newCollection=true&name=streams_shard1_replica_n1&action=CREATE&numShards=2&collection=streams&shard=shard1&wt=javabin&version=2&replicaType=NRT} status=0 QTime=209791
   [junit4]   2> 289169 ERROR (SUITE-StreamingTest-seed#[2FEBF971BABB417B]-worker) [    ] o.a.z.s.ZooKeeperServer ZKShutdownHandler is not registered, so ZooKeeper server won't take any action on ERROR or SHUTDOWN server state changes
   [junit4]   2> 289169 INFO  (SUITE-StreamingTest-seed#[2FEBF971BABB417B]-worker) [    ] o.a.s.c.ZkTestServer connecting to 127.0.0.1:33235 33235
   [junit4]   2> 292052 INFO  (Thread-207) [    ] o.a.s.c.ZkTestServer connecting to 127.0.0.1:33235 33235
   [junit4]   2> 292053 WARN  (Thread-207) [    ] o.a.s.c.ZkTestServer Watch limit violations: 
   [junit4]   2> Maximum concurrent create/delete watches above limit:
   [junit4]   2> 
   [junit4]   2> 	3	/solr/aliases.json
   [junit4]   2> 	3	/solr/clusterprops.json
   [junit4]   2> 	2	/solr/security.json
   [junit4]   2> 	2	/solr/configs/conf
   [junit4]   2> 
   [junit4]   2> Maximum concurrent data watches above limit:
   [junit4]   2> 
   [junit4]   2> 	6	/solr/collections/streams/state.json
   [junit4]   2> 	3	/solr/clusterstate.json
   [junit4]   2> 
   [junit4]   2> Maximum concurrent children watches above limit:
   [junit4]   2> 
   [junit4]   2> 	3	/solr/live_nodes
   [junit4]   2> 	3	/solr/collections
   [junit4]   2> 
   [junit4]   2> 292053 INFO  (SUITE-StreamingTest-seed#[2FEBF971BABB417B]-worker) [    ] o.a.s.SolrTestCaseJ4 ------------------------------------------------------- Done waiting for tracked resources to be released
   [junit4]   2> NOTE: test params are: codec=Asserting(Lucene70): {}, docValues:{}, maxPointsInLeafNode=1424, maxMBSortInHeap=7.980469446748868, sim=RandomSimilarity(queryNorm=false): {}, locale=so-SO, timezone=Australia/Hobart
   [junit4]   2> NOTE: Linux 4.10.0-37-generic amd64/Oracle Corporation 9.0.1 (64-bit)/cpus=8,threads=1,free=213426656,total=536870912
   [junit4]   2> NOTE: All tests run in this JVM: [AscEvaluatorTest, SolrSchemalessExampleTest, SolrExampleStreamingTest, UsingSolrJRefGuideExamplesTest, HttpSolrClientConPoolTest, ArcSineEvaluatorTest, EmpiricalDistributionEvaluatorTest, TestToleratedUpdateError, LargeVolumeEmbeddedTest, HyperbolicTangentEvaluatorTest, ShardParamsTest, TestClusteringResponse, NaturalLogEvaluatorTest, TestPathTrie, TestPolicy, SquareRootEvaluatorTest, ConcurrentUpdateSolrClientBuilderTest, TestSpellCheckResponse, TestZkConfigManager, GreaterThanEvaluatorTest, SolrExampleBinaryTest, LargeVolumeBinaryJettyTest, TestBatchUpdate, LargeVolumeJettyTest, TestSolrProperties, SolrParamTest, TermsResponseTest, TestEmbeddedSolrServer, TestNamedListCodec, TestDocumentObjectBinder, ContentStreamTest, TestXMLEscaping, SolrExceptionTest, FieldAnalysisResponseTest, GetByIdTest, CloudSolrClientBuilderTest, CloudSolrClientCacheTest, HttpSolrClientSSLAuthConPoolTest, TestCloudSolrClientConnections, JdbcDriverTest, JdbcTest, StreamExpressionToExpessionTest, StreamingTest]
   [junit4]   2> NOTE: reproduce with: ant test  -Dtestcase=StreamingTest -Dtests.seed=2FEBF971BABB417B -Dtests.multiplier=3 -Dtests.slow=true -Dtests.locale=so-SO -Dtests.timezone=Australia/Hobart -Dtests.asserts=true -Dtests.file.encoding=US-ASCII
   [junit4] ERROR   0.00s J0 | StreamingTest (suite) <<<
   [junit4]    > Throwable #1: org.apache.solr.client.solrj.impl.HttpSolrClient$RemoteSolrException: Error from server at http://127.0.0.1:45823/solr: create the collection time out:180s
   [junit4]    > 	at __randomizedtesting.SeedInfo.seed([2FEBF971BABB417B]:0)
   [junit4]    > 	at org.apache.solr.client.solrj.impl.HttpSolrClient.executeMethod(HttpSolrClient.java:643)
   [junit4]    > 	at org.apache.solr.client.solrj.impl.HttpSolrClient.request(HttpSolrClient.java:255)
   [junit4]    > 	at org.apache.solr.client.solrj.impl.HttpSolrClient.request(HttpSolrClient.java:244)
   [junit4]    > 	at org.apache.solr.client.solrj.impl.LBHttpSolrClient.doRequest(LBHttpSolrClient.java:483)
   [junit4]    > 	at org.apache.solr.client.solrj.impl.LBHttpSolrClient.request(LBHttpSolrClient.java:413)
   [junit4]    > 	at org.apache.solr.client.solrj.impl.CloudSolrClient.sendRequest(CloudSolrClient.java:1103)
   [junit4]    > 	at org.apache.solr.client.solrj.impl.CloudSolrClient.requestWithRetryOnStaleState(CloudSolrClient.java:883)
   [junit4]    > 	at org.apache.solr.client.solrj.impl.CloudSolrClient.request(CloudSolrClient.java:816)
   [junit4]    > 	at org.apache.solr.client.solrj.SolrRequest.process(SolrRequest.java:194)
   [junit4]    > 	at org.apache.solr.client.solrj.SolrRequest.process(SolrRequest.java:211)
   [junit4]    > 	at org.apache.solr.client.solrj.io.stream.StreamingTest.configureCluster(StreamingTest.java:102)
   [junit4]    > 	at java.base/jdk.internal.reflect.NativeMethodAccessorImpl.invoke0(Native Method)
   [junit4]    > 	at java.base/jdk.internal.reflect.NativeMethodAccessorImpl.invoke(NativeMethodAccessorImpl.java:62)
   [junit4]    > 	at java.base/jdk.internal.reflect.DelegatingMethodAccessorImpl.invoke(DelegatingMethodAccessorImpl.java:43)
   [junit4]    > 	at java.base/java.lang.reflect.Method.invoke(Method.java:564)
   [junit4]    > 	at java.base/java.lang.Thread.run(Thread.java:844)
   [junit4] Completed [146/146 (1!)] on J0 in 213.23s, 0 tests, 1 error <<< FAILURES!

[...truncated 39225 lines...]

Mime
View raw message