lucene-dev mailing list archives

Site index · List index
Message view « Date » · « Thread »
Top « Date » · « Thread »
From Policeman Jenkins Server <jenk...@thetaphi.de>
Subject [JENKINS] Lucene-Solr-master-Windows (64bit/jdk-9.0.1) - Build # 7010 - Still Unstable!
Date Thu, 09 Nov 2017 18:29:40 GMT
Build: https://jenkins.thetaphi.de/job/Lucene-Solr-master-Windows/7010/
Java: 64bit/jdk-9.0.1 -XX:+UseCompressedOops -XX:+UseParallelGC

9 tests failed.
FAILED:  junit.framework.TestSuite.org.apache.lucene.index.TestBackwardsCompatibility

Error Message:
Could not remove the following files (in the order of attempts):    C:\Users\jenkins\workspace\Lucene-Solr-master-Windows\lucene\build\backward-codecs\test\J0\temp\lucene.index.TestBackwardsCompatibility_4AD81EEA31B91251-001\3.6.0-cfs-001: java.nio.file.DirectoryNotEmptyException: C:\Users\jenkins\workspace\Lucene-Solr-master-Windows\lucene\build\backward-codecs\test\J0\temp\lucene.index.TestBackwardsCompatibility_4AD81EEA31B91251-001\3.6.0-cfs-001 

Stack Trace:
java.io.IOException: Could not remove the following files (in the order of attempts):
   C:\Users\jenkins\workspace\Lucene-Solr-master-Windows\lucene\build\backward-codecs\test\J0\temp\lucene.index.TestBackwardsCompatibility_4AD81EEA31B91251-001\3.6.0-cfs-001: java.nio.file.DirectoryNotEmptyException: C:\Users\jenkins\workspace\Lucene-Solr-master-Windows\lucene\build\backward-codecs\test\J0\temp\lucene.index.TestBackwardsCompatibility_4AD81EEA31B91251-001\3.6.0-cfs-001

	at __randomizedtesting.SeedInfo.seed([4AD81EEA31B91251]:0)
	at org.apache.lucene.util.IOUtils.rm(IOUtils.java:329)
	at org.apache.lucene.util.TestRuleTemporaryFilesCleanup.afterAlways(TestRuleTemporaryFilesCleanup.java:216)
	at com.carrotsearch.randomizedtesting.rules.TestRuleAdapter$1.afterAlways(TestRuleAdapter.java:31)
	at com.carrotsearch.randomizedtesting.rules.StatementAdapter.evaluate(StatementAdapter.java:43)
	at com.carrotsearch.randomizedtesting.rules.StatementAdapter.evaluate(StatementAdapter.java:36)
	at org.apache.lucene.util.TestRuleAssertionsRequired$1.evaluate(TestRuleAssertionsRequired.java:53)
	at org.apache.lucene.util.TestRuleMarkFailure$1.evaluate(TestRuleMarkFailure.java:47)
	at org.apache.lucene.util.TestRuleIgnoreAfterMaxFailures$1.evaluate(TestRuleIgnoreAfterMaxFailures.java:64)
	at org.apache.lucene.util.TestRuleIgnoreTestSuites$1.evaluate(TestRuleIgnoreTestSuites.java:54)
	at com.carrotsearch.randomizedtesting.rules.StatementAdapter.evaluate(StatementAdapter.java:36)
	at com.carrotsearch.randomizedtesting.ThreadLeakControl$StatementRunner.run(ThreadLeakControl.java:368)
	at java.base/java.lang.Thread.run(Thread.java:844)


FAILED:  org.apache.lucene.search.TestSimilarity.testSimilarity

Error Message:
expected:<2.0> but was:<1.0>

Stack Trace:
java.lang.AssertionError: expected:<2.0> but was:<1.0>
	at __randomizedtesting.SeedInfo.seed([E8791717EDD7A545:19D6572FED37305E]:0)
	at org.junit.Assert.fail(Assert.java:93)
	at org.junit.Assert.failNotEquals(Assert.java:647)
	at org.junit.Assert.assertEquals(Assert.java:443)
	at org.junit.Assert.assertEquals(Assert.java:512)
	at org.apache.lucene.search.TestSimilarity$4.collect(TestSimilarity.java:146)
	at org.apache.lucene.search.AssertingLeafCollector.collect(AssertingLeafCollector.java:52)
	at org.apache.lucene.search.AssertingCollector$1.collect(AssertingCollector.java:56)
	at org.apache.lucene.search.AssertingLeafCollector.collect(AssertingLeafCollector.java:52)
	at org.apache.lucene.search.AssertingLeafCollector.collect(AssertingLeafCollector.java:52)
	at org.apache.lucene.search.Weight$DefaultBulkScorer.scoreAll(Weight.java:293)
	at org.apache.lucene.search.Weight$DefaultBulkScorer.score(Weight.java:236)
	at org.apache.lucene.search.AssertingBulkScorer.score(AssertingBulkScorer.java:79)
	at org.apache.lucene.search.AssertingBulkScorer.score(AssertingBulkScorer.java:63)
	at org.apache.lucene.search.IndexSearcher.search(IndexSearcher.java:645)
	at org.apache.lucene.search.AssertingIndexSearcher.search(AssertingIndexSearcher.java:72)
	at org.apache.lucene.search.IndexSearcher.search(IndexSearcher.java:449)
	at org.apache.lucene.search.TestSimilarity.testSimilarity(TestSimilarity.java:137)
	at java.base/jdk.internal.reflect.NativeMethodAccessorImpl.invoke0(Native Method)
	at java.base/jdk.internal.reflect.NativeMethodAccessorImpl.invoke(NativeMethodAccessorImpl.java:62)
	at java.base/jdk.internal.reflect.DelegatingMethodAccessorImpl.invoke(DelegatingMethodAccessorImpl.java:43)
	at java.base/java.lang.reflect.Method.invoke(Method.java:564)
	at com.carrotsearch.randomizedtesting.RandomizedRunner.invoke(RandomizedRunner.java:1737)
	at com.carrotsearch.randomizedtesting.RandomizedRunner$8.evaluate(RandomizedRunner.java:934)
	at com.carrotsearch.randomizedtesting.RandomizedRunner$9.evaluate(RandomizedRunner.java:970)
	at com.carrotsearch.randomizedtesting.RandomizedRunner$10.evaluate(RandomizedRunner.java:984)
	at org.apache.lucene.util.TestRuleSetupTeardownChained$1.evaluate(TestRuleSetupTeardownChained.java:49)
	at org.apache.lucene.util.AbstractBeforeAfterRule$1.evaluate(AbstractBeforeAfterRule.java:45)
	at org.apache.lucene.util.TestRuleThreadAndTestName$1.evaluate(TestRuleThreadAndTestName.java:48)
	at org.apache.lucene.util.TestRuleIgnoreAfterMaxFailures$1.evaluate(TestRuleIgnoreAfterMaxFailures.java:64)
	at org.apache.lucene.util.TestRuleMarkFailure$1.evaluate(TestRuleMarkFailure.java:47)
	at com.carrotsearch.randomizedtesting.rules.StatementAdapter.evaluate(StatementAdapter.java:36)
	at com.carrotsearch.randomizedtesting.ThreadLeakControl$StatementRunner.run(ThreadLeakControl.java:368)
	at com.carrotsearch.randomizedtesting.ThreadLeakControl.forkTimeoutingTask(ThreadLeakControl.java:817)
	at com.carrotsearch.randomizedtesting.ThreadLeakControl$3.evaluate(ThreadLeakControl.java:468)
	at com.carrotsearch.randomizedtesting.RandomizedRunner.runSingleTest(RandomizedRunner.java:943)
	at com.carrotsearch.randomizedtesting.RandomizedRunner$5.evaluate(RandomizedRunner.java:829)
	at com.carrotsearch.randomizedtesting.RandomizedRunner$6.evaluate(RandomizedRunner.java:879)
	at com.carrotsearch.randomizedtesting.RandomizedRunner$7.evaluate(RandomizedRunner.java:890)
	at org.apache.lucene.util.AbstractBeforeAfterRule$1.evaluate(AbstractBeforeAfterRule.java:45)
	at com.carrotsearch.randomizedtesting.rules.StatementAdapter.evaluate(StatementAdapter.java:36)
	at org.apache.lucene.util.TestRuleStoreClassName$1.evaluate(TestRuleStoreClassName.java:41)
	at com.carrotsearch.randomizedtesting.rules.NoShadowingOrOverridesOnMethodsRule$1.evaluate(NoShadowingOrOverridesOnMethodsRule.java:40)
	at com.carrotsearch.randomizedtesting.rules.NoShadowingOrOverridesOnMethodsRule$1.evaluate(NoShadowingOrOverridesOnMethodsRule.java:40)
	at com.carrotsearch.randomizedtesting.rules.StatementAdapter.evaluate(StatementAdapter.java:36)
	at com.carrotsearch.randomizedtesting.rules.StatementAdapter.evaluate(StatementAdapter.java:36)
	at org.apache.lucene.util.TestRuleAssertionsRequired$1.evaluate(TestRuleAssertionsRequired.java:53)
	at org.apache.lucene.util.TestRuleMarkFailure$1.evaluate(TestRuleMarkFailure.java:47)
	at org.apache.lucene.util.TestRuleIgnoreAfterMaxFailures$1.evaluate(TestRuleIgnoreAfterMaxFailures.java:64)
	at org.apache.lucene.util.TestRuleIgnoreTestSuites$1.evaluate(TestRuleIgnoreTestSuites.java:54)
	at com.carrotsearch.randomizedtesting.rules.StatementAdapter.evaluate(StatementAdapter.java:36)
	at com.carrotsearch.randomizedtesting.ThreadLeakControl$StatementRunner.run(ThreadLeakControl.java:368)
	at java.base/java.lang.Thread.run(Thread.java:844)


FAILED:  org.apache.lucene.search.spans.TestSpans.testSpanScorerZeroSloppyFreq

Error Message:
first doc score should be zero, 3.0794418

Stack Trace:
java.lang.AssertionError: first doc score should be zero, 3.0794418
	at __randomizedtesting.SeedInfo.seed([E8791717EDD7A545:D40AA33C5B359042]:0)
	at org.junit.Assert.fail(Assert.java:93)
	at org.junit.Assert.assertTrue(Assert.java:43)
	at org.apache.lucene.search.spans.TestSpans.testSpanScorerZeroSloppyFreq(TestSpans.java:320)
	at java.base/jdk.internal.reflect.NativeMethodAccessorImpl.invoke0(Native Method)
	at java.base/jdk.internal.reflect.NativeMethodAccessorImpl.invoke(NativeMethodAccessorImpl.java:62)
	at java.base/jdk.internal.reflect.DelegatingMethodAccessorImpl.invoke(DelegatingMethodAccessorImpl.java:43)
	at java.base/java.lang.reflect.Method.invoke(Method.java:564)
	at com.carrotsearch.randomizedtesting.RandomizedRunner.invoke(RandomizedRunner.java:1737)
	at com.carrotsearch.randomizedtesting.RandomizedRunner$8.evaluate(RandomizedRunner.java:934)
	at com.carrotsearch.randomizedtesting.RandomizedRunner$9.evaluate(RandomizedRunner.java:970)
	at com.carrotsearch.randomizedtesting.RandomizedRunner$10.evaluate(RandomizedRunner.java:984)
	at org.apache.lucene.util.TestRuleSetupTeardownChained$1.evaluate(TestRuleSetupTeardownChained.java:49)
	at org.apache.lucene.util.AbstractBeforeAfterRule$1.evaluate(AbstractBeforeAfterRule.java:45)
	at org.apache.lucene.util.TestRuleThreadAndTestName$1.evaluate(TestRuleThreadAndTestName.java:48)
	at org.apache.lucene.util.TestRuleIgnoreAfterMaxFailures$1.evaluate(TestRuleIgnoreAfterMaxFailures.java:64)
	at org.apache.lucene.util.TestRuleMarkFailure$1.evaluate(TestRuleMarkFailure.java:47)
	at com.carrotsearch.randomizedtesting.rules.StatementAdapter.evaluate(StatementAdapter.java:36)
	at com.carrotsearch.randomizedtesting.ThreadLeakControl$StatementRunner.run(ThreadLeakControl.java:368)
	at com.carrotsearch.randomizedtesting.ThreadLeakControl.forkTimeoutingTask(ThreadLeakControl.java:817)
	at com.carrotsearch.randomizedtesting.ThreadLeakControl$3.evaluate(ThreadLeakControl.java:468)
	at com.carrotsearch.randomizedtesting.RandomizedRunner.runSingleTest(RandomizedRunner.java:943)
	at com.carrotsearch.randomizedtesting.RandomizedRunner$5.evaluate(RandomizedRunner.java:829)
	at com.carrotsearch.randomizedtesting.RandomizedRunner$6.evaluate(RandomizedRunner.java:879)
	at com.carrotsearch.randomizedtesting.RandomizedRunner$7.evaluate(RandomizedRunner.java:890)
	at org.apache.lucene.util.AbstractBeforeAfterRule$1.evaluate(AbstractBeforeAfterRule.java:45)
	at com.carrotsearch.randomizedtesting.rules.StatementAdapter.evaluate(StatementAdapter.java:36)
	at org.apache.lucene.util.TestRuleStoreClassName$1.evaluate(TestRuleStoreClassName.java:41)
	at com.carrotsearch.randomizedtesting.rules.NoShadowingOrOverridesOnMethodsRule$1.evaluate(NoShadowingOrOverridesOnMethodsRule.java:40)
	at com.carrotsearch.randomizedtesting.rules.NoShadowingOrOverridesOnMethodsRule$1.evaluate(NoShadowingOrOverridesOnMethodsRule.java:40)
	at com.carrotsearch.randomizedtesting.rules.StatementAdapter.evaluate(StatementAdapter.java:36)
	at com.carrotsearch.randomizedtesting.rules.StatementAdapter.evaluate(StatementAdapter.java:36)
	at org.apache.lucene.util.TestRuleAssertionsRequired$1.evaluate(TestRuleAssertionsRequired.java:53)
	at org.apache.lucene.util.TestRuleMarkFailure$1.evaluate(TestRuleMarkFailure.java:47)
	at org.apache.lucene.util.TestRuleIgnoreAfterMaxFailures$1.evaluate(TestRuleIgnoreAfterMaxFailures.java:64)
	at org.apache.lucene.util.TestRuleIgnoreTestSuites$1.evaluate(TestRuleIgnoreTestSuites.java:54)
	at com.carrotsearch.randomizedtesting.rules.StatementAdapter.evaluate(StatementAdapter.java:36)
	at com.carrotsearch.randomizedtesting.ThreadLeakControl$StatementRunner.run(ThreadLeakControl.java:368)
	at java.base/java.lang.Thread.run(Thread.java:844)


FAILED:  org.apache.lucene.replicator.IndexAndTaxonomyReplicationClientTest.testConsistencyOnExceptions

Error Message:
Captured an uncaught exception in thread: Thread[id=83, name=ReplicationThread-indexAndTaxo, state=RUNNABLE, group=TGRP-IndexAndTaxonomyReplicationClientTest]

Stack Trace:
com.carrotsearch.randomizedtesting.UncaughtExceptionError: Captured an uncaught exception in thread: Thread[id=83, name=ReplicationThread-indexAndTaxo, state=RUNNABLE, group=TGRP-IndexAndTaxonomyReplicationClientTest]
	at __randomizedtesting.SeedInfo.seed([EC97BF14B243349F:631958B4A02FC760]:0)
Caused by: java.lang.AssertionError: handler failed too many times: -1
	at __randomizedtesting.SeedInfo.seed([EC97BF14B243349F]:0)
	at org.apache.lucene.replicator.IndexAndTaxonomyReplicationClientTest$4.handleUpdateException(IndexAndTaxonomyReplicationClientTest.java:422)
	at org.apache.lucene.replicator.ReplicationClient$ReplicationThread.run(ReplicationClient.java:77)


FAILED:  org.apache.lucene.replicator.IndexAndTaxonomyReplicationClientTest.testNoUpdateThread

Error Message:
Could not remove the following files (in the order of attempts):    C:\Users\jenkins\workspace\Lucene-Solr-master-Windows\lucene\build\replicator\test\J0\temp\lucene.replicator.IndexAndTaxonomyReplicationClientTest_EC97BF14B243349F-001\replicationClientTest-005\1: java.nio.file.DirectoryNotEmptyException: C:\Users\jenkins\workspace\Lucene-Solr-master-Windows\lucene\build\replicator\test\J0\temp\lucene.replicator.IndexAndTaxonomyReplicationClientTest_EC97BF14B243349F-001\replicationClientTest-005\1 

Stack Trace:
java.io.IOException: Could not remove the following files (in the order of attempts):
   C:\Users\jenkins\workspace\Lucene-Solr-master-Windows\lucene\build\replicator\test\J0\temp\lucene.replicator.IndexAndTaxonomyReplicationClientTest_EC97BF14B243349F-001\replicationClientTest-005\1: java.nio.file.DirectoryNotEmptyException: C:\Users\jenkins\workspace\Lucene-Solr-master-Windows\lucene\build\replicator\test\J0\temp\lucene.replicator.IndexAndTaxonomyReplicationClientTest_EC97BF14B243349F-001\replicationClientTest-005\1

	at __randomizedtesting.SeedInfo.seed([EC97BF14B243349F:898E7C7991C36D59]:0)
	at org.apache.lucene.util.IOUtils.rm(IOUtils.java:329)
	at org.apache.lucene.replicator.PerSessionDirectoryFactory.cleanupSession(PerSessionDirectoryFactory.java:58)
	at org.apache.lucene.replicator.ReplicationClient.doUpdate(ReplicationClient.java:259)
	at org.apache.lucene.replicator.ReplicationClient.updateNow(ReplicationClient.java:401)
	at org.apache.lucene.replicator.IndexAndTaxonomyReplicationClientTest.testNoUpdateThread(IndexAndTaxonomyReplicationClientTest.java:227)
	at java.base/jdk.internal.reflect.NativeMethodAccessorImpl.invoke0(Native Method)
	at java.base/jdk.internal.reflect.NativeMethodAccessorImpl.invoke(NativeMethodAccessorImpl.java:62)
	at java.base/jdk.internal.reflect.DelegatingMethodAccessorImpl.invoke(DelegatingMethodAccessorImpl.java:43)
	at java.base/java.lang.reflect.Method.invoke(Method.java:564)
	at com.carrotsearch.randomizedtesting.RandomizedRunner.invoke(RandomizedRunner.java:1737)
	at com.carrotsearch.randomizedtesting.RandomizedRunner$8.evaluate(RandomizedRunner.java:934)
	at com.carrotsearch.randomizedtesting.RandomizedRunner$9.evaluate(RandomizedRunner.java:970)
	at com.carrotsearch.randomizedtesting.RandomizedRunner$10.evaluate(RandomizedRunner.java:984)
	at org.apache.lucene.util.TestRuleSetupTeardownChained$1.evaluate(TestRuleSetupTeardownChained.java:49)
	at org.apache.lucene.util.AbstractBeforeAfterRule$1.evaluate(AbstractBeforeAfterRule.java:45)
	at org.apache.lucene.util.TestRuleThreadAndTestName$1.evaluate(TestRuleThreadAndTestName.java:48)
	at org.apache.lucene.util.TestRuleIgnoreAfterMaxFailures$1.evaluate(TestRuleIgnoreAfterMaxFailures.java:64)
	at org.apache.lucene.util.TestRuleMarkFailure$1.evaluate(TestRuleMarkFailure.java:47)
	at com.carrotsearch.randomizedtesting.rules.StatementAdapter.evaluate(StatementAdapter.java:36)
	at com.carrotsearch.randomizedtesting.ThreadLeakControl$StatementRunner.run(ThreadLeakControl.java:368)
	at com.carrotsearch.randomizedtesting.ThreadLeakControl.forkTimeoutingTask(ThreadLeakControl.java:817)
	at com.carrotsearch.randomizedtesting.ThreadLeakControl$3.evaluate(ThreadLeakControl.java:468)
	at com.carrotsearch.randomizedtesting.RandomizedRunner.runSingleTest(RandomizedRunner.java:943)
	at com.carrotsearch.randomizedtesting.RandomizedRunner$5.evaluate(RandomizedRunner.java:829)
	at com.carrotsearch.randomizedtesting.RandomizedRunner$6.evaluate(RandomizedRunner.java:879)
	at com.carrotsearch.randomizedtesting.RandomizedRunner$7.evaluate(RandomizedRunner.java:890)
	at org.apache.lucene.util.AbstractBeforeAfterRule$1.evaluate(AbstractBeforeAfterRule.java:45)
	at com.carrotsearch.randomizedtesting.rules.StatementAdapter.evaluate(StatementAdapter.java:36)
	at org.apache.lucene.util.TestRuleStoreClassName$1.evaluate(TestRuleStoreClassName.java:41)
	at com.carrotsearch.randomizedtesting.rules.NoShadowingOrOverridesOnMethodsRule$1.evaluate(NoShadowingOrOverridesOnMethodsRule.java:40)
	at com.carrotsearch.randomizedtesting.rules.NoShadowingOrOverridesOnMethodsRule$1.evaluate(NoShadowingOrOverridesOnMethodsRule.java:40)
	at com.carrotsearch.randomizedtesting.rules.StatementAdapter.evaluate(StatementAdapter.java:36)
	at com.carrotsearch.randomizedtesting.rules.StatementAdapter.evaluate(StatementAdapter.java:36)
	at org.apache.lucene.util.TestRuleAssertionsRequired$1.evaluate(TestRuleAssertionsRequired.java:53)
	at org.apache.lucene.util.TestRuleMarkFailure$1.evaluate(TestRuleMarkFailure.java:47)
	at org.apache.lucene.util.TestRuleIgnoreAfterMaxFailures$1.evaluate(TestRuleIgnoreAfterMaxFailures.java:64)
	at org.apache.lucene.util.TestRuleIgnoreTestSuites$1.evaluate(TestRuleIgnoreTestSuites.java:54)
	at com.carrotsearch.randomizedtesting.rules.StatementAdapter.evaluate(StatementAdapter.java:36)
	at com.carrotsearch.randomizedtesting.ThreadLeakControl$StatementRunner.run(ThreadLeakControl.java:368)
	at java.base/java.lang.Thread.run(Thread.java:844)


FAILED:  junit.framework.TestSuite.org.apache.lucene.codecs.asserting.TestAssertingDocValuesFormat

Error Message:
Could not remove the following files (in the order of attempts):    C:\Users\jenkins\workspace\Lucene-Solr-master-Windows\lucene\build\test-framework\test\J0\temp\lucene.codecs.asserting.TestAssertingDocValuesFormat_A0461ED9A603ED03-001\dvduel-012\segments_b: java.nio.file.AccessDeniedException: C:\Users\jenkins\workspace\Lucene-Solr-master-Windows\lucene\build\test-framework\test\J0\temp\lucene.codecs.asserting.TestAssertingDocValuesFormat_A0461ED9A603ED03-001\dvduel-012\segments_b    C:\Users\jenkins\workspace\Lucene-Solr-master-Windows\lucene\build\test-framework\test\J0\temp\lucene.codecs.asserting.TestAssertingDocValuesFormat_A0461ED9A603ED03-001\dvduel-012: java.nio.file.DirectoryNotEmptyException: C:\Users\jenkins\workspace\Lucene-Solr-master-Windows\lucene\build\test-framework\test\J0\temp\lucene.codecs.asserting.TestAssertingDocValuesFormat_A0461ED9A603ED03-001\dvduel-012 

Stack Trace:
java.io.IOException: Could not remove the following files (in the order of attempts):
   C:\Users\jenkins\workspace\Lucene-Solr-master-Windows\lucene\build\test-framework\test\J0\temp\lucene.codecs.asserting.TestAssertingDocValuesFormat_A0461ED9A603ED03-001\dvduel-012\segments_b: java.nio.file.AccessDeniedException: C:\Users\jenkins\workspace\Lucene-Solr-master-Windows\lucene\build\test-framework\test\J0\temp\lucene.codecs.asserting.TestAssertingDocValuesFormat_A0461ED9A603ED03-001\dvduel-012\segments_b
   C:\Users\jenkins\workspace\Lucene-Solr-master-Windows\lucene\build\test-framework\test\J0\temp\lucene.codecs.asserting.TestAssertingDocValuesFormat_A0461ED9A603ED03-001\dvduel-012: java.nio.file.DirectoryNotEmptyException: C:\Users\jenkins\workspace\Lucene-Solr-master-Windows\lucene\build\test-framework\test\J0\temp\lucene.codecs.asserting.TestAssertingDocValuesFormat_A0461ED9A603ED03-001\dvduel-012

	at __randomizedtesting.SeedInfo.seed([A0461ED9A603ED03]:0)
	at org.apache.lucene.util.IOUtils.rm(IOUtils.java:329)
	at org.apache.lucene.util.TestRuleTemporaryFilesCleanup.afterAlways(TestRuleTemporaryFilesCleanup.java:216)
	at com.carrotsearch.randomizedtesting.rules.TestRuleAdapter$1.afterAlways(TestRuleAdapter.java:31)
	at com.carrotsearch.randomizedtesting.rules.StatementAdapter.evaluate(StatementAdapter.java:43)
	at com.carrotsearch.randomizedtesting.rules.StatementAdapter.evaluate(StatementAdapter.java:36)
	at org.apache.lucene.util.TestRuleAssertionsRequired$1.evaluate(TestRuleAssertionsRequired.java:53)
	at org.apache.lucene.util.TestRuleMarkFailure$1.evaluate(TestRuleMarkFailure.java:47)
	at org.apache.lucene.util.TestRuleIgnoreAfterMaxFailures$1.evaluate(TestRuleIgnoreAfterMaxFailures.java:64)
	at org.apache.lucene.util.TestRuleIgnoreTestSuites$1.evaluate(TestRuleIgnoreTestSuites.java:54)
	at com.carrotsearch.randomizedtesting.rules.StatementAdapter.evaluate(StatementAdapter.java:36)
	at com.carrotsearch.randomizedtesting.ThreadLeakControl$StatementRunner.run(ThreadLeakControl.java:368)
	at java.base/java.lang.Thread.run(Thread.java:844)


FAILED:  org.apache.solr.cloud.DocValuesNotIndexedTest.testGroupingSorting

Error Message:
Should have exactly 4 documents returned expected:<4> but was:<3>

Stack Trace:
java.lang.AssertionError: Should have exactly 4 documents returned expected:<4> but was:<3>
	at __randomizedtesting.SeedInfo.seed([61917732EFD3DD4C:7FA97F3A937867CC]:0)
	at org.junit.Assert.fail(Assert.java:93)
	at org.junit.Assert.failNotEquals(Assert.java:647)
	at org.junit.Assert.assertEquals(Assert.java:128)
	at org.junit.Assert.assertEquals(Assert.java:472)
	at org.apache.solr.cloud.DocValuesNotIndexedTest.checkSortOrder(DocValuesNotIndexedTest.java:260)
	at org.apache.solr.cloud.DocValuesNotIndexedTest.testGroupingSorting(DocValuesNotIndexedTest.java:245)
	at java.base/jdk.internal.reflect.NativeMethodAccessorImpl.invoke0(Native Method)
	at java.base/jdk.internal.reflect.NativeMethodAccessorImpl.invoke(NativeMethodAccessorImpl.java:62)
	at java.base/jdk.internal.reflect.DelegatingMethodAccessorImpl.invoke(DelegatingMethodAccessorImpl.java:43)
	at java.base/java.lang.reflect.Method.invoke(Method.java:564)
	at com.carrotsearch.randomizedtesting.RandomizedRunner.invoke(RandomizedRunner.java:1737)
	at com.carrotsearch.randomizedtesting.RandomizedRunner$8.evaluate(RandomizedRunner.java:934)
	at com.carrotsearch.randomizedtesting.RandomizedRunner$9.evaluate(RandomizedRunner.java:970)
	at com.carrotsearch.randomizedtesting.RandomizedRunner$10.evaluate(RandomizedRunner.java:984)
	at com.carrotsearch.randomizedtesting.rules.SystemPropertiesRestoreRule$1.evaluate(SystemPropertiesRestoreRule.java:57)
	at org.apache.lucene.util.TestRuleSetupTeardownChained$1.evaluate(TestRuleSetupTeardownChained.java:49)
	at org.apache.lucene.util.AbstractBeforeAfterRule$1.evaluate(AbstractBeforeAfterRule.java:45)
	at org.apache.lucene.util.TestRuleThreadAndTestName$1.evaluate(TestRuleThreadAndTestName.java:48)
	at org.apache.lucene.util.TestRuleIgnoreAfterMaxFailures$1.evaluate(TestRuleIgnoreAfterMaxFailures.java:64)
	at org.apache.lucene.util.TestRuleMarkFailure$1.evaluate(TestRuleMarkFailure.java:47)
	at com.carrotsearch.randomizedtesting.rules.StatementAdapter.evaluate(StatementAdapter.java:36)
	at com.carrotsearch.randomizedtesting.ThreadLeakControl$StatementRunner.run(ThreadLeakControl.java:368)
	at com.carrotsearch.randomizedtesting.ThreadLeakControl.forkTimeoutingTask(ThreadLeakControl.java:817)
	at com.carrotsearch.randomizedtesting.ThreadLeakControl$3.evaluate(ThreadLeakControl.java:468)
	at com.carrotsearch.randomizedtesting.RandomizedRunner.runSingleTest(RandomizedRunner.java:943)
	at com.carrotsearch.randomizedtesting.RandomizedRunner$5.evaluate(RandomizedRunner.java:829)
	at com.carrotsearch.randomizedtesting.RandomizedRunner$6.evaluate(RandomizedRunner.java:879)
	at com.carrotsearch.randomizedtesting.RandomizedRunner$7.evaluate(RandomizedRunner.java:890)
	at com.carrotsearch.randomizedtesting.rules.StatementAdapter.evaluate(StatementAdapter.java:36)
	at com.carrotsearch.randomizedtesting.rules.SystemPropertiesRestoreRule$1.evaluate(SystemPropertiesRestoreRule.java:57)
	at org.apache.lucene.util.AbstractBeforeAfterRule$1.evaluate(AbstractBeforeAfterRule.java:45)
	at com.carrotsearch.randomizedtesting.rules.StatementAdapter.evaluate(StatementAdapter.java:36)
	at org.apache.lucene.util.TestRuleStoreClassName$1.evaluate(TestRuleStoreClassName.java:41)
	at com.carrotsearch.randomizedtesting.rules.NoShadowingOrOverridesOnMethodsRule$1.evaluate(NoShadowingOrOverridesOnMethodsRule.java:40)
	at com.carrotsearch.randomizedtesting.rules.NoShadowingOrOverridesOnMethodsRule$1.evaluate(NoShadowingOrOverridesOnMethodsRule.java:40)
	at com.carrotsearch.randomizedtesting.rules.StatementAdapter.evaluate(StatementAdapter.java:36)
	at com.carrotsearch.randomizedtesting.rules.StatementAdapter.evaluate(StatementAdapter.java:36)
	at org.apache.lucene.util.TestRuleAssertionsRequired$1.evaluate(TestRuleAssertionsRequired.java:53)
	at org.apache.lucene.util.TestRuleMarkFailure$1.evaluate(TestRuleMarkFailure.java:47)
	at org.apache.lucene.util.TestRuleIgnoreAfterMaxFailures$1.evaluate(TestRuleIgnoreAfterMaxFailures.java:64)
	at org.apache.lucene.util.TestRuleIgnoreTestSuites$1.evaluate(TestRuleIgnoreTestSuites.java:54)
	at com.carrotsearch.randomizedtesting.rules.StatementAdapter.evaluate(StatementAdapter.java:36)
	at com.carrotsearch.randomizedtesting.ThreadLeakControl$StatementRunner.run(ThreadLeakControl.java:368)
	at java.base/java.lang.Thread.run(Thread.java:844)


FAILED:  junit.framework.TestSuite.org.apache.solr.core.TestConfigSetImmutable

Error Message:
Could not remove the following files (in the order of attempts):    C:\Users\jenkins\workspace\Lucene-Solr-master-Windows\solr\build\solr-core\test\J0\temp\solr.core.TestConfigSetImmutable_61917732EFD3DD4C-001\tempDir-009\cores\core: java.nio.file.DirectoryNotEmptyException: C:\Users\jenkins\workspace\Lucene-Solr-master-Windows\solr\build\solr-core\test\J0\temp\solr.core.TestConfigSetImmutable_61917732EFD3DD4C-001\tempDir-009\cores\core    C:\Users\jenkins\workspace\Lucene-Solr-master-Windows\solr\build\solr-core\test\J0\temp\solr.core.TestConfigSetImmutable_61917732EFD3DD4C-001\tempDir-009\cores: java.nio.file.DirectoryNotEmptyException: C:\Users\jenkins\workspace\Lucene-Solr-master-Windows\solr\build\solr-core\test\J0\temp\solr.core.TestConfigSetImmutable_61917732EFD3DD4C-001\tempDir-009\cores    C:\Users\jenkins\workspace\Lucene-Solr-master-Windows\solr\build\solr-core\test\J0\temp\solr.core.TestConfigSetImmutable_61917732EFD3DD4C-001\tempDir-009: java.nio.file.DirectoryNotEmptyException: C:\Users\jenkins\workspace\Lucene-Solr-master-Windows\solr\build\solr-core\test\J0\temp\solr.core.TestConfigSetImmutable_61917732EFD3DD4C-001\tempDir-009 

Stack Trace:
java.io.IOException: Could not remove the following files (in the order of attempts):
   C:\Users\jenkins\workspace\Lucene-Solr-master-Windows\solr\build\solr-core\test\J0\temp\solr.core.TestConfigSetImmutable_61917732EFD3DD4C-001\tempDir-009\cores\core: java.nio.file.DirectoryNotEmptyException: C:\Users\jenkins\workspace\Lucene-Solr-master-Windows\solr\build\solr-core\test\J0\temp\solr.core.TestConfigSetImmutable_61917732EFD3DD4C-001\tempDir-009\cores\core
   C:\Users\jenkins\workspace\Lucene-Solr-master-Windows\solr\build\solr-core\test\J0\temp\solr.core.TestConfigSetImmutable_61917732EFD3DD4C-001\tempDir-009\cores: java.nio.file.DirectoryNotEmptyException: C:\Users\jenkins\workspace\Lucene-Solr-master-Windows\solr\build\solr-core\test\J0\temp\solr.core.TestConfigSetImmutable_61917732EFD3DD4C-001\tempDir-009\cores
   C:\Users\jenkins\workspace\Lucene-Solr-master-Windows\solr\build\solr-core\test\J0\temp\solr.core.TestConfigSetImmutable_61917732EFD3DD4C-001\tempDir-009: java.nio.file.DirectoryNotEmptyException: C:\Users\jenkins\workspace\Lucene-Solr-master-Windows\solr\build\solr-core\test\J0\temp\solr.core.TestConfigSetImmutable_61917732EFD3DD4C-001\tempDir-009

	at __randomizedtesting.SeedInfo.seed([61917732EFD3DD4C]:0)
	at org.apache.lucene.util.IOUtils.rm(IOUtils.java:329)
	at org.apache.lucene.util.TestRuleTemporaryFilesCleanup.afterAlways(TestRuleTemporaryFilesCleanup.java:216)
	at com.carrotsearch.randomizedtesting.rules.TestRuleAdapter$1.afterAlways(TestRuleAdapter.java:31)
	at com.carrotsearch.randomizedtesting.rules.StatementAdapter.evaluate(StatementAdapter.java:43)
	at com.carrotsearch.randomizedtesting.rules.StatementAdapter.evaluate(StatementAdapter.java:36)
	at org.apache.lucene.util.TestRuleAssertionsRequired$1.evaluate(TestRuleAssertionsRequired.java:53)
	at org.apache.lucene.util.TestRuleMarkFailure$1.evaluate(TestRuleMarkFailure.java:47)
	at org.apache.lucene.util.TestRuleIgnoreAfterMaxFailures$1.evaluate(TestRuleIgnoreAfterMaxFailures.java:64)
	at org.apache.lucene.util.TestRuleIgnoreTestSuites$1.evaluate(TestRuleIgnoreTestSuites.java:54)
	at com.carrotsearch.randomizedtesting.rules.StatementAdapter.evaluate(StatementAdapter.java:36)
	at com.carrotsearch.randomizedtesting.ThreadLeakControl$StatementRunner.run(ThreadLeakControl.java:368)
	at java.base/java.lang.Thread.run(Thread.java:844)


FAILED:  junit.framework.TestSuite.org.apache.solr.search.TestSearcherReuse

Error Message:
Could not remove the following files (in the order of attempts):    C:\Users\jenkins\workspace\Lucene-Solr-master-Windows\solr\build\solr-core\test\J1\temp\solr.search.TestSearcherReuse_61917732EFD3DD4C-001\init-core-data-001\index: java.nio.file.DirectoryNotEmptyException: C:\Users\jenkins\workspace\Lucene-Solr-master-Windows\solr\build\solr-core\test\J1\temp\solr.search.TestSearcherReuse_61917732EFD3DD4C-001\init-core-data-001\index    C:\Users\jenkins\workspace\Lucene-Solr-master-Windows\solr\build\solr-core\test\J1\temp\solr.search.TestSearcherReuse_61917732EFD3DD4C-001\init-core-data-001: java.nio.file.DirectoryNotEmptyException: C:\Users\jenkins\workspace\Lucene-Solr-master-Windows\solr\build\solr-core\test\J1\temp\solr.search.TestSearcherReuse_61917732EFD3DD4C-001\init-core-data-001    C:\Users\jenkins\workspace\Lucene-Solr-master-Windows\solr\build\solr-core\test\J1\temp\solr.search.TestSearcherReuse_61917732EFD3DD4C-001\init-core-data-001\index\segments_5: java.nio.file.AccessDeniedException: C:\Users\jenkins\workspace\Lucene-Solr-master-Windows\solr\build\solr-core\test\J1\temp\solr.search.TestSearcherReuse_61917732EFD3DD4C-001\init-core-data-001\index\segments_5    C:\Users\jenkins\workspace\Lucene-Solr-master-Windows\solr\build\solr-core\test\J1\temp\solr.search.TestSearcherReuse_61917732EFD3DD4C-001: java.nio.file.DirectoryNotEmptyException: C:\Users\jenkins\workspace\Lucene-Solr-master-Windows\solr\build\solr-core\test\J1\temp\solr.search.TestSearcherReuse_61917732EFD3DD4C-001 

Stack Trace:
java.io.IOException: Could not remove the following files (in the order of attempts):
   C:\Users\jenkins\workspace\Lucene-Solr-master-Windows\solr\build\solr-core\test\J1\temp\solr.search.TestSearcherReuse_61917732EFD3DD4C-001\init-core-data-001\index: java.nio.file.DirectoryNotEmptyException: C:\Users\jenkins\workspace\Lucene-Solr-master-Windows\solr\build\solr-core\test\J1\temp\solr.search.TestSearcherReuse_61917732EFD3DD4C-001\init-core-data-001\index
   C:\Users\jenkins\workspace\Lucene-Solr-master-Windows\solr\build\solr-core\test\J1\temp\solr.search.TestSearcherReuse_61917732EFD3DD4C-001\init-core-data-001: java.nio.file.DirectoryNotEmptyException: C:\Users\jenkins\workspace\Lucene-Solr-master-Windows\solr\build\solr-core\test\J1\temp\solr.search.TestSearcherReuse_61917732EFD3DD4C-001\init-core-data-001
   C:\Users\jenkins\workspace\Lucene-Solr-master-Windows\solr\build\solr-core\test\J1\temp\solr.search.TestSearcherReuse_61917732EFD3DD4C-001\init-core-data-001\index\segments_5: java.nio.file.AccessDeniedException: C:\Users\jenkins\workspace\Lucene-Solr-master-Windows\solr\build\solr-core\test\J1\temp\solr.search.TestSearcherReuse_61917732EFD3DD4C-001\init-core-data-001\index\segments_5
   C:\Users\jenkins\workspace\Lucene-Solr-master-Windows\solr\build\solr-core\test\J1\temp\solr.search.TestSearcherReuse_61917732EFD3DD4C-001: java.nio.file.DirectoryNotEmptyException: C:\Users\jenkins\workspace\Lucene-Solr-master-Windows\solr\build\solr-core\test\J1\temp\solr.search.TestSearcherReuse_61917732EFD3DD4C-001

	at __randomizedtesting.SeedInfo.seed([61917732EFD3DD4C]:0)
	at org.apache.lucene.util.IOUtils.rm(IOUtils.java:329)
	at org.apache.lucene.util.TestRuleTemporaryFilesCleanup.afterAlways(TestRuleTemporaryFilesCleanup.java:216)
	at com.carrotsearch.randomizedtesting.rules.TestRuleAdapter$1.afterAlways(TestRuleAdapter.java:31)
	at com.carrotsearch.randomizedtesting.rules.StatementAdapter.evaluate(StatementAdapter.java:43)
	at com.carrotsearch.randomizedtesting.rules.StatementAdapter.evaluate(StatementAdapter.java:36)
	at org.apache.lucene.util.TestRuleAssertionsRequired$1.evaluate(TestRuleAssertionsRequired.java:53)
	at org.apache.lucene.util.TestRuleMarkFailure$1.evaluate(TestRuleMarkFailure.java:47)
	at org.apache.lucene.util.TestRuleIgnoreAfterMaxFailures$1.evaluate(TestRuleIgnoreAfterMaxFailures.java:64)
	at org.apache.lucene.util.TestRuleIgnoreTestSuites$1.evaluate(TestRuleIgnoreTestSuites.java:54)
	at com.carrotsearch.randomizedtesting.rules.StatementAdapter.evaluate(StatementAdapter.java:36)
	at com.carrotsearch.randomizedtesting.ThreadLeakControl$StatementRunner.run(ThreadLeakControl.java:368)
	at java.base/java.lang.Thread.run(Thread.java:844)




Build Log:
[...truncated 1163 lines...]
   [junit4] Suite: org.apache.lucene.search.spans.TestSpans
   [junit4]   2> NOTE: reproduce with: ant test  -Dtestcase=TestSpans -Dtests.method=testSpanScorerZeroSloppyFreq -Dtests.seed=E8791717EDD7A545 -Dtests.slow=true -Dtests.locale=en-PG -Dtests.timezone=Etc/UCT -Dtests.asserts=true -Dtests.file.encoding=Cp1252
   [junit4] FAILURE 0.00s J1 | TestSpans.testSpanScorerZeroSloppyFreq <<<
   [junit4]    > Throwable #1: java.lang.AssertionError: first doc score should be zero, 3.0794418
   [junit4]    > 	at __randomizedtesting.SeedInfo.seed([E8791717EDD7A545:D40AA33C5B359042]:0)
   [junit4]    > 	at org.apache.lucene.search.spans.TestSpans.testSpanScorerZeroSloppyFreq(TestSpans.java:320)
   [junit4]    > 	at java.base/jdk.internal.reflect.NativeMethodAccessorImpl.invoke0(Native Method)
   [junit4]    > 	at java.base/jdk.internal.reflect.NativeMethodAccessorImpl.invoke(NativeMethodAccessorImpl.java:62)
   [junit4]    > 	at java.base/jdk.internal.reflect.DelegatingMethodAccessorImpl.invoke(DelegatingMethodAccessorImpl.java:43)
   [junit4]    > 	at java.base/java.lang.reflect.Method.invoke(Method.java:564)
   [junit4]    > 	at java.base/java.lang.Thread.run(Thread.java:844)
   [junit4]   2> NOTE: test params are: codec=Asserting(Lucene70), sim=Asserting(org.apache.lucene.search.similarities.AssertingSimilarity@13ca9ac9), locale=en-PG, timezone=Etc/UCT
   [junit4]   2> NOTE: Windows 10 10.0 amd64/Oracle Corporation 9.0.1 (64-bit)/cpus=3,threads=1,free=173608600,total=315097088
   [junit4]   2> NOTE: All tests run in this JVM: [Test2BPostings, TestMathUtil, TestNoDeletionPolicy, TestFilterDirectoryReader, TestLucene60FieldInfoFormat, TestFastDecompressionMode, Test2BDocs, TestNoMergeScheduler, TestTransactions, TestBytesStore, TestPhraseQuery, TestPositiveScoresOnlyCollector, TestPolygon2D, TestExitableDirectoryReader, TestManyFields, TestMixedDocValuesUpdates, TestFixedBitDocIdSet, TestIndexWriterOnDiskFull, TestFieldType, Test2BPostingsBytes, TestPersistentSnapshotDeletionPolicy, TestDirectPacked, FiniteStringsIteratorTest, TestBasics, TestCompiledAutomaton, TestFieldMaskingSpanQuery, TestSegmentTermDocs, TestBlockPostingsFormat, TestSortRandom, TestIntRangeFieldQueries, TestWeakIdentityMap, TestSizeBoundedForceMerge, TestNRTReaderCleanup, TestStringHelper, TestLucene70NormsFormat, TestMultiset, TestLongRangeFieldQueries, TestIndexWriterOnVMError, TestControlledRealTimeReopenThread, TestSubScorerFreqs, TestMultiTermConstantScore, TestSegmentMerger, TestStressIndexing2, TestTermVectorsReader, FuzzyTermOnShortTermsTest, TestRollback, TestFlex, TestIndexCommit, Test2BPagedBytes, TestField, TestLMDirichletSimilarity, TestUniqueTermCount, TestTrackingDirectoryWrapper, TestDocumentWriter, TestAxiomaticF1EXP, TestTimSorter, TestTopFieldCollector, TestIndexWriterDeleteByQuery, TestByteSlices, TestPagedBytes, TestTermdocPerf, TestDocValuesScoring, TestPayloads, TestGeoUtils, TestSortedSetDocValues, TestReaderClosed, TestGraphTokenizers, TestIndexWriterNRTIsCurrent, TestAllFilesCheckIndexHeader, TestMultiCollector, TestNot, TestSetOnce, TestParallelTermEnum, TestApproximationSearchEquivalence, TestClassicSimilarity, TestMatchNoDocsQuery, TestPerSegmentDeletes, TestNRTReaderWithThreads, TestIndependenceSaturated, TestAxiomaticSimilarity, TestIntsRef, TestSpanMultiTermQueryWrapper, TestDuelingCodecsAtNight, TestFrequencyTrackingRingBuffer, TestCachingTokenFilter, TestFilterSpans, TestForTooMuchCloning, TestMergePolicyWrapper, TestDelegatingAnalyzerWrapper, TestSpanFirstQuery, Test2BBinaryDocValues, TestBKD, TestIndexWriterDelete, TestIntroSorter, TestBytesRefHash, TestRadixSelector, TestSearchAfter, TestSortedSetSortField, TestTermQuery, TestBoostQuery, TestSpanOrQuery, TestRollingUpdates, TestTermRangeQuery, TestStressNRT, TestConcurrentMergeScheduler, TestNearSpansOrdered, TestDocumentsWriterStallControl, TestVersion, TestMultiFields, TestDirectoryReaderReopen, TestSortedNumericSortField, TestBytesRefAttImpl, TestIndexedDISI, TestAxiomaticF3EXP, TestIndexOrDocValuesQuery, TestEarlyTermination, TestTotalHitCountCollector, TestTryDelete, TestPerFieldDocValuesFormat, TestIndexWriterReader, TestFSTs, TestPackedInts, TestShardSearching, TestIndexWriterExceptions, TestMultiMMap, TestSearcherManager, TestDeletionPolicy, TestFlushByRamOrCountsPolicy, TestSloppyPhraseQuery, TestIndexWriterMergePolicy, TestNRTThreads, TestDuelingCodecs, TestBoolean2, TestAtomicUpdate, TestStressAdvance, TestNorms, TestIndexWriterCommit, TestTimeLimitingCollector, TestSearchWithThreads, TestTopDocsMerge, TestLongPostings, TestStressIndexing, TestMinimize, TestIndexWriterUnicode, TestIndexWriterForceMerge, TestPerFieldPostingsFormat, TestArrayUtil, TestLevenshteinAutomata, TestBufferedIndexInput, TestTermsEnum, TestConsistentFieldNumbers, TestSimpleExplanations, TestLockFactory, TestCollectionUtil, TestBagOfPositions, TestOmitNorms, TestFixedBitSet, TestComplexExplanations, TestRegexpRandom2, TestNRTCachingDirectory, TestSegmentReader, TestCrash, TestPerFieldPostingsFormat2, TestSort, TestMultiDocValues, TestSimpleSearchEquivalence, TestCustomSearcherSort, TestDocValuesIndexing, TestSimilarityBase, TestBooleanMinShouldMatch, TestTermsEnum2, TestSpans]
   [junit4] Completed [289/475 (1!)] on J1 in 0.13s, 26 tests, 1 failure <<< FAILURES!

[...truncated 177 lines...]
   [junit4] Suite: org.apache.lucene.search.TestSimilarity
   [junit4]   2> NOTE: reproduce with: ant test  -Dtestcase=TestSimilarity -Dtests.method=testSimilarity -Dtests.seed=E8791717EDD7A545 -Dtests.slow=true -Dtests.locale=vo -Dtests.timezone=America/Shiprock -Dtests.asserts=true -Dtests.file.encoding=Cp1252
   [junit4] FAILURE 0.01s J1 | TestSimilarity.testSimilarity <<<
   [junit4]    > Throwable #1: java.lang.AssertionError: expected:<2.0> but was:<1.0>
   [junit4]    > 	at __randomizedtesting.SeedInfo.seed([E8791717EDD7A545:19D6572FED37305E]:0)
   [junit4]    > 	at org.apache.lucene.search.TestSimilarity$4.collect(TestSimilarity.java:146)
   [junit4]    > 	at org.apache.lucene.search.AssertingLeafCollector.collect(AssertingLeafCollector.java:52)
   [junit4]    > 	at org.apache.lucene.search.AssertingCollector$1.collect(AssertingCollector.java:56)
   [junit4]    > 	at org.apache.lucene.search.AssertingLeafCollector.collect(AssertingLeafCollector.java:52)
   [junit4]    > 	at org.apache.lucene.search.AssertingLeafCollector.collect(AssertingLeafCollector.java:52)
   [junit4]    > 	at org.apache.lucene.search.Weight$DefaultBulkScorer.scoreAll(Weight.java:293)
   [junit4]    > 	at org.apache.lucene.search.Weight$DefaultBulkScorer.score(Weight.java:236)
   [junit4]    > 	at org.apache.lucene.search.AssertingBulkScorer.score(AssertingBulkScorer.java:79)
   [junit4]    > 	at org.apache.lucene.search.AssertingBulkScorer.score(AssertingBulkScorer.java:63)
   [junit4]    > 	at org.apache.lucene.search.IndexSearcher.search(IndexSearcher.java:645)
   [junit4]    > 	at org.apache.lucene.search.AssertingIndexSearcher.search(AssertingIndexSearcher.java:72)
   [junit4]    > 	at org.apache.lucene.search.IndexSearcher.search(IndexSearcher.java:449)
   [junit4]    > 	at org.apache.lucene.search.TestSimilarity.testSimilarity(TestSimilarity.java:137)
   [junit4]    > 	at java.base/jdk.internal.reflect.NativeMethodAccessorImpl.invoke0(Native Method)
   [junit4]    > 	at java.base/jdk.internal.reflect.NativeMethodAccessorImpl.invoke(NativeMethodAccessorImpl.java:62)
   [junit4]    > 	at java.base/jdk.internal.reflect.DelegatingMethodAccessorImpl.invoke(DelegatingMethodAccessorImpl.java:43)
   [junit4]    > 	at java.base/java.lang.reflect.Method.invoke(Method.java:564)
   [junit4]    > 	at java.base/java.lang.Thread.run(Thread.java:844)
   [junit4]   2> NOTE: test params are: codec=Asserting(Lucene70): {field=Lucene50(blocksize=128)}, docValues:{}, maxPointsInLeafNode=1209, maxMBSortInHeap=5.144673397642066, sim=Asserting(org.apache.lucene.search.similarities.AssertingSimilarity@4d22ebf4), locale=vo, timezone=America/Shiprock
   [junit4]   2> NOTE: Windows 10 10.0 amd64/Oracle Corporation 9.0.1 (64-bit)/cpus=3,threads=1,free=72561816,total=316145664
   [junit4]   2> NOTE: All tests run in this JVM: [Test2BPostings, TestMathUtil, TestNoDeletionPolicy, TestFilterDirectoryReader, TestLucene60FieldInfoFormat, TestFastDecompressionMode, Test2BDocs, TestNoMergeScheduler, TestTransactions, TestBytesStore, TestPhraseQuery, TestPositiveScoresOnlyCollector, TestPolygon2D, TestExitableDirectoryReader, TestManyFields, TestMixedDocValuesUpdates, TestFixedBitDocIdSet, TestIndexWriterOnDiskFull, TestFieldType, Test2BPostingsBytes, TestPersistentSnapshotDeletionPolicy, TestDirectPacked, FiniteStringsIteratorTest, TestBasics, TestCompiledAutomaton, TestFieldMaskingSpanQuery, TestSegmentTermDocs, TestBlockPostingsFormat, TestSortRandom, TestIntRangeFieldQueries, TestWeakIdentityMap, TestSizeBoundedForceMerge, TestNRTReaderCleanup, TestStringHelper, TestLucene70NormsFormat, TestMultiset, TestLongRangeFieldQueries, TestIndexWriterOnVMError, TestControlledRealTimeReopenThread, TestSubScorerFreqs, TestMultiTermConstantScore, TestSegmentMerger, TestStressIndexing2, TestTermVectorsReader, FuzzyTermOnShortTermsTest, TestRollback, TestFlex, TestIndexCommit, Test2BPagedBytes, TestField, TestLMDirichletSimilarity, TestUniqueTermCount, TestTrackingDirectoryWrapper, TestDocumentWriter, TestAxiomaticF1EXP, TestTimSorter, TestTopFieldCollector, TestIndexWriterDeleteByQuery, TestByteSlices, TestPagedBytes, TestTermdocPerf, TestDocValuesScoring, TestPayloads, TestGeoUtils, TestSortedSetDocValues, TestReaderClosed, TestGraphTokenizers, TestIndexWriterNRTIsCurrent, TestAllFilesCheckIndexHeader, TestMultiCollector, TestNot, TestSetOnce, TestParallelTermEnum, TestApproximationSearchEquivalence, TestClassicSimilarity, TestMatchNoDocsQuery, TestPerSegmentDeletes, TestNRTReaderWithThreads, TestIndependenceSaturated, TestAxiomaticSimilarity, TestIntsRef, TestSpanMultiTermQueryWrapper, TestDuelingCodecsAtNight, TestFrequencyTrackingRingBuffer, TestCachingTokenFilter, TestFilterSpans, TestForTooMuchCloning, TestMergePolicyWrapper, TestDelegatingAnalyzerWrapper, TestSpanFirstQuery, Test2BBinaryDocValues, TestBKD, TestIndexWriterDelete, TestIntroSorter, TestBytesRefHash, TestRadixSelector, TestSearchAfter, TestSortedSetSortField, TestTermQuery, TestBoostQuery, TestSpanOrQuery, TestRollingUpdates, TestTermRangeQuery, TestStressNRT, TestConcurrentMergeScheduler, TestNearSpansOrdered, TestDocumentsWriterStallControl, TestVersion, TestMultiFields, TestDirectoryReaderReopen, TestSortedNumericSortField, TestBytesRefAttImpl, TestIndexedDISI, TestAxiomaticF3EXP, TestIndexOrDocValuesQuery, TestEarlyTermination, TestTotalHitCountCollector, TestTryDelete, TestPerFieldDocValuesFormat, TestIndexWriterReader, TestFSTs, TestPackedInts, TestShardSearching, TestIndexWriterExceptions, TestMultiMMap, TestSearcherManager, TestDeletionPolicy, TestFlushByRamOrCountsPolicy, TestSloppyPhraseQuery, TestIndexWriterMergePolicy, TestNRTThreads, TestDuelingCodecs, TestBoolean2, TestAtomicUpdate, TestStressAdvance, TestNorms, TestIndexWriterCommit, TestTimeLimitingCollector, TestSearchWithThreads, TestTopDocsMerge, TestLongPostings, TestStressIndexing, TestMinimize, TestIndexWriterUnicode, TestIndexWriterForceMerge, TestPerFieldPostingsFormat, TestArrayUtil, TestLevenshteinAutomata, TestBufferedIndexInput, TestTermsEnum, TestConsistentFieldNumbers, TestSimpleExplanations, TestLockFactory, TestCollectionUtil, TestBagOfPositions, TestOmitNorms, TestFixedBitSet, TestComplexExplanations, TestRegexpRandom2, TestNRTCachingDirectory, TestSegmentReader, TestCrash, TestPerFieldPostingsFormat2, TestSort, TestMultiDocValues, TestSimpleSearchEquivalence, TestCustomSearcherSort, TestDocValuesIndexing, TestSimilarityBase, TestBooleanMinShouldMatch, TestTermsEnum2, TestSpans, TestPostingsOffsets, TestTransactionRollback, TestFastCompressionMode, TestRAMDirectory, TestMultiPhraseQuery, TestLazyProxSkipping, TestDeterminism, TestMergeSchedulerExternal, TestBagOfPostings, TestTermVectorsWriter, TestThreadedForceMerge, TestScorerPerf, TestWildcard, TestExternalCodecs, TestSimpleExplanationsOfNonMatches, TestRegexpQuery, TestPrefixInBooleanQuery, TestComplexExplanationsOfNonMatches, TestPrefixCodedTerms, TestMaxTermFrequency, TestFileSwitchDirectory, TestSentinelIntSet, TestRegexpRandom, TestMultiLevelSkipList, TestPayloadsOnVectors, TestBooleanQueryVisitSubscorers, TestIndexFileDeleter, TestElevationComparator, TestIndexWriterConfig, TestMultiTermQueryRewrites, TestSimilarity]
   [junit4] Completed [344/475 (2!)] on J1 in 0.01s, 1 test, 1 failure <<< FAILURES!

[...truncated 701 lines...]
   [junit4] Suite: org.apache.lucene.codecs.asserting.TestAssertingDocValuesFormat
   [junit4]   2> NOTE: test params are: codec=FastCompressingStoredFields(storedFieldsFormat=CompressingStoredFieldsFormat(compressionMode=FAST, chunkSize=9913, maxDocsPerChunk=7, blockSize=7), termVectorsFormat=CompressingTermVectorsFormat(compressionMode=FAST, chunkSize=9913, blockSize=7)), sim=Asserting(org.apache.lucene.search.similarities.AssertingSimilarity@43c13094), locale=fr-LU, timezone=Asia/Qyzylorda
   [junit4]   2> NOTE: Windows 10 10.0 amd64/Oracle Corporation 9.0.1 (64-bit)/cpus=3,threads=1,free=103743304,total=204472320
   [junit4]   2> NOTE: All tests run in this JVM: [Nested, Nested, Nested, Nested, Nested, Nested, Nested, Nested, Nested, Nested, Nested, Nested, Nested, Nested, Nested, Nested, Nested, Nested, Nested, Nested, Nested, TestHandleLimitFS, NestedSetupChain, NestedTeardownChain, TestAssertingStoredFieldsFormat, TestLeakFS, TestAssertingDocValuesFormat]
   [junit4]   2> NOTE: reproduce with: ant test  -Dtestcase=TestAssertingDocValuesFormat -Dtests.seed=A0461ED9A603ED03 -Dtests.slow=true -Dtests.locale=fr-LU -Dtests.timezone=Asia/Qyzylorda -Dtests.asserts=true -Dtests.file.encoding=Cp1252
   [junit4] ERROR   0.00s J0 | TestAssertingDocValuesFormat (suite) <<<
   [junit4]    > Throwable #1: java.io.IOException: Could not remove the following files (in the order of attempts):
   [junit4]    >    C:\Users\jenkins\workspace\Lucene-Solr-master-Windows\lucene\build\test-framework\test\J0\temp\lucene.codecs.asserting.TestAssertingDocValuesFormat_A0461ED9A603ED03-001\dvduel-012\segments_b: java.nio.file.AccessDeniedException: C:\Users\jenkins\workspace\Lucene-Solr-master-Windows\lucene\build\test-framework\test\J0\temp\lucene.codecs.asserting.TestAssertingDocValuesFormat_A0461ED9A603ED03-001\dvduel-012\segments_b
   [junit4]    >    C:\Users\jenkins\workspace\Lucene-Solr-master-Windows\lucene\build\test-framework\test\J0\temp\lucene.codecs.asserting.TestAssertingDocValuesFormat_A0461ED9A603ED03-001\dvduel-012: java.nio.file.DirectoryNotEmptyException: C:\Users\jenkins\workspace\Lucene-Solr-master-Windows\lucene\build\test-framework\test\J0\temp\lucene.codecs.asserting.TestAssertingDocValuesFormat_A0461ED9A603ED03-001\dvduel-012
   [junit4]    > 	at __randomizedtesting.SeedInfo.seed([A0461ED9A603ED03]:0)
   [junit4]    > 	at org.apache.lucene.util.IOUtils.rm(IOUtils.java:329)
   [junit4]    > 	at java.base/java.lang.Thread.run(Thread.java:844)
   [junit4] Completed [25/41 (1!)] on J0 in 27.34s, 108 tests, 1 error <<< FAILURES!

[...truncated 2588 lines...]
   [junit4] Suite: org.apache.lucene.index.TestBackwardsCompatibility
   [junit4] IGNOR/A 0.00s J0 | TestBackwardsCompatibility.testCreateEmptyIndex
   [junit4]    > Assumption #1: backcompat creation tests must be run with -Dtests.bwcdir=/path/to/write/indexes
   [junit4] IGNOR/A 0.00s J0 | TestBackwardsCompatibility.testCreateNoCFS
   [junit4]    > Assumption #1: backcompat creation tests must be run with -Dtests.bwcdir=/path/to/write/indexes
   [junit4] IGNOR/A 0.00s J0 | TestBackwardsCompatibility.testCreateSortedIndex
   [junit4]    > Assumption #1: backcompat creation tests must be run with -Dtests.bwcdir=/path/to/write/indexes
   [junit4] IGNOR/A 0.00s J0 | TestBackwardsCompatibility.testCreateCFS
   [junit4]    > Assumption #1: backcompat creation tests must be run with -Dtests.bwcdir=/path/to/write/indexes
   [junit4] IGNOR/A 0.00s J0 | TestBackwardsCompatibility.testCreateMoreTermsIndex
   [junit4]    > Assumption #1: backcompat creation tests must be run with -Dtests.bwcdir=/path/to/write/indexes
   [junit4] IGNOR/A 0.00s J0 | TestBackwardsCompatibility.testCreateIndexWithDocValuesUpdates
   [junit4]    > Assumption #1: backcompat creation tests must be run with -Dtests.bwcdir=/path/to/write/indexes
   [junit4] IGNOR/A 0.00s J0 | TestBackwardsCompatibility.testCreateSingleSegmentNoCFS
   [junit4]    > Assumption #1: backcompat creation tests must be run with -Dtests.bwcdir=/path/to/write/indexes
   [junit4] IGNOR/A 0.00s J0 | TestBackwardsCompatibility.testCreateSingleSegmentCFS
   [junit4]    > Assumption #1: backcompat creation tests must be run with -Dtests.bwcdir=/path/to/write/indexes
   [junit4]   2> NOTE: test params are: codec=CheapBastard, sim=Asserting(org.apache.lucene.search.similarities.AssertingSimilarity@77f15164), locale=mzn-IR, timezone=Europe/Lisbon
   [junit4]   2> NOTE: Windows 10 10.0 amd64/Oracle Corporation 9.0.1 (64-bit)/cpus=3,threads=1,free=67869720,total=169869312
   [junit4]   2> NOTE: All tests run in this JVM: [TestBackwardsCompatibility]
   [junit4]   2> NOTE: reproduce with: ant test  -Dtestcase=TestBackwardsCompatibility -Dtests.seed=4AD81EEA31B91251 -Dtests.slow=true -Dtests.locale=mzn-IR -Dtests.timezone=Europe/Lisbon -Dtests.asserts=true -Dtests.file.encoding=ISO-8859-1
   [junit4] ERROR   0.00s J0 | TestBackwardsCompatibility (suite) <<<
   [junit4]    > Throwable #1: java.io.IOException: Could not remove the following files (in the order of attempts):
   [junit4]    >    C:\Users\jenkins\workspace\Lucene-Solr-master-Windows\lucene\build\backward-codecs\test\J0\temp\lucene.index.TestBackwardsCompatibility_4AD81EEA31B91251-001\3.6.0-cfs-001: java.nio.file.DirectoryNotEmptyException: C:\Users\jenkins\workspace\Lucene-Solr-master-Windows\lucene\build\backward-codecs\test\J0\temp\lucene.index.TestBackwardsCompatibility_4AD81EEA31B91251-001\3.6.0-cfs-001
   [junit4]    > 	at __randomizedtesting.SeedInfo.seed([4AD81EEA31B91251]:0)
   [junit4]    > 	at org.apache.lucene.util.IOUtils.rm(IOUtils.java:329)
   [junit4]    > 	at java.base/java.lang.Thread.run(Thread.java:844)
   [junit4] Completed [3/3 (1!)] on J0 in 9.62s, 30 tests, 1 error, 8 skipped <<< FAILURES!

[...truncated 4095 lines...]
   [junit4] Suite: org.apache.lucene.replicator.IndexAndTaxonomyReplicationClientTest
   [junit4]   2> Nov 10, 2017 3:56:24 A. com.carrotsearch.randomizedtesting.RandomizedRunner$QueueUncaughtExceptionsHandler uncaughtException
   [junit4]   2> WARNING: Uncaught exception in thread: Thread[ReplicationThread-indexAndTaxo,5,TGRP-IndexAndTaxonomyReplicationClientTest]
   [junit4]   2> java.lang.AssertionError: handler failed too many times: -1
   [junit4]   2> 	at __randomizedtesting.SeedInfo.seed([EC97BF14B243349F]:0)
   [junit4]   2> 	at org.apache.lucene.replicator.IndexAndTaxonomyReplicationClientTest$4.handleUpdateException(IndexAndTaxonomyReplicationClientTest.java:422)
   [junit4]   2> 	at org.apache.lucene.replicator.ReplicationClient$ReplicationThread.run(ReplicationClient.java:77)
   [junit4]   2> 
   [junit4]   2> NOTE: reproduce with: ant test  -Dtestcase=IndexAndTaxonomyReplicationClientTest -Dtests.method=testConsistencyOnExceptions -Dtests.seed=EC97BF14B243349F -Dtests.slow=true -Dtests.locale=fur -Dtests.timezone=Australia/Broken_Hill -Dtests.asserts=true -Dtests.file.encoding=ISO-8859-1
   [junit4] ERROR   2.86s J0 | IndexAndTaxonomyReplicationClientTest.testConsistencyOnExceptions <<<
   [junit4]    > Throwable #1: com.carrotsearch.randomizedtesting.UncaughtExceptionError: Captured an uncaught exception in thread: Thread[id=83, name=ReplicationThread-indexAndTaxo, state=RUNNABLE, group=TGRP-IndexAndTaxonomyReplicationClientTest]
   [junit4]    > 	at __randomizedtesting.SeedInfo.seed([EC97BF14B243349F:631958B4A02FC760]:0)
   [junit4]    > Caused by: java.lang.AssertionError: handler failed too many times: -1
   [junit4]    > 	at __randomizedtesting.SeedInfo.seed([EC97BF14B243349F]:0)
   [junit4]    > 	at org.apache.lucene.replicator.IndexAndTaxonomyReplicationClientTest$4.handleUpdateException(IndexAndTaxonomyReplicationClientTest.java:422)
   [junit4]    > 	at org.apache.lucene.replicator.ReplicationClient$ReplicationThread.run(ReplicationClient.java:77)
   [junit4]   2> NOTE: reproduce with: ant test  -Dtestcase=IndexAndTaxonomyReplicationClientTest -Dtests.method=testNoUpdateThread -Dtests.seed=EC97BF14B243349F -Dtests.slow=true -Dtests.locale=fur -Dtests.timezone=Australia/Broken_Hill -Dtests.asserts=true -Dtests.file.encoding=ISO-8859-1
   [junit4] ERROR   0.09s J0 | IndexAndTaxonomyReplicationClientTest.testNoUpdateThread <<<
   [junit4]    > Throwable #1: java.io.IOException: Could not remove the following files (in the order of attempts):
   [junit4]    >    C:\Users\jenkins\workspace\Lucene-Solr-master-Windows\lucene\build\replicator\test\J0\temp\lucene.replicator.IndexAndTaxonomyReplicationClientTest_EC97BF14B243349F-001\replicationClientTest-005\1: java.nio.file.DirectoryNotEmptyException: C:\Users\jenkins\workspace\Lucene-Solr-master-Windows\lucene\build\replicator\test\J0\temp\lucene.replicator.IndexAndTaxonomyReplicationClientTest_EC97BF14B243349F-001\replicationClientTest-005\1
   [junit4]    > 	at __randomizedtesting.SeedInfo.seed([EC97BF14B243349F:898E7C7991C36D59]:0)
   [junit4]    > 	at org.apache.lucene.util.IOUtils.rm(IOUtils.java:329)
   [junit4]    > 	at org.apache.lucene.replicator.PerSessionDirectoryFactory.cleanupSession(PerSessionDirectoryFactory.java:58)
   [junit4]    > 	at org.apache.lucene.replicator.ReplicationClient.doUpdate(ReplicationClient.java:259)
   [junit4]    > 	at org.apache.lucene.replicator.ReplicationClient.updateNow(ReplicationClient.java:401)
   [junit4]    > 	at org.apache.lucene.replicator.IndexAndTaxonomyReplicationClientTest.testNoUpdateThread(IndexAndTaxonomyReplicationClientTest.java:227)
   [junit4]    > 	at java.base/jdk.internal.reflect.NativeMethodAccessorImpl.invoke0(Native Method)
   [junit4]    > 	at java.base/jdk.internal.reflect.NativeMethodAccessorImpl.invoke(NativeMethodAccessorImpl.java:62)
   [junit4]    > 	at java.base/jdk.internal.reflect.DelegatingMethodAccessorImpl.invoke(DelegatingMethodAccessorImpl.java:43)
   [junit4]    > 	at java.base/java.lang.reflect.Method.invoke(Method.java:564)
   [junit4]    > 	at java.base/java.lang.Thread.run(Thread.java:844)
   [junit4]   2> NOTE: leaving temporary files on disk at: C:\Users\jenkins\workspace\Lucene-Solr-master-Windows\lucene\build\replicator\test\J0\temp\lucene.replicator.IndexAndTaxonomyReplicationClientTest_EC97BF14B243349F-001
   [junit4]   2> NOTE: test params are: codec=DummyCompressingStoredFields(storedFieldsFormat=CompressingStoredFieldsFormat(compressionMode=DUMMY, chunkSize=1, maxDocsPerChunk=6, blockSize=856), termVectorsFormat=CompressingTermVectorsFormat(compressionMode=DUMMY, chunkSize=1, blockSize=856)), sim=Asserting(org.apache.lucene.search.similarities.AssertingSimilarity@2acf7803), locale=fur, timezone=Australia/Broken_Hill
   [junit4]   2> NOTE: Windows 10 10.0 amd64/Oracle Corporation 9.0.1 (64-bit)/cpus=3,threads=1,free=79321736,total=176685056
   [junit4]   2> NOTE: All tests run in this JVM: [HttpReplicatorTest, TestStressNRTReplication, IndexAndTaxonomyReplicationClientTest]
   [junit4] Completed [9/9 (1!)] on J0 in 4.18s, 5 tests, 2 errors <<< FAILURES!

[...truncated 3264 lines...]
   [junit4] Suite: org.apache.solr.search.TestSearcherReuse
   [junit4]   2> Creating dataDir: C:\Users\jenkins\workspace\Lucene-Solr-master-Windows\solr\build\solr-core\test\J1\temp\solr.search.TestSearcherReuse_61917732EFD3DD4C-001\init-core-data-001
   [junit4]   2> 834993 WARN  (SUITE-TestSearcherReuse-seed#[61917732EFD3DD4C]-worker) [    ] o.a.s.SolrTestCaseJ4 startTrackingSearchers: numOpens=225 numCloses=225
   [junit4]   2> 834993 INFO  (SUITE-TestSearcherReuse-seed#[61917732EFD3DD4C]-worker) [    ] o.a.s.SolrTestCaseJ4 Using PointFields (NUMERIC_POINTS_SYSPROP=true) w/NUMERIC_DOCVALUES_SYSPROP=true
   [junit4]   2> 834994 INFO  (SUITE-TestSearcherReuse-seed#[61917732EFD3DD4C]-worker) [    ] o.a.s.SolrTestCaseJ4 Randomized ssl (false) and clientAuth (false) via: @org.apache.solr.util.RandomizeSSL(reason="", value=0.0/0.0, ssl=0.0/0.0, clientAuth=0.0/0.0)
   [junit4]   2> 834994 INFO  (SUITE-TestSearcherReuse-seed#[61917732EFD3DD4C]-worker) [    ] o.a.s.SolrTestCaseJ4 SecureRandom sanity checks: test.solr.allowed.securerandom=null & java.security.egd=file:/dev/./urandom
   [junit4]   2> 835001 INFO  (SUITE-TestSearcherReuse-seed#[61917732EFD3DD4C]-worker) [    ] o.a.s.SolrTestCaseJ4 ####initCore
   [junit4]   2> 835007 INFO  (SUITE-TestSearcherReuse-seed#[61917732EFD3DD4C]-worker) [    ] o.a.s.c.SolrConfig Using Lucene MatchVersion: 8.0.0
   [junit4]   2> 835012 INFO  (SUITE-TestSearcherReuse-seed#[61917732EFD3DD4C]-worker) [    ] o.a.s.s.ManagedIndexSchemaFactory The schema is configured as managed, but managed schema resource managed-schema not found - loading non-managed schema schema-id-and-version-fields-only.xml instead
   [junit4]   2> 835014 INFO  (SUITE-TestSearcherReuse-seed#[61917732EFD3DD4C]-worker) [    ] o.a.s.s.IndexSchema [null] Schema name=id-and-version-fields-only
   [junit4]   2> 835014 INFO  (SUITE-TestSearcherReuse-seed#[61917732EFD3DD4C]-worker) [    ] o.a.s.s.IndexSchema Loaded schema id-and-version-fields-only/1.6 with uniqueid field id
   [junit4]   2> 835016 INFO  (SUITE-TestSearcherReuse-seed#[61917732EFD3DD4C]-worker) [    ] o.a.s.s.ManagedIndexSchema Upgraded to managed schema at C:\Users\jenkins\workspace\Lucene-Solr-master-Windows\solr\build\solr-core\test\J1\temp\solr.search.TestSearcherReuse_61917732EFD3DD4C-001\tempDir-001\collection1\conf\managed-schema
   [junit4]   2> 835017 INFO  (SUITE-TestSearcherReuse-seed#[61917732EFD3DD4C]-worker) [    ] o.a.s.s.ManagedIndexSchemaFactory After upgrading to managed schema, renamed the non-managed schema C:\Users\jenkins\workspace\Lucene-Solr-master-Windows\solr\build\solr-core\test\J1\temp\solr.search.TestSearcherReuse_61917732EFD3DD4C-001\tempDir-001\collection1\conf\schema-id-and-version-fields-only.xml to C:\Users\jenkins\workspace\Lucene-Solr-master-Windows\solr\build\solr-core\test\J1\temp\solr.search.TestSearcherReuse_61917732EFD3DD4C-001\tempDir-001\collection1\conf\schema-id-and-version-fields-only.xml.bak
   [junit4]   2> 835061 INFO  (SUITE-TestSearcherReuse-seed#[61917732EFD3DD4C]-worker) [    ] o.a.s.m.r.SolrJmxReporter JMX monitoring for 'solr.node' (registry 'solr.node') enabled at server: com.sun.jmx.mbeanserver.JmxMBeanServer@1b4e1849
   [junit4]   2> 835069 INFO  (SUITE-TestSearcherReuse-seed#[61917732EFD3DD4C]-worker) [    ] o.a.s.m.r.SolrJmxReporter JMX monitoring for 'solr.jvm' (registry 'solr.jvm') enabled at server: com.sun.jmx.mbeanserver.JmxMBeanServer@1b4e1849
   [junit4]   2> 835069 INFO  (SUITE-TestSearcherReuse-seed#[61917732EFD3DD4C]-worker) [    ] o.a.s.m.r.SolrJmxReporter JMX monitoring for 'solr.jetty' (registry 'solr.jetty') enabled at server: com.sun.jmx.mbeanserver.JmxMBeanServer@1b4e1849
   [junit4]   2> 835071 INFO  (coreLoadExecutor-2980-thread-1) [    ] o.a.s.c.TransientSolrCoreCacheDefault Allocating transient cache for 2147483647 transient cores
   [junit4]   2> 835081 INFO  (coreLoadExecutor-2980-thread-1) [    x:collection1] o.a.s.c.SolrConfig Using Lucene MatchVersion: 8.0.0
   [junit4]   2> 835087 INFO  (coreLoadExecutor-2980-thread-1) [    x:collection1] o.a.s.s.IndexSchema [collection1] Schema name=id-and-version-fields-only
   [junit4]   2> 835089 INFO  (coreLoadExecutor-2980-thread-1) [    x:collection1] o.a.s.s.IndexSchema Loaded schema id-and-version-fields-only/1.6 with uniqueid field id
   [junit4]   2> 835089 INFO  (coreLoadExecutor-2980-thread-1) [    x:collection1] o.a.s.c.CoreContainer Creating SolrCore 'collection1' using configuration from instancedir C:\Users\jenkins\workspace\Lucene-Solr-master-Windows\solr\build\solr-core\test\J1\temp\solr.search.TestSearcherReuse_61917732EFD3DD4C-001\tempDir-001\collection1, trusted=true
   [junit4]   2> 835089 INFO  (coreLoadExecutor-2980-thread-1) [    x:collection1] o.a.s.m.r.SolrJmxReporter JMX monitoring for 'solr.core.collection1' (registry 'solr.core.collection1') enabled at server: com.sun.jmx.mbeanserver.JmxMBeanServer@1b4e1849
   [junit4]   2> 835089 INFO  (coreLoadExecutor-2980-thread-1) [    x:collection1] o.a.s.c.SolrCore solr.RecoveryStrategy.Builder
   [junit4]   2> 835089 INFO  (coreLoadExecutor-2980-thread-1) [    x:collection1] o.a.s.c.SolrCore [[collection1] ] Opening new SolrCore at [C:\Users\jenkins\workspace\Lucene-Solr-master-Windows\solr\build\solr-core\test\J1\temp\solr.search.TestSearcherReuse_61917732EFD3DD4C-001\tempDir-001\collection1], dataDir=[C:\Users\jenkins\workspace\Lucene-Solr-master-Windows\solr\build\solr-core\test\J1\temp\solr.search.TestSearcherReuse_61917732EFD3DD4C-001\init-core-data-001\]
   [junit4]   2> 835095 INFO  (coreLoadExecutor-2980-thread-1) [    x:collection1] o.a.s.u.RandomMergePolicy RandomMergePolicy wrapping class org.apache.lucene.index.TieredMergePolicy: [TieredMergePolicy: maxMergeAtOnce=34, maxMergeAtOnceExplicit=49, maxMergedSegmentMB=18.6357421875, floorSegmentMB=0.3115234375, forceMergeDeletesPctAllowed=11.06706086054771, segmentsPerTier=43.0, maxCFSSegmentSizeMB=8.796093022207999E12, noCFSRatio=0.0
   [junit4]   2> 835099 WARN  (coreLoadExecutor-2980-thread-1) [    x:collection1] o.a.s.c.RequestHandlers INVALID paramSet a in requestHandler {type = requestHandler,name = /dump,class = DumpRequestHandler,attributes = {initParams=a, name=/dump, registerPath=/solr,/v2, class=DumpRequestHandler},args = {defaults={a=A,b=B}}}
   [junit4]   2> 835159 INFO  (coreLoadExecutor-2980-thread-1) [    x:collection1] o.a.s.u.UpdateHandler Using UpdateLog implementation: org.apache.solr.update.UpdateLog
   [junit4]   2> 835159 INFO  (coreLoadExecutor-2980-thread-1) [    x:collection1] o.a.s.u.UpdateLog Initializing UpdateLog: dataDir= defaultSyncLevel=FLUSH numRecordsToKeep=100 maxNumLogsToKeep=10 numVersionBuckets=65536
   [junit4]   2> 835160 INFO  (coreLoadExecutor-2980-thread-1) [    x:collection1] o.a.s.u.CommitTracker Hard AutoCommit: disabled
   [junit4]   2> 835160 INFO  (coreLoadExecutor-2980-thread-1) [    x:collection1] o.a.s.u.CommitTracker Soft AutoCommit: disabled
   [junit4]   2> 835161 INFO  (coreLoadExecutor-2980-thread-1) [    x:collection1] o.a.s.u.RandomMergePolicy RandomMergePolicy wrapping class org.apache.lucene.index.TieredMergePolicy: [TieredMergePolicy: maxMergeAtOnce=36, maxMergeAtOnceExplicit=39, maxMergedSegmentMB=0.333984375, floorSegmentMB=1.77734375, forceMergeDeletesPctAllowed=23.81204243852879, segmentsPerTier=33.0, maxCFSSegmentSizeMB=8.796093022207999E12, noCFSRatio=0.41964859646204544
   [junit4]   2> 835162 INFO  (coreLoadExecutor-2980-thread-1) [    x:collection1] o.a.s.s.SolrIndexSearcher Opening [Searcher@31c47aa4[collection1] main]
   [junit4]   2> 835163 INFO  (coreLoadExecutor-2980-thread-1) [    x:collection1] o.a.s.r.ManagedResourceStorage File-based storage initialized to use dir: C:\Users\jenkins\workspace\Lucene-Solr-master-Windows\solr\build\solr-core\test\J1\temp\solr.search.TestSearcherReuse_61917732EFD3DD4C-001\tempDir-001\collection1\conf
   [junit4]   2> 835164 INFO  (coreLoadExecutor-2980-thread-1) [    x:collection1] o.a.s.h.ReplicationHandler Commits will be reserved for 10000ms.
   [junit4]   2> 835164 INFO  (searcherExecutor-2981-thread-1-processing-x:collection1) [    x:collection1] o.a.s.c.SolrCore [collection1] Registered new searcher Searcher@31c47aa4[collection1] main{ExitableDirectoryReader(UninvertingDirectoryReader())}
   [junit4]   2> 835165 INFO  (coreLoadExecutor-2980-thread-1) [    x:collection1] o.a.s.u.UpdateLog Could not find max version in index or recent updates, using new clock 1583611253375369216
   [junit4]   2> 835168 INFO  (SUITE-TestSearcherReuse-seed#[61917732EFD3DD4C]-worker) [    ] o.a.s.SolrTestCaseJ4 ####initCore end
   [junit4]   2> 835170 INFO  (TEST-TestSearcherReuse.test-seed#[61917732EFD3DD4C]) [    ] o.a.s.SolrTestCaseJ4 ###Starting test
   [junit4]   2> 835172 INFO  (TEST-TestSearcherReuse.test-seed#[61917732EFD3DD4C]) [    ] o.a.s.u.p.LogUpdateProcessorFactory [collection1]  webapp=null path=null params={}{add=[1 (1583611253380612096)]} 0 2
   [junit4]   2> 835174 INFO  (TEST-TestSearcherReuse.test-seed#[61917732EFD3DD4C]) [    ] o.a.s.u.DirectUpdateHandler2 start commit{_version_=1583611253384806400,optimize=false,openSearcher=true,waitSearcher=true,expungeDeletes=false,softCommit=false,prepareCommit=false}
   [junit4]   2> 835174 INFO  (TEST-TestSearcherReuse.test-seed#[61917732EFD3DD4C]) [    ] o.a.s.u.SolrIndexWriter Calling setCommitData with IW:org.apache.solr.update.SolrIndexWriter@3816c93b commitCommandVersion:1583611253384806400
   [junit4]   2> 835194 INFO  (TEST-TestSearcherReuse.test-seed#[61917732EFD3DD4C]) [    ] o.a.s.s.SolrIndexSearcher Opening [Searcher@5a0d09d3[collection1] main]
   [junit4]   2> 835195 INFO  (searcherExecutor-2981-thread-1) [    ] o.a.s.c.SolrCore [collection1] Registered new searcher Searcher@5a0d09d3[collection1] main{ExitableDirectoryReader(UninvertingDirectoryReader(Uninverting(_0(8.0.0):C1)))}
   [junit4]   2> 835195 INFO  (TEST-TestSearcherReuse.test-seed#[61917732EFD3DD4C]) [    ] o.a.s.u.DirectUpdateHandler2 end_commit_flush
   [junit4]   2> 835195 INFO  (TEST-TestSearcherReuse.test-seed#[61917732EFD3DD4C]) [    ] o.a.s.u.p.LogUpdateProcessorFactory [collection1]  webapp=null path=null params={}{commit=} 0 21
   [junit4]   2> 835195 INFO  (TEST-TestSearcherReuse.test-seed#[61917732EFD3DD4C]) [    ] o.a.s.u.DirectUpdateHandler2 start commit{_version_=1583611253406826496,optimize=true,openSearcher=true,waitSearcher=true,expungeDeletes=false,softCommit=false,prepareCommit=false}
   [junit4]   2> 835196 WARN  (TEST-TestSearcherReuse.test-seed#[61917732EFD3DD4C]) [    ] o.a.s.u.DirectUpdateHandler2 Starting optimize... Reading and rewriting the entire index! Use with care.
   [junit4]   2> 835196 INFO  (TEST-TestSearcherReuse.test-seed#[61917732EFD3DD4C]) [    ] o.a.s.u.DirectUpdateHandler2 No uncommitted changes. Skipping IW.commit.
   [junit4]   2> 835199 INFO  (TEST-TestSearcherReuse.test-seed#[61917732EFD3DD4C]) [    ] o.a.s.u.DirectUpdateHandler2 end_commit_flush
   [junit4]   2> 835199 INFO  (TEST-TestSearcherReuse.test-seed#[61917732EFD3DD4C]) [    ] o.a.s.u.p.LogUpdateProcessorFactory [collection1]  webapp=null path=null params={}{optimize=} 0 3
   [junit4]   2> 835200 INFO  (TEST-TestSearcherReuse.test-seed#[61917732EFD3DD4C]) [    ] o.a.s.c.S.Request [collection1]  webapp=null path=null params={q=*:*&qt=&start=0&rows=20&version=2.2} hits=1 status=0 QTime=0
   [junit4]   2> 835219 INFO  (TEST-TestSearcherReuse.test-seed#[61917732EFD3DD4C]) [    ] o.a.s.u.DirectUpdateHandler2 start commit{_version_=1583611253431992320,optimize=false,openSearcher=true,waitSearcher=true,expungeDeletes=false,softCommit=false,prepareCommit=false}
   [junit4]   2> 835219 INFO  (TEST-TestSearcherReuse.test-seed#[61917732EFD3DD4C]) [    ] o.a.s.u.DirectUpdateHandler2 No uncommitted changes. Skipping IW.commit.
   [junit4]   2> 835220 INFO  (TEST-TestSearcherReuse.test-seed#[61917732EFD3DD4C]) [    ] o.a.s.u.DirectUpdateHandler2 end_commit_flush
   [junit4]   2> 835220 INFO  (TEST-TestSearcherReuse.test-seed#[61917732EFD3DD4C]) [    ] o.a.s.u.p.LogUpdateProcessorFactory [collection1]  webapp=null path=null params={}{commit=} 0 0
   [junit4]   2> 835220 INFO  (TEST-TestSearcherReuse.test-seed#[61917732EFD3DD4C]) [    ] o.a.s.u.DirectUpdateHandler2 start commit{_version_=1583611253433040896,optimize=false,openSearcher=true,waitSearcher=true,expungeDeletes=false,softCommit=false,prepareCommit=false}
   [junit4]   2> 835220 INFO  (TEST-TestSearcherReuse.test-seed#[61917732EFD3DD4C]) [    ] o.a.s.u.DirectUpdateHandler2 No uncommitted changes. Skipping IW.commit.
   [junit4]   2> 835220 INFO  (TEST-TestSearcherReuse.test-seed#[61917732EFD3DD4C]) [    ] o.a.s.u.DirectUpdateHandler2 end_commit_flush
   [junit4]   2> 835220 INFO  (TEST-TestSearcherReuse.test-seed#[61917732EFD3DD4C]) [    ] o.a.s.u.p.LogUpdateProcessorFactory [collection1]  webapp=null path=null params={}{commit=} 0 0
   [junit4]   2> 835220 INFO  (TEST-TestSearcherReuse.test-seed#[61917732EFD3DD4C]) [    ] o.a.s.u.DirectUpdateHandler2 start commit{_version_=1583611253433040897,optimize=false,openSearcher=true,waitSearcher=true,expungeDeletes=false,softCommit=true,prepareCommit=false}
   [junit4]   2> 835220 INFO  (TEST-TestSearcherReuse.test-seed#[61917732EFD3DD4C]) [    ] o.a.s.u.DirectUpdateHandler2 end_commit_flush
   [junit4]   2> 835220 INFO  (TEST-TestSearcherReuse.test-seed#[61917732EFD3DD4C]) [    ] o.a.s.u.p.LogUpdateProcessorFactory [collection1]  webapp=null path=null params={}{commit=} 0 0
   [junit4]   2> 835221 INFO  (TEST-TestSearcherReuse.test-seed#[61917732EFD3DD4C]) [    ] o.a.s.u.DirectUpdateHandler2 start commit{_version_=1583611253434089472,optimize=false,openSearcher=true,waitSearcher=true,expungeDeletes=false,softCommit=true,prepareCommit=false}
   [junit4]   2> 835221 INFO  (TEST-TestSearcherReuse.test-seed#[61917732EFD3DD4C]) [    ] o.a.s.u.DirectUpdateHandler2 end_commit_flush
   [junit4]   2> 835221 INFO  (TEST-TestSearcherReuse.test-seed#[61917732EFD3DD4C]) [    ] o.a.s.u.p.LogUpdateProcessorFactory [collection1]  webapp=null path=null params={}{commit=} 0 0
   [junit4]   2> 835222 INFO  (TEST-TestSearcherReuse.test-seed#[61917732EFD3DD4C]) [    ] o.a.s.u.p.LogUpdateProcessorFactory [collection1]  webapp=null path=null params={}{deleteByQuery=id:match_no_documents (-1583611253434089473)} 0 1
   [junit4]   2> 835222 INFO  (TEST-TestSearcherReuse.test-seed#[61917732EFD3DD4C]) [    ] o.a.s.u.DirectUpdateHandler2 start commit{_version_=1583611253435138048,optimize=false,openSearcher=true,waitSearcher=true,expungeDeletes=false,softCommit=true,prepareCommit=false}
   [junit4]   2> 835223 INFO  (TEST-TestSearcherReuse.test-seed#[61917732EFD3DD4C]) [    ] o.a.s.u.DirectUpdateHandler2 end_commit_flush
   [junit4]   2> 835223 INFO  (TEST-TestSearcherReuse.test-seed#[61917732EFD3DD4C]) [    ] o.a.s.u.p.LogUpdateProcessorFactory [collection1]  webapp=null path=null params={}{commit=} 0 0
   [junit4]   2> 835223 INFO  (TEST-TestSearcherReuse.test-seed#[61917732EFD3DD4C]) [    ] o.a.s.u.p.LogUpdateProcessorFactory [collection1]  webapp=null path=null params={}{delete=[0 (-1583611253436186624)]} 0 0
   [junit4]   2> 835223 INFO  (TEST-TestSearcherReuse.test-seed#[61917732EFD3DD4C]) [    ] o.a.s.u.DirectUpdateHandler2 start commit{_version_=1583611253436186625,optimize=false,openSearcher=true,waitSearcher=true,expungeDeletes=false,softCommit=true,prepareCommit=false}
   [junit4]   2> 835223 INFO  (TEST-TestSearcherReuse.test-seed#[61917732EFD3DD4C]) [    ] o.a.s.u.DirectUpdateHandler2 end_commit_flush
   [junit4]   2> 835223 INFO  (TEST-TestSearcherReuse.test-seed#[61917732EFD3DD4C]) [    ] o.a.s.u.p.LogUpdateProcessorFactory [collection1]  webapp=null path=null params={}{commit=} 0 0
   [junit4]   2> 835224 INFO  (TEST-TestSearcherReuse.test-seed#[61917732EFD3DD4C]) [    ] o.a.s.u.p.LogUpdateProcessorFactory [collection1]  webapp=null path=null params={}{delete=[1 (-1583611253437235200)]} 0 0
   [junit4]   2> 835224 INFO  (TEST-TestSearcherReuse.test-seed#[61917732EFD3DD4C]) [    ] o.a.s.u.DirectUpdateHandler2 start commit{_version_=1583611253437235201,optimize=false,openSearcher=true,waitSearcher=true,expungeDeletes=false,softCommit=false,prepareCommit=false}
   [junit4]   2> 835224 INFO  (TEST-TestSearcherReuse.test-seed#[61917732EFD3DD4C]) [    ] o.a.s.u.SolrIndexWriter Calling setCommitData with IW:org.apache.solr.update.SolrIndexWriter@3816c93b commitCommandVersion:1583611253437235201
   [junit4]   2> 835226 INFO  (TEST-TestSearcherReuse.test-seed#[61917732EFD3DD4C]) [    ] o.a.s.s.SolrIndexSearcher Opening [Searcher@77e354df[collection1] main]
   [junit4]   2> 835227 INFO  (TEST-TestSearcherReuse.test-seed#[61917732EFD3DD4C]) [    ] o.a.s.u.DirectUpdateHandler2 end_commit_flush
   [junit4]   2> 835227 INFO  (searcherExecutor-2981-thread-1) [    ] o.a.s.c.SolrCore [collection1] Registered new searcher Searcher@77e354df[collection1] main{ExitableDirectoryReader(UninvertingDirectoryReader())}
   [junit4]   2> 835227 INFO  (TEST-TestSearcherReuse.test-seed#[61917732EFD3DD4C]) [    ] o.a.s.u.p.LogUpdateProcessorFactory [collection1]  webapp=null path=null params={}{commit=} 0 3
   [junit4]   2> 835232 INFO  (TEST-TestSearcherReuse.test-seed#[61917732EFD3DD4C]) [    ] o.a.s.u.p.LogUpdateProcessorFactory [collection1]  webapp=null path=null params={}{add=[0 (1583611253444575232)]} 0 1
   [junit4]   2> 835232 INFO  (TEST-TestSearcherReuse.test-seed#[61917732EFD3DD4C]) [    ] o.a.s.u.DirectUpdateHandler2 start commit{_version_=1583611253445623808,optimize=false,openSearcher=true,waitSearcher=true,expungeDeletes=false,softCommit=false,prepareCommit=false}
   [junit4]   2> 835232 INFO  (TEST-TestSearcherReuse.test-seed#[61917732EFD3DD4C]) [    ] o.a.s.u.SolrIndexWriter Calling setCommitData with IW:org.apache.solr.update.SolrIndexWriter@3816c93b commitCommandVersion:1583611253445623808
   [junit4]   2> 835253 INFO  (TEST-TestSearcherReuse.test-seed#[61917732EFD3DD4C]) [    ] o.a.s.s.SolrIndexSearcher Opening [Searcher@5ba4c104[collection1] main]
   [junit4]   2> 835254 INFO  (searcherExecutor-2981-thread-1) [    ] o.a.s.c.SolrCore [collection1] Registered new searcher Searcher@5ba4c104[collection1] main{ExitableDirectoryReader(UninvertingDirectoryReader(Uninverting(_1(8.0.0):C1)))}
   [junit4]   2> 835254 INFO  (TEST-TestSearcherReuse.test-seed#[61917732EFD3DD4C]) [    ] o.a.s.u.DirectUpdateHandler2 end_commit_flush
   [junit4]   2> 835254 INFO  (TEST-TestSearcherReuse.test-seed#[61917732EFD3DD4C]) [    ] o.a.s.u.p.LogUpdateProcessorFactory [collection1]  webapp=null path=null params={}{commit=} 0 21
   [junit4]   2> 835273 INFO  (TEST-TestSearcherReuse.test-seed#[61917732EFD3DD4C]) [    ] o.a.s.s.SolrIndexSearcher Opening [Searcher@74de15f3[collection1] realtime]
   [junit4]   2> 835273 INFO  (TEST-TestSearcherReuse.test-seed#[61917732EFD3DD4C]) [    ] o.a.s.u.p.LogUpdateProcessorFactory [collection1]  webapp=null path=null params={}{deleteByQuery=id:[0 TO 5] (-1583611253468692480)} 0 19
   [junit4]   2> 835273 INFO  (TEST-TestSearcherReuse.test-seed#[61917732EFD3DD4C]) [    ] o.a.s.u.DirectUpdateHandler2 start commit{_version_=1583611253488615424,optimize=false,openSearcher=true,waitSearcher=true,expungeDeletes=false,softCommit=false,prepareCommit=false}
   [junit4]   2> 835273 INFO  (TEST-TestSearcherReuse.test-seed#[61917732EFD3DD4C]) [    ] o.a.s.u.SolrIndexWriter Calling setCommitData with IW:org.apache.solr.update.SolrIndexWriter@3816c93b commitCommandVersion:1583611253488615424
   [junit4]   2> 835277 INFO  (TEST-TestSearcherReuse.test-seed#[61917732EFD3DD4C]) [    ] o.a.s.s.SolrIndexSearcher Opening [Searcher@1b8d6a4c[collection1] main]
   [junit4]   2> 835277 INFO  (TEST-TestSearcherReuse.test-seed#[61917732EFD3DD4C]) [    ] o.a.s.u.DirectUpdateHandler2 end_commit_flush
   [junit4]   2> 835279 INFO  (searcherExecutor-2981-thread-1) [    ] o.a.s.c.SolrCore [collection1] Registered new searcher Searcher@1b8d6a4c[collection1] main{ExitableDirectoryReader(UninvertingDirectoryReader())}
   [junit4]   2> 835279 INFO  (TEST-TestSearcherReuse.test-seed#[61917732EFD3DD4C]) [    ] o.a.s.u.p.LogUpdateProcessorFactory [collection1]  webapp=null path=null params={}{commit=} 0 5
   [junit4]   2> 835284 INFO  (TEST-TestSearcherReuse.test-seed#[61917732EFD3DD4C]) [    ] o.a.s.s.ManagedIndexSchema Upgraded to managed schema at C:\Users\jenkins\workspace\Lucene-Solr-master-Windows\solr\build\solr-core\test\J1\temp\solr.search.TestSearcherReuse_61917732EFD3DD4C-001\tempDir-001\collection1\conf\managed-schema
   [junit4]   2> 835286 INFO  (TEST-TestSearcherReuse.test-seed#[61917732EFD3DD4C]) [    ] o.a.s.u.DirectUpdateHandler2 start commit{_version_=1583611253502246912,optimize=false,openSearcher=true,waitSearcher=true,expungeDeletes=false,softCommit=true,prepareCommit=false}
   [junit4]   2> 835286 INFO  (TEST-TestSearcherReuse.test-seed#[61917732EFD3DD4C]) [    ] o.a.s.s.SolrIndexSearcher Opening [Searcher@51678f2e[collection1] main]
   [junit4]   2> 835287 INFO  (TEST-TestSearcherReuse.test-seed#[61917732EFD3DD4C]) [    ] o.a.s.u.DirectUpdateHandler2 end_commit_flush
   [junit4]   2> 835287 INFO  (searcherExecutor-2981-thread-1) [    ] o.a.s.c.SolrCore [collection1] Registered new searcher Searcher@51678f2e[collection1] main{ExitableDirectoryReader(UninvertingDirectoryReader())}
   [junit4]   2> 835287 INFO  (TEST-TestSearcherReuse.test-seed#[61917732EFD3DD4C]) [    ] o.a.s.u.p.LogUpdateProcessorFactory [collection1]  webapp=null path=null params={}{commit=} 0 1
   [junit4]   2> 835287 INFO  (TEST-TestSearcherReuse.test-seed#[61917732EFD3DD4C]) [    ] o.a.s.SolrTestCaseJ4 ###Ending test
   [junit4]   2> 835288 INFO  (TEST-TestSearcherReuse.test-seed#[61917732EFD3DD4C]) [    ] o.a.s.u.p.LogUpdateProcessorFactory [collection1]  webapp=null path=null params={}{deleteByQuery=*:* (-1583611253503295488)} 0 1
   [junit4]   2> 835289 INFO  (TEST-TestSearcherReuse.test-seed#[61917732EFD3DD4C]) [    ] o.a.s.u.DirectUpdateHandler2 start commit{_version_=1583611253505392640,optimize=false,openSearcher=true,waitSearcher=true,expungeDeletes=false,softCommit=false,prepareCommit=false}
   [junit4]   2> 835289 INFO  (TEST-TestSearcherReuse.test-seed#[61917732EFD3DD4C]) [    ] o.a.s.u.DirectUpdateHandler2 No uncommitted changes. Skipping IW.commit.
   [junit4]   2> 835289 INFO  (TEST-TestSearcherReuse.test-seed#[61917732EFD3DD4C]) [    ] o.a.s.u.DirectUpdateHandler2 end_commit_flush
   [junit4]   2> 835289 INFO  (TEST-TestSearcherReuse.test-seed#[61917732EFD3DD4C]) [    ] o.a.s.u.p.LogUpdateProcessorFactory [collection1]  webapp=null path=null params={}{commit=} 0 0
   [junit4]   2> 835289 INFO  (SUITE-TestSearcherReuse-seed#[61917732EFD3DD4C]-worker) [    ] o.a.s.SolrTestCaseJ4 ###deleteCore
   [junit4]   2> 835289 INFO  (SUITE-TestSearcherReuse-seed#[61917732EFD3DD4C]-worker) [    ] o.a.s.c.CoreContainer Shutting down CoreContainer instance=1810182676
   [junit4]   2> 835290 INFO  (SUITE-TestSearcherReuse-seed#[61917732EFD3DD4C]-worker) [    ] o.a.s.m.SolrMetricManager Closing metric reporters for registry=solr.node, tag=null
   [junit4]   2> 835290 INFO  (SUITE-TestSearcherReuse-seed#[61917732EFD3DD4C]-worker) [    ] o.a.s.m.r.SolrJmxReporter Closing reporter [org.apache.solr.metrics.reporters.SolrJmxReporter@51e2dd4a: rootName = null, domain = solr.node, service url = null, agent id = null] for registry solr.node / com.codahale.metrics.MetricRegistry@5419a60e
   [junit4]   2> 835294 INFO  (SUITE-TestSearcherReuse-seed#[61917732EFD3DD4C]-worker) [    ] o.a.s.m.SolrMetricManager Closing metric reporters for registry=solr.jvm, tag=null
   [junit4]   2> 835294 INFO  (SUITE-TestSearcherReuse-seed#[61917732EFD3DD4C]-worker) [    ] o.a.s.m.r.SolrJmxReporter Closing reporter [org.apache.solr.metrics.reporters.SolrJmxReporter@14dc930c: rootName = null, domain = solr.jvm, service url = null, agent id = null] for registry solr.jvm / com.codahale.metrics.MetricRegistry@5cfbe383
   [junit4]   2> 835296 INFO  (SUITE-TestSearcherReuse-seed#[61917732EFD3DD4C]-worker) [    ] o.a.s.m.SolrMetricManager Closing metric reporters for registry=solr.jetty, tag=null
   [junit4]   2> 835296 INFO  (SUITE-TestSearcherReuse-seed#[61917732EFD3DD4C]-worker) [    ] o.a.s.m.r.SolrJmxReporter Closing reporter [org.apache.solr.metrics.reporters.SolrJmxReporter@923bfdb: rootName = null, domain = solr.jetty, service url = null, agent id = null] for registry solr.jetty / com.codahale.metrics.MetricRegistry@31dc60d0
   [junit4]   2> 835297 INFO  (coreCloseExecutor-2986-thread-1) [    x:collection1] o.a.s.c.SolrCore [collection1]  CLOSING SolrCore org.apache.solr.core.SolrCore@6ea2713f
   [junit4]   2> 835297 INFO  (coreCloseExecutor-2986-thread-1) [    x:collection1] o.a.s.m.SolrMetricManager Closing metric reporters for registry=solr.core.collection1, tag=1856139583
   [junit4]   2> 835297 INFO  (coreCloseExecutor-2986-thread-1) [    x:collection1] o.a.s.m.r.SolrJmxReporter Closing reporter [org.apache.solr.metrics.reporters.SolrJmxReporter@5f3ad432: rootName = null, domain = solr.core.collection1, service url = null, agent id = null] for registry solr.core.collection1 / com.codahale.metrics.MetricRegistry@e7d9d1d
   [junit4]   2> 835308 INFO  (SUITE-TestSearcherReuse-seed#[61917732EFD3DD4C]-worker) [    ] o.a.s.SolrTestCaseJ4 ------------------------------------------------------- Done waiting for tracked resources to be released
   [junit4]   2> NOTE: test params are: codec=Asserting(Lucene70): {}, docValues:{}, maxPointsInLeafNode=558, maxMBSortInHeap=6.978609127743088, sim=Asserting(org.apache.lucene.search.similarities.AssertingSimilarity@1146a9e5), locale=mua, timezone=Antarctica/Troll
   [junit4]   2> NOTE: Windows 10 10.0 amd64/Oracle Corporation 9.0.1 (64-bit)/cpus=3,threads=1,free=163469400,total=410517504
   [junit4]   2> NOTE: All tests run in this JVM: [UpdateRequestProcessorFactoryTest, PolyFieldTest, V2StandaloneTest, ZkStateWriterTest, TestDownShardTolerantSearch, TestSolrCLIRunExample, CollectionsAPIDistributedZkTest, ChaosMonkeyNothingIsSafeWithPullReplicasTest, SolrPluginUtilsTest, TestQueryUtils, TestFieldCacheSort, ConnectionManagerTest, TestSolrCloudWithDelegationTokens, TestNRTOpen, NodeMutatorTest, ReplicaListTransformerTest, TestExportWriter, TestSolrIndexConfig, TestCloudPseudoReturnFields, TestBlendedInfixSuggestions, DistribDocExpirationUpdateProcessorTest, HdfsWriteToMultipleCollectionsTest, TestWordDelimiterFilterFactory, SolrJmxReporterCloudTest, TestConfig, TestGraphMLResponseWriter, TestPKIAuthenticationPlugin, TestExtendedDismaxParser, TestManagedSynonymGraphFilterFactory, SpellCheckCollatorWithCollapseTest, TestShardHandlerFactory, RuleEngineTest, TestCollectionAPI, TestFieldCacheVsDocValues, CoreAdminHandlerTest, TestMacroExpander, TestObjectReleaseTracker, TestSuggestSpellingConverter, TestStressReorder, TestLegacyFieldReuse, TestXmlQParserPlugin, TestValueSourceCache, TestSolrConfigHandlerCloud, TestCloudDeleteByQuery, DeleteLastCustomShardedReplicaTest, TestLMJelinekMercerSimilarityFactory, TestCloudJSONFacetJoinDomain, TestManagedResourceStorage, CollectionStateFormat2Test, TestSegmentSorting, SolrCoreTest, CdcrVersionReplicationTest, QueryEqualityTest, DocValuesTest, TestSerializedLuceneMatchVersion, TestIntervalFaceting, UtilsToolTest, TestElisionMultitermQuery, TestPullReplicaErrorHandling, DistributedFacetPivotLargeTest, DistributedQueryComponentOptimizationTest, TestFieldTypeCollectionResource, SolrMetricReporterTest, PKIAuthenticationIntegrationTest, ConcurrentDeleteAndCreateCollectionTest, TestComplexPhraseLeadingWildcard, DocumentBuilderTest, QueryResultKeyTest, TestOrdValues, BaseCdcrDistributedZkTest, TestLegacyTerms, TestPivotHelperCode, HealthCheckHandlerTest, TestRequestStatusCollectionAPI, FileUtilsTest, TestHashPartitioner, BitVectorTest, GraphQueryTest, SearchRateTriggerTest, TestAddFieldRealTimeGet, TestImpersonationWithHadoopAuth, SchemaVersionSpecificBehaviorTest, HdfsRecoveryZkTest, TestStressInPlaceUpdates, ClassificationUpdateProcessorTest, StatelessScriptUpdateProcessorFactoryTest, TestCollectionAPIs, TestSubQueryTransformer, DeleteReplicaTest, DistributedQueueTest, TestRandomFaceting, TestSearcherReuse]
   [junit4]   2> NOTE: reproduce with: ant test  -Dtestcase=TestSearcherReuse -Dtests.seed=61917732EFD3DD4C -Dtests.slow=true -Dtests.locale=mua -Dtests.timezone=Antarctica/Troll -Dtests.asserts=true -Dtests.file.encoding=UTF-8
   [junit4] ERROR   0.00s J1 | TestSearcherReuse (suite) <<<
   [junit4]    > Throwable #1: java.io.IOException: Could not remove the following files (in the order of attempts):
   [junit4]    >    C:\Users\jenkins\workspace\Lucene-Solr-master-Windows\solr\build\solr-core\test\J1\temp\solr.search.TestSearcherReuse_61917732EFD3DD4C-001\init-core-data-001\index: java.nio.file.DirectoryNotEmptyException: C:\Users\jenkins\workspace\Lucene-Solr-master-Windows\solr\build\solr-core\test\J1\temp\solr.search.TestSearcherReuse_61917732EFD3DD4C-001\init-core-data-001\index
   [junit4]    >    C:\Users\jenkins\workspace\Lucene-Solr-master-Windows\solr\build\solr-core\test\J1\temp\solr.search.TestSearcherReuse_61917732EFD3DD4C-001\init-core-data-001: java.nio.file.DirectoryNotEmptyException: C:\Users\jenkins\workspace\Lucene-Solr-master-Windows\solr\build\solr-core\test\J1\temp\solr.search.TestSearcherReuse_61917732EFD3DD4C-001\init-core-data-001
   [junit4]    >    C:\Users\jenkins\workspace\Lucene-Solr-master-Windows\solr\build\solr-core\test\J1\temp\solr.search.TestSearcherReuse_61917732EFD3DD4C-001\init-core-data-001\index\segments_5: java.nio.file.AccessDeniedException: C:\Users\jenkins\workspace\Lucene-Solr-master-Windows\solr\build\solr-core\test\J1\temp\solr.search.TestSearcherReuse_61917732EFD3DD4C-001\init-core-data-001\index\segments_5
   [junit4]    >    C:\Users\jenkins\workspace\Lucene-Solr-master-Windows\solr\build\solr-core\test\J1\temp\solr.search.TestSearcherReuse_61917732EFD3DD4C-001: java.nio.file.DirectoryNotEmptyException: C:\Users\jenkins\workspace\Lucene-Solr-master-Windows\solr\build\solr-core\test\J1\temp\solr.search.TestSearcherReuse_61917732EFD3DD4C-001
   [junit4]    > 	at __randomizedtesting.SeedInfo.seed([61917732EFD3DD4C]:0)
   [junit4]    > 	at org.apache.lucene.util.IOUtils.rm(IOUtils.java:329)
   [junit4]    > 	at java.base/java.lang.Thread.run(Thread.java:844)
   [junit4] Completed [149/749 (1!)] on J1 in 0.33s, 1 test, 1 error <<< FAILURES!

[...truncated 642 lines...]
   [junit4] Suite: org.apache.solr.core.TestConfigSetImmutable
   [junit4]   2> Creating dataDir: C:\Users\jenkins\workspace\Lucene-Solr-master-Windows\solr\build\solr-core\test\J0\temp\solr.core.TestConfigSetImmutable_61917732EFD3DD4C-001\init-core-data-001
   [junit4]   2> 1465889 WARN  (SUITE-TestConfigSetImmutable-seed#[61917732EFD3DD4C]-worker) [    ] o.a.s.SolrTestCaseJ4 startTrackingSearchers: numOpens=2 numCloses=2
   [junit4]   2> 1465889 INFO  (SUITE-TestConfigSetImmutable-seed#[61917732EFD3DD4C]-worker) [    ] o.a.s.SolrTestCaseJ4 Using PointFields (NUMERIC_POINTS_SYSPROP=true) w/NUMERIC_DOCVALUES_SYSPROP=false
   [junit4]   2> 1465890 INFO  (SUITE-TestConfigSetImmutable-seed#[61917732EFD3DD4C]-worker) [    ] o.a.s.SolrTestCaseJ4 Randomized ssl (false) and clientAuth (false) via: @org.apache.solr.util.RandomizeSSL(reason="", value=0.0/0.0, ssl=0.0/0.0, clientAuth=0.0/0.0)
   [junit4]   2> 1465890 INFO  (SUITE-TestConfigSetImmutable-seed#[61917732EFD3DD4C]-worker) [    ] o.a.s.SolrTestCaseJ4 SecureRandom sanity checks: test.solr.allowed.securerandom=null & java.security.egd=file:/dev/./urandom
   [junit4]   2> 1465891 INFO  (TEST-TestConfigSetImmutable.testSchemaHandlerImmutable-seed#[61917732EFD3DD4C]) [    ] o.a.s.SolrTestCaseJ4 ###Starting testSchemaHandlerImmutable
   [junit4]   2> 1466197 INFO  (TEST-TestConfigSetImmutable.testSchemaHandlerImmutable-seed#[61917732EFD3DD4C]) [    ] o.a.s.SolrTestCaseJ4 ####initCore
   [junit4]   2> 1466197 INFO  (TEST-TestConfigSetImmutable.testSchemaHandlerImmutable-seed#[61917732EFD3DD4C]) [    ] o.a.s.SolrTestCaseJ4 ####initCore end
   [junit4]   2> 1466198 INFO  (TEST-TestConfigSetImmutable.testSchemaHandlerImmutable-seed#[61917732EFD3DD4C]) [    ] o.a.s.SolrTestCaseJ4 Writing core.properties file to C:\Users\jenkins\workspace\Lucene-Solr-master-Windows\solr\build\solr-core\test\J0\temp\solr.core.TestConfigSetImmutable_61917732EFD3DD4C-001\tempDir-003\cores\core
   [junit4]   2> 1466199 INFO  (TEST-TestConfigSetImmutable.testSchemaHandlerImmutable-seed#[61917732EFD3DD4C]) [    ] o.e.j.s.Server jetty-9.3.20.v20170531
   [junit4]   2> 1466200 INFO  (TEST-TestConfigSetImmutable.testSchemaHandlerImmutable-seed#[61917732EFD3DD4C]) [    ] o.e.j.s.h.ContextHandler Started o.e.j.s.ServletContextHandler@1650c430{/solr,null,AVAILABLE}
   [junit4]   2> 1466202 INFO  (TEST-TestConfigSetImmutable.testSchemaHandlerImmutable-seed#[61917732EFD3DD4C]) [    ] o.e.j.s.AbstractConnector Started ServerConnector@1a074e8c{HTTP/1.1,[http/1.1]}{127.0.0.1:49531}
   [junit4]   2> 1466202 INFO  (TEST-TestConfigSetImmutable.testSchemaHandlerImmutable-seed#[61917732EFD3DD4C]) [    ] o.e.j.s.Server Started @1477471ms
   [junit4]   2> 1466202 INFO  (TEST-TestConfigSetImmutable.testSchemaHandlerImmutable-seed#[61917732EFD3DD4C]) [    ] o.a.s.c.s.e.JettySolrRunner Jetty properties: {hostContex

[...truncated too long message...]

RROR (SUITE-DocValuesNotIndexedTest-seed#[61917732EFD3DD4C]-worker) [    ] o.a.z.s.ZooKeeperServer ZKShutdownHandler is not registered, so ZooKeeper server won't take any action on ERROR or SHUTDOWN server state changes
   [junit4]   2> 1905493 INFO  (SUITE-DocValuesNotIndexedTest-seed#[61917732EFD3DD4C]-worker) [    ] o.a.s.c.ZkTestServer connecting to 127.0.0.1:52863 52863
   [junit4]   2> 1905495 INFO  (Thread-4724) [    ] o.a.s.c.ZkTestServer connecting to 127.0.0.1:52863 52863
   [junit4]   2> 1905496 WARN  (Thread-4724) [    ] o.a.s.c.ZkTestServer Watch limit violations: 
   [junit4]   2> Maximum concurrent create/delete watches above limit:
   [junit4]   2> 
   [junit4]   2> 	7	/solr/configs/conf1/managed-schema
   [junit4]   2> 	4	/solr/configs/conf1
   [junit4]   2> 	3	/solr/aliases.json
   [junit4]   2> 	3	/solr/clusterprops.json
   [junit4]   2> 	2	/solr/security.json
   [junit4]   2> 
   [junit4]   2> Maximum concurrent data watches above limit:
   [junit4]   2> 
   [junit4]   2> 	14	/solr/collections/dv_coll/state.json
   [junit4]   2> 	3	/solr/clusterstate.json
   [junit4]   2> 	2	/solr/configs/conf1/managed-schema
   [junit4]   2> 
   [junit4]   2> Maximum concurrent children watches above limit:
   [junit4]   2> 
   [junit4]   2> 	3	/solr/live_nodes
   [junit4]   2> 	3	/solr/collections
   [junit4]   2> 
   [junit4]   2> NOTE: leaving temporary files on disk at: C:\Users\jenkins\workspace\Lucene-Solr-master-Windows\solr\build\solr-core\test\J1\temp\solr.cloud.DocValuesNotIndexedTest_61917732EFD3DD4C-001
   [junit4]   2> Nov 09, 2017 6:00:49 PM com.carrotsearch.randomizedtesting.ThreadLeakControl checkThreadLeaks
   [junit4]   2> WARNING: Will linger awaiting termination of 5 leaked thread(s).
   [junit4]   2> NOTE: test params are: codec=Asserting(Lucene70): {id=PostingsFormat(name=LuceneFixedGap)}, docValues:{floatField=DocValuesFormat(name=Lucene70), doubleField=DocValuesFormat(name=Memory), intFieldMulti=DocValuesFormat(name=Lucene70), boolFieldMulti=DocValuesFormat(name=Memory), longFieldMulti=DocValuesFormat(name=Direct), floatGSL=DocValuesFormat(name=Lucene70), intField=DocValuesFormat(name=Memory), boolField=DocValuesFormat(name=Lucene70), stringFieldMulti=DocValuesFormat(name=Lucene70), dateFieldMulti=DocValuesFormat(name=Direct), doubleFieldMulti=DocValuesFormat(name=Lucene70), longGSF=DocValuesFormat(name=Lucene70), stringGSL=DocValuesFormat(name=Direct), doubleGSF=DocValuesFormat(name=Memory), doubleGSL=DocValuesFormat(name=Direct), stringGSF=DocValuesFormat(name=Memory), intGSL=DocValuesFormat(name=Memory), longField=DocValuesFormat(name=Lucene70), dateField=DocValuesFormat(name=Lucene70), dateGSF=DocValuesFormat(name=Lucene70), boolGSF=DocValuesFormat(name=Lucene70), longGSL=DocValuesFormat(name=Lucene70), boolGSL=DocValuesFormat(name=Lucene70), floatFieldMulti=DocValuesFormat(name=Memory), floatGSF=DocValuesFormat(name=Lucene70), dateGSL=DocValuesFormat(name=Lucene70), intGSF=DocValuesFormat(name=Direct), stringField=DocValuesFormat(name=Memory)}, maxPointsInLeafNode=700, maxMBSortInHeap=6.946301366438874, sim=Asserting(org.apache.lucene.search.similarities.AssertingSimilarity@62fee608), locale=fr-MG, timezone=Pacific/Niue
   [junit4]   2> NOTE: Windows 10 10.0 amd64/Oracle Corporation 9.0.1 (64-bit)/cpus=3,threads=1,free=291577584,total=522715136
   [junit4]   2> NOTE: All tests run in this JVM: [UpdateRequestProcessorFactoryTest, PolyFieldTest, V2StandaloneTest, ZkStateWriterTest, TestDownShardTolerantSearch, TestSolrCLIRunExample, CollectionsAPIDistributedZkTest, ChaosMonkeyNothingIsSafeWithPullReplicasTest, SolrPluginUtilsTest, TestQueryUtils, TestFieldCacheSort, ConnectionManagerTest, TestSolrCloudWithDelegationTokens, TestNRTOpen, NodeMutatorTest, ReplicaListTransformerTest, TestExportWriter, TestSolrIndexConfig, TestCloudPseudoReturnFields, TestBlendedInfixSuggestions, DistribDocExpirationUpdateProcessorTest, HdfsWriteToMultipleCollectionsTest, TestWordDelimiterFilterFactory, SolrJmxReporterCloudTest, TestConfig, TestGraphMLResponseWriter, TestPKIAuthenticationPlugin, TestExtendedDismaxParser, TestManagedSynonymGraphFilterFactory, SpellCheckCollatorWithCollapseTest, TestShardHandlerFactory, RuleEngineTest, TestCollectionAPI, TestFieldCacheVsDocValues, CoreAdminHandlerTest, TestMacroExpander, TestObjectReleaseTracker, TestSuggestSpellingConverter, TestStressReorder, TestLegacyFieldReuse, TestXmlQParserPlugin, TestValueSourceCache, TestSolrConfigHandlerCloud, TestCloudDeleteByQuery, DeleteLastCustomShardedReplicaTest, TestLMJelinekMercerSimilarityFactory, TestCloudJSONFacetJoinDomain, TestManagedResourceStorage, CollectionStateFormat2Test, TestSegmentSorting, SolrCoreTest, CdcrVersionReplicationTest, QueryEqualityTest, DocValuesTest, TestSerializedLuceneMatchVersion, TestIntervalFaceting, UtilsToolTest, TestElisionMultitermQuery, TestPullReplicaErrorHandling, DistributedFacetPivotLargeTest, DistributedQueryComponentOptimizationTest, TestFieldTypeCollectionResource, SolrMetricReporterTest, PKIAuthenticationIntegrationTest, ConcurrentDeleteAndCreateCollectionTest, TestComplexPhraseLeadingWildcard, DocumentBuilderTest, QueryResultKeyTest, TestOrdValues, BaseCdcrDistributedZkTest, TestLegacyTerms, TestPivotHelperCode, HealthCheckHandlerTest, TestRequestStatusCollectionAPI, FileUtilsTest, TestHashPartitioner, BitVectorTest, GraphQueryTest, SearchRateTriggerTest, TestAddFieldRealTimeGet, TestImpersonationWithHadoopAuth, SchemaVersionSpecificBehaviorTest, HdfsRecoveryZkTest, TestStressInPlaceUpdates, ClassificationUpdateProcessorTest, StatelessScriptUpdateProcessorFactoryTest, TestCollectionAPIs, TestSubQueryTransformer, DeleteReplicaTest, DistributedQueueTest, TestRandomFaceting, TestSearcherReuse, TestDocSet, PreAnalyzedFieldTest, BasicZkTest, TestInPlaceUpdatesStandalone, TriLevelCompositeIdRoutingTest, TestBulkSchemaConcurrent, LeaderElectionIntegrationTest, HdfsBasicDistributedZkTest, TestSolrQueryParser, SimpleFacetsTest, TestSystemCollAutoCreate, DistributedIntervalFacetingTest, SuggestComponentTest, AutoAddReplicasPlanActionTest, TestFastOutputStream, TestScoreJoinQPScore, TestFreeTextSuggestions, OverriddenZkACLAndCredentialsProvidersTest, MoreLikeThisHandlerTest, SampleTest, SolrShardReporterTest, TestZkAclsWithHadoopAuth, TestConfigOverlay, TestBulkSchemaAPI, TestDeleteCollectionOnDownNodes, TestBadConfig, HdfsTlogReplayBufferedWhileIndexingTest, IndexSchemaRuntimeFieldTest, TestMissingGroups, SpellPossibilityIteratorTest, DistributedFacetPivotSmallAdvancedTest, TestFieldCache, BlockJoinFacetRandomTest, TestBlobHandler, TestQueryTypes, BasicFunctionalityTest, CollectionsAPIAsyncDistributedZkTest, AnalyticsQueryTest, TestLeaderElectionZkExpiry, TestSchemalessBufferedUpdates, BasicAuthIntegrationTest, PeerSyncWithIndexFingerprintCachingTest, HdfsSyncSliceTest, LoggingHandlerTest, TestFaceting, TestTrieFacet, TestIndexSearcher, TestSolrCloudWithSecureImpersonation, JavabinLoaderTest, TestManagedSchemaAPI, TestDocumentBuilder, SolrSlf4jReporterTest, DeleteStatusTest, TermVectorComponentDistributedTest, TestLocalFSCloudBackupRestore, ActionThrottleTest, TestPartialUpdateDeduplication, BJQParserTest, BlobRepositoryCloudTest, LukeRequestHandlerTest, RankQueryTest, TestJsonFacets, MigrateRouteKeyTest, TestCoreAdminApis, TestAnalyzedSuggestions, TestNumericRangeQuery32, DOMUtilTest, TestRTGBase, HdfsChaosMonkeySafeLeaderTest, TestSha256AuthenticationProvider, TestSolrDeletionPolicy1, RollingRestartTest, TermVectorComponentTest, CoreAdminCreateDiscoverTest, TestPrepRecovery, CachingDirectoryFactoryTest, ReplicationFactorTest, CoreSorterTest, HdfsNNFailoverTest, TestCSVLoader, AliasIntegrationTest, TestLegacyNumericRangeQueryBuilder, DocExpirationUpdateProcessorFactoryTest, FieldMutatingUpdateProcessorTest, OpenCloseCoreStressTest, SimplePostToolTest, CloudMLTQParserTest, TestDynamicFieldCollectionResource, BlockCacheTest, TestSolrCoreParser, CoreMergeIndexesAdminHandlerTest, ChaosMonkeySafeLeaderTest, BasicDistributedZk2Test, UnloadDistributedZkTest, OverseerTest, ShardRoutingTest, FullSolrCloudDistribCmdsTest, TestReplicationHandler, ZkSolrClientTest, TestDistributedGrouping, DistributedSpellCheckComponentTest, ZkControllerTest, TestReload, TestCoreContainer, StatsComponentTest, ConvertedLegacyTest, TestSort, TestFiltering, TestFunctionQuery, HighlighterTest, SolrIndexSplitterTest, TestCoreDiscovery, SpellCheckCollatorTest, SolrRequestParserTest, SuggesterTSTTest, SpatialFilterTest, WordBreakSolrSpellCheckerTest, TestPseudoReturnFields, TestAtomicUpdateErrorCases, TestRemoteStreaming, XsltUpdateRequestHandlerTest, CacheHeaderTest, TestWriterPerf, TestOmitPositions, TermsComponentTest, IndexSchemaTest, QueryParsingTest, JsonLoaderTest, TestPHPSerializedResponseWriter, PingRequestHandlerTest, CSVRequestHandlerTest, TestComponentsName, SearchHandlerTest, SOLR749Test, TestQuerySenderListener, UpdateParamsTest, AlternateDirectoryTest, CopyFieldTest, SolrIndexConfigTest, BadComponentTest, TestStressRecovery, TestMergePolicyConfig, MultiTermTest, TestBinaryField, TestSearchPerf, NumericFieldsTest, ExternalFileFieldSortTest, TestSolrCoreProperties, TestPostingsSolrHighlighter, DirectSolrConnectionTest, NotRequiredUniqueKeyTest, TestLuceneMatchVersion, TestPhraseSuggestions, TestCharFilters, TestCodecSupport, TestPerFieldSimilarity, TestBM25SimilarityFactory, TimeZoneUtilsTest, ScriptEngineTest, URLClassifyProcessorTest, TestFastLRUCache, TestSystemIdResolver, RAMDirectoryFactoryTest, TestLRUCache, ZkNodePropsTest, SystemInfoHandlerTest, DistributedMLTComponentTest, TestCrossCoreJoin, TestDistributedMissingSort, TestLuceneIndexBackCompat, TestEmbeddedSolrServerAdminHandler, TestEmbeddedSolrServerConstructors, TestJettySolrRunner, ConnectionReuseTest, AssignTest, CloudExitableDirectoryReaderTest, CollectionsAPISolrJTest, DocValuesNotIndexedTest]
   [junit4] Completed [524/749 (3!)] on J1 in 3.92s, 4 tests, 1 failure <<< FAILURES!

[...truncated 40942 lines...]

Mime
View raw message