lucene-dev mailing list archives

Site index · List index
Message view « Date » · « Thread »
Top « Date » · « Thread »
From Policeman Jenkins Server <jenk...@thetaphi.de>
Subject [JENKINS] Lucene-Solr-7.x-Windows (64bit/jdk-9.0.1) - Build # 293 - Still Unstable!
Date Tue, 07 Nov 2017 13:25:41 GMT
Build: https://jenkins.thetaphi.de/job/Lucene-Solr-7.x-Windows/293/
Java: 64bit/jdk-9.0.1 -XX:+UseCompressedOops -XX:+UseG1GC

10 tests failed.
FAILED:  junit.framework.TestSuite.org.apache.lucene.store.TestFilterDirectory

Error Message:
Could not remove the following files (in the order of attempts):    C:\Users\jenkins\workspace\Lucene-Solr-7.x-Windows\lucene\build\core\test\J1\temp\lucene.store.TestFilterDirectory_DEC84E89801CC006-001\testVLong-001: java.nio.file.DirectoryNotEmptyException: C:\Users\jenkins\workspace\Lucene-Solr-7.x-Windows\lucene\build\core\test\J1\temp\lucene.store.TestFilterDirectory_DEC84E89801CC006-001\testVLong-001 

Stack Trace:
java.io.IOException: Could not remove the following files (in the order of attempts):
   C:\Users\jenkins\workspace\Lucene-Solr-7.x-Windows\lucene\build\core\test\J1\temp\lucene.store.TestFilterDirectory_DEC84E89801CC006-001\testVLong-001: java.nio.file.DirectoryNotEmptyException: C:\Users\jenkins\workspace\Lucene-Solr-7.x-Windows\lucene\build\core\test\J1\temp\lucene.store.TestFilterDirectory_DEC84E89801CC006-001\testVLong-001

	at __randomizedtesting.SeedInfo.seed([DEC84E89801CC006]:0)
	at org.apache.lucene.util.IOUtils.rm(IOUtils.java:329)
	at org.apache.lucene.util.TestRuleTemporaryFilesCleanup.afterAlways(TestRuleTemporaryFilesCleanup.java:216)
	at com.carrotsearch.randomizedtesting.rules.TestRuleAdapter$1.afterAlways(TestRuleAdapter.java:31)
	at com.carrotsearch.randomizedtesting.rules.StatementAdapter.evaluate(StatementAdapter.java:43)
	at com.carrotsearch.randomizedtesting.rules.StatementAdapter.evaluate(StatementAdapter.java:36)
	at org.apache.lucene.util.TestRuleAssertionsRequired$1.evaluate(TestRuleAssertionsRequired.java:53)
	at org.apache.lucene.util.TestRuleMarkFailure$1.evaluate(TestRuleMarkFailure.java:47)
	at org.apache.lucene.util.TestRuleIgnoreAfterMaxFailures$1.evaluate(TestRuleIgnoreAfterMaxFailures.java:64)
	at org.apache.lucene.util.TestRuleIgnoreTestSuites$1.evaluate(TestRuleIgnoreTestSuites.java:54)
	at com.carrotsearch.randomizedtesting.rules.StatementAdapter.evaluate(StatementAdapter.java:36)
	at com.carrotsearch.randomizedtesting.ThreadLeakControl$StatementRunner.run(ThreadLeakControl.java:368)
	at java.base/java.lang.Thread.run(Thread.java:844)


FAILED:  junit.framework.TestSuite.org.apache.lucene.store.TestMultiMMap

Error Message:
Could not remove the following files (in the order of attempts):    C:\Users\jenkins\workspace\Lucene-Solr-7.x-Windows\lucene\build\core\test\J0\temp\lucene.store.TestMultiMMap_DEC84E89801CC006-001\testSeekSliceZero-024: java.nio.file.DirectoryNotEmptyException: C:\Users\jenkins\workspace\Lucene-Solr-7.x-Windows\lucene\build\core\test\J0\temp\lucene.store.TestMultiMMap_DEC84E89801CC006-001\testSeekSliceZero-024    C:\Users\jenkins\workspace\Lucene-Solr-7.x-Windows\lucene\build\core\test\J0\temp\lucene.store.TestMultiMMap_DEC84E89801CC006-001\testSeekToEOFThenBack-001: java.nio.file.DirectoryNotEmptyException: C:\Users\jenkins\workspace\Lucene-Solr-7.x-Windows\lucene\build\core\test\J0\temp\lucene.store.TestMultiMMap_DEC84E89801CC006-001\testSeekToEOFThenBack-001 

Stack Trace:
java.io.IOException: Could not remove the following files (in the order of attempts):
   C:\Users\jenkins\workspace\Lucene-Solr-7.x-Windows\lucene\build\core\test\J0\temp\lucene.store.TestMultiMMap_DEC84E89801CC006-001\testSeekSliceZero-024: java.nio.file.DirectoryNotEmptyException: C:\Users\jenkins\workspace\Lucene-Solr-7.x-Windows\lucene\build\core\test\J0\temp\lucene.store.TestMultiMMap_DEC84E89801CC006-001\testSeekSliceZero-024
   C:\Users\jenkins\workspace\Lucene-Solr-7.x-Windows\lucene\build\core\test\J0\temp\lucene.store.TestMultiMMap_DEC84E89801CC006-001\testSeekToEOFThenBack-001: java.nio.file.DirectoryNotEmptyException: C:\Users\jenkins\workspace\Lucene-Solr-7.x-Windows\lucene\build\core\test\J0\temp\lucene.store.TestMultiMMap_DEC84E89801CC006-001\testSeekToEOFThenBack-001

	at __randomizedtesting.SeedInfo.seed([DEC84E89801CC006]:0)
	at org.apache.lucene.util.IOUtils.rm(IOUtils.java:329)
	at org.apache.lucene.util.TestRuleTemporaryFilesCleanup.afterAlways(TestRuleTemporaryFilesCleanup.java:216)
	at com.carrotsearch.randomizedtesting.rules.TestRuleAdapter$1.afterAlways(TestRuleAdapter.java:31)
	at com.carrotsearch.randomizedtesting.rules.StatementAdapter.evaluate(StatementAdapter.java:43)
	at com.carrotsearch.randomizedtesting.rules.StatementAdapter.evaluate(StatementAdapter.java:36)
	at org.apache.lucene.util.TestRuleAssertionsRequired$1.evaluate(TestRuleAssertionsRequired.java:53)
	at org.apache.lucene.util.TestRuleMarkFailure$1.evaluate(TestRuleMarkFailure.java:47)
	at org.apache.lucene.util.TestRuleIgnoreAfterMaxFailures$1.evaluate(TestRuleIgnoreAfterMaxFailures.java:64)
	at org.apache.lucene.util.TestRuleIgnoreTestSuites$1.evaluate(TestRuleIgnoreTestSuites.java:54)
	at com.carrotsearch.randomizedtesting.rules.StatementAdapter.evaluate(StatementAdapter.java:36)
	at com.carrotsearch.randomizedtesting.ThreadLeakControl$StatementRunner.run(ThreadLeakControl.java:368)
	at java.base/java.lang.Thread.run(Thread.java:844)


FAILED:  junit.framework.TestSuite.org.apache.solr.core.TestConfigSetImmutable

Error Message:
Could not remove the following files (in the order of attempts):    C:\Users\jenkins\workspace\Lucene-Solr-7.x-Windows\solr\build\solr-core\test\J1\temp\solr.core.TestConfigSetImmutable_678DCEB7683F3EAF-001\tempDir-009\cores: java.nio.file.DirectoryNotEmptyException: C:\Users\jenkins\workspace\Lucene-Solr-7.x-Windows\solr\build\solr-core\test\J1\temp\solr.core.TestConfigSetImmutable_678DCEB7683F3EAF-001\tempDir-009\cores    C:\Users\jenkins\workspace\Lucene-Solr-7.x-Windows\solr\build\solr-core\test\J1\temp\solr.core.TestConfigSetImmutable_678DCEB7683F3EAF-001\tempDir-009: java.nio.file.DirectoryNotEmptyException: C:\Users\jenkins\workspace\Lucene-Solr-7.x-Windows\solr\build\solr-core\test\J1\temp\solr.core.TestConfigSetImmutable_678DCEB7683F3EAF-001\tempDir-009 

Stack Trace:
java.io.IOException: Could not remove the following files (in the order of attempts):
   C:\Users\jenkins\workspace\Lucene-Solr-7.x-Windows\solr\build\solr-core\test\J1\temp\solr.core.TestConfigSetImmutable_678DCEB7683F3EAF-001\tempDir-009\cores: java.nio.file.DirectoryNotEmptyException: C:\Users\jenkins\workspace\Lucene-Solr-7.x-Windows\solr\build\solr-core\test\J1\temp\solr.core.TestConfigSetImmutable_678DCEB7683F3EAF-001\tempDir-009\cores
   C:\Users\jenkins\workspace\Lucene-Solr-7.x-Windows\solr\build\solr-core\test\J1\temp\solr.core.TestConfigSetImmutable_678DCEB7683F3EAF-001\tempDir-009: java.nio.file.DirectoryNotEmptyException: C:\Users\jenkins\workspace\Lucene-Solr-7.x-Windows\solr\build\solr-core\test\J1\temp\solr.core.TestConfigSetImmutable_678DCEB7683F3EAF-001\tempDir-009

	at __randomizedtesting.SeedInfo.seed([678DCEB7683F3EAF]:0)
	at org.apache.lucene.util.IOUtils.rm(IOUtils.java:329)
	at org.apache.lucene.util.TestRuleTemporaryFilesCleanup.afterAlways(TestRuleTemporaryFilesCleanup.java:216)
	at com.carrotsearch.randomizedtesting.rules.TestRuleAdapter$1.afterAlways(TestRuleAdapter.java:31)
	at com.carrotsearch.randomizedtesting.rules.StatementAdapter.evaluate(StatementAdapter.java:43)
	at com.carrotsearch.randomizedtesting.rules.StatementAdapter.evaluate(StatementAdapter.java:36)
	at org.apache.lucene.util.TestRuleAssertionsRequired$1.evaluate(TestRuleAssertionsRequired.java:53)
	at org.apache.lucene.util.TestRuleMarkFailure$1.evaluate(TestRuleMarkFailure.java:47)
	at org.apache.lucene.util.TestRuleIgnoreAfterMaxFailures$1.evaluate(TestRuleIgnoreAfterMaxFailures.java:64)
	at org.apache.lucene.util.TestRuleIgnoreTestSuites$1.evaluate(TestRuleIgnoreTestSuites.java:54)
	at com.carrotsearch.randomizedtesting.rules.StatementAdapter.evaluate(StatementAdapter.java:36)
	at com.carrotsearch.randomizedtesting.ThreadLeakControl$StatementRunner.run(ThreadLeakControl.java:368)
	at java.base/java.lang.Thread.run(Thread.java:844)


FAILED:  junit.framework.TestSuite.org.apache.solr.handler.admin.CoreAdminCreateDiscoverTest

Error Message:
Could not remove the following files (in the order of attempts):    C:\Users\jenkins\workspace\Lucene-Solr-7.x-Windows\solr\build\solr-core\test\J1\temp\solr.handler.admin.CoreAdminCreateDiscoverTest_678DCEB7683F3EAF-001\tempDir-001\sys_props: java.nio.file.DirectoryNotEmptyException: C:\Users\jenkins\workspace\Lucene-Solr-7.x-Windows\solr\build\solr-core\test\J1\temp\solr.handler.admin.CoreAdminCreateDiscoverTest_678DCEB7683F3EAF-001\tempDir-001\sys_props    C:\Users\jenkins\workspace\Lucene-Solr-7.x-Windows\solr\build\solr-core\test\J1\temp\solr.handler.admin.CoreAdminCreateDiscoverTest_678DCEB7683F3EAF-001\tempDir-001: java.nio.file.DirectoryNotEmptyException: C:\Users\jenkins\workspace\Lucene-Solr-7.x-Windows\solr\build\solr-core\test\J1\temp\solr.handler.admin.CoreAdminCreateDiscoverTest_678DCEB7683F3EAF-001\tempDir-001 

Stack Trace:
java.io.IOException: Could not remove the following files (in the order of attempts):
   C:\Users\jenkins\workspace\Lucene-Solr-7.x-Windows\solr\build\solr-core\test\J1\temp\solr.handler.admin.CoreAdminCreateDiscoverTest_678DCEB7683F3EAF-001\tempDir-001\sys_props: java.nio.file.DirectoryNotEmptyException: C:\Users\jenkins\workspace\Lucene-Solr-7.x-Windows\solr\build\solr-core\test\J1\temp\solr.handler.admin.CoreAdminCreateDiscoverTest_678DCEB7683F3EAF-001\tempDir-001\sys_props
   C:\Users\jenkins\workspace\Lucene-Solr-7.x-Windows\solr\build\solr-core\test\J1\temp\solr.handler.admin.CoreAdminCreateDiscoverTest_678DCEB7683F3EAF-001\tempDir-001: java.nio.file.DirectoryNotEmptyException: C:\Users\jenkins\workspace\Lucene-Solr-7.x-Windows\solr\build\solr-core\test\J1\temp\solr.handler.admin.CoreAdminCreateDiscoverTest_678DCEB7683F3EAF-001\tempDir-001

	at __randomizedtesting.SeedInfo.seed([678DCEB7683F3EAF]:0)
	at org.apache.lucene.util.IOUtils.rm(IOUtils.java:329)
	at org.apache.lucene.util.TestRuleTemporaryFilesCleanup.afterAlways(TestRuleTemporaryFilesCleanup.java:216)
	at com.carrotsearch.randomizedtesting.rules.TestRuleAdapter$1.afterAlways(TestRuleAdapter.java:31)
	at com.carrotsearch.randomizedtesting.rules.StatementAdapter.evaluate(StatementAdapter.java:43)
	at com.carrotsearch.randomizedtesting.rules.StatementAdapter.evaluate(StatementAdapter.java:36)
	at org.apache.lucene.util.TestRuleAssertionsRequired$1.evaluate(TestRuleAssertionsRequired.java:53)
	at org.apache.lucene.util.TestRuleMarkFailure$1.evaluate(TestRuleMarkFailure.java:47)
	at org.apache.lucene.util.TestRuleIgnoreAfterMaxFailures$1.evaluate(TestRuleIgnoreAfterMaxFailures.java:64)
	at org.apache.lucene.util.TestRuleIgnoreTestSuites$1.evaluate(TestRuleIgnoreTestSuites.java:54)
	at com.carrotsearch.randomizedtesting.rules.StatementAdapter.evaluate(StatementAdapter.java:36)
	at com.carrotsearch.randomizedtesting.ThreadLeakControl$StatementRunner.run(ThreadLeakControl.java:368)
	at java.base/java.lang.Thread.run(Thread.java:844)


FAILED:  junit.framework.TestSuite.org.apache.solr.handler.component.SuggestComponentTest

Error Message:
Could not remove the following files (in the order of attempts):    C:\Users\jenkins\workspace\Lucene-Solr-7.x-Windows\solr\build\solr-core\test\J0\temp\solr.handler.component.SuggestComponentTest_678DCEB7683F3EAF-001\init-core-data-001: java.nio.file.DirectoryNotEmptyException: C:\Users\jenkins\workspace\Lucene-Solr-7.x-Windows\solr\build\solr-core\test\J0\temp\solr.handler.component.SuggestComponentTest_678DCEB7683F3EAF-001\init-core-data-001    C:\Users\jenkins\workspace\Lucene-Solr-7.x-Windows\solr\build\solr-core\test\J0\temp\solr.handler.component.SuggestComponentTest_678DCEB7683F3EAF-001\init-core-data-001\suggest_fuzzy_file_based: java.nio.file.AccessDeniedException: C:\Users\jenkins\workspace\Lucene-Solr-7.x-Windows\solr\build\solr-core\test\J0\temp\solr.handler.component.SuggestComponentTest_678DCEB7683F3EAF-001\init-core-data-001\suggest_fuzzy_file_based    C:\Users\jenkins\workspace\Lucene-Solr-7.x-Windows\solr\build\solr-core\test\J0\temp\solr.handler.component.SuggestComponentTest_678DCEB7683F3EAF-001: java.nio.file.DirectoryNotEmptyException: C:\Users\jenkins\workspace\Lucene-Solr-7.x-Windows\solr\build\solr-core\test\J0\temp\solr.handler.component.SuggestComponentTest_678DCEB7683F3EAF-001 

Stack Trace:
java.io.IOException: Could not remove the following files (in the order of attempts):
   C:\Users\jenkins\workspace\Lucene-Solr-7.x-Windows\solr\build\solr-core\test\J0\temp\solr.handler.component.SuggestComponentTest_678DCEB7683F3EAF-001\init-core-data-001: java.nio.file.DirectoryNotEmptyException: C:\Users\jenkins\workspace\Lucene-Solr-7.x-Windows\solr\build\solr-core\test\J0\temp\solr.handler.component.SuggestComponentTest_678DCEB7683F3EAF-001\init-core-data-001
   C:\Users\jenkins\workspace\Lucene-Solr-7.x-Windows\solr\build\solr-core\test\J0\temp\solr.handler.component.SuggestComponentTest_678DCEB7683F3EAF-001\init-core-data-001\suggest_fuzzy_file_based: java.nio.file.AccessDeniedException: C:\Users\jenkins\workspace\Lucene-Solr-7.x-Windows\solr\build\solr-core\test\J0\temp\solr.handler.component.SuggestComponentTest_678DCEB7683F3EAF-001\init-core-data-001\suggest_fuzzy_file_based
   C:\Users\jenkins\workspace\Lucene-Solr-7.x-Windows\solr\build\solr-core\test\J0\temp\solr.handler.component.SuggestComponentTest_678DCEB7683F3EAF-001: java.nio.file.DirectoryNotEmptyException: C:\Users\jenkins\workspace\Lucene-Solr-7.x-Windows\solr\build\solr-core\test\J0\temp\solr.handler.component.SuggestComponentTest_678DCEB7683F3EAF-001

	at __randomizedtesting.SeedInfo.seed([678DCEB7683F3EAF]:0)
	at org.apache.lucene.util.IOUtils.rm(IOUtils.java:329)
	at org.apache.lucene.util.TestRuleTemporaryFilesCleanup.afterAlways(TestRuleTemporaryFilesCleanup.java:216)
	at com.carrotsearch.randomizedtesting.rules.TestRuleAdapter$1.afterAlways(TestRuleAdapter.java:31)
	at com.carrotsearch.randomizedtesting.rules.StatementAdapter.evaluate(StatementAdapter.java:43)
	at com.carrotsearch.randomizedtesting.rules.StatementAdapter.evaluate(StatementAdapter.java:36)
	at org.apache.lucene.util.TestRuleAssertionsRequired$1.evaluate(TestRuleAssertionsRequired.java:53)
	at org.apache.lucene.util.TestRuleMarkFailure$1.evaluate(TestRuleMarkFailure.java:47)
	at org.apache.lucene.util.TestRuleIgnoreAfterMaxFailures$1.evaluate(TestRuleIgnoreAfterMaxFailures.java:64)
	at org.apache.lucene.util.TestRuleIgnoreTestSuites$1.evaluate(TestRuleIgnoreTestSuites.java:54)
	at com.carrotsearch.randomizedtesting.rules.StatementAdapter.evaluate(StatementAdapter.java:36)
	at com.carrotsearch.randomizedtesting.ThreadLeakControl$StatementRunner.run(ThreadLeakControl.java:368)
	at java.base/java.lang.Thread.run(Thread.java:844)


FAILED:  org.apache.solr.schema.TestUseDocValuesAsStored.testUseDocValuesAsStoredFalse

Error Message:
SolrCore 'collection1' is not available due to init failure: Error opening new searcher

Stack Trace:
org.apache.solr.core.SolrCoreInitializationException: SolrCore 'collection1' is not available due to init failure: Error opening new searcher
	at org.apache.solr.core.CoreContainer.getCore(CoreContainer.java:1482)
	at org.apache.solr.util.TestHarness.getCore(TestHarness.java:250)
	at org.apache.solr.schema.TestUseDocValuesAsStored.testUseDocValuesAsStoredFalse(TestUseDocValuesAsStored.java:269)
	at java.base/jdk.internal.reflect.NativeMethodAccessorImpl.invoke0(Native Method)
	at java.base/jdk.internal.reflect.NativeMethodAccessorImpl.invoke(NativeMethodAccessorImpl.java:62)
	at java.base/jdk.internal.reflect.DelegatingMethodAccessorImpl.invoke(DelegatingMethodAccessorImpl.java:43)
	at java.base/java.lang.reflect.Method.invoke(Method.java:564)
	at com.carrotsearch.randomizedtesting.RandomizedRunner.invoke(RandomizedRunner.java:1737)
	at com.carrotsearch.randomizedtesting.RandomizedRunner$8.evaluate(RandomizedRunner.java:934)
	at com.carrotsearch.randomizedtesting.RandomizedRunner$9.evaluate(RandomizedRunner.java:970)
	at com.carrotsearch.randomizedtesting.RandomizedRunner$10.evaluate(RandomizedRunner.java:984)
	at com.carrotsearch.randomizedtesting.rules.SystemPropertiesRestoreRule$1.evaluate(SystemPropertiesRestoreRule.java:57)
	at org.apache.lucene.util.TestRuleSetupTeardownChained$1.evaluate(TestRuleSetupTeardownChained.java:49)
	at org.apache.lucene.util.AbstractBeforeAfterRule$1.evaluate(AbstractBeforeAfterRule.java:45)
	at org.apache.lucene.util.TestRuleThreadAndTestName$1.evaluate(TestRuleThreadAndTestName.java:48)
	at org.apache.lucene.util.TestRuleIgnoreAfterMaxFailures$1.evaluate(TestRuleIgnoreAfterMaxFailures.java:64)
	at org.apache.lucene.util.TestRuleMarkFailure$1.evaluate(TestRuleMarkFailure.java:47)
	at com.carrotsearch.randomizedtesting.rules.StatementAdapter.evaluate(StatementAdapter.java:36)
	at com.carrotsearch.randomizedtesting.ThreadLeakControl$StatementRunner.run(ThreadLeakControl.java:368)
	at com.carrotsearch.randomizedtesting.ThreadLeakControl.forkTimeoutingTask(ThreadLeakControl.java:817)
	at com.carrotsearch.randomizedtesting.ThreadLeakControl$3.evaluate(ThreadLeakControl.java:468)
	at com.carrotsearch.randomizedtesting.RandomizedRunner.runSingleTest(RandomizedRunner.java:943)
	at com.carrotsearch.randomizedtesting.RandomizedRunner$5.evaluate(RandomizedRunner.java:829)
	at com.carrotsearch.randomizedtesting.RandomizedRunner$6.evaluate(RandomizedRunner.java:879)
	at com.carrotsearch.randomizedtesting.RandomizedRunner$7.evaluate(RandomizedRunner.java:890)
	at com.carrotsearch.randomizedtesting.rules.StatementAdapter.evaluate(StatementAdapter.java:36)
	at com.carrotsearch.randomizedtesting.rules.SystemPropertiesRestoreRule$1.evaluate(SystemPropertiesRestoreRule.java:57)
	at org.apache.lucene.util.AbstractBeforeAfterRule$1.evaluate(AbstractBeforeAfterRule.java:45)
	at com.carrotsearch.randomizedtesting.rules.StatementAdapter.evaluate(StatementAdapter.java:36)
	at org.apache.lucene.util.TestRuleStoreClassName$1.evaluate(TestRuleStoreClassName.java:41)
	at com.carrotsearch.randomizedtesting.rules.NoShadowingOrOverridesOnMethodsRule$1.evaluate(NoShadowingOrOverridesOnMethodsRule.java:40)
	at com.carrotsearch.randomizedtesting.rules.NoShadowingOrOverridesOnMethodsRule$1.evaluate(NoShadowingOrOverridesOnMethodsRule.java:40)
	at com.carrotsearch.randomizedtesting.rules.StatementAdapter.evaluate(StatementAdapter.java:36)
	at com.carrotsearch.randomizedtesting.rules.StatementAdapter.evaluate(StatementAdapter.java:36)
	at org.apache.lucene.util.TestRuleAssertionsRequired$1.evaluate(TestRuleAssertionsRequired.java:53)
	at org.apache.lucene.util.TestRuleMarkFailure$1.evaluate(TestRuleMarkFailure.java:47)
	at org.apache.lucene.util.TestRuleIgnoreAfterMaxFailures$1.evaluate(TestRuleIgnoreAfterMaxFailures.java:64)
	at org.apache.lucene.util.TestRuleIgnoreTestSuites$1.evaluate(TestRuleIgnoreTestSuites.java:54)
	at com.carrotsearch.randomizedtesting.rules.StatementAdapter.evaluate(StatementAdapter.java:36)
	at com.carrotsearch.randomizedtesting.ThreadLeakControl$StatementRunner.run(ThreadLeakControl.java:368)
	at java.base/java.lang.Thread.run(Thread.java:844)
Caused by: org.apache.solr.common.SolrException: Error opening new searcher
	at org.apache.solr.core.SolrCore.<init>(SolrCore.java:989)
	at org.apache.solr.core.SolrCore.<init>(SolrCore.java:844)
	at org.apache.solr.core.CoreContainer.createFromDescriptor(CoreContainer.java:1037)
	at org.apache.solr.core.CoreContainer.lambda$load$13(CoreContainer.java:642)
	at com.codahale.metrics.InstrumentedExecutorService$InstrumentedCallable.call(InstrumentedExecutorService.java:197)
	at java.base/java.util.concurrent.FutureTask.run(FutureTask.java:264)
	at org.apache.solr.common.util.ExecutorUtil$MDCAwareThreadPoolExecutor.lambda$execute$0(ExecutorUtil.java:188)
	at java.base/java.util.concurrent.ThreadPoolExecutor.runWorker(ThreadPoolExecutor.java:1167)
	at java.base/java.util.concurrent.ThreadPoolExecutor$Worker.run(ThreadPoolExecutor.java:641)
	... 1 more
Caused by: org.apache.solr.common.SolrException: Error opening new searcher
	at org.apache.solr.core.SolrCore.openNewSearcher(SolrCore.java:2076)
	at org.apache.solr.core.SolrCore.getSearcher(SolrCore.java:2196)
	at org.apache.solr.core.SolrCore.initSearcher(SolrCore.java:1072)
	at org.apache.solr.core.SolrCore.<init>(SolrCore.java:961)
	... 9 more
Caused by: java.nio.file.AccessDeniedException: C:\Users\jenkins\workspace\Lucene-Solr-7.x-Windows\solr\build\solr-core\test\J1\temp\solr.schema.TestUseDocValuesAsStored_678DCEB7683F3EAF-001\init-core-data-001\index\segments_2z
	at java.base/sun.nio.fs.WindowsException.translateToIOException(WindowsException.java:89)
	at java.base/sun.nio.fs.WindowsException.rethrowAsIOException(WindowsException.java:103)
	at java.base/sun.nio.fs.WindowsException.rethrowAsIOException(WindowsException.java:108)
	at java.base/sun.nio.fs.WindowsFileSystemProvider.newFileChannel(WindowsFileSystemProvider.java:116)
	at java.base/java.nio.channels.FileChannel.open(FileChannel.java:292)
	at java.base/java.nio.channels.FileChannel.open(FileChannel.java:340)
	at org.apache.lucene.store.MMapDirectory.openInput(MMapDirectory.java:238)
	at org.apache.lucene.store.NRTCachingDirectory.openInput(NRTCachingDirectory.java:192)
	at org.apache.lucene.store.Directory.openChecksumInput(Directory.java:119)
	at org.apache.lucene.index.SegmentInfos.readCommit(SegmentInfos.java:288)
	at org.apache.lucene.index.IndexFileDeleter.<init>(IndexFileDeleter.java:165)
	at org.apache.lucene.index.IndexWriter.<init>(IndexWriter.java:1120)
	at org.apache.solr.update.SolrIndexWriter.<init>(SolrIndexWriter.java:119)
	at org.apache.solr.update.SolrIndexWriter.create(SolrIndexWriter.java:94)
	at org.apache.solr.update.DefaultSolrCoreState.createMainIndexWriter(DefaultSolrCoreState.java:257)
	at org.apache.solr.update.DefaultSolrCoreState.getIndexWriter(DefaultSolrCoreState.java:131)
	at org.apache.solr.core.SolrCore.openNewSearcher(SolrCore.java:2037)
	... 12 more


FAILED:  org.apache.solr.schema.TestUseDocValuesAsStored.testOnEmptyIndex

Error Message:
org.apache.solr.core.SolrCoreInitializationException: SolrCore 'collection1' is not available due to init failure: Error opening new searcher

Stack Trace:
java.lang.RuntimeException: org.apache.solr.core.SolrCoreInitializationException: SolrCore 'collection1' is not available due to init failure: Error opening new searcher
	at org.apache.solr.SolrTestCaseJ4.clearIndex(SolrTestCaseJ4.java:1250)
	at org.apache.solr.schema.TestUseDocValuesAsStored.testOnEmptyIndex(TestUseDocValuesAsStored.java:124)
	at java.base/jdk.internal.reflect.NativeMethodAccessorImpl.invoke0(Native Method)
	at java.base/jdk.internal.reflect.NativeMethodAccessorImpl.invoke(NativeMethodAccessorImpl.java:62)
	at java.base/jdk.internal.reflect.DelegatingMethodAccessorImpl.invoke(DelegatingMethodAccessorImpl.java:43)
	at java.base/java.lang.reflect.Method.invoke(Method.java:564)
	at com.carrotsearch.randomizedtesting.RandomizedRunner.invoke(RandomizedRunner.java:1737)
	at com.carrotsearch.randomizedtesting.RandomizedRunner$8.evaluate(RandomizedRunner.java:934)
	at com.carrotsearch.randomizedtesting.RandomizedRunner$9.evaluate(RandomizedRunner.java:970)
	at com.carrotsearch.randomizedtesting.RandomizedRunner$10.evaluate(RandomizedRunner.java:984)
	at com.carrotsearch.randomizedtesting.rules.SystemPropertiesRestoreRule$1.evaluate(SystemPropertiesRestoreRule.java:57)
	at org.apache.lucene.util.TestRuleSetupTeardownChained$1.evaluate(TestRuleSetupTeardownChained.java:49)
	at org.apache.lucene.util.AbstractBeforeAfterRule$1.evaluate(AbstractBeforeAfterRule.java:45)
	at org.apache.lucene.util.TestRuleThreadAndTestName$1.evaluate(TestRuleThreadAndTestName.java:48)
	at org.apache.lucene.util.TestRuleIgnoreAfterMaxFailures$1.evaluate(TestRuleIgnoreAfterMaxFailures.java:64)
	at org.apache.lucene.util.TestRuleMarkFailure$1.evaluate(TestRuleMarkFailure.java:47)
	at com.carrotsearch.randomizedtesting.rules.StatementAdapter.evaluate(StatementAdapter.java:36)
	at com.carrotsearch.randomizedtesting.ThreadLeakControl$StatementRunner.run(ThreadLeakControl.java:368)
	at com.carrotsearch.randomizedtesting.ThreadLeakControl.forkTimeoutingTask(ThreadLeakControl.java:817)
	at com.carrotsearch.randomizedtesting.ThreadLeakControl$3.evaluate(ThreadLeakControl.java:468)
	at com.carrotsearch.randomizedtesting.RandomizedRunner.runSingleTest(RandomizedRunner.java:943)
	at com.carrotsearch.randomizedtesting.RandomizedRunner$5.evaluate(RandomizedRunner.java:829)
	at com.carrotsearch.randomizedtesting.RandomizedRunner$6.evaluate(RandomizedRunner.java:879)
	at com.carrotsearch.randomizedtesting.RandomizedRunner$7.evaluate(RandomizedRunner.java:890)
	at com.carrotsearch.randomizedtesting.rules.StatementAdapter.evaluate(StatementAdapter.java:36)
	at com.carrotsearch.randomizedtesting.rules.SystemPropertiesRestoreRule$1.evaluate(SystemPropertiesRestoreRule.java:57)
	at org.apache.lucene.util.AbstractBeforeAfterRule$1.evaluate(AbstractBeforeAfterRule.java:45)
	at com.carrotsearch.randomizedtesting.rules.StatementAdapter.evaluate(StatementAdapter.java:36)
	at org.apache.lucene.util.TestRuleStoreClassName$1.evaluate(TestRuleStoreClassName.java:41)
	at com.carrotsearch.randomizedtesting.rules.NoShadowingOrOverridesOnMethodsRule$1.evaluate(NoShadowingOrOverridesOnMethodsRule.java:40)
	at com.carrotsearch.randomizedtesting.rules.NoShadowingOrOverridesOnMethodsRule$1.evaluate(NoShadowingOrOverridesOnMethodsRule.java:40)
	at com.carrotsearch.randomizedtesting.rules.StatementAdapter.evaluate(StatementAdapter.java:36)
	at com.carrotsearch.randomizedtesting.rules.StatementAdapter.evaluate(StatementAdapter.java:36)
	at org.apache.lucene.util.TestRuleAssertionsRequired$1.evaluate(TestRuleAssertionsRequired.java:53)
	at org.apache.lucene.util.TestRuleMarkFailure$1.evaluate(TestRuleMarkFailure.java:47)
	at org.apache.lucene.util.TestRuleIgnoreAfterMaxFailures$1.evaluate(TestRuleIgnoreAfterMaxFailures.java:64)
	at org.apache.lucene.util.TestRuleIgnoreTestSuites$1.evaluate(TestRuleIgnoreTestSuites.java:54)
	at com.carrotsearch.randomizedtesting.rules.StatementAdapter.evaluate(StatementAdapter.java:36)
	at com.carrotsearch.randomizedtesting.ThreadLeakControl$StatementRunner.run(ThreadLeakControl.java:368)
	at java.base/java.lang.Thread.run(Thread.java:844)
Caused by: org.apache.solr.core.SolrCoreInitializationException: SolrCore 'collection1' is not available due to init failure: Error opening new searcher
	at org.apache.solr.core.CoreContainer.getCore(CoreContainer.java:1482)
	at org.apache.solr.util.TestHarness.getCore(TestHarness.java:250)
	at org.apache.solr.SolrTestCaseJ4.updateJ(SolrTestCaseJ4.java:1256)
	at org.apache.solr.SolrTestCaseJ4.deleteByQueryAndGetVersion(SolrTestCaseJ4.java:1462)
	at org.apache.solr.SolrTestCaseJ4.clearIndex(SolrTestCaseJ4.java:1247)
	... 39 more
Caused by: org.apache.solr.common.SolrException: Error opening new searcher
	at org.apache.solr.core.SolrCore.<init>(SolrCore.java:989)
	at org.apache.solr.core.SolrCore.<init>(SolrCore.java:844)
	at org.apache.solr.core.CoreContainer.createFromDescriptor(CoreContainer.java:1037)
	at org.apache.solr.core.CoreContainer.lambda$load$13(CoreContainer.java:642)
	at com.codahale.metrics.InstrumentedExecutorService$InstrumentedCallable.call(InstrumentedExecutorService.java:197)
	at java.base/java.util.concurrent.FutureTask.run(FutureTask.java:264)
	at org.apache.solr.common.util.ExecutorUtil$MDCAwareThreadPoolExecutor.lambda$execute$0(ExecutorUtil.java:188)
	at java.base/java.util.concurrent.ThreadPoolExecutor.runWorker(ThreadPoolExecutor.java:1167)
	at java.base/java.util.concurrent.ThreadPoolExecutor$Worker.run(ThreadPoolExecutor.java:641)
	... 1 more
Caused by: org.apache.solr.common.SolrException: Error opening new searcher
	at org.apache.solr.core.SolrCore.openNewSearcher(SolrCore.java:2076)
	at org.apache.solr.core.SolrCore.getSearcher(SolrCore.java:2196)
	at org.apache.solr.core.SolrCore.initSearcher(SolrCore.java:1072)
	at org.apache.solr.core.SolrCore.<init>(SolrCore.java:961)
	... 9 more
Caused by: java.nio.file.AccessDeniedException: C:\Users\jenkins\workspace\Lucene-Solr-7.x-Windows\solr\build\solr-core\test\J1\temp\solr.schema.TestUseDocValuesAsStored_678DCEB7683F3EAF-001\init-core-data-001\index\segments_2z
	at java.base/sun.nio.fs.WindowsException.translateToIOException(WindowsException.java:89)
	at java.base/sun.nio.fs.WindowsException.rethrowAsIOException(WindowsException.java:103)
	at java.base/sun.nio.fs.WindowsException.rethrowAsIOException(WindowsException.java:108)
	at java.base/sun.nio.fs.WindowsFileSystemProvider.newFileChannel(WindowsFileSystemProvider.java:116)
	at java.base/java.nio.channels.FileChannel.open(FileChannel.java:292)
	at java.base/java.nio.channels.FileChannel.open(FileChannel.java:340)
	at org.apache.lucene.store.MMapDirectory.openInput(MMapDirectory.java:238)
	at org.apache.lucene.store.NRTCachingDirectory.openInput(NRTCachingDirectory.java:192)
	at org.apache.lucene.store.Directory.openChecksumInput(Directory.java:119)
	at org.apache.lucene.index.SegmentInfos.readCommit(SegmentInfos.java:288)
	at org.apache.lucene.index.IndexFileDeleter.<init>(IndexFileDeleter.java:165)
	at org.apache.lucene.index.IndexWriter.<init>(IndexWriter.java:1120)
	at org.apache.solr.update.SolrIndexWriter.<init>(SolrIndexWriter.java:119)
	at org.apache.solr.update.SolrIndexWriter.create(SolrIndexWriter.java:94)
	at org.apache.solr.update.DefaultSolrCoreState.createMainIndexWriter(DefaultSolrCoreState.java:257)
	at org.apache.solr.update.DefaultSolrCoreState.getIndexWriter(DefaultSolrCoreState.java:131)
	at org.apache.solr.core.SolrCore.openNewSearcher(SolrCore.java:2037)
	... 12 more


FAILED:  junit.framework.TestSuite.org.apache.solr.schema.TestUseDocValuesAsStored

Error Message:
3 threads leaked from SUITE scope at org.apache.solr.schema.TestUseDocValuesAsStored:     1) Thread[id=35750, name=Thread-6823, state=WAITING, group=TGRP-TestUseDocValuesAsStored]         at java.base@9.0.1/java.lang.Object.wait(Native Method)         at java.base@9.0.1/java.lang.Object.wait(Object.java:516)         at app//org.apache.solr.core.CloserThread.run(CoreContainer.java:1717)    2) Thread[id=35747, name=Connection evictor, state=TIMED_WAITING, group=TGRP-TestUseDocValuesAsStored]         at java.base@9.0.1/java.lang.Thread.sleep(Native Method)         at app//org.apache.http.impl.client.IdleConnectionEvictor$1.run(IdleConnectionEvictor.java:66)         at java.base@9.0.1/java.lang.Thread.run(Thread.java:844)    3) Thread[id=35748, name=Connection evictor, state=TIMED_WAITING, group=TGRP-TestUseDocValuesAsStored]         at java.base@9.0.1/java.lang.Thread.sleep(Native Method)         at app//org.apache.http.impl.client.IdleConnectionEvictor$1.run(IdleConnectionEvictor.java:66)         at java.base@9.0.1/java.lang.Thread.run(Thread.java:844)

Stack Trace:
com.carrotsearch.randomizedtesting.ThreadLeakError: 3 threads leaked from SUITE scope at org.apache.solr.schema.TestUseDocValuesAsStored: 
   1) Thread[id=35750, name=Thread-6823, state=WAITING, group=TGRP-TestUseDocValuesAsStored]
        at java.base@9.0.1/java.lang.Object.wait(Native Method)
        at java.base@9.0.1/java.lang.Object.wait(Object.java:516)
        at app//org.apache.solr.core.CloserThread.run(CoreContainer.java:1717)
   2) Thread[id=35747, name=Connection evictor, state=TIMED_WAITING, group=TGRP-TestUseDocValuesAsStored]
        at java.base@9.0.1/java.lang.Thread.sleep(Native Method)
        at app//org.apache.http.impl.client.IdleConnectionEvictor$1.run(IdleConnectionEvictor.java:66)
        at java.base@9.0.1/java.lang.Thread.run(Thread.java:844)
   3) Thread[id=35748, name=Connection evictor, state=TIMED_WAITING, group=TGRP-TestUseDocValuesAsStored]
        at java.base@9.0.1/java.lang.Thread.sleep(Native Method)
        at app//org.apache.http.impl.client.IdleConnectionEvictor$1.run(IdleConnectionEvictor.java:66)
        at java.base@9.0.1/java.lang.Thread.run(Thread.java:844)
	at __randomizedtesting.SeedInfo.seed([678DCEB7683F3EAF]:0)


FAILED:  junit.framework.TestSuite.org.apache.solr.schema.TestUseDocValuesAsStored

Error Message:
There are still zombie threads that couldn't be terminated:    1) Thread[id=35750, name=Thread-6823, state=WAITING, group=TGRP-TestUseDocValuesAsStored]         at java.base@9.0.1/java.lang.Object.wait(Native Method)         at java.base@9.0.1/java.lang.Object.wait(Object.java:516)         at app//org.apache.solr.core.CloserThread.run(CoreContainer.java:1717)

Stack Trace:
com.carrotsearch.randomizedtesting.ThreadLeakError: There are still zombie threads that couldn't be terminated:
   1) Thread[id=35750, name=Thread-6823, state=WAITING, group=TGRP-TestUseDocValuesAsStored]
        at java.base@9.0.1/java.lang.Object.wait(Native Method)
        at java.base@9.0.1/java.lang.Object.wait(Object.java:516)
        at app//org.apache.solr.core.CloserThread.run(CoreContainer.java:1717)
	at __randomizedtesting.SeedInfo.seed([678DCEB7683F3EAF]:0)


FAILED:  junit.framework.TestSuite.org.apache.solr.search.stats.TestLRUStatsCache

Error Message:
Could not remove the following files (in the order of attempts):    C:\Users\jenkins\workspace\Lucene-Solr-7.x-Windows\solr\build\solr-core\test\J1\temp\solr.search.stats.TestLRUStatsCache_678DCEB7683F3EAF-001\tempDir-001\shard2\configsets\cdcr-cluster1: java.nio.file.DirectoryNotEmptyException: C:\Users\jenkins\workspace\Lucene-Solr-7.x-Windows\solr\build\solr-core\test\J1\temp\solr.search.stats.TestLRUStatsCache_678DCEB7683F3EAF-001\tempDir-001\shard2\configsets\cdcr-cluster1    C:\Users\jenkins\workspace\Lucene-Solr-7.x-Windows\solr\build\solr-core\test\J1\temp\solr.search.stats.TestLRUStatsCache_678DCEB7683F3EAF-001\tempDir-001\shard2\configsets: java.nio.file.DirectoryNotEmptyException: C:\Users\jenkins\workspace\Lucene-Solr-7.x-Windows\solr\build\solr-core\test\J1\temp\solr.search.stats.TestLRUStatsCache_678DCEB7683F3EAF-001\tempDir-001\shard2\configsets    C:\Users\jenkins\workspace\Lucene-Solr-7.x-Windows\solr\build\solr-core\test\J1\temp\solr.search.stats.TestLRUStatsCache_678DCEB7683F3EAF-001\tempDir-001\shard2: java.nio.file.DirectoryNotEmptyException: C:\Users\jenkins\workspace\Lucene-Solr-7.x-Windows\solr\build\solr-core\test\J1\temp\solr.search.stats.TestLRUStatsCache_678DCEB7683F3EAF-001\tempDir-001\shard2    C:\Users\jenkins\workspace\Lucene-Solr-7.x-Windows\solr\build\solr-core\test\J1\temp\solr.search.stats.TestLRUStatsCache_678DCEB7683F3EAF-001\tempDir-001: java.nio.file.DirectoryNotEmptyException: C:\Users\jenkins\workspace\Lucene-Solr-7.x-Windows\solr\build\solr-core\test\J1\temp\solr.search.stats.TestLRUStatsCache_678DCEB7683F3EAF-001\tempDir-001 

Stack Trace:
java.io.IOException: Could not remove the following files (in the order of attempts):
   C:\Users\jenkins\workspace\Lucene-Solr-7.x-Windows\solr\build\solr-core\test\J1\temp\solr.search.stats.TestLRUStatsCache_678DCEB7683F3EAF-001\tempDir-001\shard2\configsets\cdcr-cluster1: java.nio.file.DirectoryNotEmptyException: C:\Users\jenkins\workspace\Lucene-Solr-7.x-Windows\solr\build\solr-core\test\J1\temp\solr.search.stats.TestLRUStatsCache_678DCEB7683F3EAF-001\tempDir-001\shard2\configsets\cdcr-cluster1
   C:\Users\jenkins\workspace\Lucene-Solr-7.x-Windows\solr\build\solr-core\test\J1\temp\solr.search.stats.TestLRUStatsCache_678DCEB7683F3EAF-001\tempDir-001\shard2\configsets: java.nio.file.DirectoryNotEmptyException: C:\Users\jenkins\workspace\Lucene-Solr-7.x-Windows\solr\build\solr-core\test\J1\temp\solr.search.stats.TestLRUStatsCache_678DCEB7683F3EAF-001\tempDir-001\shard2\configsets
   C:\Users\jenkins\workspace\Lucene-Solr-7.x-Windows\solr\build\solr-core\test\J1\temp\solr.search.stats.TestLRUStatsCache_678DCEB7683F3EAF-001\tempDir-001\shard2: java.nio.file.DirectoryNotEmptyException: C:\Users\jenkins\workspace\Lucene-Solr-7.x-Windows\solr\build\solr-core\test\J1\temp\solr.search.stats.TestLRUStatsCache_678DCEB7683F3EAF-001\tempDir-001\shard2
   C:\Users\jenkins\workspace\Lucene-Solr-7.x-Windows\solr\build\solr-core\test\J1\temp\solr.search.stats.TestLRUStatsCache_678DCEB7683F3EAF-001\tempDir-001: java.nio.file.DirectoryNotEmptyException: C:\Users\jenkins\workspace\Lucene-Solr-7.x-Windows\solr\build\solr-core\test\J1\temp\solr.search.stats.TestLRUStatsCache_678DCEB7683F3EAF-001\tempDir-001

	at __randomizedtesting.SeedInfo.seed([678DCEB7683F3EAF]:0)
	at org.apache.lucene.util.IOUtils.rm(IOUtils.java:329)
	at org.apache.lucene.util.TestRuleTemporaryFilesCleanup.afterAlways(TestRuleTemporaryFilesCleanup.java:216)
	at com.carrotsearch.randomizedtesting.rules.TestRuleAdapter$1.afterAlways(TestRuleAdapter.java:31)
	at com.carrotsearch.randomizedtesting.rules.StatementAdapter.evaluate(StatementAdapter.java:43)
	at com.carrotsearch.randomizedtesting.rules.StatementAdapter.evaluate(StatementAdapter.java:36)
	at org.apache.lucene.util.TestRuleAssertionsRequired$1.evaluate(TestRuleAssertionsRequired.java:53)
	at org.apache.lucene.util.TestRuleMarkFailure$1.evaluate(TestRuleMarkFailure.java:47)
	at org.apache.lucene.util.TestRuleIgnoreAfterMaxFailures$1.evaluate(TestRuleIgnoreAfterMaxFailures.java:64)
	at org.apache.lucene.util.TestRuleIgnoreTestSuites$1.evaluate(TestRuleIgnoreTestSuites.java:54)
	at com.carrotsearch.randomizedtesting.rules.StatementAdapter.evaluate(StatementAdapter.java:36)
	at com.carrotsearch.randomizedtesting.ThreadLeakControl$StatementRunner.run(ThreadLeakControl.java:368)
	at java.base/java.lang.Thread.run(Thread.java:844)




Build Log:
[...truncated 567 lines...]
   [junit4] Suite: org.apache.lucene.store.TestFilterDirectory
   [junit4] IGNOR/A 0.00s J1 | TestFilterDirectory.testFsyncDoesntCreateNewFiles
   [junit4]    > Assumption #1: test only works for FSDirectory subclasses
   [junit4] IGNOR/A 0.00s J1 | TestFilterDirectory.testPendingDeletions
   [junit4]    > Assumption #1: we can only install VirusCheckingFS on an FSDirectory
   [junit4]   2> NOTE: test params are: codec=Asserting(Lucene70): {}, docValues:{}, maxPointsInLeafNode=945, maxMBSortInHeap=5.554508984374709, sim=RandomSimilarity(queryNorm=true): {}, locale=pt-GQ, timezone=Asia/Ashgabat
   [junit4]   2> NOTE: Windows 10 10.0 amd64/Oracle Corporation 9.0.1 (64-bit)/cpus=3,threads=1,free=32739104,total=67108864
   [junit4]   2> NOTE: All tests run in this JVM: [Test2BTerms, TestIndexedDISI, TestSimpleExplanationsWithFillerDocs, TestIndexWriterConfig, TestSetOnce, TestDeletionPolicy, TestSizeBoundedForceMerge, TestGraphTokenizers, TestAutomatonQuery, TestCheckIndex, TestFastDecompressionMode, TestSloppyPhraseQuery2, TestFilterSpans, TestIndexReaderClose, TestSimpleSearchEquivalence, FiniteStringsIteratorTest, TestMultiTermConstantScore, TestMultiPhraseQuery, TestFuzzyQuery, TestReaderWrapperDVTypeCheck, TestIndexWriterOnDiskFull, TestReaderClosed, TestIndexWriterReader, TestDirectory, TestPackedInts, TestPerFieldPostingsFormat2, TestTermRangeQuery, TestMathUtil, TestFastCompressionMode, TestPositiveScoresOnlyCollector, TestTransactionRollback, TestNRTThreads, TestExitableDirectoryReader, TestSpansEnum, TestIntsRef, TestSegmentMerger, TestUniqueTermCount, TestPrefixCodedTerms, TestPrefixInBooleanQuery, TestLongRangeFieldQueries, TestSpanCollection, TestFrequencyTrackingRingBuffer, TestCharsRef, TestVersion, TestForTooMuchCloning, TestSPIClassIterator, TestFilterWeight, TestIndexWriterThreadsToSegments, TestStressIndexing2, TestLucene60FieldInfoFormat, TestAxiomaticSimilarity, TestIndexWriterNRTIsCurrent, TestRegExp, TestCachingTokenFilter, TestDelegatingAnalyzerWrapper, Test2BPagedBytes, TestSimilarityBase, TestDateTools, TestSpanNearQuery, TestAutomatonQueryUnicode, TestWeakIdentityMap, TestRadixSelector, TestIndexWriterLockRelease, TestTermsEnum2, TestDisjunctionMaxQuery, TestByteBlockPool, TestOmitNorms, TestLongPostings, TestTransactions, TestPolygon2D, TestStressNRT, TestOneMergeWrappingMergePolicy, TestLongBitSet, TestTermVectorsReader, TestFilterDirectory]
   [junit4]   2> NOTE: reproduce with: ant test  -Dtestcase=TestFilterDirectory -Dtests.seed=DEC84E89801CC006 -Dtests.slow=true -Dtests.locale=pt-GQ -Dtests.timezone=Asia/Ashgabat -Dtests.asserts=true -Dtests.file.encoding=US-ASCII
   [junit4] ERROR   0.00s J1 | TestFilterDirectory (suite) <<<
   [junit4]    > Throwable #1: java.io.IOException: Could not remove the following files (in the order of attempts):
   [junit4]    >    C:\Users\jenkins\workspace\Lucene-Solr-7.x-Windows\lucene\build\core\test\J1\temp\lucene.store.TestFilterDirectory_DEC84E89801CC006-001\testVLong-001: java.nio.file.DirectoryNotEmptyException: C:\Users\jenkins\workspace\Lucene-Solr-7.x-Windows\lucene\build\core\test\J1\temp\lucene.store.TestFilterDirectory_DEC84E89801CC006-001\testVLong-001
   [junit4]    > 	at __randomizedtesting.SeedInfo.seed([DEC84E89801CC006]:0)
   [junit4]    > 	at org.apache.lucene.util.IOUtils.rm(IOUtils.java:329)
   [junit4]    > 	at java.base/java.lang.Thread.run(Thread.java:844)
   [junit4] Completed [107/455 (1!)] on J1 in 0.28s, 44 tests, 1 error, 2 skipped <<< FAILURES!

[...truncated 369 lines...]
   [junit4] Suite: org.apache.lucene.store.TestMultiMMap
   [junit4]   2> NOTE: test params are: codec=Asserting(Lucene70): {docid=FST50, junk=TestBloomFilteredLucenePostings(BloomFilteringPostingsFormat(Lucene50(blocksize=128)))}, docValues:{}, maxPointsInLeafNode=1663, maxMBSortInHeap=6.316565374557529, sim=RandomSimilarity(queryNorm=true): {}, locale=jgo-CM, timezone=Asia/Tashkent
   [junit4]   2> NOTE: Windows 10 10.0 amd64/Oracle Corporation 9.0.1 (64-bit)/cpus=3,threads=1,free=232431408,total=275775488
   [junit4]   2> NOTE: All tests run in this JVM: [TestExternalCodecs, TestDeterminizeLexicon, TestMatchAllDocsQuery, TestPointQueries, TestOrdinalMap, TestLucene60PointsFormat, TestWordlistLoader, TestStringMSBRadixSorter, TestFlushByRamOrCountsPolicy, TestBinaryTerms, TestRAMDirectory, TestFieldCacheRewriteMethod, TestLucene50StoredFieldsFormat, TestCrashCausesCorruptIndex, TestDoc, TestThreadedForceMerge, TestDocsAndPositions, TestFSTs, TestNamedSPILoader, TestConjunctionDISI, TestCharArrayMap, LimitedFiniteStringsIteratorTest, TestPrefixRandom, TestBooleanQueryVisitSubscorers, TestOmitTf, TestLazyProxSkipping, TestBooleanRewrites, TestCrash, TestGeoEncodingUtils, TestSparseFixedBitSet, TestLucene70DocValuesFormat, TestNeverDelete, TestSimpleExplanationsOfNonMatches, TestMultiThreadTermVectors, TestSpanExplanationsOfNonMatches, TestLongValuesSource, TestSegmentInfos, TestIndexWriterMergePolicy, TestPayloadsOnVectors, TestNIOFSDirectory, TestIndexManyDocuments, TestScoreCachingWrappingScorer, TestByteArrayDataInput, TestIndexInput, TestSimpleFSLockFactory, TestCollectionUtil, TestAtomicUpdate, TestConjunctions, TestFloatRangeFieldQueries, TestCustomNorms, TestRegexpRandom2, TestAttributeSource, TestIndexWriterWithThreads, TestConsistentFieldNumbers, Test2BPoints, TestTopDocsCollector, TestDocIdSetBuilder, Test2BBKDPoints, TestPolygon, TestSynonymQuery, TestMultiPhraseEnum, TestParallelLeafReader, TestIndexWriterOutOfFileDescriptors, TestMergeRateLimiter, TestRegexpRandom, TestReusableStringReader, MultiCollectorTest, TestPackedTokenAttributeImpl, TestLRUQueryCache, TestInPlaceMergeSorter, TestTieredMergePolicy, TestMultiMMap]
   [junit4]   2> NOTE: reproduce with: ant test  -Dtestcase=TestMultiMMap -Dtests.seed=DEC84E89801CC006 -Dtests.slow=true -Dtests.locale=jgo-CM -Dtests.timezone=Asia/Tashkent -Dtests.asserts=true -Dtests.file.encoding=US-ASCII
   [junit4] ERROR   0.00s J0 | TestMultiMMap (suite) <<<
   [junit4]    > Throwable #1: java.io.IOException: Could not remove the following files (in the order of attempts):
   [junit4]    >    C:\Users\jenkins\workspace\Lucene-Solr-7.x-Windows\lucene\build\core\test\J0\temp\lucene.store.TestMultiMMap_DEC84E89801CC006-001\testSeekSliceZero-024: java.nio.file.DirectoryNotEmptyException: C:\Users\jenkins\workspace\Lucene-Solr-7.x-Windows\lucene\build\core\test\J0\temp\lucene.store.TestMultiMMap_DEC84E89801CC006-001\testSeekSliceZero-024
   [junit4]    >    C:\Users\jenkins\workspace\Lucene-Solr-7.x-Windows\lucene\build\core\test\J0\temp\lucene.store.TestMultiMMap_DEC84E89801CC006-001\testSeekToEOFThenBack-001: java.nio.file.DirectoryNotEmptyException: C:\Users\jenkins\workspace\Lucene-Solr-7.x-Windows\lucene\build\core\test\J0\temp\lucene.store.TestMultiMMap_DEC84E89801CC006-001\testSeekToEOFThenBack-001
   [junit4]    > 	at __randomizedtesting.SeedInfo.seed([DEC84E89801CC006]:0)
   [junit4]    > 	at org.apache.lucene.util.IOUtils.rm(IOUtils.java:329)
   [junit4]    > 	at java.base/java.lang.Thread.run(Thread.java:844)
   [junit4] Completed [218/455 (2!)] on J0 in 1.84s, 54 tests, 1 error <<< FAILURES!

[...truncated 10833 lines...]
   [junit4] Suite: org.apache.solr.search.stats.TestLRUStatsCache
   [junit4]   2> 472287 INFO  (SUITE-TestLRUStatsCache-seed#[678DCEB7683F3EAF]-worker) [    ] o.a.s.SolrTestCaseJ4 SecureRandom sanity checks: test.solr.allowed.securerandom=null & java.security.egd=file:/dev/./urandom
   [junit4]   2> Creating dataDir: C:\Users\jenkins\workspace\Lucene-Solr-7.x-Windows\solr\build\solr-core\test\J1\temp\solr.search.stats.TestLRUStatsCache_678DCEB7683F3EAF-001\init-core-data-001
   [junit4]   2> 472289 INFO  (SUITE-TestLRUStatsCache-seed#[678DCEB7683F3EAF]-worker) [    ] o.a.s.SolrTestCaseJ4 Using PointFields (NUMERIC_POINTS_SYSPROP=true) w/NUMERIC_DOCVALUES_SYSPROP=true
   [junit4]   2> 472290 INFO  (SUITE-TestLRUStatsCache-seed#[678DCEB7683F3EAF]-worker) [    ] o.a.s.SolrTestCaseJ4 Randomized ssl (true) and clientAuth (true) via: @org.apache.solr.util.RandomizeSSL(reason="", value=0.0/0.0, ssl=0.0/0.0, clientAuth=0.0/0.0)
   [junit4]   2> 472291 INFO  (SUITE-TestLRUStatsCache-seed#[678DCEB7683F3EAF]-worker) [    ] o.a.s.BaseDistributedSearchTestCase Setting hostContext system property: /
   [junit4]   2> 472590 INFO  (TEST-TestLRUStatsCache.test-seed#[678DCEB7683F3EAF]) [    ] o.a.s.SolrTestCaseJ4 Writing core.properties file to C:\Users\jenkins\workspace\Lucene-Solr-7.x-Windows\solr\build\solr-core\test\J1\temp\solr.search.stats.TestLRUStatsCache_678DCEB7683F3EAF-001\tempDir-001\control\cores\collection1
   [junit4]   2> 472593 INFO  (TEST-TestLRUStatsCache.test-seed#[678DCEB7683F3EAF]) [    ] o.e.j.s.Server jetty-9.3.20.v20170531
   [junit4]   2> 472594 INFO  (TEST-TestLRUStatsCache.test-seed#[678DCEB7683F3EAF]) [    ] o.e.j.s.h.ContextHandler Started o.e.j.s.ServletContextHandler@823b23c{/,null,AVAILABLE}
   [junit4]   2> 472596 INFO  (TEST-TestLRUStatsCache.test-seed#[678DCEB7683F3EAF]) [    ] o.e.j.s.AbstractConnector Started ServerConnector@7a1e9f23{SSL,[ssl, http/1.1]}{127.0.0.1:54387}
   [junit4]   2> 472596 INFO  (TEST-TestLRUStatsCache.test-seed#[678DCEB7683F3EAF]) [    ] o.e.j.s.Server Started @482624ms
   [junit4]   2> 472596 INFO  (TEST-TestLRUStatsCache.test-seed#[678DCEB7683F3EAF]) [    ] o.a.s.c.s.e.JettySolrRunner Jetty properties: {hostContext=/, hostPort=54387, coreRootDirectory=C:\Users\jenkins\workspace\Lucene-Solr-7.x-Windows\solr\build\solr-core\test\J1\temp\solr.search.stats.TestLRUStatsCache_678DCEB7683F3EAF-001\tempDir-001\control\cores}
   [junit4]   2> 472596 ERROR (TEST-TestLRUStatsCache.test-seed#[678DCEB7683F3EAF]) [    ] o.a.s.u.StartupLoggingUtils Missing Java Option solr.log.dir. Logging may be missing or incomplete.
   [junit4]   2> 472596 INFO  (TEST-TestLRUStatsCache.test-seed#[678DCEB7683F3EAF]) [    ] o.a.s.s.SolrDispatchFilter  ___      _       Welcome to Apache Solr™ version 7.2.0
   [junit4]   2> 472596 INFO  (TEST-TestLRUStatsCache.test-seed#[678DCEB7683F3EAF]) [    ] o.a.s.s.SolrDispatchFilter / __| ___| |_ _   Starting in standalone mode on port null
   [junit4]   2> 472596 INFO  (TEST-TestLRUStatsCache.test-seed#[678DCEB7683F3EAF]) [    ] o.a.s.s.SolrDispatchFilter \__ \/ _ \ | '_|  Install dir: null
   [junit4]   2> 472596 INFO  (TEST-TestLRUStatsCache.test-seed#[678DCEB7683F3EAF]) [    ] o.a.s.s.SolrDispatchFilter |___/\___/_|_|    Start time: 2017-11-07T12:20:24.460543100Z
   [junit4]   2> 472597 INFO  (TEST-TestLRUStatsCache.test-seed#[678DCEB7683F3EAF]) [    ] o.a.s.c.SolrXmlConfig Loading container configuration from C:\Users\jenkins\workspace\Lucene-Solr-7.x-Windows\solr\build\solr-core\test\J1\temp\solr.search.stats.TestLRUStatsCache_678DCEB7683F3EAF-001\tempDir-001\control\solr.xml
   [junit4]   2> 472600 INFO  (TEST-TestLRUStatsCache.test-seed#[678DCEB7683F3EAF]) [    ] o.a.s.c.SolrXmlConfig Configuration parameter autoReplicaFailoverWorkLoopDelay is ignored
   [junit4]   2> 472600 INFO  (TEST-TestLRUStatsCache.test-seed#[678DCEB7683F3EAF]) [    ] o.a.s.c.SolrXmlConfig Configuration parameter autoReplicaFailoverBadNodeExpiration is ignored
   [junit4]   2> 472600 INFO  (TEST-TestLRUStatsCache.test-seed#[678DCEB7683F3EAF]) [    ] o.a.s.c.SolrXmlConfig MBean server found: com.sun.jmx.mbeanserver.JmxMBeanServer@71f47b84, but no JMX reporters were configured - adding default JMX reporter.
   [junit4]   2> 472669 INFO  (TEST-TestLRUStatsCache.test-seed#[678DCEB7683F3EAF]) [    ] o.a.s.m.r.SolrJmxReporter JMX monitoring for 'solr.node' (registry 'solr.node') enabled at server: com.sun.jmx.mbeanserver.JmxMBeanServer@71f47b84
   [junit4]   2> 472678 INFO  (TEST-TestLRUStatsCache.test-seed#[678DCEB7683F3EAF]) [    ] o.a.s.m.r.SolrJmxReporter JMX monitoring for 'solr.jvm' (registry 'solr.jvm') enabled at server: com.sun.jmx.mbeanserver.JmxMBeanServer@71f47b84
   [junit4]   2> 472678 INFO  (TEST-TestLRUStatsCache.test-seed#[678DCEB7683F3EAF]) [    ] o.a.s.m.r.SolrJmxReporter JMX monitoring for 'solr.jetty' (registry 'solr.jetty') enabled at server: com.sun.jmx.mbeanserver.JmxMBeanServer@71f47b84
   [junit4]   2> 472680 INFO  (TEST-TestLRUStatsCache.test-seed#[678DCEB7683F3EAF]) [    ] o.a.s.c.CorePropertiesLocator Found 1 core definitions underneath C:\Users\jenkins\workspace\Lucene-Solr-7.x-Windows\solr\build\solr-core\test\J1\temp\solr.search.stats.TestLRUStatsCache_678DCEB7683F3EAF-001\tempDir-001\control\cores
   [junit4]   2> 472681 INFO  (TEST-TestLRUStatsCache.test-seed#[678DCEB7683F3EAF]) [    ] o.a.s.c.CorePropertiesLocator Cores are: [collection1]
   [junit4]   2> 472681 INFO  (coreLoadExecutor-1243-thread-1) [    ] o.a.s.c.TransientSolrCoreCacheDefault Allocating transient cache for 4 transient cores
   [junit4]   2> 472683 INFO  (coreLoadExecutor-1243-thread-1) [    x:collection1] o.a.s.c.SolrResourceLoader [null] Added 2 libs to classloader, from paths: [/C:/Users/jenkins/workspace/Lucene-Solr-7.x-Windows/solr/core/src/test-files/solr/collection1/lib, /C:/Users/jenkins/workspace/Lucene-Solr-7.x-Windows/solr/core/src/test-files/solr/collection1/lib/classes]
   [junit4]   2> 472722 INFO  (coreLoadExecutor-1243-thread-1) [    x:collection1] o.a.s.c.SolrConfig Using Lucene MatchVersion: 7.2.0
   [junit4]   2> 472743 INFO  (coreLoadExecutor-1243-thread-1) [    x:collection1] o.a.s.s.IndexSchema [collection1] Schema name=test
   [junit4]   2> 472825 INFO  (coreLoadExecutor-1243-thread-1) [    x:collection1] o.a.s.s.IndexSchema Loaded schema test/1.0 with uniqueid field id
   [junit4]   2> 472839 INFO  (coreLoadExecutor-1243-thread-1) [    x:collection1] o.a.s.c.CoreContainer Creating SolrCore 'collection1' using configuration from configset C:\Users\jenkins\workspace\Lucene-Solr-7.x-Windows\solr\core\src\test-files\solr\collection1, trusted=true
   [junit4]   2> 472840 INFO  (coreLoadExecutor-1243-thread-1) [    x:collection1] o.a.s.m.r.SolrJmxReporter JMX monitoring for 'solr.core.collection1' (registry 'solr.core.collection1') enabled at server: com.sun.jmx.mbeanserver.JmxMBeanServer@71f47b84
   [junit4]   2> 472840 INFO  (coreLoadExecutor-1243-thread-1) [    x:collection1] o.a.s.c.SolrCore solr.RecoveryStrategy.Builder
   [junit4]   2> 472840 INFO  (coreLoadExecutor-1243-thread-1) [    x:collection1] o.a.s.c.SolrCore [[collection1] ] Opening new SolrCore at [C:\Users\jenkins\workspace\Lucene-Solr-7.x-Windows\solr\core\src\test-files\solr\collection1], dataDir=[C:\Users\jenkins\workspace\Lucene-Solr-7.x-Windows\solr\build\solr-core\test\J1\temp\solr.search.stats.TestLRUStatsCache_678DCEB7683F3EAF-001\tempDir-001\control\cores\collection1\data\]
   [junit4]   2> 472842 INFO  (coreLoadExecutor-1243-thread-1) [    x:collection1] o.a.s.u.RandomMergePolicy RandomMergePolicy wrapping class org.apache.lucene.index.TieredMergePolicy: [TieredMergePolicy: maxMergeAtOnce=45, maxMergeAtOnceExplicit=10, maxMergedSegmentMB=95.1298828125, floorSegmentMB=1.2626953125, forceMergeDeletesPctAllowed=3.5822726937159963, segmentsPerTier=42.0, maxCFSSegmentSizeMB=8.796093022207999E12, noCFSRatio=0.0
   [junit4]   2> 472929 INFO  (coreLoadExecutor-1243-thread-1) [    x:collection1] o.a.s.u.UpdateHandler Using UpdateLog implementation: org.apache.solr.update.UpdateLog
   [junit4]   2> 472929 INFO  (coreLoadExecutor-1243-thread-1) [    x:collection1] o.a.s.u.UpdateLog Initializing UpdateLog: dataDir= defaultSyncLevel=FLUSH numRecordsToKeep=100 maxNumLogsToKeep=10 numVersionBuckets=65536
   [junit4]   2> 472931 INFO  (coreLoadExecutor-1243-thread-1) [    x:collection1] o.a.s.u.CommitTracker Hard AutoCommit: disabled
   [junit4]   2> 472931 INFO  (coreLoadExecutor-1243-thread-1) [    x:collection1] o.a.s.u.CommitTracker Soft AutoCommit: disabled
   [junit4]   2> 472933 INFO  (coreLoadExecutor-1243-thread-1) [    x:collection1] o.a.s.u.RandomMergePolicy RandomMergePolicy wrapping class org.apache.lucene.index.LogDocMergePolicy: [LogDocMergePolicy: minMergeSize=1000, mergeFactor=46, maxMergeSize=9223372036854775807, maxMergeSizeForForcedMerge=9223372036854775807, calibrateSizeByDeletes=false, maxMergeDocs=2147483647, maxCFSSegmentSizeMB=8.796093022207999E12, noCFSRatio=0.34612966187534755]
   [junit4]   2> 472933 INFO  (coreLoadExecutor-1243-thread-1) [    x:collection1] o.a.s.s.SolrIndexSearcher Opening [Searcher@31107915[collection1] main]
   [junit4]   2> 472934 INFO  (coreLoadExecutor-1243-thread-1) [    x:collection1] o.a.s.h.c.SpellCheckComponent Initializing spell checkers
   [junit4]   2> 472942 INFO  (coreLoadExecutor-1243-thread-1) [    x:collection1] o.a.s.s.DirectSolrSpellChecker init: {name=direct,classname=DirectSolrSpellChecker,field=lowerfilt,minQueryLength=3}
   [junit4]   2> 472973 INFO  (coreLoadExecutor-1243-thread-1) [    x:collection1] o.a.s.h.ReplicationHandler Commits will be reserved for 10000ms.
   [junit4]   2> 472974 INFO  (searcherExecutor-1244-thread-1-processing-x:collection1) [    x:collection1] o.a.s.h.c.SpellCheckComponent Loading spell index for spellchecker: default
   [junit4]   2> 472974 INFO  (coreLoadExecutor-1243-thread-1) [    x:collection1] o.a.s.u.UpdateLog Could not find max version in index or recent updates, using new clock 1583409764591730688
   [junit4]   2> 472974 INFO  (searcherExecutor-1244-thread-1-processing-x:collection1) [    x:collection1] o.a.s.h.c.SpellCheckComponent Loading spell index for spellchecker: direct
   [junit4]   2> 472974 INFO  (searcherExecutor-1244-thread-1-processing-x:collection1) [    x:collection1] o.a.s.h.c.SpellCheckComponent Loading spell index for spellchecker: wordbreak
   [junit4]   2> 472974 INFO  (searcherExecutor-1244-thread-1-processing-x:collection1) [    x:collection1] o.a.s.h.c.SpellCheckComponent Loading spell index for spellchecker: multipleFields
   [junit4]   2> 472975 INFO  (searcherExecutor-1244-thread-1-processing-x:collection1) [    x:collection1] o.a.s.h.c.SpellCheckComponent Loading spell index for spellchecker: jarowinkler
   [junit4]   2> 472976 INFO  (searcherExecutor-1244-thread-1-processing-x:collection1) [    x:collection1] o.a.s.h.c.SpellCheckComponent Loading spell index for spellchecker: external
   [junit4]   2> 472976 INFO  (searcherExecutor-1244-thread-1-processing-x:collection1) [    x:collection1] o.a.s.h.c.SpellCheckComponent Loading spell index for spellchecker: freq
   [junit4]   2> 472976 INFO  (searcherExecutor-1244-thread-1-processing-x:collection1) [    x:collection1] o.a.s.h.c.SpellCheckComponent Loading spell index for spellchecker: fqcn
   [junit4]   2> 472977 INFO  (searcherExecutor-1244-thread-1-processing-x:collection1) [    x:collection1] o.a.s.h.c.SpellCheckComponent Loading spell index for spellchecker: perDict
   [junit4]   2> 472978 INFO  (searcherExecutor-1244-thread-1-processing-x:collection1) [    x:collection1] o.a.s.c.SolrCore [collection1] Registered new searcher Searcher@31107915[collection1] main{ExitableDirectoryReader(UninvertingDirectoryReader())}
   [junit4]   2> 473308 INFO  (TEST-TestLRUStatsCache.test-seed#[678DCEB7683F3EAF]) [    ] o.a.s.SolrTestCaseJ4 Writing core.properties file to C:\Users\jenkins\workspace\Lucene-Solr-7.x-Windows\solr\build\solr-core\test\J1\temp\solr.search.stats.TestLRUStatsCache_678DCEB7683F3EAF-001\tempDir-001\shard0\cores\collection1
   [junit4]   2> 473311 INFO  (TEST-TestLRUStatsCache.test-seed#[678DCEB7683F3EAF]) [    ] o.e.j.s.Server jetty-9.3.20.v20170531
   [junit4]   2> 473312 INFO  (TEST-TestLRUStatsCache.test-seed#[678DCEB7683F3EAF]) [    ] o.e.j.s.h.ContextHandler Started o.e.j.s.ServletContextHandler@74f16504{/,null,AVAILABLE}
   [junit4]   2> 473313 INFO  (TEST-TestLRUStatsCache.test-seed#[678DCEB7683F3EAF]) [    ] o.e.j.s.AbstractConnector Started ServerConnector@7d394888{SSL,[ssl, http/1.1]}{127.0.0.1:54391}
   [junit4]   2> 473313 INFO  (TEST-TestLRUStatsCache.test-seed#[678DCEB7683F3EAF]) [    ] o.e.j.s.Server Started @483341ms
   [junit4]   2> 473313 INFO  (TEST-TestLRUStatsCache.test-seed#[678DCEB7683F3EAF]) [    ] o.a.s.c.s.e.JettySolrRunner Jetty properties: {hostContext=/, hostPort=54391, coreRootDirectory=C:\Users\jenkins\workspace\Lucene-Solr-7.x-Windows\solr\build\solr-core\test\J1\temp\solr.search.stats.TestLRUStatsCache_678DCEB7683F3EAF-001\tempDir-001\shard0\cores}
   [junit4]   2> 473313 ERROR (TEST-TestLRUStatsCache.test-seed#[678DCEB7683F3EAF]) [    ] o.a.s.u.StartupLoggingUtils Missing Java Option solr.log.dir. Logging may be missing or incomplete.
   [junit4]   2> 473313 INFO  (TEST-TestLRUStatsCache.test-seed#[678DCEB7683F3EAF]) [    ] o.a.s.s.SolrDispatchFilter  ___      _       Welcome to Apache Solr™ version 7.2.0
   [junit4]   2> 473313 INFO  (TEST-TestLRUStatsCache.test-seed#[678DCEB7683F3EAF]) [    ] o.a.s.s.SolrDispatchFilter / __| ___| |_ _   Starting in standalone mode on port null
   [junit4]   2> 473314 INFO  (TEST-TestLRUStatsCache.test-seed#[678DCEB7683F3EAF]) [    ] o.a.s.s.SolrDispatchFilter \__ \/ _ \ | '_|  Install dir: null
   [junit4]   2> 473314 INFO  (TEST-TestLRUStatsCache.test-seed#[678DCEB7683F3EAF]) [    ] o.a.s.s.SolrDispatchFilter |___/\___/_|_|    Start time: 2017-11-07T12:20:25.178207100Z
   [junit4]   2> 473314 INFO  (TEST-TestLRUStatsCache.test-seed#[678DCEB7683F3EAF]) [    ] o.a.s.c.SolrXmlConfig Loading container configuration from C:\Users\jenkins\workspace\Lucene-Solr-7.x-Windows\solr\build\solr-core\test\J1\temp\solr.search.stats.TestLRUStatsCache_678DCEB7683F3EAF-001\tempDir-001\shard0\solr.xml
   [junit4]   2> 473317 INFO  (TEST-TestLRUStatsCache.test-seed#[678DCEB7683F3EAF]) [    ] o.a.s.c.SolrXmlConfig Configuration parameter autoReplicaFailoverWorkLoopDelay is ignored
   [junit4]   2> 473317 INFO  (TEST-TestLRUStatsCache.test-seed#[678DCEB7683F3EAF]) [    ] o.a.s.c.SolrXmlConfig Configuration parameter autoReplicaFailoverBadNodeExpiration is ignored
   [junit4]   2> 473317 INFO  (TEST-TestLRUStatsCache.test-seed#[678DCEB7683F3EAF]) [    ] o.a.s.c.SolrXmlConfig MBean server found: com.sun.jmx.mbeanserver.JmxMBeanServer@71f47b84, but no JMX reporters were configured - adding default JMX reporter.
   [junit4]   2> 473357 INFO  (TEST-TestLRUStatsCache.test-seed#[678DCEB7683F3EAF]) [    ] o.a.s.m.r.SolrJmxReporter JMX monitoring for 'solr.node' (registry 'solr.node') enabled at server: com.sun.jmx.mbeanserver.JmxMBeanServer@71f47b84
   [junit4]   2> 473370 INFO  (TEST-TestLRUStatsCache.test-seed#[678DCEB7683F3EAF]) [    ] o.a.s.m.r.SolrJmxReporter JMX monitoring for 'solr.jvm' (registry 'solr.jvm') enabled at server: com.sun.jmx.mbeanserver.JmxMBeanServer@71f47b84
   [junit4]   2> 473370 INFO  (TEST-TestLRUStatsCache.test-seed#[678DCEB7683F3EAF]) [    ] o.a.s.m.r.SolrJmxReporter JMX monitoring for 'solr.jetty' (registry 'solr.jetty') enabled at server: com.sun.jmx.mbeanserver.JmxMBeanServer@71f47b84
   [junit4]   2> 473371 INFO  (TEST-TestLRUStatsCache.test-seed#[678DCEB7683F3EAF]) [    ] o.a.s.c.CorePropertiesLocator Found 1 core definitions underneath C:\Users\jenkins\workspace\Lucene-Solr-7.x-Windows\solr\build\solr-core\test\J1\temp\solr.search.stats.TestLRUStatsCache_678DCEB7683F3EAF-001\tempDir-001\shard0\cores
   [junit4]   2> 473371 INFO  (TEST-TestLRUStatsCache.test-seed#[678DCEB7683F3EAF]) [    ] o.a.s.c.CorePropertiesLocator Cores are: [collection1]
   [junit4]   2> 473372 INFO  (coreLoadExecutor-1254-thread-1) [    ] o.a.s.c.TransientSolrCoreCacheDefault Allocating transient cache for 4 transient cores
   [junit4]   2> 473374 INFO  (coreLoadExecutor-1254-thread-1) [    x:collection1] o.a.s.c.SolrResourceLoader [null] Added 2 libs to classloader, from paths: [/C:/Users/jenkins/workspace/Lucene-Solr-7.x-Windows/solr/core/src/test-files/solr/collection1/lib, /C:/Users/jenkins/workspace/Lucene-Solr-7.x-Windows/solr/core/src/test-files/solr/collection1/lib/classes]
   [junit4]   2> 473402 INFO  (coreLoadExecutor-1254-thread-1) [    x:collection1] o.a.s.c.SolrConfig Using Lucene MatchVersion: 7.2.0
   [junit4]   2> 473420 INFO  (coreLoadExecutor-1254-thread-1) [    x:collection1] o.a.s.s.IndexSchema [collection1] Schema name=test
   [junit4]   2> 473490 INFO  (coreLoadExecutor-1254-thread-1) [    x:collection1] o.a.s.s.IndexSchema Loaded schema test/1.0 with uniqueid field id
   [junit4]   2> 473502 INFO  (coreLoadExecutor-1254-thread-1) [    x:collection1] o.a.s.c.CoreContainer Creating SolrCore 'collection1' using configuration from configset C:\Users\jenkins\workspace\Lucene-Solr-7.x-Windows\solr\core\src\test-files\solr\collection1, trusted=true
   [junit4]   2> 473503 INFO  (coreLoadExecutor-1254-thread-1) [    x:collection1] o.a.s.m.r.SolrJmxReporter JMX monitoring for 'solr.core.collection1' (registry 'solr.core.collection1') enabled at server: com.sun.jmx.mbeanserver.JmxMBeanServer@71f47b84
   [junit4]   2> 473503 INFO  (coreLoadExecutor-1254-thread-1) [    x:collection1] o.a.s.c.SolrCore solr.RecoveryStrategy.Builder
   [junit4]   2> 473503 INFO  (coreLoadExecutor-1254-thread-1) [    x:collection1] o.a.s.c.SolrCore [[collection1] ] Opening new SolrCore at [C:\Users\jenkins\workspace\Lucene-Solr-7.x-Windows\solr\core\src\test-files\solr\collection1], dataDir=[C:\Users\jenkins\workspace\Lucene-Solr-7.x-Windows\solr\build\solr-core\test\J1\temp\solr.search.stats.TestLRUStatsCache_678DCEB7683F3EAF-001\tempDir-001\shard0\cores\collection1\data\]
   [junit4]   2> 473505 INFO  (coreLoadExecutor-1254-thread-1) [    x:collection1] o.a.s.u.RandomMergePolicy RandomMergePolicy wrapping class org.apache.lucene.index.TieredMergePolicy: [TieredMergePolicy: maxMergeAtOnce=45, maxMergeAtOnceExplicit=10, maxMergedSegmentMB=95.1298828125, floorSegmentMB=1.2626953125, forceMergeDeletesPctAllowed=3.5822726937159963, segmentsPerTier=42.0, maxCFSSegmentSizeMB=8.796093022207999E12, noCFSRatio=0.0
   [junit4]   2> 473652 INFO  (coreLoadExecutor-1254-thread-1) [    x:collection1] o.a.s.u.UpdateHandler Using UpdateLog implementation: org.apache.solr.update.UpdateLog
   [junit4]   2> 473652 INFO  (coreLoadExecutor-1254-thread-1) [    x:collection1] o.a.s.u.UpdateLog Initializing UpdateLog: dataDir= defaultSyncLevel=FLUSH numRecordsToKeep=100 maxNumLogsToKeep=10 numVersionBuckets=65536
   [junit4]   2> 473656 INFO  (coreLoadExecutor-1254-thread-1) [    x:collection1] o.a.s.u.CommitTracker Hard AutoCommit: disabled
   [junit4]   2> 473656 INFO  (coreLoadExecutor-1254-thread-1) [    x:collection1] o.a.s.u.CommitTracker Soft AutoCommit: disabled
   [junit4]   2> 473657 INFO  (coreLoadExecutor-1254-thread-1) [    x:collection1] o.a.s.u.RandomMergePolicy RandomMergePolicy wrapping class org.apache.lucene.index.LogDocMergePolicy: [LogDocMergePolicy: minMergeSize=1000, mergeFactor=46, maxMergeSize=9223372036854775807, maxMergeSizeForForcedMerge=9223372036854775807, calibrateSizeByDeletes=false, maxMergeDocs=2147483647, maxCFSSegmentSizeMB=8.796093022207999E12, noCFSRatio=0.34612966187534755]
   [junit4]   2> 473658 INFO  (coreLoadExecutor-1254-thread-1) [    x:collection1] o.a.s.s.SolrIndexSearcher Opening [Searcher@34beeb2e[collection1] main]
   [junit4]   2> 473659 INFO  (coreLoadExecutor-1254-thread-1) [    x:collection1] o.a.s.h.c.SpellCheckComponent Initializing spell checkers
   [junit4]   2> 473665 INFO  (coreLoadExecutor-1254-thread-1) [    x:collection1] o.a.s.s.DirectSolrSpellChecker init: {name=direct,classname=DirectSolrSpellChecker,field=lowerfilt,minQueryLength=3}
   [junit4]   2> 473696 INFO  (coreLoadExecutor-1254-thread-1) [    x:collection1] o.a.s.h.ReplicationHandler Commits will be reserved for 10000ms.
   [junit4]   2> 473697 INFO  (searcherExecutor-1255-thread-1-processing-x:collection1) [    x:collection1] o.a.s.h.c.SpellCheckComponent Loading spell index for spellchecker: default
   [junit4]   2> 473697 INFO  (coreLoadExecutor-1254-thread-1) [    x:collection1] o.a.s.u.UpdateLog Could not find max version in index or recent updates, using new clock 1583409765349851136
   [junit4]   2> 473698 INFO  (searcherExecutor-1255-thread-1-processing-x:collection1) [    x:collection1] o.a.s.h.c.SpellCheckComponent Loading spell index for spellchecker: direct
   [junit4]   2> 473698 INFO  (searcherExecutor-1255-thread-1-processing-x:collection1) [    x:collection1] o.a.s.h.c.SpellCheckComponent Loading spell index for spellchecker: wordbreak
   [junit4]   2> 473698 INFO  (searcherExecutor-1255-thread-1-processing-x:collection1) [    x:collection1] o.a.s.h.c.SpellCheckComponent Loading spell index for spellchecker: multipleFields
   [junit4]   2> 473699 INFO  (searcherExecutor-1255-thread-1-processing-x:collection1) [    x:collection1] o.a.s.h.c.SpellCheckComponent Loading spell index for spellchecker: jarowinkler
   [junit4]   2> 473700 INFO  (searcherExecutor-1255-thread-1-processing-x:collection1) [    x:collection1] o.a.s.h.c.SpellCheckComponent Loading spell index for spellchecker: external
   [junit4]   2> 473700 INFO  (TEST-TestLRUStatsCache.test-seed#[678DCEB7683F3EAF]) [    ] o.a.s.SolrTestCaseJ4 ###Starting test
   [junit4]   2> 473700 INFO  (searcherExecutor-1255-thread-1-processing-x:collection1) [    x:collection1] o.a.s.h.c.SpellCheckComponent Loading spell index for spellchecker: freq
   [junit4]   2> 473701 INFO  (searcherExecutor-1255-thread-1-processing-x:collection1) [    x:collection1] o.a.s.h.c.SpellCheckComponent Loading spell index for spellchecker: fqcn
   [junit4]   2> 473703 INFO  (searcherExecutor-1255-thread-1-processing-x:collection1) [    x:collection1] o.a.s.h.c.SpellCheckComponent Loading spell index for spellchecker: perDict
   [junit4]   2> 473706 INFO  (searcherExecutor-1255-thread-1-processing-x:collection1) [    x:collection1] o.a.s.c.SolrCore [collection1] Registered new searcher Searcher@34beeb2e[collection1] main{ExitableDirectoryReader(UninvertingDirectoryReader())}
   [junit4]   2> 473730 INFO  (qtp1927159233-3463) [    x:collection1] o.a.s.u.p.LogUpdateProcessorFactory [collection1]  webapp= path=/update params={wt=javabin&version=2}{deleteByQuery=*:* (-1583409765382356992)} 0 3
   [junit4]   2> 473756 INFO  (qtp1506069946-3480) [    x:collection1] o.a.s.u.p.LogUpdateProcessorFactory [collection1]  webapp= path=/update params={wt=javabin&version=2}{deleteByQuery=*:* (-1583409765408571392)} 0 3
   [junit4]   2> 473759 INFO  (qtp1927159233-3464) [    x:collection1] o.a.s.u.p.LogUpdateProcessorFactory [collection1]  webapp= path=/update params={wt=javabin&version=2}{add=[0 (1583409765413814272)]} 0 1
   [junit4]   2> 473761 INFO  (qtp1506069946-3482) [    x:collection1] o.a.s.u.p.LogUpdateProcessorFactory [collection1]  webapp= path=/update params={wt=javabin&version=2}{add=[0 (1583409765415911424)]} 0 0
   [junit4]   2> 473761 INFO  (qtp1927159233-3465) [    x:collection1] o.a.s.u.DirectUpdateHandler2 start commit{_version_=1583409765416960000,optimize=false,openSearcher=true,waitSearcher=true,expungeDeletes=false,softCommit=false,prepareCommit=false}
   [junit4]   2> 473761 INFO  (qtp1927159233-3465) [    x:collection1] o.a.s.u.SolrIndexWriter Calling setCommitData with IW:org.apache.solr.update.SolrIndexWriter@615db3e4 commitCommandVersion:1583409765416960000
   [junit4]   2> 473767 INFO  (qtp1927159233-3465) [    x:collection1] o.a.s.s.SolrIndexSearcher Opening [Searcher@24d032be[collection1] main]
   [junit4]   2> 473767 INFO  (qtp1927159233-3465) [    x:collection1] o.a.s.u.DirectUpdateHandler2 end_commit_flush
   [junit4]   2> 473769 INFO  (searcherExecutor-1244-thread-1-processing-x:collection1) [    x:collection1] o.a.s.c.SolrCore [collection1] Registered new searcher Searcher@24d032be[collection1] main{ExitableDirectoryReader(UninvertingDirectoryReader(Uninverting(_0(7.2.0):C1)))}
   [junit4]   2> 473769 INFO  (qtp1927159233-3465) [    x:collection1] o.a.s.u.p.LogUpdateProcessorFactory [collection1]  webapp= path=/update params={waitSearcher=true&commit=true&softCommit=false&wt=javabin&version=2}{commit=} 0 7
   [junit4]   2> 473770 INFO  (qtp1506069946-3481) [    x:collection1] o.a.s.u.DirectUpdateHandler2 start commit{_version_=1583409765426397184,optimize=false,openSearcher=true,waitSearcher=true,expungeDeletes=false,softCommit=false,prepareCommit=false}
   [junit4]   2> 473770 INFO  (qtp1506069946-3481) [    x:collection1] o.a.s.u.SolrIndexWriter Calling setCommitData with IW:org.apache.solr.update.SolrIndexWriter@6372c086 commitCommandVersion:1583409765426397184
   [junit4]   2> 473778 INFO  (qtp1506069946-3481) [    x:collection1] o.a.s.s.SolrIndexSearcher Opening [Searcher@728f0367[collection1] main]
   [junit4]   2> 473778 INFO  (qtp1506069946-3481) [    x:collection1] o.a.s.u.DirectUpdateHandler2 end_commit_flush
   [junit4]   2> 473779 INFO  (searcherExecutor-1255-thread-1-processing-x:collection1) [    x:collection1] o.a.s.c.SolrCore [collection1] Registered new searcher Searcher@728f0367[collection1] main{ExitableDirectoryReader(UninvertingDirectoryReader(Uninverting(_0(7.2.0):C1)))}
   [junit4]   2> 473780 INFO  (qtp1506069946-3481) [    x:collection1] o.a.s.u.p.LogUpdateProcessorFactory [collection1]  webapp= path=/update params={waitSearcher=true&commit=true&softCommit=false&wt=javabin&version=2}{commit=} 0 9
   [junit4]   2> 473781 INFO  (qtp1927159233-3458) [    x:collection1] o.a.s.c.S.Request [collection1]  webapp= path=/select params={q=a_t:one&fl=*,score&wt=javabin&version=2&debugQuery=true} hits=1 status=0 QTime=1
   [junit4]   2> 473795 INFO  (qtp1506069946-3479) [    x:collection1] o.a.s.c.S.Request [collection1]  webapp= path=/select params={df=text&distrib=false&debug=false&debug=timing&debug=track&fl=*,score&shards.purpose=32768&shard.url=https://127.0.0.1:54391//collection1&rid=127.0.0.1-collection1-1510057225647-2&version=2&q=a_t:one&requestPurpose=GET_TERM_STATS&NOW=1510057225647&isShard=true&wt=javabin&debugQuery=false} status=0 QTime=3
   [junit4]   2> 473798 INFO  (qtp1506069946-3480) [    x:collection1] o.a.s.c.S.Request [collection1]  webapp= path=/select params={df=text&distrib=false&debug=false&debug=timing&debug=track&fl=id&fl=score&shards.purpose=16388&start=0&fsv=true&org.apache.solr.stats.termStats=a_t:on,1,1&shard.url=https://127.0.0.1:54391//collection1&rid=127.0.0.1-collection1-1510057225647-2&rows=10&version=2&org.apache.solr.stats.colStats=a_t,1,1,3,3&q=a_t:one&requestPurpose=GET_TOP_IDS,SET_TERM_STATS&NOW=1510057225647&isShard=true&org.apache.solr.stats.terms=a_t:on&wt=javabin&debugQuery=false} hits=1 status=0 QTime=0
   [junit4]   2> 473799 INFO  (qtp1506069946-3482) [    x:collection1] o.a.s.c.S.Request [collection1]  webapp= path=/select params={df=text&distrib=false&debug=timing&debug=track&fl=*,score&shards.purpose=320&shard.url=https://127.0.0.1:54391//collection1&rid=127.0.0.1-collection1-1510057225647-2&version=2&q=a_t:one&requestPurpose=GET_FIELDS,GET_DEBUG&NOW=1510057225647&ids=0&isShard=true&wt=javabin&debugQuery=true} status=0 QTime=0
   [junit4]   2> 473800 INFO  (qtp1506069946-3475) [    x:collection1] o.a.s.c.S.Request [collection1]  webapp= path=/select params={q=a_t:one&shards=https://127.0.0.1:54391//collection1&fl=*,score&wt=javabin&version=2&debugQuery=true} rid=127.0.0.1-collection1-1510057225647-2 hits=1 status=0 QTime=17
   [junit4]   1> ======================= Control Response =======================
   [junit4]   1> {responseHeader={status=0,QTime=1},response={numFound=1,start=0,maxScore=0.57735026,docs=[SolrDocument{id=0, range_facet_l=[0], id_i1=0, range_facet_l_dv=[0], range_facet_i_dv=[0], a_t=[one two three], shard_i=[1], multiDefault=[muLti-Default], intDefault=42, timestamp=Tue Nov 07 17:20:25 AQTT 2017, _version_=1583409765413814272, intDvoDefault=42, score=0.57735026}]},debug={rawquerystring=a_t:one,querystring=a_t:one,parsedquery=a_t:on,parsedquery_toString=a_t:on,explain={0=
   [junit4]   1> 0.57735026 = weight(a_t:on in 0) [MockConfigurableSimilarity], result of:
   [junit4]   1>   0.57735026 = fieldWeight in 0, product of:
   [junit4]   1>     1.0 = tf(freq=1.0), with freq of:
   [junit4]   1>       1.0 = termFreq=1.0
   [junit4]   1>     1.0 = idf, computed as log((docCount+1)/(docFreq+1)) + 1 from:
   [junit4]   1>       1.0 = docFreq
   [junit4]   1>       1.0 = docCount
   [junit4]   1>     0.57735026 = fieldNorm(doc=0)
   [junit4]   1> },QParser=LuceneQParser,timing={time=1.0,prepare={time=0.0,query={time=0.0},facet={time=0.0},facet_module={time=0.0},mlt={time=0.0},highlight={time=0.0},stats={time=0.0},expand={time=0.0},terms={time=0.0},debug={time=0.0}},process={time=0.0,query={time=0.0},facet={time=0.0},facet_module={time=0.0},mlt={time=0.0},highlight={time=0.0},stats={time=0.0},expand={time=0.0},terms={time=0.0},debug={time=0.0}}}}}
   [junit4]   1> 
   [junit4]   1> 
   [junit4]   1> ======================= Shard Response =======================
   [junit4]   1> 
   [junit4]   1> {responseHeader={status=0,QTime=17},response={numFound=1,start=0,maxScore=0.57735026,docs=[SolrDocument{id=0, range_facet_l=[0], id_i1=0, range_facet_l_dv=[0], range_facet_i_dv=[0], a_t=[one two three], shard_i=[1], multiDefault=[muLti-Default], intDefault=42, timestamp=Tue Nov 07 17:20:25 AQTT 2017, _version_=1583409765415911424, intDvoDefault=42, score=0.57735026}]},debug={track={rid=127.0.0.1-collection1-1510057225647-2,PARSE_QUERY={https://127.0.0.1:54391//collection1={QTime=3,ElapsedTime=11,RequestPurpose=GET_TERM_STATS,Response={responseHeader={status=0,QTime=3},org.apache.solr.stats.terms=a_t:on,org.apache.solr.stats.termStats=a_t:on,1,1,org.apache.solr.stats.colStats=a_t,1,1,3,3,debug={timing={time=3.0,prepare={time=0.0,query={time=0.0},facet={time=0.0},facet_module={time=0.0},mlt={time=0.0},highlight={time=0.0},stats={time=0.0},expand={time=0.0},terms={time=0.0},debug={time=0.0}},process={time=3.0,query={time=3.0},facet={time=0.0},facet_module={time=0.0},mlt={time=0.0},highlight={time=0.0},stats={time=0.0},expand={time=0.0},terms={time=0.0},debug={time=0.0}}}}}}},EXECUTE_QUERY={https://127.0.0.1:54391//collection1={QTime=0,ElapsedTime=1,RequestPurpose=GET_TOP_IDS,SET_TERM_STATS,NumFound=1,Response={responseHeader={status=0,QTime=0},response={numFound=1,start=0,maxScore=0.57735026,docs=[SolrDocument{id=0, score=0.57735026}]},sort_values={},debug={timing={time=0.0,prepare={time=0.0,query={time=0.0},facet={time=0.0},facet_module={time=0.0},mlt={time=0.0},highlight={time=0.0},stats={time=0.0},expand={time=0.0},terms={time=0.0},debug={time=0.0}},process={time=0.0,query={time=0.0},facet={time=0.0},facet_module={time=0.0},mlt={time=0.0},highlight={time=0.0},stats={time=0.0},expand={time=0.0},terms={time=0.0},debug={time=0.0}}}}}}},GET_FIELDS={https://127.0.0.1:54391//collection1={QTime=0,ElapsedTime=2,RequestPurpose=GET_FIELDS,GET_DEBUG,NumFound=1,Response={responseHeader={status=0,QTime=0},response={numFound=1,start=0,docs=[SolrDocument{id=0, range_facet_l=[0], id_i1=0, range_facet_l_dv=[0], range_facet_i_dv=[0], a_t=[one two three], shard_i=[1], multiDefault=[muLti-Default], intDefault=42, timestamp=Tue Nov 07 17:20:25 AQTT 2017, _version_=1583409765415911424, intDvoDefault=42, score=0.57735026}]},debug={rawquerystring=a_t:one,querystring=a_t:one,parsedquery=a_t:on,parsedquery_toString=a_t:on,explain={0=
   [junit4]   1> 0.57735026 = weight(a_t:on in 0) [MockConfigurableSimilarity], result of:
   [junit4]   1>   0.57735026 = fieldWeight in 0, product of:
   [junit4]   1>     1.0 = tf(freq=1.0), with freq of:
   [junit4]   1>       1.0 = termFreq=1.0
   [junit4]   1>     1.0 = idf, computed as log((docCount+1)/(docFreq+1)) + 1 from:
   [junit4]   1>       1.0 = docFreq
   [junit4]   1>       1.0 = docCount
   [junit4]   1>     0.57735026 = fieldNorm(doc=0)
   [junit4]   1> },QParser=LuceneQParser,timing={time=0.0,prepare={time=0.0,query={time=0.0},facet={time=0.0},facet_module={time=0.0},mlt={time=0.0},highlight={time=0.0},stats={time=0.0},expand={time=0.0},terms={time=0.0},debug={time=0.0}},process={time=0.0,query={time=0.0},facet={time=0.0},facet_module={time=0.0},mlt={time=0.0},highlight={time=0.0},stats={time=0.0},expand={time=0.0},terms={time=0.0},debug={time=0.0}}}}}}}},timing={time=3.0,prepare={time=0.0,query={time=0.0},facet={time=0.0},facet_module={time=0.0},mlt={time=0.0},highlight={time=0.0},stats={time=0.0},expand={time=0.0},terms={time=0.0},debug={time=0.0}},process={time=3.0,query={time=3.0},facet={time=0.0},facet_module={time=0.0},mlt={time=0.0},highlight={time=0.0},stats={time=0.0},expand={time=0.0},terms={time=0.0},debug={time=0.0}}},rawquerystring=a_t:one,querystring=a_t:one,parsedquery=a_t:on,parsedquery_toString=a_t:on,QParser=LuceneQParser,explain={0=
   [junit4]   1> 0.57735026 = weight(a_t:on in 0) [MockConfigurableSimilarity], result of:
   [junit4]   1>   0.57735026 = fieldWeight in 0, product of:
   [junit4]   1>     1.0 = tf(freq=1.0), with freq of:
   [junit4]   1>       1.0 = termFreq=1.0
   [junit4]   1>     1.0 = idf, computed as log((docCount+1)/(docFreq+1)) + 1 from:
   [junit4]   1>       1.0 = docFreq
   [junit4]   1>       1.0 = docCount
   [junit4]   1>     0.57735026 = fieldNorm(doc=0)
   [junit4]   1> }}}
   [junit4]   2> 473805 INFO  (qtp1927159233-3460) [    x:collection1] o.a.s.u.p.LogUpdateProcessorFactory [collection1]  webapp= path=/update params={wt=javabin&version=2}{add=[1 (1583409765461000192)]} 0 1
   [junit4]   2> 473807 INFO  (qtp1506069946-3481) [    x:collection1] o.a.s.u.p.LogUpdateProcessorFactory [collection1]  webapp= path=/update params={wt=javabin&version=2}{add=[1 (1583409765464145920)]} 0 1
   [junit4]   2> 473810 INFO  (qtp1927159233-3461) [    x:collection1] o.a.s.u.DirectUpdateHandler2 start commit{_version_=1583409765468340224,optimize=false,openSearcher=true,waitSearcher=true,expungeDeletes=false,softCommit=false,prepareCommit=false}
   [junit4]   2> 473810 INFO  (qtp1927159233-3461) [    x:collection1] o.a.s.u.SolrIndexWriter Calling setCommitData with IW:org.apache.solr.update.SolrIndexWriter@615db3e4 commitCommandVersion:1583409765468340224
   [junit4]   2> 473849 INFO  (qtp1927159233-3461) [    x:collection1] o.a.s.s.SolrIndexSearcher Opening [Searcher@5b3c71a[collection1] main]
   [junit4]   2> 473849 INFO  (qtp1927159233-3461) [    x:collection1] o.a.s.u.DirectUpdateHandler2 end_commit_flush
   [junit4]   2> 473854 INFO  (searcherExecutor-1244-thread-1-processing-x:collection1) [    x:collection1] o.a.s.c.SolrCore [collection1] Registered new searcher Searcher@5b3c71a[collection1] main{ExitableDirectoryReader(UninvertingDirectoryReader(Uninverting(_0(7.2.0):C1) Uninverting(_1(7.2.0):C1)))}
   [junit4]   2> 473854 INFO  (qtp1927159233-3461) [    x:collection1] o.a.s.u.p.LogUpdateProcessorFactory [collection1]  webapp= path=/update params={waitSearcher=true&commit=true&softCommit=false&wt=javabin&version=2}{commit=} 0 45
   [junit4]   2> 473855 INFO  (qtp1506069946-3478) [    x:collection1] o.a.s.u.DirectUpdateHandler2 start commit{_version_=1583409765515526144,optimize=false,openSearcher=true,waitSearcher=true,expungeDeletes=false,softCommit=false,prepareCommit=false}
   [junit4]   2> 473855 INFO  (qtp1506069946-3478) [    x:collection1] o.a.s.u.SolrIndexWriter Calling setCommitData with IW:org.apache.solr.update.SolrIndexWriter@6372c086 commitCommandVersion:1583409765515526144
   [junit4]   2> 473897 INFO  (qtp1506069946-3478) [    x:collection1] o.a.s.s.SolrIndexSearcher Opening [Searcher@19fefd3d[collection1] main]
   [junit4]   2> 473897 INFO  (qtp1506069946-3478) [    x:collection1] o.a.s.u.DirectUpdateHandler2 end_commit_flush
   [junit4]   2> 473897 INFO  (searcherExecutor-1255-thread-1-processing-x:collection1) [    x:collection1] o.a.s.c.SolrCore [collection1] Registered new searcher Searcher@19fefd3d[collection1] main{ExitableDirectoryReader(UninvertingDirectoryReader(Uninverting(_0(7.2.0):C1) Uninverting(_1(7.2.0):C1)))}
   [junit4]   2> 473899 INFO  (qtp1506069946-3478) [    x:collection1] o.a.s.u.p.LogUpdateProcessorFactory [collection1]  webapp= path=/update params={waitSearcher=true&commit=true&softCommit=false&wt=javabin&version=2}{commit=} 0 44
   [junit4]   2> 473902 INFO  (qtp1927159233-3462) [    x:collection1] o.a.s.c.S.Request [collection1]  webapp= path=/select params={q=a_t:one+a_t:four&fl=*,score&wt=javabin&version=2&debugQuery=true} hits=2 status=0 QTime=1
   [junit4]   2> 473904 INFO  (qtp1506069946-3479) [    x:collection1] o.a.s.c.S.Request [collection1]  webapp= path=/select params={df=text&distrib=false&debug=false&debug=timing&debug=track&fl=*,score&shards.purpose=32768&shard.url=https://127.0.0.1:54391//collection1&rid=127.0.0.1-collection1-1510057225767-3&version=2&q=a_t:one+a_t:four&requestPurpose=GET_TERM_STATS&NOW=1510057225767&isShard=true&wt=javabin&debugQuery=false} status=0 QTime=0
   [junit4]   2> 473905 INFO  (qtp1506069946-3480) [    x:collection1] o.a.s.c.S.Request [collection1]  webapp= path=/select params={df=text&distrib=false&debug=false&debug=timing&debug=track&fl=id&fl=score&shards.purpose=16388&start=0&fsv=true&org.apache.solr.stats.termStats=a_t:on,2,2!a_t:four,1,1&shard.url=https://127.0.0.1:54391//collection1&rid=127.0.0.1-collection1-1510057225767-3&rows=10&version=2&org.apache.solr.stats.colStats=a_t,2,2,8,8&q=a_t:one+a_t:four&requestPurpose=GET_TOP_IDS,SET_TERM_STATS&NOW=1510057225767&isShard=true&org.apache.solr.stats.terms=a_t:on&org.apache.solr.stats.terms=a_t:four&wt=javabin&debugQuery=false} hits=2 status=0 QTime=0
   [junit4]   2> 473907 INFO  (qtp1506069946-3480) [    x:collection1] o.a.s.c.S.Request [collection1]  webapp= path=/select params={df=text&distrib=false&debug=timing&debug=track&fl=*,score&shards.purpose=320&shard.url=https://127.0.0.1:54391//collection1&rid=127.0.0.1-collection1-1510057225767-3&version=2&q=a_t:one+a_t:four&requestPurpose=GET_FIELDS,GET_DEBUG&NOW=1510057225767&ids=0,1&isShard=true&wt=javabin&debugQuery=true} status=0 QTime=0
   [junit4]   2> 473908 INFO  (qtp1506069946-3477) [    x:collection1] o.a.s.c.S.Request [collection1]  webapp= path=/select params={q=a_t:one+a_t:four&shards=https://127.0.0.1:54391//collection1&fl=*,score&wt=javabin&version=2&debugQuery=true} rid=127.0.0.1-collection1-1510057225767-3 hits=2 status=0 QTime=5
   [junit4]   1> ======================= Control Response =======================
   [junit4]   1> {responseHeader={status=0,QTime=1},response={numFound=2,start=0,maxScore=1.0757567,docs=[SolrDocument{id=1, range_facet_l=[1], id_i1=1, range_facet_l_dv=[1], range_facet_i_dv=[1], a_t=[one two three four five], shard_i=[1], multiDefault=[muLti-Default], intDefault=42, timestamp=Tue Nov 07 17:20:25 AQTT 2017, _version_=1583409765461000192, intDvoDefault=42, score=1.0757567}, SolrDocument{id=0, range_facet_l=[0], id_i1=0, range_facet_l_dv=[0], range_facet_i_dv=[0], a_t=[one two three], shard_i=[1], multiDefault=[muLti-Default], intDefault=42, timestamp=Tue Nov 07 17:20:25 AQTT 2017, _version_=1583409765413814272, intDvoDefault=42, score=0.57735026}]},debug={rawquerystring=a_t:one a_t:four,querystring=a_t:one a_t:four,parsedquery=a_t:on a_t:four,parsedquery_toString=a_t:on a_t:four,explain={1=
   [junit4]   1> 1.0757567 = sum of:
   [junit4]   1>   0.4472136 = weight(a_t:on in 0) [MockConfigurableSimilarity], result of:
   [junit4]   1>     0.4472136 = fieldWeight in 0, product of:
   [junit4]   1>       1.0 = tf(freq=1.0), with freq of:
   [junit4]   1>         1.0 = termFreq=1.0
   [junit4]   1>       1.0 = idf, computed as log((docCount+1)/(docFreq+1)) + 1 from:
   [junit4]   1>         2.0 = docFreq
   [junit4]   1>         2.0 = docCount
   [junit4]   1>       0.4472136 = fieldNorm(doc=0)
   [junit4]   1>   0.6285431 = weight(a_t:four in 0) [MockConfigurableSimilarity], result of:
   [junit4]   1>     0.6285431 = fieldWeight in 0, product of:
   [junit4]   1>       1.0 = tf(freq=1.0), with freq of:
   [junit4]   1>         1.0 = termFreq=1.0
   [junit4]   1>       1.4054651 = idf, computed as log((docCount+1)/(docFreq+1)) + 1 from:
   [junit4]   1>         1.0 = docFreq
   [junit4]   1>         2.0 = docCount
   [junit4]   1>       0.4472136 = fieldNorm(doc=0)
   [junit4]   1> ,0=
   [junit4]   1> 0.57735026 = sum of:
   [junit4]   1>   0.57735026 = weight(a_t:on in 0) [MockConfigurableSimilarity], result of:
   [junit4]   1>     0.57735026 = fieldWeight in 0, product of:
   [junit4]   1>       1.0 = tf(freq=1.0), with freq of:
   [junit4]   1>         1.0 = termFreq=1.0
   [junit4]   1>       1.0 = idf, computed as log((docCount+1)/(docFreq+1)) + 1 from:
   [junit4]   1>         2.0 = docFreq
   [junit4]   1>         2.0 = docCount
   [junit4]   1>       0.57735026 = fieldNorm(doc=0)
   [junit4]   1> },QParser=LuceneQParser,timing={time=1.0,prepare={time=0.0,query={time=0.0},facet={time=0.0},facet_module={time=0.0},mlt={time=0.0},highlight={time=0.0},stats={time=0.0},expand={time=0.0},terms={time=0.0},debug={time=0.0}},process={time=1.0,query={time=0.0},facet={time=0.0},facet_module={time=0.0},mlt={time=0.0},highlight={time=0.0},stats={time=0.0},expand={time=0.0},terms={time=0.0},debug={time=0.0}}}}}
   [junit4]   1> 
   [junit4]   1> 
   [junit4]   1> ======================= Shard Response =======================
   [junit4]   1> 
   [junit4]   1> {responseHeader={status=0,QTime=5},response={numFound=2,start=0,maxScore=1.0757567,docs=[SolrDocument{id=1, range_facet_l=[1], id_i1=1, range_facet_l_dv=[1], range_facet_i_dv=[1], a_t=[one two three four five], shard_i=[1], multiDefault=[muLti-Default], intDefault=42, timestamp=Tue Nov 07 17:20:25 AQTT 2017, _version_=1583409765464145920, intDvoDefault=42, score=1.0757567}, SolrDocument{id=0, range_facet_l=[0], id_i1=0, range_facet_l_dv=[0], range_facet_i_dv=[0], a_t=[one two three], shard_i=[1], multiDefault=[muLti-Default], intDefault=42, timestamp=Tue Nov 07 17:20:25 AQTT 2017, _version_=1583409765415911424, intDvoDefault=42, score=0.57735026}]},debug={track={rid=127.0.0.1-collection1-1510057225767-3,PARSE_QUERY={https://127.0.0.1:54391//collection1={QTime=0,ElapsedTime=0,RequestPurpose=GET_TERM_STATS,Response={responseHeader={status=0,QTime=0},org.apache.solr.stats.terms=a_t:four,org.apache.solr.stats.terms=a_t:on,org.apache.solr.stats.termStats=a_t:on,2,2!a_t:four,1,1,org.apache.solr.stats.colStats=a_t,2,2,8,8,debug={timing={time=0.0,prepare={time=0.0,query={time=0.0},facet={time=0.0},facet_module={time=0.0},mlt={time=0.0},highlight={time=0.0},stats={time=0.0},expand={time=0.0},terms={time=0.0},debug={time=0.0}},process={time=0.0,query={time=0.0},facet={time=0.0},facet_module={time=0.0},mlt={time=0.0},highlight={time=0.0},stats={time=0.0},expand={time=0.0},terms={time=0.0},debug={time=0.0}}}}}}},EXECUTE_QUERY={https://127.0.0.1:54391//collection1={QTime=0,ElapsedTime=1,RequestPurpose=GET_TOP_IDS,SET_TERM_STATS,NumFound=2,Response={responseHeader={status=0,QTime=0},response={numFound=2,start=0,maxScore=1.0757567,docs=[SolrDocument{id=1, score=1.0757567}, SolrDocument{id=0, score=0.57735026}]},sort_values={},debug={timing={time=0.0,prepare={time=0.0,query={time=0.0},facet={time=0.0},facet_module={time=0.0},mlt={time=0.0},highlight={time=0.0},stats={time=0.0},expand={time=0.0},terms={time=0.0},debug={time=0.0}},process={time=0.0,query={time=0.0},facet={time=0.0},facet_module={time=0.0},mlt={time=0.0},highlight={time=0.0},stats={time=0.0},expand={time=0.0},terms={time=0.0},debug={time=0.0}}}}}}},GET_FIELDS={https://127.0.0.1:54391//collection1={QTime=0,ElapsedTime=1,RequestPurpose=GET_FIELDS,GET_DEBUG,NumFound=2,Response={responseHeader={status=0,QTime=0},response={numFound=2,start=0,docs=[SolrDocument{id=0, range_facet_l=[0], id_i1=0, range_facet_l_dv=[0], range_facet_i_dv=[0], a_t=[one two three], shard_i=[1], multiDefault=[muLti-Default], intDefault=42, timestamp=Tue Nov 07 17:20:25 AQTT 2017, _version_=1583409765415911424, intDvoDefault=42, score=0.57735026}, SolrDocument{id=1, range_facet_l=[1], id_i1=1, range_facet_l_dv=[1], range_facet_i_dv=[1], a_t=[one two three four five], shard_i=[1], multiDefault=[muLti-Default], intDefault=42, timestamp=Tue Nov 07 17:20:25 AQTT 2017, _version_=1583409765464145920, intDvoDefault=42, score=1.0757567}]},debug={rawquerystring=a_t:one a_t:four,querystring=a_t:one a_t:four,parsedquery=a_t:on a_t:four,parsedquery_toString=a_t:on a_t:four,explain={0=
   [junit4]   1> 0.57735026 = sum of:
   [junit4]   1>   0.57735026 = weight(a_t:on in 0) [MockConfigurableSimilarity], result of:
   [junit4]   1>     0.57735026 = fieldWeight in 0, product of:
   [junit4]   1>       1.0 = tf(freq=1.0), with freq of:
   [junit4]   1>         1.0 = termFreq=1.0
   [junit4]   1>       1.0 = idf, comp

[...truncated too long message...]

adTest, TestCollationFieldDocValues, DataDrivenBlockJoinTest, TestFieldResource, DistribDocExpirationUpdateProcessorTest, BlockJoinFacetDistribTest, CdcrReplicationDistributedZkTest, TestMacros, TestBM25SimilarityFactory, SimpleFacetsTest, TestJsonRequest, TestCloudManagedSchema, HttpSolrCallGetCoreTest, TestSystemIdResolver, TestCrossCoreJoin, TestScoreJoinQPNoScore, TestTolerantUpdateProcessorCloud, FieldMutatingUpdateProcessorTest, TestPullReplica, CloudExitableDirectoryReaderTest, MultiThreadedOCPTest, FileBasedSpellCheckerTest, HdfsDirectoryFactoryTest, TestSolrXml, PingRequestHandlerTest, TestStressCloudBlindAtomicUpdates, TestExactSharedStatsCache, SolrIndexConfigTest, TestValueSourceCache, RecoveryAfterSoftCommitTest, SolrPluginUtilsTest, ImplicitSnitchTest, TestConfigSets, TestLeaderElectionWithEmptyReplica, TestSchemaResource, TestReloadAndDeleteDocs, TestGraphTermsQParserPlugin, MetricsConfigTest, TestFileDictionaryLookup, TestConfigSetImmutable, TestSimpleTrackingShardHandler, TestDistributedGrouping, TestLockTree, TestXmlQParser, TriggerIntegrationTest, CursorMarkTest, LukeRequestHandlerTest, TestPerFieldSimilarityWithDefaultOverride, TestLeaderInitiatedRecoveryThread, TestRandomCollapseQParserPlugin, OverseerTaskQueueTest, IgnoreCommitOptimizeUpdateProcessorFactoryTest, CloneFieldUpdateProcessorFactoryTest, TestOnReconnectListenerSupport, TestChildDocTransformer, TestClusterProperties, TestCloudRecovery, DOMUtilTest, TestFoldingMultitermQuery, TestManagedSchema, SchemaVersionSpecificBehaviorTest, TestMultiWordSynonyms, SortSpecParsingTest, LeaderInitiatedRecoveryOnCommitTest, TestFastOutputStream, BigEndianAscendingWordSerializerTest, CollectionsAPIDistributedZkTest, HdfsCollectionsAPIDistributedZkTest, TestAuthorizationFramework, TestReRankQParserPlugin, SolrGraphiteReporterTest, SystemLogListenerTest, AssignTest, TestFunctionQuery, UpdateParamsTest, TestJettySolrRunner, BlockDirectoryTest, TestSort, OpenExchangeRatesOrgProviderTest, SolrMetricsIntegrationTest, InfoHandlerTest, DistributedQueueTest, HdfsRecoverLeaseTest, FullSolrCloudDistribCmdsTest, PeerSyncTest, TestUniqueKeyFieldResource, RulesTest, TestOverriddenPrefixQueryForCustomFieldType, TestConfigSetsAPIExclusivity, TestLuceneIndexBackCompat, PreAnalyzedUpdateProcessorTest, CoreAdminRequestStatusTest, CdcrBidirectionalTest, TestCollapseQParserPlugin, TestCollectionsAPIViaSolrCloudCluster, DeleteReplicaTest, DocumentBuilderTest, DistributedFacetPivotLongTailTest, OverseerCollectionConfigSetProcessorTest, CollectionsAPIAsyncDistributedZkTest, TestInitParams, DirectSolrSpellCheckerTest, TestDFISimilarityFactory, TestMergePolicyConfig, DeleteStatusTest, TestComponentsName, SimplePostToolTest, NodeLostTriggerTest, OutOfBoxZkACLAndCredentialsProvidersTest, PolyFieldTest, SolrCoreCheckLockOnStartupTest, UpdateRequestProcessorFactoryTest, MissingSegmentRecoveryTest, WrapperMergePolicyFactoryTest, QueryEqualityTest, ActionThrottleTest, TestBackupRepositoryFactory, TestExclusionRuleCollectionAccess, TestSolrJ, DirectoryFactoryTest, TestSolrDeletionPolicy1, TestStressLiveNodes, TestSolrCloudWithKerberosAlt, DeleteLastCustomShardedReplicaTest, TestFastLRUCache, TestSlowCompositeReaderWrapper, SimpleMLTQParserTest, TestDefaultStatsCache, TestLMJelinekMercerSimilarityFactory, TestSearchPerf, TestInitQParser, TestSubQueryTransformerCrossCore, TestReloadDeadlock, TestRestoreCore, TestSimpleTextCodec, TestLuceneMatchVersion, TemplateUpdateProcessorTest, QueryElevationComponentTest, ExecutePlanActionTest, ChaosMonkeySafeLeaderTest, UnloadDistributedZkTest, SyncSliceTest, OverseerTest, LeaderElectionIntegrationTest, BasicZkTest, TestZkChroot, ShardRoutingCustomTest, TestFaceting, TestRecovery, TestHashPartitioner, TermVectorComponentDistributedTest, TestStressReorder, TestReload, SolrCoreTest, TestGroupingSearch, SolrCmdDistributorTest, BasicFunctionalityTest, TestIndexSearcher, ShowFileRequestHandlerTest, SolrIndexSplitterTest, TestExtendedDismaxParser, CoreAdminHandlerTest, SuggesterTest, TestStressLucene, TestTrie, SuggesterWFSTTest, TestCSVLoader, TestUpdate, TestWordDelimiterFilterFactory, TestRemoteStreaming, DebugComponentTest, TestSurroundQueryParser, TestQueryUtils, TestReversedWildcardFilterFactory, DocumentAnalysisRequestHandlerTest, PrimitiveFieldTypeTest, TermsComponentTest, TestSolrQueryParser, LoggingHandlerTest, ReturnFieldsTest, TestAnalyzedSuggestions, UniqFieldsUpdateProcessorFactoryTest, JsonLoaderTest, BinaryUpdateRequestHandlerTest, TestPartialUpdateDeduplication, TestPHPSerializedResponseWriter, SearchHandlerTest, HighlighterConfigTest, SOLR749Test, AlternateDirectoryTest, CopyFieldTest, BadComponentTest, TestStressRecovery, SampleTest, TestDocSet, TestBinaryField, NumericFieldsTest, MinimalSchemaTest, TestElisionMultitermQuery, TestConfig, OutputWriterTest, TestFuzzyAnalyzedSuggestions, ExternalFileFieldSortTest, TestSolrCoreProperties, TestPostingsSolrHighlighter, DirectSolrConnectionTest, SpellPossibilityIteratorTest, TestCharFilters, TestCodecSupport, SynonymTokenizerTest, TestXIncludeConfig, EchoParamsTest, TestPerFieldSimilarity, TestLMDirichletSimilarityFactory, TestFastWriter, PluginInfoTest, ChaosMonkeyNothingIsSafeTest, AssignBackwardCompatibilityTest, CreateCollectionCleanupTest, DeleteInactiveReplicaTest, DocValuesNotIndexedTest, ForceLeaderTest, LeaderInitiatedRecoveryOnShardRestartTest, LegacyCloudClusterPropTest, NodeMutatorTest, OverseerRolesTest, ReplaceNodeTest, SSLMigrationTest, SaslZkACLProviderTest, ShardSplitTest, TestRandomFlRTGCloud, TestRandomRequestDistribution, TestRebalanceLeaders, TestReplicaProperties, TestRequestForwarding, TestSSLRandomization, TestTlogReplica, AutoAddReplicasIntegrationTest, CdcrReplicationHandlerTest, CdcrRequestHandlerTest, HdfsBasicDistributedZk2Test, HdfsNNFailoverTest, HdfsRecoveryZkTest, HdfsRestartWhileUpdatingTest, HdfsSyncSliceTest, HdfsThreadLeakTest, HdfsTlogReplayBufferedWhileIndexingTest, HdfsUnloadDistributedZkTest, HdfsWriteToMultipleCollectionsTest, StressHdfsTest, ZkStateReaderTest, RuleEngineTest, ConfigureRecoveryStrategyTest, ExitableDirectoryReaderTest, QueryResultKeyTest, TestConfigOverlay, TestCustomStream, TestImplicitCoreProperties, TestInfoStreamLogging, TestSolrCloudSnapshots, TestConfigReload, TestSQLHandlerNonCloud, TestSolrConfigHandlerCloud, TestSolrConfigHandlerConcurrent, V2ApiIntegrationTest, CoreAdminCreateDiscoverTest, MetricsHandlerTest, PropertiesRequestHandlerTest, SecurityConfHandlerTest, SegmentsInfoRequestHandlerTest, StatsReloadRaceTest, DistributedDebugComponentTest, DistributedExpandComponentTest, DistributedFacetPivotLargeTest, DistributedFacetPivotSmallAdvancedTest, DistributedFacetPivotSmallTest, FacetPivotSmallTest, InfixSuggestersTest, ReplicaListTransformerTest, ShufflingReplicaListTransformerTest, SpatialHeatmapFacetsTest, SolrSlf4jReporterTest, RegexBytesRefFilterTest, TestIntervalFaceting, TestStreamBody, TestMacroExpander, TestCustomDocTransformer, TestExportWriter, TestGeoJSONResponseWriter, TestPushWriter, TestRawResponseWriter, TestRetrieveFieldsOptimizer, TestSubQueryTransformer, TestManagedResource, TestManagedResourceStorage, TestRestManager, TestBulkSchemaAPI, TestFieldCollectionResource, TestSchemaNameResource, TestSerializedLuceneMatchVersion, TestManagedSynonymFilterFactory, TestManagedSynonymGraphFilterFactory, ChangedSchemaMergeTest, DateRangeFieldTest, EnumFieldTest, PreAnalyzedFieldManagedSchemaCloudTest, TestManagedSchemaThreadSafety, TestSchemaManager, TestSchemalessBufferedUpdates, TestUseDocValuesAsStored]
   [junit4]   2> NOTE: reproduce with: ant test  -Dtestcase=TestUseDocValuesAsStored -Dtests.seed=678DCEB7683F3EAF -Dtests.slow=true -Dtests.locale=kl-GL -Dtests.timezone=America/Fort_Nelson -Dtests.asserts=true -Dtests.file.encoding=Cp1252
   [junit4] ERROR   0.00s J1 | TestUseDocValuesAsStored (suite) <<<
   [junit4]    > Throwable #1: com.carrotsearch.randomizedtesting.ThreadLeakError: 3 threads leaked from SUITE scope at org.apache.solr.schema.TestUseDocValuesAsStored: 
   [junit4]    >    1) Thread[id=35750, name=Thread-6823, state=WAITING, group=TGRP-TestUseDocValuesAsStored]
   [junit4]    >         at java.base@9.0.1/java.lang.Object.wait(Native Method)
   [junit4]    >         at java.base@9.0.1/java.lang.Object.wait(Object.java:516)
   [junit4]    >         at app//org.apache.solr.core.CloserThread.run(CoreContainer.java:1717)
   [junit4]    >    2) Thread[id=35747, name=Connection evictor, state=TIMED_WAITING, group=TGRP-TestUseDocValuesAsStored]
   [junit4]    >         at java.base@9.0.1/java.lang.Thread.sleep(Native Method)
   [junit4]    >         at app//org.apache.http.impl.client.IdleConnectionEvictor$1.run(IdleConnectionEvictor.java:66)
   [junit4]    >         at java.base@9.0.1/java.lang.Thread.run(Thread.java:844)
   [junit4]    >    3) Thread[id=35748, name=Connection evictor, state=TIMED_WAITING, group=TGRP-TestUseDocValuesAsStored]
   [junit4]    >         at java.base@9.0.1/java.lang.Thread.sleep(Native Method)
   [junit4]    >         at app//org.apache.http.impl.client.IdleConnectionEvictor$1.run(IdleConnectionEvictor.java:66)
   [junit4]    >         at java.base@9.0.1/java.lang.Thread.run(Thread.java:844)
   [junit4]    > 	at __randomizedtesting.SeedInfo.seed([678DCEB7683F3EAF]:0)Throwable #2: com.carrotsearch.randomizedtesting.ThreadLeakError: There are still zombie threads that couldn't be terminated:
   [junit4]    >    1) Thread[id=35750, name=Thread-6823, state=WAITING, group=TGRP-TestUseDocValuesAsStored]
   [junit4]    >         at java.base@9.0.1/java.lang.Object.wait(Native Method)
   [junit4]    >         at java.base@9.0.1/java.lang.Object.wait(Object.java:516)
   [junit4]    >         at app//org.apache.solr.core.CloserThread.run(CoreContainer.java:1717)
   [junit4]    > 	at __randomizedtesting.SeedInfo.seed([678DCEB7683F3EAF]:0)
   [junit4] Completed [678/748 (5!)] on J1 in 28.43s, 7 tests, 4 errors <<< FAILURES!

[...truncated 40331 lines...]

Mime
View raw message