lucene-dev mailing list archives

Site index · List index
Message view « Date » · « Thread »
Top « Date » · « Thread »
From Apache Jenkins Server <jenk...@builds.apache.org>
Subject [JENKINS] Lucene-Solr-Tests-7.x - Build # 264 - Still unstable
Date Thu, 30 Nov 2017 04:49:30 GMT
Build: https://builds.apache.org/job/Lucene-Solr-Tests-7.x/264/

10 tests failed.
FAILED:  org.apache.solr.cloud.AddReplicaTest.test

Error Message:
core_node6:{"core":"addreplicatest_coll_shard1_replica_n5","base_url":"http://127.0.0.1:57891/solr","node_name":"127.0.0.1:57891_solr","state":"active","type":"NRT"}

Stack Trace:
java.lang.AssertionError: core_node6:{"core":"addreplicatest_coll_shard1_replica_n5","base_url":"http://127.0.0.1:57891/solr","node_name":"127.0.0.1:57891_solr","state":"active","type":"NRT"}
	at __randomizedtesting.SeedInfo.seed([98DB7E6CD5118B43:108F41B67BEDE6BB]:0)
	at org.junit.Assert.fail(Assert.java:93)
	at org.junit.Assert.assertTrue(Assert.java:43)
	at org.apache.solr.cloud.AddReplicaTest.test(AddReplicaTest.java:84)
	at sun.reflect.NativeMethodAccessorImpl.invoke0(Native Method)
	at sun.reflect.NativeMethodAccessorImpl.invoke(NativeMethodAccessorImpl.java:62)
	at sun.reflect.DelegatingMethodAccessorImpl.invoke(DelegatingMethodAccessorImpl.java:43)
	at java.lang.reflect.Method.invoke(Method.java:498)
	at com.carrotsearch.randomizedtesting.RandomizedRunner.invoke(RandomizedRunner.java:1737)
	at com.carrotsearch.randomizedtesting.RandomizedRunner$8.evaluate(RandomizedRunner.java:934)
	at com.carrotsearch.randomizedtesting.RandomizedRunner$9.evaluate(RandomizedRunner.java:970)
	at com.carrotsearch.randomizedtesting.RandomizedRunner$10.evaluate(RandomizedRunner.java:984)
	at com.carrotsearch.randomizedtesting.rules.SystemPropertiesRestoreRule$1.evaluate(SystemPropertiesRestoreRule.java:57)
	at org.apache.lucene.util.TestRuleSetupTeardownChained$1.evaluate(TestRuleSetupTeardownChained.java:49)
	at org.apache.lucene.util.AbstractBeforeAfterRule$1.evaluate(AbstractBeforeAfterRule.java:45)
	at org.apache.lucene.util.TestRuleThreadAndTestName$1.evaluate(TestRuleThreadAndTestName.java:48)
	at org.apache.lucene.util.TestRuleIgnoreAfterMaxFailures$1.evaluate(TestRuleIgnoreAfterMaxFailures.java:64)
	at org.apache.lucene.util.TestRuleMarkFailure$1.evaluate(TestRuleMarkFailure.java:47)
	at com.carrotsearch.randomizedtesting.rules.StatementAdapter.evaluate(StatementAdapter.java:36)
	at com.carrotsearch.randomizedtesting.ThreadLeakControl$StatementRunner.run(ThreadLeakControl.java:368)
	at com.carrotsearch.randomizedtesting.ThreadLeakControl.forkTimeoutingTask(ThreadLeakControl.java:817)
	at com.carrotsearch.randomizedtesting.ThreadLeakControl$3.evaluate(ThreadLeakControl.java:468)
	at com.carrotsearch.randomizedtesting.RandomizedRunner.runSingleTest(RandomizedRunner.java:943)
	at com.carrotsearch.randomizedtesting.RandomizedRunner$5.evaluate(RandomizedRunner.java:829)
	at com.carrotsearch.randomizedtesting.RandomizedRunner$6.evaluate(RandomizedRunner.java:879)
	at com.carrotsearch.randomizedtesting.RandomizedRunner$7.evaluate(RandomizedRunner.java:890)
	at com.carrotsearch.randomizedtesting.rules.StatementAdapter.evaluate(StatementAdapter.java:36)
	at com.carrotsearch.randomizedtesting.rules.SystemPropertiesRestoreRule$1.evaluate(SystemPropertiesRestoreRule.java:57)
	at org.apache.lucene.util.AbstractBeforeAfterRule$1.evaluate(AbstractBeforeAfterRule.java:45)
	at com.carrotsearch.randomizedtesting.rules.StatementAdapter.evaluate(StatementAdapter.java:36)
	at org.apache.lucene.util.TestRuleStoreClassName$1.evaluate(TestRuleStoreClassName.java:41)
	at com.carrotsearch.randomizedtesting.rules.NoShadowingOrOverridesOnMethodsRule$1.evaluate(NoShadowingOrOverridesOnMethodsRule.java:40)
	at com.carrotsearch.randomizedtesting.rules.NoShadowingOrOverridesOnMethodsRule$1.evaluate(NoShadowingOrOverridesOnMethodsRule.java:40)
	at com.carrotsearch.randomizedtesting.rules.StatementAdapter.evaluate(StatementAdapter.java:36)
	at com.carrotsearch.randomizedtesting.rules.StatementAdapter.evaluate(StatementAdapter.java:36)
	at com.carrotsearch.randomizedtesting.rules.StatementAdapter.evaluate(StatementAdapter.java:36)
	at org.apache.lucene.util.TestRuleAssertionsRequired$1.evaluate(TestRuleAssertionsRequired.java:53)
	at org.apache.lucene.util.TestRuleMarkFailure$1.evaluate(TestRuleMarkFailure.java:47)
	at org.apache.lucene.util.TestRuleIgnoreAfterMaxFailures$1.evaluate(TestRuleIgnoreAfterMaxFailures.java:64)
	at org.apache.lucene.util.TestRuleIgnoreTestSuites$1.evaluate(TestRuleIgnoreTestSuites.java:54)
	at com.carrotsearch.randomizedtesting.rules.StatementAdapter.evaluate(StatementAdapter.java:36)
	at com.carrotsearch.randomizedtesting.ThreadLeakControl$StatementRunner.run(ThreadLeakControl.java:368)
	at java.lang.Thread.run(Thread.java:748)


FAILED:  org.apache.solr.cloud.CollectionsAPIDistributedZkTest.testCreateNodeSet

Error Message:
Could not find collection : nodeset_collection

Stack Trace:
org.apache.solr.common.SolrException: Could not find collection : nodeset_collection
	at __randomizedtesting.SeedInfo.seed([98DB7E6CD5118B43:C378A98CBC90AFCB]:0)
	at org.apache.solr.common.cloud.ClusterState.getCollection(ClusterState.java:111)
	at org.apache.solr.cloud.SolrCloudTestCase.getCollectionState(SolrCloudTestCase.java:247)
	at org.apache.solr.cloud.CollectionsAPIDistributedZkTest.testCreateNodeSet(CollectionsAPIDistributedZkTest.java:404)
	at sun.reflect.NativeMethodAccessorImpl.invoke0(Native Method)
	at sun.reflect.NativeMethodAccessorImpl.invoke(NativeMethodAccessorImpl.java:62)
	at sun.reflect.DelegatingMethodAccessorImpl.invoke(DelegatingMethodAccessorImpl.java:43)
	at java.lang.reflect.Method.invoke(Method.java:498)
	at com.carrotsearch.randomizedtesting.RandomizedRunner.invoke(RandomizedRunner.java:1737)
	at com.carrotsearch.randomizedtesting.RandomizedRunner$8.evaluate(RandomizedRunner.java:934)
	at com.carrotsearch.randomizedtesting.RandomizedRunner$9.evaluate(RandomizedRunner.java:970)
	at com.carrotsearch.randomizedtesting.RandomizedRunner$10.evaluate(RandomizedRunner.java:984)
	at com.carrotsearch.randomizedtesting.rules.SystemPropertiesRestoreRule$1.evaluate(SystemPropertiesRestoreRule.java:57)
	at org.apache.lucene.util.TestRuleSetupTeardownChained$1.evaluate(TestRuleSetupTeardownChained.java:49)
	at org.apache.lucene.util.AbstractBeforeAfterRule$1.evaluate(AbstractBeforeAfterRule.java:45)
	at org.apache.lucene.util.TestRuleThreadAndTestName$1.evaluate(TestRuleThreadAndTestName.java:48)
	at org.apache.lucene.util.TestRuleIgnoreAfterMaxFailures$1.evaluate(TestRuleIgnoreAfterMaxFailures.java:64)
	at org.apache.lucene.util.TestRuleMarkFailure$1.evaluate(TestRuleMarkFailure.java:47)
	at com.carrotsearch.randomizedtesting.rules.StatementAdapter.evaluate(StatementAdapter.java:36)
	at com.carrotsearch.randomizedtesting.ThreadLeakControl$StatementRunner.run(ThreadLeakControl.java:368)
	at com.carrotsearch.randomizedtesting.ThreadLeakControl.forkTimeoutingTask(ThreadLeakControl.java:817)
	at com.carrotsearch.randomizedtesting.ThreadLeakControl$3.evaluate(ThreadLeakControl.java:468)
	at com.carrotsearch.randomizedtesting.RandomizedRunner.runSingleTest(RandomizedRunner.java:943)
	at com.carrotsearch.randomizedtesting.RandomizedRunner$5.evaluate(RandomizedRunner.java:829)
	at com.carrotsearch.randomizedtesting.RandomizedRunner$6.evaluate(RandomizedRunner.java:879)
	at com.carrotsearch.randomizedtesting.RandomizedRunner$7.evaluate(RandomizedRunner.java:890)
	at com.carrotsearch.randomizedtesting.rules.StatementAdapter.evaluate(StatementAdapter.java:36)
	at com.carrotsearch.randomizedtesting.rules.SystemPropertiesRestoreRule$1.evaluate(SystemPropertiesRestoreRule.java:57)
	at org.apache.lucene.util.AbstractBeforeAfterRule$1.evaluate(AbstractBeforeAfterRule.java:45)
	at com.carrotsearch.randomizedtesting.rules.StatementAdapter.evaluate(StatementAdapter.java:36)
	at org.apache.lucene.util.TestRuleStoreClassName$1.evaluate(TestRuleStoreClassName.java:41)
	at com.carrotsearch.randomizedtesting.rules.NoShadowingOrOverridesOnMethodsRule$1.evaluate(NoShadowingOrOverridesOnMethodsRule.java:40)
	at com.carrotsearch.randomizedtesting.rules.NoShadowingOrOverridesOnMethodsRule$1.evaluate(NoShadowingOrOverridesOnMethodsRule.java:40)
	at com.carrotsearch.randomizedtesting.rules.StatementAdapter.evaluate(StatementAdapter.java:36)
	at com.carrotsearch.randomizedtesting.rules.StatementAdapter.evaluate(StatementAdapter.java:36)
	at com.carrotsearch.randomizedtesting.rules.StatementAdapter.evaluate(StatementAdapter.java:36)
	at org.apache.lucene.util.TestRuleAssertionsRequired$1.evaluate(TestRuleAssertionsRequired.java:53)
	at org.apache.lucene.util.TestRuleMarkFailure$1.evaluate(TestRuleMarkFailure.java:47)
	at org.apache.lucene.util.TestRuleIgnoreAfterMaxFailures$1.evaluate(TestRuleIgnoreAfterMaxFailures.java:64)
	at org.apache.lucene.util.TestRuleIgnoreTestSuites$1.evaluate(TestRuleIgnoreTestSuites.java:54)
	at com.carrotsearch.randomizedtesting.rules.StatementAdapter.evaluate(StatementAdapter.java:36)
	at com.carrotsearch.randomizedtesting.ThreadLeakControl$StatementRunner.run(ThreadLeakControl.java:368)
	at java.lang.Thread.run(Thread.java:748)


FAILED:  org.apache.solr.cloud.CustomCollectionTest.testCustomCollectionsAPI

Error Message:
Could not find collection : implicitcoll

Stack Trace:
org.apache.solr.common.SolrException: Could not find collection : implicitcoll
	at __randomizedtesting.SeedInfo.seed([98DB7E6CD5118B43:F23AF007E88B3D3B]:0)
	at org.apache.solr.common.cloud.ClusterState.getCollection(ClusterState.java:111)
	at org.apache.solr.cloud.SolrCloudTestCase.getCollectionState(SolrCloudTestCase.java:247)
	at org.apache.solr.cloud.CustomCollectionTest.testCustomCollectionsAPI(CustomCollectionTest.java:68)
	at sun.reflect.NativeMethodAccessorImpl.invoke0(Native Method)
	at sun.reflect.NativeMethodAccessorImpl.invoke(NativeMethodAccessorImpl.java:62)
	at sun.reflect.DelegatingMethodAccessorImpl.invoke(DelegatingMethodAccessorImpl.java:43)
	at java.lang.reflect.Method.invoke(Method.java:498)
	at com.carrotsearch.randomizedtesting.RandomizedRunner.invoke(RandomizedRunner.java:1737)
	at com.carrotsearch.randomizedtesting.RandomizedRunner$8.evaluate(RandomizedRunner.java:934)
	at com.carrotsearch.randomizedtesting.RandomizedRunner$9.evaluate(RandomizedRunner.java:970)
	at com.carrotsearch.randomizedtesting.RandomizedRunner$10.evaluate(RandomizedRunner.java:984)
	at com.carrotsearch.randomizedtesting.rules.SystemPropertiesRestoreRule$1.evaluate(SystemPropertiesRestoreRule.java:57)
	at org.apache.lucene.util.TestRuleSetupTeardownChained$1.evaluate(TestRuleSetupTeardownChained.java:49)
	at org.apache.lucene.util.AbstractBeforeAfterRule$1.evaluate(AbstractBeforeAfterRule.java:45)
	at org.apache.lucene.util.TestRuleThreadAndTestName$1.evaluate(TestRuleThreadAndTestName.java:48)
	at org.apache.lucene.util.TestRuleIgnoreAfterMaxFailures$1.evaluate(TestRuleIgnoreAfterMaxFailures.java:64)
	at org.apache.lucene.util.TestRuleMarkFailure$1.evaluate(TestRuleMarkFailure.java:47)
	at com.carrotsearch.randomizedtesting.rules.StatementAdapter.evaluate(StatementAdapter.java:36)
	at com.carrotsearch.randomizedtesting.ThreadLeakControl$StatementRunner.run(ThreadLeakControl.java:368)
	at com.carrotsearch.randomizedtesting.ThreadLeakControl.forkTimeoutingTask(ThreadLeakControl.java:817)
	at com.carrotsearch.randomizedtesting.ThreadLeakControl$3.evaluate(ThreadLeakControl.java:468)
	at com.carrotsearch.randomizedtesting.RandomizedRunner.runSingleTest(RandomizedRunner.java:943)
	at com.carrotsearch.randomizedtesting.RandomizedRunner$5.evaluate(RandomizedRunner.java:829)
	at com.carrotsearch.randomizedtesting.RandomizedRunner$6.evaluate(RandomizedRunner.java:879)
	at com.carrotsearch.randomizedtesting.RandomizedRunner$7.evaluate(RandomizedRunner.java:890)
	at com.carrotsearch.randomizedtesting.rules.StatementAdapter.evaluate(StatementAdapter.java:36)
	at com.carrotsearch.randomizedtesting.rules.SystemPropertiesRestoreRule$1.evaluate(SystemPropertiesRestoreRule.java:57)
	at org.apache.lucene.util.AbstractBeforeAfterRule$1.evaluate(AbstractBeforeAfterRule.java:45)
	at com.carrotsearch.randomizedtesting.rules.StatementAdapter.evaluate(StatementAdapter.java:36)
	at org.apache.lucene.util.TestRuleStoreClassName$1.evaluate(TestRuleStoreClassName.java:41)
	at com.carrotsearch.randomizedtesting.rules.NoShadowingOrOverridesOnMethodsRule$1.evaluate(NoShadowingOrOverridesOnMethodsRule.java:40)
	at com.carrotsearch.randomizedtesting.rules.NoShadowingOrOverridesOnMethodsRule$1.evaluate(NoShadowingOrOverridesOnMethodsRule.java:40)
	at com.carrotsearch.randomizedtesting.rules.StatementAdapter.evaluate(StatementAdapter.java:36)
	at com.carrotsearch.randomizedtesting.rules.StatementAdapter.evaluate(StatementAdapter.java:36)
	at com.carrotsearch.randomizedtesting.rules.StatementAdapter.evaluate(StatementAdapter.java:36)
	at org.apache.lucene.util.TestRuleAssertionsRequired$1.evaluate(TestRuleAssertionsRequired.java:53)
	at org.apache.lucene.util.TestRuleMarkFailure$1.evaluate(TestRuleMarkFailure.java:47)
	at org.apache.lucene.util.TestRuleIgnoreAfterMaxFailures$1.evaluate(TestRuleIgnoreAfterMaxFailures.java:64)
	at org.apache.lucene.util.TestRuleIgnoreTestSuites$1.evaluate(TestRuleIgnoreTestSuites.java:54)
	at com.carrotsearch.randomizedtesting.rules.StatementAdapter.evaluate(StatementAdapter.java:36)
	at com.carrotsearch.randomizedtesting.ThreadLeakControl$StatementRunner.run(ThreadLeakControl.java:368)
	at java.lang.Thread.run(Thread.java:748)


FAILED:  org.apache.solr.cloud.MultiThreadedOCPTest.test

Error Message:


Stack Trace:
java.lang.AssertionError
	at __randomizedtesting.SeedInfo.seed([98DB7E6CD5118B43:108F41B67BEDE6BB]:0)
	at org.junit.Assert.fail(Assert.java:92)
	at org.junit.Assert.assertTrue(Assert.java:43)
	at org.junit.Assert.assertTrue(Assert.java:54)
	at org.apache.solr.cloud.MultiThreadedOCPTest.testFillWorkQueue(MultiThreadedOCPTest.java:112)
	at org.apache.solr.cloud.MultiThreadedOCPTest.test(MultiThreadedOCPTest.java:67)
	at sun.reflect.NativeMethodAccessorImpl.invoke0(Native Method)
	at sun.reflect.NativeMethodAccessorImpl.invoke(NativeMethodAccessorImpl.java:62)
	at sun.reflect.DelegatingMethodAccessorImpl.invoke(DelegatingMethodAccessorImpl.java:43)
	at java.lang.reflect.Method.invoke(Method.java:498)
	at com.carrotsearch.randomizedtesting.RandomizedRunner.invoke(RandomizedRunner.java:1737)
	at com.carrotsearch.randomizedtesting.RandomizedRunner$8.evaluate(RandomizedRunner.java:934)
	at com.carrotsearch.randomizedtesting.RandomizedRunner$9.evaluate(RandomizedRunner.java:970)
	at com.carrotsearch.randomizedtesting.RandomizedRunner$10.evaluate(RandomizedRunner.java:984)
	at org.apache.solr.BaseDistributedSearchTestCase$ShardsRepeatRule$ShardsFixedStatement.callStatement(BaseDistributedSearchTestCase.java:993)
	at org.apache.solr.BaseDistributedSearchTestCase$ShardsRepeatRule$ShardsStatement.evaluate(BaseDistributedSearchTestCase.java:968)
	at com.carrotsearch.randomizedtesting.rules.SystemPropertiesRestoreRule$1.evaluate(SystemPropertiesRestoreRule.java:57)
	at org.apache.lucene.util.TestRuleSetupTeardownChained$1.evaluate(TestRuleSetupTeardownChained.java:49)
	at org.apache.lucene.util.AbstractBeforeAfterRule$1.evaluate(AbstractBeforeAfterRule.java:45)
	at org.apache.lucene.util.TestRuleThreadAndTestName$1.evaluate(TestRuleThreadAndTestName.java:48)
	at org.apache.lucene.util.TestRuleIgnoreAfterMaxFailures$1.evaluate(TestRuleIgnoreAfterMaxFailures.java:64)
	at org.apache.lucene.util.TestRuleMarkFailure$1.evaluate(TestRuleMarkFailure.java:47)
	at com.carrotsearch.randomizedtesting.rules.StatementAdapter.evaluate(StatementAdapter.java:36)
	at com.carrotsearch.randomizedtesting.ThreadLeakControl$StatementRunner.run(ThreadLeakControl.java:368)
	at com.carrotsearch.randomizedtesting.ThreadLeakControl.forkTimeoutingTask(ThreadLeakControl.java:817)
	at com.carrotsearch.randomizedtesting.ThreadLeakControl$3.evaluate(ThreadLeakControl.java:468)
	at com.carrotsearch.randomizedtesting.RandomizedRunner.runSingleTest(RandomizedRunner.java:943)
	at com.carrotsearch.randomizedtesting.RandomizedRunner$5.evaluate(RandomizedRunner.java:829)
	at com.carrotsearch.randomizedtesting.RandomizedRunner$6.evaluate(RandomizedRunner.java:879)
	at com.carrotsearch.randomizedtesting.RandomizedRunner$7.evaluate(RandomizedRunner.java:890)
	at com.carrotsearch.randomizedtesting.rules.StatementAdapter.evaluate(StatementAdapter.java:36)
	at com.carrotsearch.randomizedtesting.rules.SystemPropertiesRestoreRule$1.evaluate(SystemPropertiesRestoreRule.java:57)
	at org.apache.lucene.util.AbstractBeforeAfterRule$1.evaluate(AbstractBeforeAfterRule.java:45)
	at com.carrotsearch.randomizedtesting.rules.StatementAdapter.evaluate(StatementAdapter.java:36)
	at org.apache.lucene.util.TestRuleStoreClassName$1.evaluate(TestRuleStoreClassName.java:41)
	at com.carrotsearch.randomizedtesting.rules.NoShadowingOrOverridesOnMethodsRule$1.evaluate(NoShadowingOrOverridesOnMethodsRule.java:40)
	at com.carrotsearch.randomizedtesting.rules.NoShadowingOrOverridesOnMethodsRule$1.evaluate(NoShadowingOrOverridesOnMethodsRule.java:40)
	at com.carrotsearch.randomizedtesting.rules.StatementAdapter.evaluate(StatementAdapter.java:36)
	at com.carrotsearch.randomizedtesting.rules.StatementAdapter.evaluate(StatementAdapter.java:36)
	at com.carrotsearch.randomizedtesting.rules.StatementAdapter.evaluate(StatementAdapter.java:36)
	at org.apache.lucene.util.TestRuleAssertionsRequired$1.evaluate(TestRuleAssertionsRequired.java:53)
	at org.apache.lucene.util.TestRuleMarkFailure$1.evaluate(TestRuleMarkFailure.java:47)
	at org.apache.lucene.util.TestRuleIgnoreAfterMaxFailures$1.evaluate(TestRuleIgnoreAfterMaxFailures.java:64)
	at org.apache.lucene.util.TestRuleIgnoreTestSuites$1.evaluate(TestRuleIgnoreTestSuites.java:54)
	at com.carrotsearch.randomizedtesting.rules.StatementAdapter.evaluate(StatementAdapter.java:36)
	at com.carrotsearch.randomizedtesting.ThreadLeakControl$StatementRunner.run(ThreadLeakControl.java:368)
	at java.lang.Thread.run(Thread.java:748)


FAILED:  org.apache.solr.cloud.RecoveryZkTest.test

Error Message:


Stack Trace:
java.util.concurrent.TimeoutException
	at __randomizedtesting.SeedInfo.seed([98DB7E6CD5118B43:108F41B67BEDE6BB]:0)
	at org.apache.solr.common.cloud.ZkStateReader.waitForState(ZkStateReader.java:1275)
	at org.apache.solr.client.solrj.impl.CloudSolrClient.waitForState(CloudSolrClient.java:448)
	at org.apache.solr.cloud.RecoveryZkTest.test(RecoveryZkTest.java:122)
	at sun.reflect.NativeMethodAccessorImpl.invoke0(Native Method)
	at sun.reflect.NativeMethodAccessorImpl.invoke(NativeMethodAccessorImpl.java:62)
	at sun.reflect.DelegatingMethodAccessorImpl.invoke(DelegatingMethodAccessorImpl.java:43)
	at java.lang.reflect.Method.invoke(Method.java:498)
	at com.carrotsearch.randomizedtesting.RandomizedRunner.invoke(RandomizedRunner.java:1737)
	at com.carrotsearch.randomizedtesting.RandomizedRunner$8.evaluate(RandomizedRunner.java:934)
	at com.carrotsearch.randomizedtesting.RandomizedRunner$9.evaluate(RandomizedRunner.java:970)
	at com.carrotsearch.randomizedtesting.RandomizedRunner$10.evaluate(RandomizedRunner.java:984)
	at com.carrotsearch.randomizedtesting.rules.SystemPropertiesRestoreRule$1.evaluate(SystemPropertiesRestoreRule.java:57)
	at org.apache.lucene.util.TestRuleSetupTeardownChained$1.evaluate(TestRuleSetupTeardownChained.java:49)
	at org.apache.lucene.util.AbstractBeforeAfterRule$1.evaluate(AbstractBeforeAfterRule.java:45)
	at org.apache.lucene.util.TestRuleThreadAndTestName$1.evaluate(TestRuleThreadAndTestName.java:48)
	at org.apache.lucene.util.TestRuleIgnoreAfterMaxFailures$1.evaluate(TestRuleIgnoreAfterMaxFailures.java:64)
	at org.apache.lucene.util.TestRuleMarkFailure$1.evaluate(TestRuleMarkFailure.java:47)
	at com.carrotsearch.randomizedtesting.rules.StatementAdapter.evaluate(StatementAdapter.java:36)
	at com.carrotsearch.randomizedtesting.ThreadLeakControl$StatementRunner.run(ThreadLeakControl.java:368)
	at com.carrotsearch.randomizedtesting.ThreadLeakControl.forkTimeoutingTask(ThreadLeakControl.java:817)
	at com.carrotsearch.randomizedtesting.ThreadLeakControl$3.evaluate(ThreadLeakControl.java:468)
	at com.carrotsearch.randomizedtesting.RandomizedRunner.runSingleTest(RandomizedRunner.java:943)
	at com.carrotsearch.randomizedtesting.RandomizedRunner$5.evaluate(RandomizedRunner.java:829)
	at com.carrotsearch.randomizedtesting.RandomizedRunner$6.evaluate(RandomizedRunner.java:879)
	at com.carrotsearch.randomizedtesting.RandomizedRunner$7.evaluate(RandomizedRunner.java:890)
	at com.carrotsearch.randomizedtesting.rules.StatementAdapter.evaluate(StatementAdapter.java:36)
	at com.carrotsearch.randomizedtesting.rules.SystemPropertiesRestoreRule$1.evaluate(SystemPropertiesRestoreRule.java:57)
	at org.apache.lucene.util.AbstractBeforeAfterRule$1.evaluate(AbstractBeforeAfterRule.java:45)
	at com.carrotsearch.randomizedtesting.rules.StatementAdapter.evaluate(StatementAdapter.java:36)
	at org.apache.lucene.util.TestRuleStoreClassName$1.evaluate(TestRuleStoreClassName.java:41)
	at com.carrotsearch.randomizedtesting.rules.NoShadowingOrOverridesOnMethodsRule$1.evaluate(NoShadowingOrOverridesOnMethodsRule.java:40)
	at com.carrotsearch.randomizedtesting.rules.NoShadowingOrOverridesOnMethodsRule$1.evaluate(NoShadowingOrOverridesOnMethodsRule.java:40)
	at com.carrotsearch.randomizedtesting.rules.StatementAdapter.evaluate(StatementAdapter.java:36)
	at com.carrotsearch.randomizedtesting.rules.StatementAdapter.evaluate(StatementAdapter.java:36)
	at com.carrotsearch.randomizedtesting.rules.StatementAdapter.evaluate(StatementAdapter.java:36)
	at org.apache.lucene.util.TestRuleAssertionsRequired$1.evaluate(TestRuleAssertionsRequired.java:53)
	at org.apache.lucene.util.TestRuleMarkFailure$1.evaluate(TestRuleMarkFailure.java:47)
	at org.apache.lucene.util.TestRuleIgnoreAfterMaxFailures$1.evaluate(TestRuleIgnoreAfterMaxFailures.java:64)
	at org.apache.lucene.util.TestRuleIgnoreTestSuites$1.evaluate(TestRuleIgnoreTestSuites.java:54)
	at com.carrotsearch.randomizedtesting.rules.StatementAdapter.evaluate(StatementAdapter.java:36)
	at com.carrotsearch.randomizedtesting.ThreadLeakControl$StatementRunner.run(ThreadLeakControl.java:368)
	at java.lang.Thread.run(Thread.java:748)


FAILED:  org.apache.solr.cloud.TestHdfsCloudBackupRestore.test

Error Message:
expected:<COMPLETED> but was:<RUNNING>

Stack Trace:
java.lang.AssertionError: expected:<COMPLETED> but was:<RUNNING>
	at __randomizedtesting.SeedInfo.seed([98DB7E6CD5118B43:108F41B67BEDE6BB]:0)
	at org.junit.Assert.fail(Assert.java:93)
	at org.junit.Assert.failNotEquals(Assert.java:647)
	at org.junit.Assert.assertEquals(Assert.java:128)
	at org.junit.Assert.assertEquals(Assert.java:147)
	at org.apache.solr.cloud.AbstractCloudBackupRestoreTestCase.testBackupAndRestore(AbstractCloudBackupRestoreTestCase.java:287)
	at org.apache.solr.cloud.AbstractCloudBackupRestoreTestCase.test(AbstractCloudBackupRestoreTestCase.java:140)
	at sun.reflect.NativeMethodAccessorImpl.invoke0(Native Method)
	at sun.reflect.NativeMethodAccessorImpl.invoke(NativeMethodAccessorImpl.java:62)
	at sun.reflect.DelegatingMethodAccessorImpl.invoke(DelegatingMethodAccessorImpl.java:43)
	at java.lang.reflect.Method.invoke(Method.java:498)
	at com.carrotsearch.randomizedtesting.RandomizedRunner.invoke(RandomizedRunner.java:1737)
	at com.carrotsearch.randomizedtesting.RandomizedRunner$8.evaluate(RandomizedRunner.java:934)
	at com.carrotsearch.randomizedtesting.RandomizedRunner$9.evaluate(RandomizedRunner.java:970)
	at com.carrotsearch.randomizedtesting.RandomizedRunner$10.evaluate(RandomizedRunner.java:984)
	at com.carrotsearch.randomizedtesting.rules.SystemPropertiesRestoreRule$1.evaluate(SystemPropertiesRestoreRule.java:57)
	at org.apache.lucene.util.TestRuleSetupTeardownChained$1.evaluate(TestRuleSetupTeardownChained.java:49)
	at org.apache.lucene.util.AbstractBeforeAfterRule$1.evaluate(AbstractBeforeAfterRule.java:45)
	at org.apache.lucene.util.TestRuleThreadAndTestName$1.evaluate(TestRuleThreadAndTestName.java:48)
	at org.apache.lucene.util.TestRuleIgnoreAfterMaxFailures$1.evaluate(TestRuleIgnoreAfterMaxFailures.java:64)
	at org.apache.lucene.util.TestRuleMarkFailure$1.evaluate(TestRuleMarkFailure.java:47)
	at com.carrotsearch.randomizedtesting.rules.StatementAdapter.evaluate(StatementAdapter.java:36)
	at com.carrotsearch.randomizedtesting.ThreadLeakControl$StatementRunner.run(ThreadLeakControl.java:368)
	at com.carrotsearch.randomizedtesting.ThreadLeakControl.forkTimeoutingTask(ThreadLeakControl.java:817)
	at com.carrotsearch.randomizedtesting.ThreadLeakControl$3.evaluate(ThreadLeakControl.java:468)
	at com.carrotsearch.randomizedtesting.RandomizedRunner.runSingleTest(RandomizedRunner.java:943)
	at com.carrotsearch.randomizedtesting.RandomizedRunner$5.evaluate(RandomizedRunner.java:829)
	at com.carrotsearch.randomizedtesting.RandomizedRunner$6.evaluate(RandomizedRunner.java:879)
	at com.carrotsearch.randomizedtesting.RandomizedRunner$7.evaluate(RandomizedRunner.java:890)
	at com.carrotsearch.randomizedtesting.rules.StatementAdapter.evaluate(StatementAdapter.java:36)
	at com.carrotsearch.randomizedtesting.rules.SystemPropertiesRestoreRule$1.evaluate(SystemPropertiesRestoreRule.java:57)
	at org.apache.lucene.util.AbstractBeforeAfterRule$1.evaluate(AbstractBeforeAfterRule.java:45)
	at com.carrotsearch.randomizedtesting.rules.StatementAdapter.evaluate(StatementAdapter.java:36)
	at org.apache.lucene.util.TestRuleStoreClassName$1.evaluate(TestRuleStoreClassName.java:41)
	at com.carrotsearch.randomizedtesting.rules.NoShadowingOrOverridesOnMethodsRule$1.evaluate(NoShadowingOrOverridesOnMethodsRule.java:40)
	at com.carrotsearch.randomizedtesting.rules.NoShadowingOrOverridesOnMethodsRule$1.evaluate(NoShadowingOrOverridesOnMethodsRule.java:40)
	at com.carrotsearch.randomizedtesting.rules.StatementAdapter.evaluate(StatementAdapter.java:36)
	at com.carrotsearch.randomizedtesting.rules.StatementAdapter.evaluate(StatementAdapter.java:36)
	at com.carrotsearch.randomizedtesting.rules.StatementAdapter.evaluate(StatementAdapter.java:36)
	at org.apache.lucene.util.TestRuleAssertionsRequired$1.evaluate(TestRuleAssertionsRequired.java:53)
	at org.apache.lucene.util.TestRuleMarkFailure$1.evaluate(TestRuleMarkFailure.java:47)
	at org.apache.lucene.util.TestRuleIgnoreAfterMaxFailures$1.evaluate(TestRuleIgnoreAfterMaxFailures.java:64)
	at org.apache.lucene.util.TestRuleIgnoreTestSuites$1.evaluate(TestRuleIgnoreTestSuites.java:54)
	at com.carrotsearch.randomizedtesting.rules.StatementAdapter.evaluate(StatementAdapter.java:36)
	at com.carrotsearch.randomizedtesting.ThreadLeakControl$StatementRunner.run(ThreadLeakControl.java:368)
	at java.lang.Thread.run(Thread.java:748)


FAILED:  org.apache.solr.cloud.TestRandomRequestDistribution.test

Error Message:
Could not load collection from ZK: collection1

Stack Trace:
org.apache.solr.common.SolrException: Could not load collection from ZK: collection1
	at __randomizedtesting.SeedInfo.seed([98DB7E6CD5118B43:108F41B67BEDE6BB]:0)
	at org.apache.solr.common.cloud.ZkStateReader.getCollectionLive(ZkStateReader.java:1122)
	at org.apache.solr.common.cloud.ZkStateReader$LazyCollectionRef.get(ZkStateReader.java:647)
	at org.apache.solr.common.cloud.ClusterState.getCollectionOrNull(ClusterState.java:130)
	at org.apache.solr.cloud.AbstractFullDistribZkTestBase.getTotalReplicas(AbstractFullDistribZkTestBase.java:487)
	at org.apache.solr.cloud.AbstractFullDistribZkTestBase.createJettys(AbstractFullDistribZkTestBase.java:440)
	at org.apache.solr.cloud.AbstractFullDistribZkTestBase.createServers(AbstractFullDistribZkTestBase.java:333)
	at org.apache.solr.BaseDistributedSearchTestCase$ShardsRepeatRule$ShardsFixedStatement.callStatement(BaseDistributedSearchTestCase.java:991)
	at org.apache.solr.BaseDistributedSearchTestCase$ShardsRepeatRule$ShardsStatement.evaluate(BaseDistributedSearchTestCase.java:968)
	at com.carrotsearch.randomizedtesting.rules.SystemPropertiesRestoreRule$1.evaluate(SystemPropertiesRestoreRule.java:57)
	at org.apache.lucene.util.TestRuleSetupTeardownChained$1.evaluate(TestRuleSetupTeardownChained.java:49)
	at org.apache.lucene.util.AbstractBeforeAfterRule$1.evaluate(AbstractBeforeAfterRule.java:45)
	at org.apache.lucene.util.TestRuleThreadAndTestName$1.evaluate(TestRuleThreadAndTestName.java:48)
	at org.apache.lucene.util.TestRuleIgnoreAfterMaxFailures$1.evaluate(TestRuleIgnoreAfterMaxFailures.java:64)
	at org.apache.lucene.util.TestRuleMarkFailure$1.evaluate(TestRuleMarkFailure.java:47)
	at com.carrotsearch.randomizedtesting.rules.StatementAdapter.evaluate(StatementAdapter.java:36)
	at com.carrotsearch.randomizedtesting.ThreadLeakControl$StatementRunner.run(ThreadLeakControl.java:368)
	at com.carrotsearch.randomizedtesting.ThreadLeakControl.forkTimeoutingTask(ThreadLeakControl.java:817)
	at com.carrotsearch.randomizedtesting.ThreadLeakControl$3.evaluate(ThreadLeakControl.java:468)
	at com.carrotsearch.randomizedtesting.RandomizedRunner.runSingleTest(RandomizedRunner.java:943)
	at com.carrotsearch.randomizedtesting.RandomizedRunner$5.evaluate(RandomizedRunner.java:829)
	at com.carrotsearch.randomizedtesting.RandomizedRunner$6.evaluate(RandomizedRunner.java:879)
	at com.carrotsearch.randomizedtesting.RandomizedRunner$7.evaluate(RandomizedRunner.java:890)
	at com.carrotsearch.randomizedtesting.rules.StatementAdapter.evaluate(StatementAdapter.java:36)
	at com.carrotsearch.randomizedtesting.rules.SystemPropertiesRestoreRule$1.evaluate(SystemPropertiesRestoreRule.java:57)
	at org.apache.lucene.util.AbstractBeforeAfterRule$1.evaluate(AbstractBeforeAfterRule.java:45)
	at com.carrotsearch.randomizedtesting.rules.StatementAdapter.evaluate(StatementAdapter.java:36)
	at org.apache.lucene.util.TestRuleStoreClassName$1.evaluate(TestRuleStoreClassName.java:41)
	at com.carrotsearch.randomizedtesting.rules.NoShadowingOrOverridesOnMethodsRule$1.evaluate(NoShadowingOrOverridesOnMethodsRule.java:40)
	at com.carrotsearch.randomizedtesting.rules.NoShadowingOrOverridesOnMethodsRule$1.evaluate(NoShadowingOrOverridesOnMethodsRule.java:40)
	at com.carrotsearch.randomizedtesting.rules.StatementAdapter.evaluate(StatementAdapter.java:36)
	at com.carrotsearch.randomizedtesting.rules.StatementAdapter.evaluate(StatementAdapter.java:36)
	at com.carrotsearch.randomizedtesting.rules.StatementAdapter.evaluate(StatementAdapter.java:36)
	at org.apache.lucene.util.TestRuleAssertionsRequired$1.evaluate(TestRuleAssertionsRequired.java:53)
	at org.apache.lucene.util.TestRuleMarkFailure$1.evaluate(TestRuleMarkFailure.java:47)
	at org.apache.lucene.util.TestRuleIgnoreAfterMaxFailures$1.evaluate(TestRuleIgnoreAfterMaxFailures.java:64)
	at org.apache.lucene.util.TestRuleIgnoreTestSuites$1.evaluate(TestRuleIgnoreTestSuites.java:54)
	at com.carrotsearch.randomizedtesting.rules.StatementAdapter.evaluate(StatementAdapter.java:36)
	at com.carrotsearch.randomizedtesting.ThreadLeakControl$StatementRunner.run(ThreadLeakControl.java:368)
	at java.lang.Thread.run(Thread.java:748)
Caused by: org.apache.zookeeper.KeeperException$SessionExpiredException: KeeperErrorCode = Session expired for /collections/collection1/state.json
	at org.apache.zookeeper.KeeperException.create(KeeperException.java:127)
	at org.apache.zookeeper.KeeperException.create(KeeperException.java:51)
	at org.apache.zookeeper.ZooKeeper.getData(ZooKeeper.java:1212)
	at org.apache.solr.common.cloud.SolrZkClient.lambda$getData$5(SolrZkClient.java:332)
	at org.apache.solr.common.cloud.ZkCmdExecutor.retryOperation(ZkCmdExecutor.java:60)
	at org.apache.solr.common.cloud.SolrZkClient.getData(SolrZkClient.java:332)
	at org.apache.solr.common.cloud.ZkStateReader.fetchCollectionState(ZkStateReader.java:1134)
	at org.apache.solr.common.cloud.ZkStateReader.getCollectionLive(ZkStateReader.java:1120)
	... 38 more


FAILED:  org.apache.solr.cloud.TestTolerantUpdateProcessorCloud.testSanity

Error Message:
Could not load collection from ZK: test_col

Stack Trace:
org.apache.solr.common.SolrException: Could not load collection from ZK: test_col
	at __randomizedtesting.SeedInfo.seed([98DB7E6CD5118B43:1138D991DA368D6D]:0)
	at org.apache.solr.common.cloud.ZkStateReader.getCollectionLive(ZkStateReader.java:1122)
	at org.apache.solr.common.cloud.ZkStateReader$LazyCollectionRef.get(ZkStateReader.java:647)
	at org.apache.solr.client.solrj.impl.CloudSolrClient.getDocCollection(CloudSolrClient.java:1205)
	at org.apache.solr.client.solrj.impl.CloudSolrClient.requestWithRetryOnStaleState(CloudSolrClient.java:848)
	at org.apache.solr.client.solrj.impl.CloudSolrClient.request(CloudSolrClient.java:816)
	at org.apache.solr.client.solrj.SolrRequest.process(SolrRequest.java:194)
	at org.apache.solr.client.solrj.SolrClient.deleteByQuery(SolrClient.java:895)
	at org.apache.solr.client.solrj.SolrClient.deleteByQuery(SolrClient.java:858)
	at org.apache.solr.client.solrj.SolrClient.deleteByQuery(SolrClient.java:873)
	at org.apache.solr.cloud.TestTolerantUpdateProcessorCloud.clearCollection(TestTolerantUpdateProcessorCloud.java:220)
	at sun.reflect.NativeMethodAccessorImpl.invoke0(Native Method)
	at sun.reflect.NativeMethodAccessorImpl.invoke(NativeMethodAccessorImpl.java:62)
	at sun.reflect.DelegatingMethodAccessorImpl.invoke(DelegatingMethodAccessorImpl.java:43)
	at java.lang.reflect.Method.invoke(Method.java:498)
	at com.carrotsearch.randomizedtesting.RandomizedRunner.invoke(RandomizedRunner.java:1737)
	at com.carrotsearch.randomizedtesting.RandomizedRunner$9.evaluate(RandomizedRunner.java:968)
	at com.carrotsearch.randomizedtesting.RandomizedRunner$10.evaluate(RandomizedRunner.java:984)
	at com.carrotsearch.randomizedtesting.rules.SystemPropertiesRestoreRule$1.evaluate(SystemPropertiesRestoreRule.java:57)
	at org.apache.lucene.util.TestRuleSetupTeardownChained$1.evaluate(TestRuleSetupTeardownChained.java:49)
	at org.apache.lucene.util.AbstractBeforeAfterRule$1.evaluate(AbstractBeforeAfterRule.java:45)
	at org.apache.lucene.util.TestRuleThreadAndTestName$1.evaluate(TestRuleThreadAndTestName.java:48)
	at org.apache.lucene.util.TestRuleIgnoreAfterMaxFailures$1.evaluate(TestRuleIgnoreAfterMaxFailures.java:64)
	at org.apache.lucene.util.TestRuleMarkFailure$1.evaluate(TestRuleMarkFailure.java:47)
	at com.carrotsearch.randomizedtesting.rules.StatementAdapter.evaluate(StatementAdapter.java:36)
	at com.carrotsearch.randomizedtesting.ThreadLeakControl$StatementRunner.run(ThreadLeakControl.java:368)
	at com.carrotsearch.randomizedtesting.ThreadLeakControl.forkTimeoutingTask(ThreadLeakControl.java:817)
	at com.carrotsearch.randomizedtesting.ThreadLeakControl$3.evaluate(ThreadLeakControl.java:468)
	at com.carrotsearch.randomizedtesting.RandomizedRunner.runSingleTest(RandomizedRunner.java:943)
	at com.carrotsearch.randomizedtesting.RandomizedRunner$5.evaluate(RandomizedRunner.java:829)
	at com.carrotsearch.randomizedtesting.RandomizedRunner$6.evaluate(RandomizedRunner.java:879)
	at com.carrotsearch.randomizedtesting.RandomizedRunner$7.evaluate(RandomizedRunner.java:890)
	at com.carrotsearch.randomizedtesting.rules.StatementAdapter.evaluate(StatementAdapter.java:36)
	at com.carrotsearch.randomizedtesting.rules.SystemPropertiesRestoreRule$1.evaluate(SystemPropertiesRestoreRule.java:57)
	at org.apache.lucene.util.AbstractBeforeAfterRule$1.evaluate(AbstractBeforeAfterRule.java:45)
	at com.carrotsearch.randomizedtesting.rules.StatementAdapter.evaluate(StatementAdapter.java:36)
	at org.apache.lucene.util.TestRuleStoreClassName$1.evaluate(TestRuleStoreClassName.java:41)
	at com.carrotsearch.randomizedtesting.rules.NoShadowingOrOverridesOnMethodsRule$1.evaluate(NoShadowingOrOverridesOnMethodsRule.java:40)
	at com.carrotsearch.randomizedtesting.rules.NoShadowingOrOverridesOnMethodsRule$1.evaluate(NoShadowingOrOverridesOnMethodsRule.java:40)
	at com.carrotsearch.randomizedtesting.rules.StatementAdapter.evaluate(StatementAdapter.java:36)
	at com.carrotsearch.randomizedtesting.rules.StatementAdapter.evaluate(StatementAdapter.java:36)
	at com.carrotsearch.randomizedtesting.rules.StatementAdapter.evaluate(StatementAdapter.java:36)
	at org.apache.lucene.util.TestRuleAssertionsRequired$1.evaluate(TestRuleAssertionsRequired.java:53)
	at org.apache.lucene.util.TestRuleMarkFailure$1.evaluate(TestRuleMarkFailure.java:47)
	at org.apache.lucene.util.TestRuleIgnoreAfterMaxFailures$1.evaluate(TestRuleIgnoreAfterMaxFailures.java:64)
	at org.apache.lucene.util.TestRuleIgnoreTestSuites$1.evaluate(TestRuleIgnoreTestSuites.java:54)
	at com.carrotsearch.randomizedtesting.rules.StatementAdapter.evaluate(StatementAdapter.java:36)
	at com.carrotsearch.randomizedtesting.ThreadLeakControl$StatementRunner.run(ThreadLeakControl.java:368)
	at java.lang.Thread.run(Thread.java:748)
Caused by: org.apache.zookeeper.KeeperException$SessionExpiredException: KeeperErrorCode = Session expired for /collections/test_col/state.json
	at org.apache.zookeeper.KeeperException.create(KeeperException.java:127)
	at org.apache.zookeeper.KeeperException.create(KeeperException.java:51)
	at org.apache.zookeeper.ZooKeeper.getData(ZooKeeper.java:1212)
	at org.apache.solr.common.cloud.SolrZkClient.lambda$getData$5(SolrZkClient.java:332)
	at org.apache.solr.common.cloud.ZkCmdExecutor.retryOperation(ZkCmdExecutor.java:60)
	at org.apache.solr.common.cloud.SolrZkClient.getData(SolrZkClient.java:332)
	at org.apache.solr.common.cloud.ZkStateReader.fetchCollectionState(ZkStateReader.java:1134)
	at org.apache.solr.common.cloud.ZkStateReader.getCollectionLive(ZkStateReader.java:1120)
	... 47 more


FAILED:  org.apache.solr.cloud.autoscaling.SystemLogListenerTest.test

Error Message:
Trigger was not fired 

Stack Trace:
java.lang.AssertionError: Trigger was not fired 
	at __randomizedtesting.SeedInfo.seed([98DB7E6CD5118B43:108F41B67BEDE6BB]:0)
	at org.junit.Assert.fail(Assert.java:93)
	at org.junit.Assert.assertTrue(Assert.java:43)
	at org.apache.solr.cloud.autoscaling.SystemLogListenerTest.test(SystemLogListenerTest.java:151)
	at sun.reflect.NativeMethodAccessorImpl.invoke0(Native Method)
	at sun.reflect.NativeMethodAccessorImpl.invoke(NativeMethodAccessorImpl.java:62)
	at sun.reflect.DelegatingMethodAccessorImpl.invoke(DelegatingMethodAccessorImpl.java:43)
	at java.lang.reflect.Method.invoke(Method.java:498)
	at com.carrotsearch.randomizedtesting.RandomizedRunner.invoke(RandomizedRunner.java:1737)
	at com.carrotsearch.randomizedtesting.RandomizedRunner$8.evaluate(RandomizedRunner.java:934)
	at com.carrotsearch.randomizedtesting.RandomizedRunner$9.evaluate(RandomizedRunner.java:970)
	at com.carrotsearch.randomizedtesting.RandomizedRunner$10.evaluate(RandomizedRunner.java:984)
	at com.carrotsearch.randomizedtesting.rules.SystemPropertiesRestoreRule$1.evaluate(SystemPropertiesRestoreRule.java:57)
	at org.apache.lucene.util.TestRuleSetupTeardownChained$1.evaluate(TestRuleSetupTeardownChained.java:49)
	at org.apache.lucene.util.AbstractBeforeAfterRule$1.evaluate(AbstractBeforeAfterRule.java:45)
	at org.apache.lucene.util.TestRuleThreadAndTestName$1.evaluate(TestRuleThreadAndTestName.java:48)
	at org.apache.lucene.util.TestRuleIgnoreAfterMaxFailures$1.evaluate(TestRuleIgnoreAfterMaxFailures.java:64)
	at org.apache.lucene.util.TestRuleMarkFailure$1.evaluate(TestRuleMarkFailure.java:47)
	at com.carrotsearch.randomizedtesting.rules.StatementAdapter.evaluate(StatementAdapter.java:36)
	at com.carrotsearch.randomizedtesting.ThreadLeakControl$StatementRunner.run(ThreadLeakControl.java:368)
	at com.carrotsearch.randomizedtesting.ThreadLeakControl.forkTimeoutingTask(ThreadLeakControl.java:817)
	at com.carrotsearch.randomizedtesting.ThreadLeakControl$3.evaluate(ThreadLeakControl.java:468)
	at com.carrotsearch.randomizedtesting.RandomizedRunner.runSingleTest(RandomizedRunner.java:943)
	at com.carrotsearch.randomizedtesting.RandomizedRunner$5.evaluate(RandomizedRunner.java:829)
	at com.carrotsearch.randomizedtesting.RandomizedRunner$6.evaluate(RandomizedRunner.java:879)
	at com.carrotsearch.randomizedtesting.RandomizedRunner$7.evaluate(RandomizedRunner.java:890)
	at com.carrotsearch.randomizedtesting.rules.StatementAdapter.evaluate(StatementAdapter.java:36)
	at com.carrotsearch.randomizedtesting.rules.SystemPropertiesRestoreRule$1.evaluate(SystemPropertiesRestoreRule.java:57)
	at org.apache.lucene.util.AbstractBeforeAfterRule$1.evaluate(AbstractBeforeAfterRule.java:45)
	at com.carrotsearch.randomizedtesting.rules.StatementAdapter.evaluate(StatementAdapter.java:36)
	at org.apache.lucene.util.TestRuleStoreClassName$1.evaluate(TestRuleStoreClassName.java:41)
	at com.carrotsearch.randomizedtesting.rules.NoShadowingOrOverridesOnMethodsRule$1.evaluate(NoShadowingOrOverridesOnMethodsRule.java:40)
	at com.carrotsearch.randomizedtesting.rules.NoShadowingOrOverridesOnMethodsRule$1.evaluate(NoShadowingOrOverridesOnMethodsRule.java:40)
	at com.carrotsearch.randomizedtesting.rules.StatementAdapter.evaluate(StatementAdapter.java:36)
	at com.carrotsearch.randomizedtesting.rules.StatementAdapter.evaluate(StatementAdapter.java:36)
	at com.carrotsearch.randomizedtesting.rules.StatementAdapter.evaluate(StatementAdapter.java:36)
	at org.apache.lucene.util.TestRuleAssertionsRequired$1.evaluate(TestRuleAssertionsRequired.java:53)
	at org.apache.lucene.util.TestRuleMarkFailure$1.evaluate(TestRuleMarkFailure.java:47)
	at org.apache.lucene.util.TestRuleIgnoreAfterMaxFailures$1.evaluate(TestRuleIgnoreAfterMaxFailures.java:64)
	at org.apache.lucene.util.TestRuleIgnoreTestSuites$1.evaluate(TestRuleIgnoreTestSuites.java:54)
	at com.carrotsearch.randomizedtesting.rules.StatementAdapter.evaluate(StatementAdapter.java:36)
	at com.carrotsearch.randomizedtesting.ThreadLeakControl$StatementRunner.run(ThreadLeakControl.java:368)
	at java.lang.Thread.run(Thread.java:748)


FAILED:  org.apache.solr.cloud.autoscaling.TriggerIntegrationTest.testNodeMarkersRegistration

Error Message:
Path /autoscaling/nodeAdded/127.0.0.1:60472_solr wasn't created

Stack Trace:
java.lang.AssertionError: Path /autoscaling/nodeAdded/127.0.0.1:60472_solr wasn't created
	at __randomizedtesting.SeedInfo.seed([98DB7E6CD5118B43:8061F660DB2446AC]:0)
	at org.junit.Assert.fail(Assert.java:93)
	at org.junit.Assert.assertTrue(Assert.java:43)
	at org.apache.solr.cloud.autoscaling.TriggerIntegrationTest.testNodeMarkersRegistration(TriggerIntegrationTest.java:924)
	at sun.reflect.NativeMethodAccessorImpl.invoke0(Native Method)
	at sun.reflect.NativeMethodAccessorImpl.invoke(NativeMethodAccessorImpl.java:62)
	at sun.reflect.DelegatingMethodAccessorImpl.invoke(DelegatingMethodAccessorImpl.java:43)
	at java.lang.reflect.Method.invoke(Method.java:498)
	at com.carrotsearch.randomizedtesting.RandomizedRunner.invoke(RandomizedRunner.java:1737)
	at com.carrotsearch.randomizedtesting.RandomizedRunner$8.evaluate(RandomizedRunner.java:934)
	at com.carrotsearch.randomizedtesting.RandomizedRunner$9.evaluate(RandomizedRunner.java:970)
	at com.carrotsearch.randomizedtesting.RandomizedRunner$10.evaluate(RandomizedRunner.java:984)
	at com.carrotsearch.randomizedtesting.rules.SystemPropertiesRestoreRule$1.evaluate(SystemPropertiesRestoreRule.java:57)
	at org.apache.lucene.util.TestRuleSetupTeardownChained$1.evaluate(TestRuleSetupTeardownChained.java:49)
	at org.apache.lucene.util.AbstractBeforeAfterRule$1.evaluate(AbstractBeforeAfterRule.java:45)
	at org.apache.lucene.util.TestRuleThreadAndTestName$1.evaluate(TestRuleThreadAndTestName.java:48)
	at org.apache.lucene.util.TestRuleIgnoreAfterMaxFailures$1.evaluate(TestRuleIgnoreAfterMaxFailures.java:64)
	at org.apache.lucene.util.TestRuleMarkFailure$1.evaluate(TestRuleMarkFailure.java:47)
	at com.carrotsearch.randomizedtesting.rules.StatementAdapter.evaluate(StatementAdapter.java:36)
	at com.carrotsearch.randomizedtesting.ThreadLeakControl$StatementRunner.run(ThreadLeakControl.java:368)
	at com.carrotsearch.randomizedtesting.ThreadLeakControl.forkTimeoutingTask(ThreadLeakControl.java:817)
	at com.carrotsearch.randomizedtesting.ThreadLeakControl$3.evaluate(ThreadLeakControl.java:468)
	at com.carrotsearch.randomizedtesting.RandomizedRunner.runSingleTest(RandomizedRunner.java:943)
	at com.carrotsearch.randomizedtesting.RandomizedRunner$5.evaluate(RandomizedRunner.java:829)
	at com.carrotsearch.randomizedtesting.RandomizedRunner$6.evaluate(RandomizedRunner.java:879)
	at com.carrotsearch.randomizedtesting.RandomizedRunner$7.evaluate(RandomizedRunner.java:890)
	at com.carrotsearch.randomizedtesting.rules.StatementAdapter.evaluate(StatementAdapter.java:36)
	at com.carrotsearch.randomizedtesting.rules.SystemPropertiesRestoreRule$1.evaluate(SystemPropertiesRestoreRule.java:57)
	at org.apache.lucene.util.AbstractBeforeAfterRule$1.evaluate(AbstractBeforeAfterRule.java:45)
	at com.carrotsearch.randomizedtesting.rules.StatementAdapter.evaluate(StatementAdapter.java:36)
	at org.apache.lucene.util.TestRuleStoreClassName$1.evaluate(TestRuleStoreClassName.java:41)
	at com.carrotsearch.randomizedtesting.rules.NoShadowingOrOverridesOnMethodsRule$1.evaluate(NoShadowingOrOverridesOnMethodsRule.java:40)
	at com.carrotsearch.randomizedtesting.rules.NoShadowingOrOverridesOnMethodsRule$1.evaluate(NoShadowingOrOverridesOnMethodsRule.java:40)
	at com.carrotsearch.randomizedtesting.rules.StatementAdapter.evaluate(StatementAdapter.java:36)
	at com.carrotsearch.randomizedtesting.rules.StatementAdapter.evaluate(StatementAdapter.java:36)
	at com.carrotsearch.randomizedtesting.rules.StatementAdapter.evaluate(StatementAdapter.java:36)
	at org.apache.lucene.util.TestRuleAssertionsRequired$1.evaluate(TestRuleAssertionsRequired.java:53)
	at org.apache.lucene.util.TestRuleMarkFailure$1.evaluate(TestRuleMarkFailure.java:47)
	at org.apache.lucene.util.TestRuleIgnoreAfterMaxFailures$1.evaluate(TestRuleIgnoreAfterMaxFailures.java:64)
	at org.apache.lucene.util.TestRuleIgnoreTestSuites$1.evaluate(TestRuleIgnoreTestSuites.java:54)
	at com.carrotsearch.randomizedtesting.rules.StatementAdapter.evaluate(StatementAdapter.java:36)
	at com.carrotsearch.randomizedtesting.ThreadLeakControl$StatementRunner.run(ThreadLeakControl.java:368)
	at java.lang.Thread.run(Thread.java:748)




Build Log:
[...truncated 11644 lines...]
   [junit4] Suite: org.apache.solr.cloud.MultiThreadedOCPTest
   [junit4]   2> 154231 INFO  (SUITE-MultiThreadedOCPTest-seed#[98DB7E6CD5118B43]-worker) [    ] o.a.s.SolrTestCaseJ4 SecureRandom sanity checks: test.solr.allowed.securerandom=null & java.security.egd=file:/dev/./urandom
   [junit4]   2> Creating dataDir: /x1/jenkins/jenkins-slave/workspace/Lucene-Solr-Tests-7.x/solr/build/solr-core/test/J1/temp/solr.cloud.MultiThreadedOCPTest_98DB7E6CD5118B43-001/init-core-data-001
   [junit4]   2> 154232 WARN  (SUITE-MultiThreadedOCPTest-seed#[98DB7E6CD5118B43]-worker) [    ] o.a.s.SolrTestCaseJ4 startTrackingSearchers: numOpens=5 numCloses=5
   [junit4]   2> 154233 INFO  (SUITE-MultiThreadedOCPTest-seed#[98DB7E6CD5118B43]-worker) [    ] o.a.s.SolrTestCaseJ4 Using TrieFields (NUMERIC_POINTS_SYSPROP=false) w/NUMERIC_DOCVALUES_SYSPROP=true
   [junit4]   2> 154344 INFO  (SUITE-MultiThreadedOCPTest-seed#[98DB7E6CD5118B43]-worker) [    ] o.a.s.SolrTestCaseJ4 Randomized ssl (false) and clientAuth (true) via: @org.apache.solr.util.RandomizeSSL(reason=, ssl=NaN, value=NaN, clientAuth=NaN)
   [junit4]   2> 154344 INFO  (SUITE-MultiThreadedOCPTest-seed#[98DB7E6CD5118B43]-worker) [    ] o.a.s.BaseDistributedSearchTestCase Setting hostContext system property: /
   [junit4]   2> 154390 INFO  (TEST-MultiThreadedOCPTest.test-seed#[98DB7E6CD5118B43]) [    ] o.a.s.c.ZkTestServer STARTING ZK TEST SERVER
   [junit4]   2> 155041 INFO  (Thread-24) [    ] o.a.s.c.ZkTestServer client port:0.0.0.0/0.0.0.0:0
   [junit4]   2> 155041 INFO  (Thread-24) [    ] o.a.s.c.ZkTestServer Starting server
   [junit4]   2> 155042 INFO  (TEST-MultiThreadedOCPTest.test-seed#[98DB7E6CD5118B43]) [    ] o.a.s.c.ZkTestServer start zk server on port:48970
   [junit4]   2> 155057 ERROR (Thread-24) [    ] o.a.z.s.ZooKeeperServer ZKShutdownHandler is not registered, so ZooKeeper server won't take any action on ERROR or SHUTDOWN server state changes
   [junit4]   2> 157150 INFO  (TEST-MultiThreadedOCPTest.test-seed#[98DB7E6CD5118B43]) [    ] o.a.s.c.AbstractZkTestCase put /x1/jenkins/jenkins-slave/workspace/Lucene-Solr-Tests-7.x/solr/core/src/test-files/solr/collection1/conf/solrconfig-tlog.xml to /configs/conf1/solrconfig.xml
   [junit4]   2> 157154 INFO  (TEST-MultiThreadedOCPTest.test-seed#[98DB7E6CD5118B43]) [    ] o.a.s.c.AbstractZkTestCase put /x1/jenkins/jenkins-slave/workspace/Lucene-Solr-Tests-7.x/solr/core/src/test-files/solr/collection1/conf/schema.xml to /configs/conf1/schema.xml
   [junit4]   2> 157161 INFO  (TEST-MultiThreadedOCPTest.test-seed#[98DB7E6CD5118B43]) [    ] o.a.s.c.AbstractZkTestCase put /x1/jenkins/jenkins-slave/workspace/Lucene-Solr-Tests-7.x/solr/core/src/test-files/solr/collection1/conf/solrconfig.snippet.randomindexconfig.xml to /configs/conf1/solrconfig.snippet.randomindexconfig.xml
   [junit4]   2> 157166 INFO  (TEST-MultiThreadedOCPTest.test-seed#[98DB7E6CD5118B43]) [    ] o.a.s.c.AbstractZkTestCase put /x1/jenkins/jenkins-slave/workspace/Lucene-Solr-Tests-7.x/solr/core/src/test-files/solr/collection1/conf/stopwords.txt to /configs/conf1/stopwords.txt
   [junit4]   2> 157170 INFO  (TEST-MultiThreadedOCPTest.test-seed#[98DB7E6CD5118B43]) [    ] o.a.s.c.AbstractZkTestCase put /x1/jenkins/jenkins-slave/workspace/Lucene-Solr-Tests-7.x/solr/core/src/test-files/solr/collection1/conf/protwords.txt to /configs/conf1/protwords.txt
   [junit4]   2> 157177 INFO  (TEST-MultiThreadedOCPTest.test-seed#[98DB7E6CD5118B43]) [    ] o.a.s.c.AbstractZkTestCase put /x1/jenkins/jenkins-slave/workspace/Lucene-Solr-Tests-7.x/solr/core/src/test-files/solr/collection1/conf/currency.xml to /configs/conf1/currency.xml
   [junit4]   2> 157221 INFO  (TEST-MultiThreadedOCPTest.test-seed#[98DB7E6CD5118B43]) [    ] o.a.s.c.AbstractZkTestCase put /x1/jenkins/jenkins-slave/workspace/Lucene-Solr-Tests-7.x/solr/core/src/test-files/solr/collection1/conf/enumsConfig.xml to /configs/conf1/enumsConfig.xml
   [junit4]   2> 157225 INFO  (TEST-MultiThreadedOCPTest.test-seed#[98DB7E6CD5118B43]) [    ] o.a.s.c.AbstractZkTestCase put /x1/jenkins/jenkins-slave/workspace/Lucene-Solr-Tests-7.x/solr/core/src/test-files/solr/collection1/conf/open-exchange-rates.json to /configs/conf1/open-exchange-rates.json
   [junit4]   2> 157230 INFO  (TEST-MultiThreadedOCPTest.test-seed#[98DB7E6CD5118B43]) [    ] o.a.s.c.AbstractZkTestCase put /x1/jenkins/jenkins-slave/workspace/Lucene-Solr-Tests-7.x/solr/core/src/test-files/solr/collection1/conf/mapping-ISOLatin1Accent.txt to /configs/conf1/mapping-ISOLatin1Accent.txt
   [junit4]   2> 157237 INFO  (TEST-MultiThreadedOCPTest.test-seed#[98DB7E6CD5118B43]) [    ] o.a.s.c.AbstractZkTestCase put /x1/jenkins/jenkins-slave/workspace/Lucene-Solr-Tests-7.x/solr/core/src/test-files/solr/collection1/conf/old_synonyms.txt to /configs/conf1/old_synonyms.txt
   [junit4]   2> 157241 INFO  (TEST-MultiThreadedOCPTest.test-seed#[98DB7E6CD5118B43]) [    ] o.a.s.c.AbstractZkTestCase put /x1/jenkins/jenkins-slave/workspace/Lucene-Solr-Tests-7.x/solr/core/src/test-files/solr/collection1/conf/synonyms.txt to /configs/conf1/synonyms.txt
   [junit4]   2> 157299 INFO  (TEST-MultiThreadedOCPTest.test-seed#[98DB7E6CD5118B43]) [    ] o.a.s.c.AbstractFullDistribZkTestBase Will use NRT replicas unless explicitly asked otherwise
   [junit4]   2> 159238 INFO  (TEST-MultiThreadedOCPTest.test-seed#[98DB7E6CD5118B43]) [    ] o.e.j.s.Server jetty-9.3.20.v20170531
   [junit4]   2> 159239 INFO  (TEST-MultiThreadedOCPTest.test-seed#[98DB7E6CD5118B43]) [    ] o.e.j.s.h.ContextHandler Started o.e.j.s.ServletContextHandler@35a06b8f{/,null,AVAILABLE}
   [junit4]   2> 159282 INFO  (TEST-MultiThreadedOCPTest.test-seed#[98DB7E6CD5118B43]) [    ] o.e.j.s.AbstractConnector Started ServerConnector@1cd07c10{HTTP/1.1,[http/1.1]}{127.0.0.1:58297}
   [junit4]   2> 159282 INFO  (TEST-MultiThreadedOCPTest.test-seed#[98DB7E6CD5118B43]) [    ] o.e.j.s.Server Started @176251ms
   [junit4]   2> 159282 INFO  (TEST-MultiThreadedOCPTest.test-seed#[98DB7E6CD5118B43]) [    ] o.a.s.c.s.e.JettySolrRunner Jetty properties: {solr.data.dir=/x1/jenkins/jenkins-slave/workspace/Lucene-Solr-Tests-7.x/solr/build/solr-core/test/J1/temp/solr.cloud.MultiThreadedOCPTest_98DB7E6CD5118B43-001/tempDir-001/control/data, replicaType=NRT, hostContext=/, hostPort=58297, coreRootDirectory=/x1/jenkins/jenkins-slave/workspace/Lucene-Solr-Tests-7.x/solr/build/solr-core/test/J1/temp/solr.cloud.MultiThreadedOCPTest_98DB7E6CD5118B43-001/control-001/cores}
   [junit4]   2> 159282 ERROR (TEST-MultiThreadedOCPTest.test-seed#[98DB7E6CD5118B43]) [    ] o.a.s.u.StartupLoggingUtils Missing Java Option solr.log.dir. Logging may be missing or incomplete.
   [junit4]   2> 159282 INFO  (TEST-MultiThreadedOCPTest.test-seed#[98DB7E6CD5118B43]) [    ] o.a.s.s.SolrDispatchFilter  ___      _       Welcome to Apache Solr™ version 7.2.0
   [junit4]   2> 159282 INFO  (TEST-MultiThreadedOCPTest.test-seed#[98DB7E6CD5118B43]) [    ] o.a.s.s.SolrDispatchFilter / __| ___| |_ _   Starting in cloud mode on port null
   [junit4]   2> 159282 INFO  (TEST-MultiThreadedOCPTest.test-seed#[98DB7E6CD5118B43]) [    ] o.a.s.s.SolrDispatchFilter \__ \/ _ \ | '_|  Install dir: null
   [junit4]   2> 159282 INFO  (TEST-MultiThreadedOCPTest.test-seed#[98DB7E6CD5118B43]) [    ] o.a.s.s.SolrDispatchFilter |___/\___/_|_|    Start time: 2017-11-30T00:30:54.679Z
   [junit4]   2> 159525 INFO  (TEST-MultiThreadedOCPTest.test-seed#[98DB7E6CD5118B43]) [    ] o.a.s.s.SolrDispatchFilter Loading solr.xml from SolrHome (not found in ZooKeeper)
   [junit4]   2> 159525 INFO  (TEST-MultiThreadedOCPTest.test-seed#[98DB7E6CD5118B43]) [    ] o.a.s.c.SolrXmlConfig Loading container configuration from /x1/jenkins/jenkins-slave/workspace/Lucene-Solr-Tests-7.x/solr/build/solr-core/test/J1/temp/solr.cloud.MultiThreadedOCPTest_98DB7E6CD5118B43-001/control-001/solr.xml
   [junit4]   2> 159863 INFO  (TEST-MultiThreadedOCPTest.test-seed#[98DB7E6CD5118B43]) [    ] o.a.s.c.SolrXmlConfig Configuration parameter autoReplicaFailoverWorkLoopDelay is ignored
   [junit4]   2> 159863 INFO  (TEST-MultiThreadedOCPTest.test-seed#[98DB7E6CD5118B43]) [    ] o.a.s.c.SolrXmlConfig Configuration parameter autoReplicaFailoverBadNodeExpiration is ignored
   [junit4]   2> 159920 INFO  (TEST-MultiThreadedOCPTest.test-seed#[98DB7E6CD5118B43]) [    ] o.a.s.c.SolrXmlConfig MBean server found: com.sun.jmx.mbeanserver.JmxMBeanServer@6e046ec7, but no JMX reporters were configured - adding default JMX reporter.
   [junit4]   2> 160039 INFO  (TEST-MultiThreadedOCPTest.test-seed#[98DB7E6CD5118B43]) [    ] o.a.s.c.ZkContainer Zookeeper client=127.0.0.1:48970/solr
   [junit4]   2> 161253 INFO  (TEST-MultiThreadedOCPTest.test-seed#[98DB7E6CD5118B43]) [n:127.0.0.1:58297_    ] o.a.s.c.Overseer Overseer (id=null) closing
   [junit4]   2> 161255 INFO  (TEST-MultiThreadedOCPTest.test-seed#[98DB7E6CD5118B43]) [n:127.0.0.1:58297_    ] o.a.s.c.OverseerElectionContext I am going to be the leader 127.0.0.1:58297_
   [junit4]   2> 161255 INFO  (TEST-MultiThreadedOCPTest.test-seed#[98DB7E6CD5118B43]) [n:127.0.0.1:58297_    ] o.a.s.c.Overseer Overseer (id=99090553270435844-127.0.0.1:58297_-n_0000000000) starting
   [junit4]   2> 161562 INFO  (TEST-MultiThreadedOCPTest.test-seed#[98DB7E6CD5118B43]) [n:127.0.0.1:58297_    ] o.a.s.c.ZkController Register node as live in ZooKeeper:/live_nodes/127.0.0.1:58297_
   [junit4]   2> 161566 INFO  (zkCallback-29-thread-1-processing-n:127.0.0.1:58297_) [n:127.0.0.1:58297_    ] o.a.s.c.c.ZkStateReader Updated live nodes from ZooKeeper... (0) -> (1)
   [junit4]   2> 162877 INFO  (TEST-MultiThreadedOCPTest.test-seed#[98DB7E6CD5118B43]) [n:127.0.0.1:58297_    ] o.a.s.m.r.SolrJmxReporter JMX monitoring for 'solr.node' (registry 'solr.node') enabled at server: com.sun.jmx.mbeanserver.JmxMBeanServer@6e046ec7
   [junit4]   2> 163445 INFO  (TEST-MultiThreadedOCPTest.test-seed#[98DB7E6CD5118B43]) [n:127.0.0.1:58297_    ] o.a.s.m.r.SolrJmxReporter JMX monitoring for 'solr.jvm' (registry 'solr.jvm') enabled at server: com.sun.jmx.mbeanserver.JmxMBeanServer@6e046ec7
   [junit4]   2> 163481 INFO  (TEST-MultiThreadedOCPTest.test-seed#[98DB7E6CD5118B43]) [n:127.0.0.1:58297_    ] o.a.s.m.r.SolrJmxReporter JMX monitoring for 'solr.jetty' (registry 'solr.jetty') enabled at server: com.sun.jmx.mbeanserver.JmxMBeanServer@6e046ec7
   [junit4]   2> 163483 INFO  (TEST-MultiThreadedOCPTest.test-seed#[98DB7E6CD5118B43]) [n:127.0.0.1:58297_    ] o.a.s.c.CorePropertiesLocator Found 0 core definitions underneath /x1/jenkins/jenkins-slave/workspace/Lucene-Solr-Tests-7.x/solr/build/solr-core/test/J1/temp/solr.cloud.MultiThreadedOCPTest_98DB7E6CD5118B43-001/control-001/cores
   [junit4]   2> 164672 INFO  (TEST-MultiThreadedOCPTest.test-seed#[98DB7E6CD5118B43]) [    ] o.a.s.c.c.ZkStateReader Updated live nodes from ZooKeeper... (0) -> (1)
   [junit4]   2> 164673 INFO  (TEST-MultiThreadedOCPTest.test-seed#[98DB7E6CD5118B43]) [    ] o.a.s.c.s.i.ZkClientClusterStateProvider Cluster at 127.0.0.1:48970/solr ready
   [junit4]   2> 164700 INFO  (qtp1782636886-154) [n:127.0.0.1:58297_    ] o.a.s.h.a.CollectionsHandler Invoked Collection Action :create with params replicationFactor=1&collection.configName=conf1&name=control_collection&nrtReplicas=1&action=CREATE&numShards=1&createNodeSet=127.0.0.1:58297_&wt=javabin&version=2 and sendToOCPQueue=true
   [junit4]   2> 165066 INFO  (OverseerThreadFactory-65-thread-1-processing-n:127.0.0.1:58297_) [n:127.0.0.1:58297_    ] o.a.s.c.CreateCollectionCmd Create collection control_collection
   [junit4]   2> 165262 INFO  (qtp1782636886-152) [n:127.0.0.1:58297_    ] o.a.s.h.a.CoreAdminOperation core create command qt=/admin/cores&collection.configName=conf1&newCollection=true&name=control_collection_shard1_replica_n1&action=CREATE&numShards=1&collection=control_collection&shard=shard1&wt=javabin&version=2&replicaType=NRT
   [junit4]   2> 165320 INFO  (qtp1782636886-152) [n:127.0.0.1:58297_    ] o.a.s.c.TransientSolrCoreCacheDefault Allocating transient cache for 4 transient cores
   [junit4]   2> 165446 INFO  (zkCallback-29-thread-1-processing-n:127.0.0.1:58297_) [n:127.0.0.1:58297_    ] o.a.s.c.c.ZkStateReader A cluster state change: [WatchedEvent state:SyncConnected type:NodeDataChanged path:/collections/control_collection/state.json] for collection [control_collection] has occurred - updating... (live nodes size: [1])
   [junit4]   2> 167270 INFO  (qtp1782636886-152) [n:127.0.0.1:58297_ c:control_collection s:shard1  x:control_collection_shard1_replica_n1] o.a.s.c.SolrConfig Using Lucene MatchVersion: 7.2.0
   [junit4]   2> 170625 INFO  (qtp1782636886-152) [n:127.0.0.1:58297_ c:control_collection s:shard1  x:control_collection_shard1_replica_n1] o.a.s.s.IndexSchema [control_collection_shard1_replica_n1] Schema name=test
   [junit4]   2> 170691 WARN  (qtp1782636886-152) [n:127.0.0.1:58297_ c:control_collection s:shard1  x:control_collection_shard1_replica_n1] o.a.s.c.SolrResourceLoader Solr loaded a deprecated plugin/analysis class [solr.TrieFloatField]. Please consult documentation how to replace it accordingly.
   [junit4]   2> 170838 WARN  (qtp1782636886-152) [n:127.0.0.1:58297_ c:control_collection s:shard1  x:control_collection_shard1_replica_n1] o.a.s.c.SolrResourceLoader Solr loaded a deprecated plugin/analysis class [solr.TrieDoubleField]. Please consult documentation how to replace it accordingly.
   [junit4]   2> 171114 WARN  (qtp1782636886-152) [n:127.0.0.1:58297_ c:control_collection s:shard1  x:control_collection_shard1_replica_n1] o.a.s.c.SolrResourceLoader Solr loaded a deprecated plugin/analysis class [solr.TrieDateField]. Please consult documentation how to replace it accordingly.
   [junit4]   2> 173426 WARN  (qtp1782636886-152) [n:127.0.0.1:58297_ c:control_collection s:shard1  x:control_collection_shard1_replica_n1] o.a.s.c.SolrResourceLoader Solr loaded a deprecated plugin/analysis class [solr.EnumField]. Please consult documentation how to replace it accordingly.
   [junit4]   2> 174921 INFO  (qtp1782636886-152) [n:127.0.0.1:58297_ c:control_collection s:shard1  x:control_collection_shard1_replica_n1] o.a.s.s.IndexSchema Loaded schema test/1.0 with uniqueid field id
   [junit4]   2> 175190 INFO  (qtp1782636886-152) [n:127.0.0.1:58297_ c:control_collection s:shard1  x:control_collection_shard1_replica_n1] o.a.s.c.CoreContainer Creating SolrCore 'control_collection_shard1_replica_n1' using configuration from collection control_collection, trusted=true
   [junit4]   2> 175191 INFO  (qtp1782636886-152) [n:127.0.0.1:58297_ c:control_collection s:shard1  x:control_collection_shard1_replica_n1] o.a.s.m.r.SolrJmxReporter JMX monitoring for 'solr.core.control_collection.shard1.replica_n1' (registry 'solr.core.control_collection.shard1.replica_n1') enabled at server: com.sun.jmx.mbeanserver.JmxMBeanServer@6e046ec7
   [junit4]   2> 175191 INFO  (qtp1782636886-152) [n:127.0.0.1:58297_ c:control_collection s:shard1  x:control_collection_shard1_replica_n1] o.a.s.c.SolrCore solr.RecoveryStrategy.Builder
   [junit4]   2> 175191 INFO  (qtp1782636886-152) [n:127.0.0.1:58297_ c:control_collection s:shard1  x:control_collection_shard1_replica_n1] o.a.s.c.SolrCore [[control_collection_shard1_replica_n1] ] Opening new SolrCore at [/x1/jenkins/jenkins-slave/workspace/Lucene-Solr-Tests-7.x/solr/build/solr-core/test/J1/temp/solr.cloud.MultiThreadedOCPTest_98DB7E6CD5118B43-001/control-001/cores/control_collection_shard1_replica_n1], dataDir=[/x1/jenkins/jenkins-slave/workspace/Lucene-Solr-Tests-7.x/solr/build/solr-core/test/J1/temp/solr.cloud.MultiThreadedOCPTest_98DB7E6CD5118B43-001/control-001/cores/control_collection_shard1_replica_n1/data/]
   [junit4]   2> 175226 INFO  (qtp1782636886-152) [n:127.0.0.1:58297_ c:control_collection s:shard1  x:control_collection_shard1_replica_n1] o.a.s.u.RandomMergePolicy RandomMergePolicy wrapping class org.apache.lucene.index.LogByteSizeMergePolicy: [LogByteSizeMergePolicy: minMergeSize=1677721, mergeFactor=42, maxMergeSize=2147483648, maxMergeSizeForForcedMerge=9223372036854775807, calibrateSizeByDeletes=true, maxMergeDocs=2147483647, maxCFSSegmentSizeMB=8.796093022207999E12, noCFSRatio=0.7130372378030084]
   [junit4]   2> 175350 WARN  (qtp1782636886-152) [n:127.0.0.1:58297_ c:control_collection s:shard1  x:control_collection_shard1_replica_n1] o.a.s.c.RequestHandlers INVALID paramSet a in requestHandler {type = requestHandler,name = /dump,class = DumpRequestHandler,attributes = {initParams=a, name=/dump, class=DumpRequestHandler},args = {defaults={a=A,b=B}}}
   [junit4]   2> 176039 INFO  (qtp1782636886-152) [n:127.0.0.1:58297_ c:control_collection s:shard1  x:control_collection_shard1_replica_n1] o.a.s.u.UpdateHandler Using UpdateLog implementation: org.apache.solr.update.UpdateLog
   [junit4]   2> 176039 INFO  (qtp1782636886-152) [n:127.0.0.1:58297_ c:control_collection s:shard1  x:control_collection_shard1_replica_n1] o.a.s.u.UpdateLog Initializing UpdateLog: dataDir= defaultSyncLevel=FLUSH numRecordsToKeep=100 maxNumLogsToKeep=10 numVersionBuckets=65536
   [junit4]   2> 176041 INFO  (qtp1782636886-152) [n:127.0.0.1:58297_ c:control_collection s:shard1  x:control_collection_shard1_replica_n1] o.a.s.u.CommitTracker Hard AutoCommit: disabled
   [junit4]   2> 176041 INFO  (qtp1782636886-152) [n:127.0.0.1:58297_ c:control_collection s:shard1  x:control_collection_shard1_replica_n1] o.a.s.u.CommitTracker Soft AutoCommit: disabled
   [junit4]   2> 176061 INFO  (qtp1782636886-152) [n:127.0.0.1:58297_ c:control_collection s:shard1  x:control_collection_shard1_replica_n1] o.a.s.u.RandomMergePolicy RandomMergePolicy wrapping class org.apache.lucene.index.AlcoholicMergePolicy: [AlcoholicMergePolicy: minMergeSize=0, mergeFactor=10, maxMergeSize=520455802, maxMergeSizeForForcedMerge=9223372036854775807, calibrateSizeByDeletes=true, maxMergeDocs=2147483647, maxCFSSegmentSizeMB=8.796093022207999E12, noCFSRatio=0.1]
   [junit4]   2> 176109 INFO  (qtp1782636886-152) [n:127.0.0.1:58297_ c:control_collection s:shard1  x:control_collection_shard1_replica_n1] o.a.s.s.SolrIndexSearcher Opening [Searcher@70ed7ed3[control_collection_shard1_replica_n1] main]
   [junit4]   2> 176131 INFO  (qtp1782636886-152) [n:127.0.0.1:58297_ c:control_collection s:shard1  x:control_collection_shard1_replica_n1] o.a.s.r.ManagedResourceStorage Configured ZooKeeperStorageIO with znodeBase: /configs/conf1
   [junit4]   2> 176132 INFO  (qtp1782636886-152) [n:127.0.0.1:58297_ c:control_collection s:shard1  x:control_collection_shard1_replica_n1] o.a.s.r.ManagedResourceStorage Loaded null at path _rest_managed.json using ZooKeeperStorageIO:path=/configs/conf1
   [junit4]   2> 176133 INFO  (qtp1782636886-152) [n:127.0.0.1:58297_ c:control_collection s:shard1  x:control_collection_shard1_replica_n1] o.a.s.h.ReplicationHandler Commits will be reserved for 10000ms.
   [junit4]   2> 176133 INFO  (qtp1782636886-152) [n:127.0.0.1:58297_ c:control_collection s:shard1  x:control_collection_shard1_replica_n1] o.a.s.u.UpdateLog Could not find max version in index or recent updates, using new clock 1585448874441441280
   [junit4]   2> 176142 INFO  (searcherExecutor-68-thread-1-processing-n:127.0.0.1:58297_ x:control_collection_shard1_replica_n1 s:shard1 c:control_collection) [n:127.0.0.1:58297_ c:control_collection s:shard1  x:control_collection_shard1_replica_n1] o.a.s.c.SolrCore [control_collection_shard1_replica_n1] Registered new searcher Searcher@70ed7ed3[control_collection_shard1_replica_n1] main{ExitableDirectoryReader(UninvertingDirectoryReader())}
   [junit4]   2> 176165 INFO  (qtp1782636886-152) [n:127.0.0.1:58297_ c:control_collection s:shard1  x:control_collection_shard1_replica_n1] o.a.s.c.ShardLeaderElectionContext Enough replicas found to continue.
   [junit4]   2> 176165 INFO  (qtp1782636886-152) [n:127.0.0.1:58297_ c:control_collection s:shard1  x:control_collection_shard1_replica_n1] o.a.s.c.ShardLeaderElectionContext I may be the new leader - try and sync
   [junit4]   2> 176165 INFO  (qtp1782636886-152) [n:127.0.0.1:58297_ c:control_collection s:shard1  x:control_collection_shard1_replica_n1] o.a.s.c.SyncStrategy Sync replicas to http://127.0.0.1:58297/control_collection_shard1_replica_n1/
   [junit4]   2> 176165 INFO  (qtp1782636886-152) [n:127.0.0.1:58297_ c:control_collection s:shard1  x:control_collection_shard1_replica_n1] o.a.s.c.SyncStrategy Sync Success - now sync replicas to me
   [junit4]   2> 176166 INFO  (qtp1782636886-152) [n:127.0.0.1:58297_ c:control_collection s:shard1  x:control_collection_shard1_replica_n1] o.a.s.c.SyncStrategy http://127.0.0.1:58297/control_collection_shard1_replica_n1/ has no replicas
   [junit4]   2> 176166 INFO  (qtp1782636886-152) [n:127.0.0.1:58297_ c:control_collection s:shard1  x:control_collection_shard1_replica_n1] o.a.s.c.ShardLeaderElectionContext Found all replicas participating in election, clear LIR
   [junit4]   2> 176189 INFO  (qtp1782636886-152) [n:127.0.0.1:58297_ c:control_collection s:shard1  x:control_collection_shard1_replica_n1] o.a.s.c.ShardLeaderElectionContext I am the new leader: http://127.0.0.1:58297/control_collection_shard1_replica_n1/ shard1
   [junit4]   2> 176690 INFO  (zkCallback-29-thread-2-processing-n:127.0.0.1:58297_) [n:127.0.0.1:58297_    ] o.a.s.c.c.ZkStateReader A cluster state change: [WatchedEvent state:SyncConnected type:NodeDataChanged path:/collections/control_collection/state.json] for collection [control_collection] has occurred - updating... (live nodes size: [1])
   [junit4]   2> 176729 INFO  (qtp1782636886-152) [n:127.0.0.1:58297_ c:control_collection s:shard1  x:control_collection_shard1_replica_n1] o.a.s.c.ZkController I am the leader, no recovery necessary
   [junit4]   2> 176751 INFO  (qtp1782636886-152) [n:127.0.0.1:58297_ c:control_collection s:shard1  x:control_collection_shard1_replica_n1] o.a.s.s.HttpSolrCall [admin] webapp=null path=/admin/cores params={qt=/admin/cores&collection.configName=conf1&newCollection=true&name=control_collection_shard1_replica_n1&action=CREATE&numShards=1&collection=control_collection&shard=shard1&wt=javabin&version=2&replicaType=NRT} status=0 QTime=11489
   [junit4]   2> 176832 INFO  (qtp1782636886-154) [n:127.0.0.1:58297_    ] o.a.s.h.a.CollectionsHandler Wait for new collection to be active for at most 30 seconds. Check all shard replicas
   [junit4]   2> 176850 INFO  (OverseerCollectionConfigSetProcessor-99090553270435844-127.0.0.1:58297_-n_0000000000) [n:127.0.0.1:58297_    ] o.a.s.c.OverseerTaskQueue Response ZK path: /overseer/collection-queue-work/qnr-0000000000 doesn't exist.  Requestor may have disconnected from ZooKeeper
   [junit4]   2> 176851 INFO  (zkCallback-29-thread-2-processing-n:127.0.0.1:58297_) [n:127.0.0.1:58297_    ] o.a.s.c.c.ZkStateReader A cluster state change: [WatchedEvent state:SyncConnected type:NodeDataChanged path:/collections/control_collection/state.json] for collection [control_collection] has occurred - updating... (live nodes size: [1])
   [junit4]   2> 177841 INFO  (qtp1782636886-154) [n:127.0.0.1:58297_    ] o.a.s.s.HttpSolrCall [admin] webapp=null path=/admin/collections params={replicationFactor=1&collection.configName=conf1&name=control_collection&nrtReplicas=1&action=CREATE&numShards=1&createNodeSet=127.0.0.1:58297_&wt=javabin&version=2} status=0 QTime=13141
   [junit4]   2> 178843 INFO  (TEST-MultiThreadedOCPTest.test-seed#[98DB7E6CD5118B43]) [    ] o.a.s.c.c.ZkStateReader Updated live nodes from ZooKeeper... (0) -> (1)
   [junit4]   2> 178843 INFO  (TEST-MultiThreadedOCPTest.test-seed#[98DB7E6CD5118B43]) [    ] o.a.s.c.s.i.ZkClientClusterStateProvider Cluster at 127.0.0.1:48970/solr ready
   [junit4]   2> 178852 INFO  (TEST-MultiThreadedOCPTest.test-seed#[98DB7E6CD5118B43]) [    ] o.a.s.c.ChaosMonkey monkey: init - expire sessions:false cause connection loss:false
   [junit4]   2> 179585 INFO  (qtp1782636886-155) [n:127.0.0.1:58297_    ] o.a.s.h.a.CollectionsHandler Invoked Collection Action :create with params replicationFactor=1&collection.configName=conf1&name=collection1&nrtReplicas=1&action=CREATE&numShards=2&createNodeSet=&stateFormat=2&wt=javabin&version=2 and sendToOCPQueue=true
   [junit4]   2> 179688 INFO  (OverseerThreadFactory-65-thread-2-processing-n:127.0.0.1:58297_) [n:127.0.0.1:58297_    ] o.a.s.c.CreateCollectionCmd Create collection collection1
   [junit4]   2> 179689 WARN  (OverseerThreadFactory-65-thread-2-processing-n:127.0.0.1:58297_) [n:127.0.0.1:58297_    ] o.a.s.c.CreateCollectionCmd It is unusual to create a collection (collection1) without cores.
   [junit4]   2> 179842 INFO  (qtp1782636886-155) [n:127.0.0.1:58297_    ] o.a.s.h.a.CollectionsHandler Wait for new collection to be active for at most 30 seconds. Check all shard replicas
   [junit4]   2> 179843 INFO  (qtp1782636886-155) [n:127.0.0.1:58297_    ] o.a.s.s.HttpSolrCall [admin] webapp=null path=/admin/collections params={replicationFactor=1&collection.configName=conf1&name=collection1&nrtReplicas=1&action=CREATE&numShards=2&createNodeSet=&stateFormat=2&wt=javabin&version=2} status=0 QTime=258
   [junit4]   2> 179874 INFO  (OverseerCollectionConfigSetProcessor-99090553270435844-127.0.0.1:58297_-n_0000000000) [n:127.0.0.1:58297_    ] o.a.s.c.OverseerTaskQueue Response ZK path: /overseer/collection-queue-work/qnr-0000000002 doesn't exist.  Requestor may have disconnected from ZooKeeper
   [junit4]   2> 183171 INFO  (TEST-MultiThreadedOCPTest.test-seed#[98DB7E6CD5118B43]) [    ] o.a.s.c.AbstractFullDistribZkTestBase create jetty 1 in directory /x1/jenkins/jenkins-slave/workspace/Lucene-Solr-Tests-7.x/solr/build/solr-core/test/J1/temp/solr.cloud.MultiThreadedOCPTest_98DB7E6CD5118B43-001/shard-1-001 of type NRT
   [junit4]   2> 183174 INFO  (TEST-MultiThreadedOCPTest.test-seed#[98DB7E6CD5118B43]) [    ] o.e.j.s.Server jetty-9.3.20.v20170531
   [junit4]   2> 183195 INFO  (TEST-MultiThreadedOCPTest.test-seed#[98DB7E6CD5118B43]) [    ] o.e.j.s.h.ContextHandler Started o.e.j.s.ServletContextHandler@254fbd17{/,null,AVAILABLE}
   [junit4]   2> 183196 INFO  (TEST-MultiThreadedOCPTest.test-seed#[98DB7E6CD5118B43]) [    ] o.e.j.s.AbstractConnector Started ServerConnector@35a958ad{HTTP/1.1,[http/1.1]}{127.0.0.1:59915}
   [junit4]   2> 183196 INFO  (TEST-MultiThreadedOCPTest.test-seed#[98DB7E6CD5118B43]) [    ] o.e.j.s.Server Started @200165ms
   [junit4]   2> 183196 INFO  (TEST-MultiThreadedOCPTest.test-seed#[98DB7E6CD5118B43]) [    ] o.a.s.c.s.e.JettySolrRunner Jetty properties: {solr.data.dir=/x1/jenkins/jenkins-slave/workspace/Lucene-Solr-Tests-7.x/solr/build/solr-core/test/J1/temp/solr.cloud.MultiThreadedOCPTest_98DB7E6CD5118B43-001/tempDir-001/jetty1, replicaType=NRT, solrconfig=solrconfig.xml, hostContext=/, hostPort=59915, coreRootDirectory=/x1/jenkins/jenkins-slave/workspace/Lucene-Solr-Tests-7.x/solr/build/solr-core/test/J1/temp/solr.cloud.MultiThreadedOCPTest_98DB7E6CD5118B43-001/shard-1-001/cores}
   [junit4]   2> 183196 ERROR (TEST-MultiThreadedOCPTest.test-seed#[98DB7E6CD5118B43]) [    ] o.a.s.u.StartupLoggingUtils Missing Java Option solr.log.dir. Logging may be missing or incomplete.
   [junit4]   2> 183196 INFO  (TEST-MultiThreadedOCPTest.test-seed#[98DB7E6CD5118B43]) [    ] o.a.s.s.SolrDispatchFilter  ___      _       Welcome to Apache Solr™ version 7.2.0
   [junit4]   2> 183196 INFO  (TEST-MultiThreadedOCPTest.test-seed#[98DB7E6CD5118B43]) [    ] o.a.s.s.SolrDispatchFilter / __| ___| |_ _   Starting in cloud mode on port null
   [junit4]   2> 183196 INFO  (TEST-MultiThreadedOCPTest.test-seed#[98DB7E6CD5118B43]) [    ] o.a.s.s.SolrDispatchFilter \__ \/ _ \ | '_|  Install dir: null
   [junit4]   2> 183196 INFO  (TEST-MultiThreadedOCPTest.test-seed#[98DB7E6CD5118B43]) [    ] o.a.s.s.SolrDispatchFilter |___/\___/_|_|    Start time: 2017-11-30T00:31:18.593Z
   [junit4]   2> 183640 INFO  (TEST-MultiThreadedOCPTest.test-seed#[98DB7E6CD5118B43]) [    ] o.a.s.s.SolrDispatchFilter Loading solr.xml from SolrHome (not found in ZooKeeper)
   [junit4]   2> 183641 INFO  (TEST-MultiThreadedOCPTest.test-seed#[98DB7E6CD5118B43]) [    ] o.a.s.c.SolrXmlConfig Loading container configuration from /x1/jenkins/jenkins-slave/workspace/Lucene-Solr-Tests-7.x/solr/build/solr-core/test/J1/temp/solr.cloud.MultiThreadedOCPTest_98DB7E6CD5118B43-001/shard-1-001/solr.xml
   [junit4]   2> 183659 INFO  (TEST-MultiThreadedOCPTest.test-seed#[98DB7E6CD5118B43]) [    ] o.a.s.c.SolrXmlConfig Configuration parameter autoReplicaFailoverWorkLoopDelay is ignored
   [junit4]   2> 183659 INFO  (TEST-MultiThreadedOCPTest.test-seed#[98DB7E6CD5118B43]) [    ] o.a.s.c.SolrXmlConfig Configuration parameter autoReplicaFailoverBadNodeExpiration is ignored
   [junit4]   2> 183660 INFO  (TEST-MultiThreadedOCPTest.test-seed#[98DB7E6CD5118B43]) [    ] o.a.s.c.SolrXmlConfig MBean server found: com.sun.jmx.mbeanserver.JmxMBeanServer@6e046ec7, but no JMX reporters were configured - adding default JMX reporter.
   [junit4]   2> 184353 INFO  (TEST-MultiThreadedOCPTest.test-seed#[98DB7E6CD5118B43]) [    ] o.a.s.c.ZkContainer Zookeeper client=127.0.0.1:48970/solr
   [junit4]   2> 184834 INFO  (TEST-MultiThreadedOCPTest.test-seed#[98DB7E6CD5118B43]) [n:127.0.0.1:59915_    ] o.a.s.c.c.ZkStateReader Updated live nodes from ZooKeeper... (0) -> (1)
   [junit4]   2> 184849 INFO  (TEST-MultiThreadedOCPTest.test-seed#[98DB7E6CD5118B43]) [n:127.0.0.1:59915_    ] o.a.s.c.Overseer Overseer (id=null) closing
   [junit4]   2> 184867 INFO  (TEST-MultiThreadedOCPTest.test-seed#[98DB7E6CD5118B43]) [n:127.0.0.1:59915_    ] o.a.s.c.ZkController Register node as live in ZooKeeper:/live_nodes/127.0.0.1:59915_
   [junit4]   2> 184868 INFO  (zkCallback-29-thread-2-processing-n:127.0.0.1:58297_) [n:127.0.0.1:58297_    ] o.a.s.c.c.ZkStateReader Updated live nodes from ZooKeeper... (1) -> (2)
   [junit4]   2> 184931 INFO  (zkCallback-37-thread-1) [    ] o.a.s.c.c.ZkStateReader Updated live nodes from ZooKeeper... (1) -> (2)
   [junit4]   2> 185035 INFO  (zkCallback-42-thread-1-processing-n:127.0.0.1:59915_) [n:127.0.0.1:59915_    ] o.a.s.c.c.ZkStateReader Updated live nodes from ZooKeeper... (1) -> (2)
   [junit4]   2> 186596 INFO  (TEST-MultiThreadedOCPTest.test-seed#[98DB7E6CD5118B43]) [n:127.0.0.1:59915_    ] o.a.s.m.r.SolrJmxReporter JMX monitoring for 'solr.node' (registry 'solr.node') enabled at server: com.sun.jmx.mbeanserver.JmxMBeanServer@6e046ec7
   [junit4]   2> 186960 INFO  (TEST-MultiThreadedOCPTest.test-seed#[98DB7E6CD5118B43]) [n:127.0.0.1:59915_    ] o.a.s.m.r.SolrJmxReporter JMX monitoring for 'solr.jvm' (registry 'solr.jvm') enabled at server: com.sun.jmx.mbeanserver.JmxMBeanServer@6e046ec7
   [junit4]   2> 186961 INFO  (TEST-MultiThreadedOCPTest.test-seed#[98DB7E6CD5118B43]) [n:127.0.0.1:59915_    ] o.a.s.m.r.SolrJmxReporter JMX monitoring for 'solr.jetty' (registry 'solr.jetty') enabled at server: com.sun.jmx.mbeanserver.JmxMBeanServer@6e046ec7
   [junit4]   2> 187100 INFO  (TEST-MultiThreadedOCPTest.test-seed#[98DB7E6CD5118B43]) [n:127.0.0.1:59915_    ] o.a.s.c.CorePropertiesLocator Found 0 core definitions underneath /x1/jenkins/jenkins-slave/workspace/Lucene-Solr-Tests-7.x/solr/build/solr-core/test/J1/temp/solr.cloud.MultiThreadedOCPTest_98DB7E6CD5118B43-001/shard-1-001/cores
   [junit4]   2> 187630 INFO  (qtp1782636886-151) [n:127.0.0.1:58297_    ] o.a.s.h.a.CollectionsHandler Invoked Collection Action :addreplica with params node=127.0.0.1:59915_&action=ADDREPLICA&collection=collection1&shard=shard2&type=NRT&wt=javabin&version=2 and sendToOCPQueue=true
   [junit4]   2> 187694 INFO  (OverseerThreadFactory-65-thread-3-processing-n:127.0.0.1:58297_) [n:127.0.0.1:58297_    ] o.a.s.c.AddReplicaCmd Node Identified 127.0.0.1:59915_ for creating new replica
   [junit4]   2> 187850 INFO  (qtp2065411609-201) [n:127.0.0.1:59915_    ] o.a.s.h.a.CoreAdminOperation core create command qt=/admin/cores&collection.configName=conf1&name=collection1_shard2_replica_n41&action=CREATE&collection=collection1&shard=shard2&wt=javabin&version=2&replicaType=NRT
   [junit4]   2> 187851 INFO  (qtp2065411609-201) [n:127.0.0.1:59915_    ] o.a.s.c.TransientSolrCoreCacheDefault Allocating transient cache for 4 transient cores
   [junit4]   2> 188326 INFO  (qtp2065411609-201) [n:127.0.0.1:59915_ c:collection1 s:shard2  x:collection1_shard2_replica_n41] o.a.s.c.SolrConfig Using Lucene MatchVersion: 7.2.0
   [junit4]   2> 188635 INFO  (qtp2065411609-201) [n:127.0.0.1:59915_ c:collection1 s:shard2  x:collection1_shard2_replica_n41] o.a.s.s.IndexSchema [collection1_shard2_replica_n41] Schema name=test
   [junit4]   2> 190299 INFO  (qtp2065411609-201) [n:127.0.0.1:59915_ c:collection1 s:shard2  x:collection1_shard2_replica_n41] o.a.s.s.IndexSchema Loaded schema test/1.0 with uniqueid field id
   [junit4]   2> 190582 INFO  (qtp2065411609-201) [n:127.0.0.1:59915_ c:collection1 s:shard2  x:collection1_shard2_replica_n41] o.a.s.c.CoreContainer Creating SolrCore 'collection1_shard2_replica_n41' using configuration from collection collection1, trusted=true
   [junit4]   2> 190582 INFO  (qtp2065411609-201) [n:127.0.0.1:59915_ c:collection1 s:shard2  x:collection1_shard2_replica_n41] o.a.s.m.r.SolrJmxReporter JMX monitoring for 'solr.core.collection1.shard2.replica_n41' (registry 'solr.core.collection1.shard2.replica_n41') enabled at server: com.sun.jmx.mbeanserver.JmxMBeanServer@6e046ec7
   [junit4]   2> 190583 INFO  (qtp2065411609-201) [n:127.0.0.1:59915_ c:collection1 s:shard2  x:collection1_shard2_replica_n41] o.a.s.c.SolrCore solr.RecoveryStrategy.Builder
   [junit4]   2> 190583 INFO  (qtp2065411609-201) [n:127.0.0.1:59915_ c:collection1 s:shard2  x:collection1_shard2_replica_n41] o.a.s.c.SolrCore [[collection1_shard2_replica_n41] ] Opening new SolrCore at [/x1/jenkins/jenkins-slave/workspace/Lucene-Solr-Tests-7.x/solr/build/solr-core/test/J1/temp/solr.cloud.MultiThreadedOCPTest_98DB7E6CD5118B43-001/shard-1-001/cores/collection1_shard2_replica_n41], dataDir=[/x1/jenkins/jenkins-slave/workspace/Lucene-Solr-Tests-7.x/solr/build/solr-core/test/J1/temp/solr.cloud.MultiThreadedOCPTest_98DB7E6CD5118B43-001/shard-1-001/cores/collection1_shard2_replica_n41/data/]
   [junit4]   2> 190604 INFO  (qtp2065411609-201) [n:127.0.0.1:59915_ c:collection1 s:shard2  x:collection1_shard2_replica_n41] o.a.s.u.RandomMergePolicy RandomMergePolicy wrapping class org.apache.lucene.index.LogByteSizeMergePolicy: [LogByteSizeMergePolicy: minMergeSize=1677721, mergeFactor=42, maxMergeSize=2147483648, maxMergeSizeForForcedMerge=9223372036854775807, calibrateSizeByDeletes=true, maxMergeDocs=2147483647, maxCFSSegmentSizeMB=8.796093022207999E12, noCFSRatio=0.7130372378030084]
   [junit4]   2> 190701 WARN  (qtp2065411609-201) [n:127.0.0.1:59915_ c:collection1 s:shard2  x:collection1_shard2_replica_n41] o.a.s.c.RequestHandlers INVALID paramSet a in requestHandler {type = requestHandler,name = /dump,class = DumpRequestHandler,attributes = {initParams=a, name=/dump, class=DumpRequestHandler},args = {defaults={a=A,b=B}}}
   [junit4]   2> 191306 INFO  (qtp2065411609-201) [n:127.0.0.1:59915_ c:collection1 s:shard2  x:collection1_shard2_replica_n41] o.a.s.u.UpdateHandler Using UpdateLog implementation: org.apache.solr.update.UpdateLog
   [junit4]   2> 191306 INFO  (qtp2065411609-201) [n:127.0.0.1:59915_ c:collection1 s:shard2  x:collection1_shard2_replica_n41] o.a.s.u.UpdateLog Initializing UpdateLog: dataDir= defaultSyncLevel=FLUSH numRecordsToKeep=100 maxNumLogsToKeep=10 numVersionBuckets=65536
   [junit4]   2> 191307 INFO  (qtp2065411609-201) [n:127.0.0.1:59915_ c:collection1 s:shard2  x:collection1_shard2_replica_n41] o.a.s.u.CommitTracker Hard AutoCommit: disabled
   [junit4]   2> 191307 INFO  (qtp2065411609-201) [n:127.0.0.1:59915_ c:collection1 s:shard2  x:collection1_shard2_replica_n41] o.a.s.u.CommitTracker Soft AutoCommit: disabled
   [junit4]   2> 191393 INFO  (qtp2065411609-201) [n:127.0.0.1:59915_ c:collection1 s:shard2  x:collection1_shard2_replica_n41] o.a.s.u.RandomMergePolicy RandomMergePolicy wrapping class org.apache.lucene.index.AlcoholicMergePolicy: [AlcoholicMergePolicy: minMergeSize=0, mergeFactor=10, maxMergeSize=520455802, maxMergeSizeForForcedMerge=9223372036854775807, calibrateSizeByDeletes=true, maxMergeDocs=2147483647, maxCFSSegmentSizeMB=8.796093022207999E12, noCFSRatio=0.1]
   [junit4]   2> 191413 INFO  (qtp2065411609-201) [n:127.0.0.1:59915_ c:collection1 s:shard2  x:collection1_shard2_replica_n41] o.a.s.s.SolrIndexSearcher Opening [Searcher@5f350fb0[collection1_shard2_replica_n41] main]
   [junit4]   2> 191415 INFO  (qtp2065411609-201) [n:127.0.0.1:59915_ c:collection1 s:shard2  x:collection1_shard2_replica_n41] o.a.s.r.ManagedResourceStorage Configured ZooKeeperStorageIO with znodeBase: /configs/conf1
   [junit4]   2> 191415 INFO  (qtp2065411609-201) [n:127.0.0.1:59915_ c:collection1 s:shard2  x:collection1_shard2_replica_n41] o.a.s.r.ManagedResourceStorage Loaded null at path _rest_managed.json using ZooKeeperStorageIO:path=/configs/conf1
   [junit4]   2> 191416 INFO  (qtp2065411609-201) [n:127.0.0.1:59915_ c:collection1 s:shard2  x:collection1_shard2_replica_n41] o.a.s.h.ReplicationHandler Commits will be reserved for 10000ms.
   [junit4]   2> 191416 INFO  (qtp2065411609-201) [n:127.0.0.1:59915_ c:collection1 s:shard2  x:collection1_shard2_replica_n41] o.a.s.u.UpdateLog Could not find max version in index or recent updates, using new clock 1585448890466828288
   [junit4]   2> 191423 INFO  (searcherExecutor-79-thread-1-processing-n:127.0.0.1:59915_ x:collection1_shard2_replica_n41 s:shard2 c:collection1) [n:127.0.0.1:59915_ c:collection1 s:shard2  x:collection1_shard2_replica_n41] o.a.s.c.SolrCore [collection1_shard2_replica_n41] Registered new searcher Searcher@5f350fb0[collection1_shard2_replica_n41] main{ExitableDirectoryReader(UninvertingDirectoryReader())}
   [junit4]   2> 191458 INFO  (qtp2065411609-201) [n:127.0.0.1:59915_ c:collection1 s:shard2  x:collection1_shard2_replica_n41] o.a.s.c.ShardLeaderElectionContext Enough replicas found to continue.
   [junit4]   2> 191458 INFO  (qtp2065411609-201) [n:127.0.0.1:59915_ c:collection1 s:shard2  x:collection1_shard2_replica_n41] o.a.s.c.ShardLeaderElectionContext I may be the new leader - try and sync
   [junit4]   2> 191458 INFO  (qtp2065411609-201) [n:127.0.0.1:59915_ c:collection1 s:shard2  x:collection1_shard2_replica_n41] o.a.s.c.SyncStrategy Sync replicas to http://127.0.0.1:59915/collection1_shard2_replica_n41/
   [junit4]   2> 191458 INFO  (qtp2065411609-201) [n:127.0.0.1:59915_ c:collection1 s:shard2  x:collection1_shard2_replica_n41] o.a.s.c.SyncStrategy Sync Success - now sync replicas to me
   [junit4]   2> 191458 INFO  (qtp2065411609-201) [n:127.0.0.1:59915_ c:collection1 s:shard2  x:collection1_shard2_replica_n41] o.a.s.c.SyncStrategy http://127.0.0.1:59915/collection1_shard2_replica_n41/ has no replicas
   [junit4]   2> 191458 INFO  (qtp2065411609-201) [n:127.0.0.1:59915_ c:collection1 s:shard2  x:collection1_shard2_replica_n41] o.a.s.c.ShardLeaderElectionContext Found all replicas participating in election, clear LIR
   [junit4]   2> 191479 INFO  (qtp2065411609-201) [n:127.0.0.1:59915_ c:collection1 s:shard2  x:collection1_shard2_replica_n41] o.a.s.c.ShardLeaderElectionContext I am the new leader: http://127.0.0.1:59915/collection1_shard2_replica_n41/ shard2
   [junit4]   2> 191501 INFO  (zkCallback-42-thread-1-processing-n:127.0.0.1:59915_) [n:127.0.0.1:59915_    ] o.a.s.c.c.ZkStateReader A cluster state change: [WatchedEvent state:SyncConnected type:NodeDataChanged path:/collections/collection1/state.json] for collection [collection1] has occurred - updating... (live nodes size: [2])
   [junit4]   2> 191541 INFO  (qtp2065411609-201) [n:127.0.0.1:59915_ c:collection1 s:shard2  x:collection1_shard2_replica_n41] o.a.s.c.ZkController I am the leader, no recovery necessary
   [junit4]   2> 191570 INFO  (qtp2065411609-201) [n:127.0.0.1:59915_ c:collection1 s:shard2  x:collection1_shard2_replica_n41] o.a.s.s.HttpSolrCall [admin] webapp=null path=/admin/cores params={qt=/admin/cores&collection.configName=conf1&name=collection1_shard2_replica_n41&action=CREATE&collection=collection1&shard=shard2&wt=javabin&version=2&replicaType=NRT} status=0 QTime=3719
   [junit4]   2> 191617 INFO  (qtp1782636886-151) [n:127.0.0.1:58297_    ] o.a.s.s.HttpSolrCall [admin] webapp=null path=/admin/collections params={node=127.0.0.1:59915_&action=ADDREPLICA&collection=collection1&shard=shard2&type=NRT&wt=javabin&version=2} status=0 QTime=3987
   [junit4]   2> 191749 INFO  (zkCallback-42-thread-1-processing-n:127.0.0.1:59915_) [n:127.0.0.1:59915_    ] o.a.s.c.c.ZkStateReader A cluster state change: [WatchedEvent state:SyncConnected type:NodeDataChanged path:/collections/collection1/state.json] for collection [collection1] has occurred - updating... (live nodes size: [2])
   [junit4]   2> 191842 INFO  (OverseerCollectionConfigSetProcessor-99090553270435844-127.0.0.1:58297_-n_0000000000) [n:127.0.0.1:58297_    ] o.a.s.c.OverseerTaskQueue Response ZK path: /overseer/collection-queue-work/qnr-0000000004 doesn't exist.  Requestor may have disconnected from ZooKeeper
   [junit4]   2> 192942 INFO  (TEST-MultiThreadedOCPTest.test-seed#[98DB7E6CD5118B43]) [    ] o.a.s.c.AbstractFullDistribZkTestBase create jetty 2 in directory /x1/jenkins/jenkins-slave/workspace/Lucene-Solr-Tests-7.x/solr/build/solr-core/test/J1/temp/solr.cloud.MultiThreadedOCPTest_98DB7E6CD5118B43-001/shard-2-001 of type NRT
   [junit4]   2> 192943 INFO  (TEST-MultiThreadedOCPTest.test-seed#[98DB7E6CD5118B43]) [    ] o.e.j.s.Server jetty-9.3.20.v20170531
   [junit4]   2> 194100 INFO  (TEST-MultiThreadedOCPTest.test-seed#[98DB7E6CD5118B43]) [    ] o.e.j.s.h.ContextHandler Started o.e.j.s.ServletContextHandler@56a86964{/,null,AVAILABLE}
   [junit4]   2> 194101 INFO  (TEST-MultiThreadedOCPTest.test-seed#[98DB7E6CD5118B43]) [    ] o.e.j.s.AbstractConnector Started ServerConnector@4805183d{HTTP/1.1,[http/1.1]}{127.0.0.1:49611}
   [junit4]   2> 194101 INFO  (TEST-MultiThreadedOCPTest.test-seed#[98DB7E6CD5118B43]) [    ] o.e.j.s.Server Started @211070ms
   [junit4]   2> 194101 INFO  (TEST-MultiThreadedOCPTest.test-seed#[98DB7E6CD5118B43]) [    ] o.a.s.c.s.e.JettySolrRunner Jetty properties: {solr.data.dir=/x1/jenkins/jenkins-slave/workspace/Lucene-Solr-Tests-7.x/solr/build/solr-core/test/J1/temp/solr.cloud.MultiThreadedOCPTest_98DB7E6CD5118B43-001/tempDir-001/jetty2, solrconfig=solrconfig.xml, hostContext=/, hostPort=49611, coreRootDirectory=/x1/jenkins/jenkins-slave/workspace/Lucene-Solr-Tests-7.x/solr/build/solr-core/test/J1/temp/solr.cloud.MultiThreadedOCPTest_98DB7E6CD5118B43-001/shard-2-001/cores}
   [junit4]   2> 194109 ERROR (TEST-MultiThreadedOCPTest.test-seed#[98DB7E6CD5118B43]) [    ] o.a.s.u.StartupLoggingUtils Missing Java Option solr.log.dir. Logging may be missing or incomplete.
   [junit4]   2> 194113 INFO  (TEST-MultiThreadedOCPTest.test-seed#[98DB7E6CD5118B43]) [    ] o.a.s.s.SolrDispatchFilter  ___      _       Welcome to Apache Solr™ version 7.2.0
   [junit4]   2> 194113 INFO  (TEST-MultiThreadedOCPTest.test-seed#[98DB7E6CD5118B43]) [    ] o.a.s.s.SolrDispatchFilter / __| ___| |_ _   Starting in cloud mode on port null
   [junit4]   2> 194113 INFO  (TEST-MultiThreadedOCPTest.test-seed#[98DB7E6CD5118B43]) [    ] o.a.s.s.SolrDispatchFilter \__ \/ _ \ | '_|  Install dir: null
   [junit4]   2> 194113 INFO  (TEST-MultiThreadedOCPTest.test-seed#[98DB7E6CD5118B43]) [    ] o.a.s.s.SolrDispatchFilter |___/\___/_|_|    Start time: 2017-11-30T00:31:29.510Z
   [junit4]   2> 194249 INFO  (TEST-MultiThreadedOCPTest.test-seed#[98DB7E6CD5118B43]) [    ] o.a.s.s.SolrDispatchFilter Loading solr.xml from SolrHome (not found in ZooKeeper)
   [junit4]   2> 194249 INFO  (TEST-MultiThreadedOCPTest.test-seed#[98DB7E6CD5118B43]) [    ] o.a.s.c.SolrXmlConfig Loading container configuration from /x1/jenkins/jenkins-slave/workspace/Lucene-Solr-Tests-7.x/solr/build/solr-core/test/J1/temp/solr.cloud.MultiThreadedOCPTest_98DB7E6CD5118B43-001/shard-2-001/solr.xml
   [junit4]   2> 194384 INFO  (TEST-MultiThreadedOCPTest.test-seed#[98DB7E6CD5118B43]) [    ] o.a.s.c.SolrXmlConfig Configuration parameter autoReplicaFailoverWorkLoopDelay is ignored
   [junit4]   2> 194

[...truncated too long message...]

a_n3] o.a.s.m.SolrMetricManager Closing metric reporters for registry=solr.collection.test_col.shard1.leader, tag=761949083
   [junit4]   2> 8854407 INFO  (coreCloseExecutor-7675-thread-1) [n:127.0.0.1:48695_solr c:test_col s:shard2 r:core_node8 x:test_col_shard2_replica_n7] o.a.s.m.SolrMetricManager Closing metric reporters for registry=solr.core.test_col.shard2.replica_n7, tag=561560033
   [junit4]   2> 8854407 INFO  (coreCloseExecutor-7675-thread-1) [n:127.0.0.1:48695_solr c:test_col s:shard2 r:core_node8 x:test_col_shard2_replica_n7] o.a.s.m.r.SolrJmxReporter Closing reporter [org.apache.solr.metrics.reporters.SolrJmxReporter@7c47ce19: rootName = solr_48695, domain = solr.core.test_col.shard2.replica_n7, service url = null, agent id = null] for registry solr.core.test_col.shard2.replica_n7 / com.codahale.metrics.MetricRegistry@59e96356
   [junit4]   2> 8854423 INFO  (jetty-closer-2929-thread-2) [    ] o.a.s.c.Overseer Overseer (id=99091107951673355-127.0.0.1:57927_solr-n_0000000000) closing
   [junit4]   2> 8854452 INFO  (OverseerStateUpdate-99091107951673355-127.0.0.1:57927_solr-n_0000000000) [n:127.0.0.1:57927_solr    ] o.a.s.c.Overseer Overseer Loop exiting : 127.0.0.1:57927_solr
   [junit4]   2> 8854454 INFO  (coreCloseExecutor-7677-thread-1) [n:127.0.0.1:52421_solr c:test_col s:shard1 r:core_node2 x:test_col_shard1_replica_n1] o.a.s.m.SolrMetricManager Closing metric reporters for registry=solr.collection.test_col.shard1.leader, tag=270763561
   [junit4]   2> 8854506 INFO  (jetty-closer-2929-thread-4) [    ] o.e.j.s.h.ContextHandler Stopped o.e.j.s.ServletContextHandler@7dbfb2d6{/solr,null,UNAVAILABLE}
   [junit4]   2> 8854514 INFO  (coreCloseExecutor-7676-thread-1) [n:127.0.0.1:41827_solr c:test_col s:shard2 r:core_node6 x:test_col_shard2_replica_n5] o.a.s.m.SolrMetricManager Closing metric reporters for registry=solr.collection.test_col.shard2.leader, tag=1109232987
   [junit4]   2> 8854522 INFO  (coreCloseExecutor-7675-thread-1) [n:127.0.0.1:48695_solr c:test_col s:shard2 r:core_node8 x:test_col_shard2_replica_n7] o.a.s.m.SolrMetricManager Closing metric reporters for registry=solr.collection.test_col.shard2.leader, tag=561560033
   [junit4]   2> 8854573 INFO  (jetty-closer-2929-thread-1) [    ] o.e.j.s.h.ContextHandler Stopped o.e.j.s.ServletContextHandler@6cbce3ee{/solr,null,UNAVAILABLE}
   [junit4]   2> 8855271 WARN  (OverseerAutoScalingTriggerThread-99091107951673355-127.0.0.1:57927_solr-n_0000000000) [n:127.0.0.1:57927_solr    ] o.a.s.c.a.OverseerTriggerThread OverseerTriggerThread woken up but we are closed, exiting.
   [junit4]   2> 8855371 INFO  (jetty-closer-2929-thread-2) [    ] o.e.j.s.h.ContextHandler Stopped o.e.j.s.ServletContextHandler@2c862c06{/solr,null,UNAVAILABLE}
   [junit4]   2> 8856242 INFO  (jetty-closer-2929-thread-3) [    ] o.e.j.s.h.ContextHandler Stopped o.e.j.s.ServletContextHandler@45bccef{/solr,null,UNAVAILABLE}
   [junit4]   2> 8856264 ERROR (SUITE-TestTolerantUpdateProcessorCloud-seed#[98DB7E6CD5118B43]-worker) [    ] o.a.z.s.ZooKeeperServer ZKShutdownHandler is not registered, so ZooKeeper server won't take any action on ERROR or SHUTDOWN server state changes
   [junit4]   2> 8856265 INFO  (SUITE-TestTolerantUpdateProcessorCloud-seed#[98DB7E6CD5118B43]-worker) [    ] o.a.s.c.ZkTestServer connecting to 127.0.0.1:40151 40151
   [junit4]   2> 8856368 INFO  (Thread-6707) [    ] o.a.s.c.ZkTestServer connecting to 127.0.0.1:40151 40151
   [junit4]   2> 8856370 WARN  (Thread-6707) [    ] o.a.s.c.ZkTestServer Watch limit violations: 
   [junit4]   2> Maximum concurrent create/delete watches above limit:
   [junit4]   2> 
   [junit4]   2> 	7	/solr/aliases.json
   [junit4]   2> 	5	/solr/security.json
   [junit4]   2> 	4	/solr/configs/solrCloudCollectionConfig/managed-schema
   [junit4]   2> 	4	/solr/configs/solrCloudCollectionConfig
   [junit4]   2> 
   [junit4]   2> Maximum concurrent data watches above limit:
   [junit4]   2> 
   [junit4]   2> 	42	/solr/collections/test_col/state.json
   [junit4]   2> 	7	/solr/clusterstate.json
   [junit4]   2> 	7	/solr/clusterprops.json
   [junit4]   2> 	2	/solr/overseer_elect/election/99091107951673359-127.0.0.1:52421_solr-n_0000000002
   [junit4]   2> 	2	/solr/overseer_elect/election/99091107951673352-127.0.0.1:41827_solr-n_0000000001
   [junit4]   2> 
   [junit4]   2> Maximum concurrent children watches above limit:
   [junit4]   2> 
   [junit4]   2> 	7	/solr/live_nodes
   [junit4]   2> 	7	/solr/collections
   [junit4]   2> 
   [junit4]   2> NOTE: leaving temporary files on disk at: /x1/jenkins/jenkins-slave/workspace/Lucene-Solr-Tests-7.x/solr/build/solr-core/test/J2/temp/solr.cloud.TestTolerantUpdateProcessorCloud_98DB7E6CD5118B43-001
   [junit4]   2> Nov 30, 2017 2:55:51 AM com.carrotsearch.randomizedtesting.ThreadLeakControl checkThreadLeaks
   [junit4]   2> WARNING: Will linger awaiting termination of 1 leaked thread(s).
   [junit4]   2> NOTE: test params are: codec=Asserting(Lucene70), sim=RandomSimilarity(queryNorm=true): {}, locale=fi, timezone=Africa/Mogadishu
   [junit4]   2> NOTE: Linux 3.13.0-88-generic amd64/Oracle Corporation 1.8.0_144 (64-bit)/cpus=4,threads=1,free=106949536,total=527433728
   [junit4]   2> NOTE: All tests run in this JVM: [ZkNodePropsTest, TestRequestForwarding, DirectSolrSpellCheckerTest, DistributedSpellCheckComponentTest, PreAnalyzedUpdateProcessorTest, V2ApiIntegrationTest, TestRealTimeGet, DirectSolrConnectionTest, CursorMarkTest, TestElisionMultitermQuery, ReturnFieldsTest, LeaderElectionContextKeyTest, TestCharFilters, TestSolrQueryResponse, TestUniqueKeyFieldResource, AsyncCallRequestStatusResponseTest, DistributedQueryComponentCustomSortTest, TestCoreDiscovery, SolrIndexMetricsTest, HdfsTlogReplayBufferedWhileIndexingTest, HLLSerializationTest, TestDistributedGrouping, RequiredFieldsTest, TestSchemaManager, DefaultValueUpdateProcessorTest, BlockJoinFacetSimpleTest, HdfsRestartWhileUpdatingTest, MigrateRouteKeyTest, TestCorePropertiesReload, SystemInfoHandlerTest, DistanceFunctionTest, TestLMDirichletSimilarityFactory, TestHdfsBackupRestoreCore, TestHdfsUpdateLog, TestLRUCache, TestNamedUpdateProcessors, DirectoryFactoryTest, TestSkipOverseerOperations, TestGraphMLResponseWriter, IndexSchemaTest, SolrCloudExampleTest, TestSlowCompositeReaderWrapper, DistributedFacetExistsSmallTest, RecoveryAfterSoftCommitTest, RecoveryZkTest, TestDistribDocBasedVersion, XmlUpdateRequestHandlerTest, TestSolrCoreParser, CheckHdfsIndexTest, HdfsChaosMonkeyNothingIsSafeTest, TestSubQueryTransformerCrossCore, TestApiFramework, TestQuerySenderListener, TestLegacyFieldCache, RankQueryTest, ChangedSchemaMergeTest, RulesTest, TestFieldCacheSortRandom, DistribJoinFromCollectionTest, CoreAdminHandlerTest, SimplePostToolTest, TestFunctionQuery, TestManagedSchemaAPI, SolrCloudReportersTest, OverseerCollectionConfigSetProcessorTest, TestSolrCloudSnapshots, TestJsonRequest, TestCloudPivotFacet, TestConfigSetImmutable, SuggesterWFSTTest, TestRestoreCore, AlternateDirectoryTest, TestImpersonationWithHadoopAuth, WordBreakSolrSpellCheckerTest, TestRuleBasedAuthorizationPlugin, ReplicationFactorTest, SpellPossibilityIteratorTest, UUIDUpdateProcessorFallbackTest, TestEmbeddedSolrServerConstructors, ClassificationUpdateProcessorIntegrationTest, UUIDFieldTest, TestTolerantUpdateProcessorRandomCloud, UpdateLogTest, StressHdfsTest, TestStressUserVersions, XsltUpdateRequestHandlerTest, TestMultiWordSynonyms, CoreAdminCreateDiscoverTest, TestCoreAdminApis, SortByFunctionTest, AtomicUpdateProcessorFactoryTest, TestCustomDocTransformer, TestLegacyNumericUtils, DeleteNodeTest, CopyFieldTest, TestCustomSort, TestReload, VMParamsZkACLAndCredentialsProvidersTest, LeaderInitiatedRecoveryOnCommitTest, TestHttpShardHandlerFactory, ExecutePlanActionTest, SystemLogListenerTest, TestUseDocValuesAsStored2, TestRandomRequestDistribution, PluginInfoTest, TestLeaderInitiatedRecoveryThread, ClusterStateTest, LeaderElectionTest, ShufflingReplicaListTransformerTest, HttpSolrCallGetCoreTest, QueryResultKeyTest, NodeAddedTriggerTest, PKIAuthenticationIntegrationTest, TestRandomCollapseQParserPlugin, TestPullReplica, UnloadDistributedZkTest, SolrTestCaseJ4Test, TestIndexSearcher, TestValueSourceCache, TestPartialUpdateDeduplication, SearchHandlerTest, SuggesterTest, BasicDistributedZkTest, BasicDistributedZk2Test, CollectionsAPIDistributedZkTest, OpenCloseCoreStressTest, OverseerTest, BasicZkTest, FullSolrCloudDistribCmdsTest, TestRandomFaceting, TestDistributedSearch, TermVectorComponentDistributedTest, TestCoreContainer, StatsComponentTest, DirectUpdateHandlerTest, HighlighterTest, DistributedQueryElevationComponentTest, SpellCheckCollatorTest, SpatialFilterTest, NoCacheHeaderTest, SolrCoreCheckLockOnStartupTest, TestAtomicUpdateErrorCases, QueryEqualityTest, DocValuesMultiTest, DebugComponentTest, IndexBasedSpellCheckerTest, TestReversedWildcardFilterFactory, DocumentAnalysisRequestHandlerTest, TestOmitPositions, TermsComponentTest, JsonLoaderTest, TestPHPSerializedResponseWriter, CSVRequestHandlerTest, SearchHandlerTest, UpdateParamsTest, TestQuerySenderNoQuery, SolrIndexConfigTest, TestSolrDeletionPolicy2, SampleTest, TestSearchPerf, MinimalSchemaTest, OutputWriterTest, ExternalFileFieldSortTest, TestPostingsSolrHighlighter, TestXIncludeConfig, EchoParamsTest, TestPerFieldSimilarity, TestLMJelinekMercerSimilarityFactory, TimeZoneUtilsTest, ScriptEngineTest, TestSystemIdResolver, TestSuggestSpellingConverter, RAMDirectoryFactoryTest, TestDocumentBuilder, DistributedMLTComponentTest, CursorPagingTest, TestDistributedMissingSort, TestTolerantSearch, TestEmbeddedSolrServerAdminHandler, TestJettySolrRunner, AddReplicaTest, AssignTest, DistributedVersionInfoTest, LeaderInitiatedRecoveryOnShardRestartTest, MissingSegmentRecoveryTest, MoveReplicaHDFSFailoverTest, ReplaceNodeTest, SSLMigrationTest, ShardSplitTest, TestTolerantUpdateProcessorCloud]
   [junit4] Completed [564/749 (10!)] on J2 in 238.19s, 19 tests, 1 error <<< FAILURES!

[...truncated 48097 lines...]

Mime
View raw message