lucene-dev mailing list archives

Site index · List index
Message view « Date » · « Thread »
Top « Date » · « Thread »
From Policeman Jenkins Server <jenk...@thetaphi.de>
Subject [JENKINS] Lucene-Solr-7.x-Linux (32bit/jdk1.8.0_144) - Build # 765 - Still Unstable!
Date Tue, 07 Nov 2017 15:17:15 GMT
Build: https://jenkins.thetaphi.de/job/Lucene-Solr-7.x-Linux/765/
Java: 32bit/jdk1.8.0_144 -server -XX:+UseConcMarkSweepGC

3 tests failed.
FAILED:  junit.framework.TestSuite.org.apache.solr.client.solrj.io.graph.GraphTest

Error Message:
There are still nodes recoverying - waited for 30 seconds

Stack Trace:
java.lang.AssertionError: There are still nodes recoverying - waited for 30 seconds
	at __randomizedtesting.SeedInfo.seed([90D73DD5B929599B]:0)
	at org.junit.Assert.fail(Assert.java:93)
	at org.apache.solr.cloud.AbstractDistribZkTestBase.waitForRecoveriesToFinish(AbstractDistribZkTestBase.java:185)
	at org.apache.solr.client.solrj.io.graph.GraphTest.setupCluster(GraphTest.java:63)
	at sun.reflect.NativeMethodAccessorImpl.invoke0(Native Method)
	at sun.reflect.NativeMethodAccessorImpl.invoke(NativeMethodAccessorImpl.java:62)
	at sun.reflect.DelegatingMethodAccessorImpl.invoke(DelegatingMethodAccessorImpl.java:43)
	at java.lang.reflect.Method.invoke(Method.java:498)
	at com.carrotsearch.randomizedtesting.RandomizedRunner.invoke(RandomizedRunner.java:1737)
	at com.carrotsearch.randomizedtesting.RandomizedRunner$6.evaluate(RandomizedRunner.java:874)
	at com.carrotsearch.randomizedtesting.RandomizedRunner$7.evaluate(RandomizedRunner.java:890)
	at com.carrotsearch.randomizedtesting.rules.StatementAdapter.evaluate(StatementAdapter.java:36)
	at com.carrotsearch.randomizedtesting.rules.SystemPropertiesRestoreRule$1.evaluate(SystemPropertiesRestoreRule.java:57)
	at org.apache.lucene.util.AbstractBeforeAfterRule$1.evaluate(AbstractBeforeAfterRule.java:45)
	at com.carrotsearch.randomizedtesting.rules.StatementAdapter.evaluate(StatementAdapter.java:36)
	at org.apache.lucene.util.TestRuleStoreClassName$1.evaluate(TestRuleStoreClassName.java:41)
	at com.carrotsearch.randomizedtesting.rules.NoShadowingOrOverridesOnMethodsRule$1.evaluate(NoShadowingOrOverridesOnMethodsRule.java:40)
	at com.carrotsearch.randomizedtesting.rules.NoShadowingOrOverridesOnMethodsRule$1.evaluate(NoShadowingOrOverridesOnMethodsRule.java:40)
	at com.carrotsearch.randomizedtesting.rules.StatementAdapter.evaluate(StatementAdapter.java:36)
	at com.carrotsearch.randomizedtesting.rules.StatementAdapter.evaluate(StatementAdapter.java:36)
	at com.carrotsearch.randomizedtesting.rules.StatementAdapter.evaluate(StatementAdapter.java:36)
	at org.apache.lucene.util.TestRuleAssertionsRequired$1.evaluate(TestRuleAssertionsRequired.java:53)
	at org.apache.lucene.util.TestRuleMarkFailure$1.evaluate(TestRuleMarkFailure.java:47)
	at org.apache.lucene.util.TestRuleIgnoreAfterMaxFailures$1.evaluate(TestRuleIgnoreAfterMaxFailures.java:64)
	at org.apache.lucene.util.TestRuleIgnoreTestSuites$1.evaluate(TestRuleIgnoreTestSuites.java:54)
	at com.carrotsearch.randomizedtesting.rules.StatementAdapter.evaluate(StatementAdapter.java:36)
	at com.carrotsearch.randomizedtesting.ThreadLeakControl$StatementRunner.run(ThreadLeakControl.java:368)
	at java.lang.Thread.run(Thread.java:748)


FAILED:  org.apache.lucene.search.TestApproximationSearchEquivalence.testNestedConjunction

Error Message:
expected:<231> but was:<126>

Stack Trace:
java.lang.AssertionError: expected:<231> but was:<126>
	at __randomizedtesting.SeedInfo.seed([9F6B7F794927E1CF:11FB7846EFC58219]:0)
	at org.junit.Assert.fail(Assert.java:93)
	at org.junit.Assert.failNotEquals(Assert.java:647)
	at org.junit.Assert.assertEquals(Assert.java:128)
	at org.junit.Assert.assertEquals(Assert.java:472)
	at org.junit.Assert.assertEquals(Assert.java:456)
	at org.apache.lucene.search.SearchEquivalenceTestBase.assertSameScores(SearchEquivalenceTestBase.java:255)
	at org.apache.lucene.search.SearchEquivalenceTestBase.assertSameScores(SearchEquivalenceTestBase.java:228)
	at org.apache.lucene.search.TestApproximationSearchEquivalence.testNestedConjunction(TestApproximationSearchEquivalence.java:69)
	at sun.reflect.NativeMethodAccessorImpl.invoke0(Native Method)
	at sun.reflect.NativeMethodAccessorImpl.invoke(NativeMethodAccessorImpl.java:62)
	at sun.reflect.DelegatingMethodAccessorImpl.invoke(DelegatingMethodAccessorImpl.java:43)
	at java.lang.reflect.Method.invoke(Method.java:498)
	at com.carrotsearch.randomizedtesting.RandomizedRunner.invoke(RandomizedRunner.java:1737)
	at com.carrotsearch.randomizedtesting.RandomizedRunner$8.evaluate(RandomizedRunner.java:934)
	at com.carrotsearch.randomizedtesting.RandomizedRunner$9.evaluate(RandomizedRunner.java:970)
	at com.carrotsearch.randomizedtesting.RandomizedRunner$10.evaluate(RandomizedRunner.java:984)
	at org.apache.lucene.util.TestRuleSetupTeardownChained$1.evaluate(TestRuleSetupTeardownChained.java:49)
	at org.apache.lucene.util.AbstractBeforeAfterRule$1.evaluate(AbstractBeforeAfterRule.java:45)
	at org.apache.lucene.util.TestRuleThreadAndTestName$1.evaluate(TestRuleThreadAndTestName.java:48)
	at org.apache.lucene.util.TestRuleIgnoreAfterMaxFailures$1.evaluate(TestRuleIgnoreAfterMaxFailures.java:64)
	at org.apache.lucene.util.TestRuleMarkFailure$1.evaluate(TestRuleMarkFailure.java:47)
	at com.carrotsearch.randomizedtesting.rules.StatementAdapter.evaluate(StatementAdapter.java:36)
	at com.carrotsearch.randomizedtesting.ThreadLeakControl$StatementRunner.run(ThreadLeakControl.java:368)
	at com.carrotsearch.randomizedtesting.ThreadLeakControl.forkTimeoutingTask(ThreadLeakControl.java:817)
	at com.carrotsearch.randomizedtesting.ThreadLeakControl$3.evaluate(ThreadLeakControl.java:468)
	at com.carrotsearch.randomizedtesting.RandomizedRunner.runSingleTest(RandomizedRunner.java:943)
	at com.carrotsearch.randomizedtesting.RandomizedRunner$5.evaluate(RandomizedRunner.java:829)
	at com.carrotsearch.randomizedtesting.RandomizedRunner$6.evaluate(RandomizedRunner.java:879)
	at com.carrotsearch.randomizedtesting.RandomizedRunner$7.evaluate(RandomizedRunner.java:890)
	at org.apache.lucene.util.AbstractBeforeAfterRule$1.evaluate(AbstractBeforeAfterRule.java:45)
	at com.carrotsearch.randomizedtesting.rules.StatementAdapter.evaluate(StatementAdapter.java:36)
	at org.apache.lucene.util.TestRuleStoreClassName$1.evaluate(TestRuleStoreClassName.java:41)
	at com.carrotsearch.randomizedtesting.rules.NoShadowingOrOverridesOnMethodsRule$1.evaluate(NoShadowingOrOverridesOnMethodsRule.java:40)
	at com.carrotsearch.randomizedtesting.rules.NoShadowingOrOverridesOnMethodsRule$1.evaluate(NoShadowingOrOverridesOnMethodsRule.java:40)
	at com.carrotsearch.randomizedtesting.rules.StatementAdapter.evaluate(StatementAdapter.java:36)
	at com.carrotsearch.randomizedtesting.rules.StatementAdapter.evaluate(StatementAdapter.java:36)
	at com.carrotsearch.randomizedtesting.rules.StatementAdapter.evaluate(StatementAdapter.java:36)
	at org.apache.lucene.util.TestRuleAssertionsRequired$1.evaluate(TestRuleAssertionsRequired.java:53)
	at org.apache.lucene.util.TestRuleMarkFailure$1.evaluate(TestRuleMarkFailure.java:47)
	at org.apache.lucene.util.TestRuleIgnoreAfterMaxFailures$1.evaluate(TestRuleIgnoreAfterMaxFailures.java:64)
	at org.apache.lucene.util.TestRuleIgnoreTestSuites$1.evaluate(TestRuleIgnoreTestSuites.java:54)
	at com.carrotsearch.randomizedtesting.rules.StatementAdapter.evaluate(StatementAdapter.java:36)
	at com.carrotsearch.randomizedtesting.ThreadLeakControl$StatementRunner.run(ThreadLeakControl.java:368)
	at java.lang.Thread.run(Thread.java:748)


FAILED:  org.apache.solr.cloud.MoveReplicaHDFSTest.test

Error Message:
Error from server at https://127.0.0.1:35065/solr: Could not fully remove collection: movereplicatest_failed_coll

Stack Trace:
org.apache.solr.client.solrj.impl.HttpSolrClient$RemoteSolrException: Error from server at https://127.0.0.1:35065/solr: Could not fully remove collection: movereplicatest_failed_coll
	at __randomizedtesting.SeedInfo.seed([BB43A9802663F944:3317965A889F94BC]:0)
	at org.apache.solr.client.solrj.impl.HttpSolrClient.executeMethod(HttpSolrClient.java:643)
	at org.apache.solr.client.solrj.impl.HttpSolrClient.request(HttpSolrClient.java:255)
	at org.apache.solr.client.solrj.impl.HttpSolrClient.request(HttpSolrClient.java:244)
	at org.apache.solr.client.solrj.impl.LBHttpSolrClient.doRequest(LBHttpSolrClient.java:483)
	at org.apache.solr.client.solrj.impl.LBHttpSolrClient.request(LBHttpSolrClient.java:413)
	at org.apache.solr.client.solrj.impl.CloudSolrClient.sendRequest(CloudSolrClient.java:1096)
	at org.apache.solr.client.solrj.impl.CloudSolrClient.requestWithRetryOnStaleState(CloudSolrClient.java:875)
	at org.apache.solr.client.solrj.impl.CloudSolrClient.request(CloudSolrClient.java:808)
	at org.apache.solr.client.solrj.SolrRequest.process(SolrRequest.java:194)
	at org.apache.solr.client.solrj.SolrRequest.process(SolrRequest.java:211)
	at org.apache.solr.cloud.MiniSolrCloudCluster.deleteAllCollections(MiniSolrCloudCluster.java:444)
	at org.apache.solr.cloud.MoveReplicaTest.beforeTest(MoveReplicaTest.java:88)
	at sun.reflect.NativeMethodAccessorImpl.invoke0(Native Method)
	at sun.reflect.NativeMethodAccessorImpl.invoke(NativeMethodAccessorImpl.java:62)
	at sun.reflect.DelegatingMethodAccessorImpl.invoke(DelegatingMethodAccessorImpl.java:43)
	at java.lang.reflect.Method.invoke(Method.java:498)
	at com.carrotsearch.randomizedtesting.RandomizedRunner.invoke(RandomizedRunner.java:1737)
	at com.carrotsearch.randomizedtesting.RandomizedRunner$9.evaluate(RandomizedRunner.java:968)
	at com.carrotsearch.randomizedtesting.RandomizedRunner$10.evaluate(RandomizedRunner.java:984)
	at com.carrotsearch.randomizedtesting.rules.SystemPropertiesRestoreRule$1.evaluate(SystemPropertiesRestoreRule.java:57)
	at org.apache.lucene.util.TestRuleSetupTeardownChained$1.evaluate(TestRuleSetupTeardownChained.java:49)
	at org.apache.lucene.util.AbstractBeforeAfterRule$1.evaluate(AbstractBeforeAfterRule.java:45)
	at org.apache.lucene.util.TestRuleThreadAndTestName$1.evaluate(TestRuleThreadAndTestName.java:48)
	at org.apache.lucene.util.TestRuleIgnoreAfterMaxFailures$1.evaluate(TestRuleIgnoreAfterMaxFailures.java:64)
	at org.apache.lucene.util.TestRuleMarkFailure$1.evaluate(TestRuleMarkFailure.java:47)
	at com.carrotsearch.randomizedtesting.rules.StatementAdapter.evaluate(StatementAdapter.java:36)
	at com.carrotsearch.randomizedtesting.ThreadLeakControl$StatementRunner.run(ThreadLeakControl.java:368)
	at com.carrotsearch.randomizedtesting.ThreadLeakControl.forkTimeoutingTask(ThreadLeakControl.java:817)
	at com.carrotsearch.randomizedtesting.ThreadLeakControl$3.evaluate(ThreadLeakControl.java:468)
	at com.carrotsearch.randomizedtesting.RandomizedRunner.runSingleTest(RandomizedRunner.java:943)
	at com.carrotsearch.randomizedtesting.RandomizedRunner$5.evaluate(RandomizedRunner.java:829)
	at com.carrotsearch.randomizedtesting.RandomizedRunner$6.evaluate(RandomizedRunner.java:879)
	at com.carrotsearch.randomizedtesting.RandomizedRunner$7.evaluate(RandomizedRunner.java:890)
	at com.carrotsearch.randomizedtesting.rules.StatementAdapter.evaluate(StatementAdapter.java:36)
	at com.carrotsearch.randomizedtesting.rules.SystemPropertiesRestoreRule$1.evaluate(SystemPropertiesRestoreRule.java:57)
	at org.apache.lucene.util.AbstractBeforeAfterRule$1.evaluate(AbstractBeforeAfterRule.java:45)
	at com.carrotsearch.randomizedtesting.rules.StatementAdapter.evaluate(StatementAdapter.java:36)
	at org.apache.lucene.util.TestRuleStoreClassName$1.evaluate(TestRuleStoreClassName.java:41)
	at com.carrotsearch.randomizedtesting.rules.NoShadowingOrOverridesOnMethodsRule$1.evaluate(NoShadowingOrOverridesOnMethodsRule.java:40)
	at com.carrotsearch.randomizedtesting.rules.NoShadowingOrOverridesOnMethodsRule$1.evaluate(NoShadowingOrOverridesOnMethodsRule.java:40)
	at com.carrotsearch.randomizedtesting.rules.StatementAdapter.evaluate(StatementAdapter.java:36)
	at com.carrotsearch.randomizedtesting.rules.StatementAdapter.evaluate(StatementAdapter.java:36)
	at com.carrotsearch.randomizedtesting.rules.StatementAdapter.evaluate(StatementAdapter.java:36)
	at org.apache.lucene.util.TestRuleAssertionsRequired$1.evaluate(TestRuleAssertionsRequired.java:53)
	at org.apache.lucene.util.TestRuleMarkFailure$1.evaluate(TestRuleMarkFailure.java:47)
	at org.apache.lucene.util.TestRuleIgnoreAfterMaxFailures$1.evaluate(TestRuleIgnoreAfterMaxFailures.java:64)
	at org.apache.lucene.util.TestRuleIgnoreTestSuites$1.evaluate(TestRuleIgnoreTestSuites.java:54)
	at com.carrotsearch.randomizedtesting.rules.StatementAdapter.evaluate(StatementAdapter.java:36)
	at com.carrotsearch.randomizedtesting.ThreadLeakControl$StatementRunner.run(ThreadLeakControl.java:368)
	at java.lang.Thread.run(Thread.java:748)




Build Log:
[...truncated 574 lines...]
   [junit4] Suite: org.apache.lucene.search.TestApproximationSearchEquivalence
   [junit4]   2> NOTE: reproduce with: ant test  -Dtestcase=TestApproximationSearchEquivalence -Dtests.method=testNestedConjunction -Dtests.seed=9F6B7F794927E1CF -Dtests.multiplier=3 -Dtests.slow=true -Dtests.locale=ar-MA -Dtests.timezone=America/Yakutat -Dtests.asserts=true -Dtests.file.encoding=UTF-8
   [junit4] FAILURE 0.04s J0 | TestApproximationSearchEquivalence.testNestedConjunction <<<
   [junit4]    > Throwable #1: java.lang.AssertionError: expected:<231> but was:<126>
   [junit4]    > 	at __randomizedtesting.SeedInfo.seed([9F6B7F794927E1CF:11FB7846EFC58219]:0)
   [junit4]    > 	at org.apache.lucene.search.SearchEquivalenceTestBase.assertSameScores(SearchEquivalenceTestBase.java:255)
   [junit4]    > 	at org.apache.lucene.search.SearchEquivalenceTestBase.assertSameScores(SearchEquivalenceTestBase.java:228)
   [junit4]    > 	at org.apache.lucene.search.TestApproximationSearchEquivalence.testNestedConjunction(TestApproximationSearchEquivalence.java:69)
   [junit4]    > 	at java.lang.Thread.run(Thread.java:748)
   [junit4]   2> NOTE: test params are: codec=FastCompressingStoredFields(storedFieldsFormat=CompressingStoredFieldsFormat(compressionMode=FAST, chunkSize=3, maxDocsPerChunk=5, blockSize=7), termVectorsFormat=CompressingTermVectorsFormat(compressionMode=FAST, chunkSize=3, blockSize=7)), sim=RandomSimilarity(queryNorm=false): {field=ClassicSimilarity}, locale=ar-MA, timezone=America/Yakutat
   [junit4]   2> NOTE: Linux 4.10.0-37-generic i386/Oracle Corporation 1.8.0_144 (32-bit)/cpus=8,threads=1,free=149826848,total=254242816
   [junit4]   2> NOTE: All tests run in this JVM: [TestTerm, TestSnapshotDeletionPolicy, TestSpanMultiTermQueryWrapper, TestTimSorterWorstCase, TestFlushByRamOrCountsPolicy, TestDeterminizeLexicon, TestWildcardRandom, TestPerFieldPostingsFormat, TestStringHelper, TestUTF32ToUTF8, TestLucene70SegmentInfoFormat, TestFlex, TestBoolean2, TestNewestSegment, TestAutomaton, TestBytesRef, TestNot, TestSpanBoostQuery, TestBooleanMinShouldMatch, TestIntBlockPool, TestCharFilter, TestFilterCodecReader, TestIndexingSequenceNumbers, TestLiveFieldValues, TestIsCurrent, TestSort, TestIndexedDISI, TestIndexWriterNRTIsCurrent, TestApproximationSearchEquivalence]
   [junit4] Completed [114/455 (1!)] on J0 in 0.59s, 10 tests, 1 failure <<< FAILURES!

[...truncated 12647 lines...]
   [junit4] Suite: org.apache.solr.cloud.MoveReplicaHDFSTest
   [junit4]   2> 1786435 INFO  (SUITE-MoveReplicaHDFSTest-seed#[BB43A9802663F944]-worker) [    ] o.a.s.SolrTestCaseJ4 SecureRandom sanity checks: test.solr.allowed.securerandom=null & java.security.egd=file:/dev/./urandom
   [junit4]   2> Creating dataDir: /home/jenkins/workspace/Lucene-Solr-7.x-Linux/solr/build/solr-core/test/J0/temp/solr.cloud.MoveReplicaHDFSTest_BB43A9802663F944-001/init-core-data-001
   [junit4]   2> 1786435 WARN  (SUITE-MoveReplicaHDFSTest-seed#[BB43A9802663F944]-worker) [    ] o.a.s.SolrTestCaseJ4 startTrackingSearchers: numOpens=102 numCloses=102
   [junit4]   2> 1786435 INFO  (SUITE-MoveReplicaHDFSTest-seed#[BB43A9802663F944]-worker) [    ] o.a.s.SolrTestCaseJ4 Using PointFields (NUMERIC_POINTS_SYSPROP=true) w/NUMERIC_DOCVALUES_SYSPROP=false
   [junit4]   2> 1786437 INFO  (SUITE-MoveReplicaHDFSTest-seed#[BB43A9802663F944]-worker) [    ] o.a.s.SolrTestCaseJ4 Randomized ssl (true) and clientAuth (false) via: @org.apache.solr.util.RandomizeSSL(reason=, ssl=NaN, value=NaN, clientAuth=NaN)
   [junit4]   2> 1786437 INFO  (SUITE-MoveReplicaHDFSTest-seed#[BB43A9802663F944]-worker) [    ] o.a.s.c.MiniSolrCloudCluster Starting cluster of 4 servers in /home/jenkins/workspace/Lucene-Solr-7.x-Linux/solr/build/solr-core/test/J0/temp/solr.cloud.MoveReplicaHDFSTest_BB43A9802663F944-001/tempDir-001
   [junit4]   2> 1786438 INFO  (SUITE-MoveReplicaHDFSTest-seed#[BB43A9802663F944]-worker) [    ] o.a.s.c.ZkTestServer STARTING ZK TEST SERVER
   [junit4]   2> 1786438 INFO  (Thread-3378) [    ] o.a.s.c.ZkTestServer client port:0.0.0.0/0.0.0.0:0
   [junit4]   2> 1786438 INFO  (Thread-3378) [    ] o.a.s.c.ZkTestServer Starting server
   [junit4]   2> 1786439 ERROR (Thread-3378) [    ] o.a.z.s.ZooKeeperServer ZKShutdownHandler is not registered, so ZooKeeper server won't take any action on ERROR or SHUTDOWN server state changes
   [junit4]   2> 1786538 INFO  (SUITE-MoveReplicaHDFSTest-seed#[BB43A9802663F944]-worker) [    ] o.a.s.c.ZkTestServer start zk server on port:33825
   [junit4]   2> 1786542 INFO  (jetty-launcher-2795-thread-2) [    ] o.e.j.s.Server jetty-9.3.20.v20170531
   [junit4]   2> 1786542 INFO  (jetty-launcher-2795-thread-1) [    ] o.e.j.s.Server jetty-9.3.20.v20170531
   [junit4]   2> 1786545 INFO  (jetty-launcher-2795-thread-1) [    ] o.e.j.s.h.ContextHandler Started o.e.j.s.ServletContextHandler@117365c{/solr,null,AVAILABLE}
   [junit4]   2> 1786546 INFO  (jetty-launcher-2795-thread-4) [    ] o.e.j.s.Server jetty-9.3.20.v20170531
   [junit4]   2> 1786546 INFO  (jetty-launcher-2795-thread-3) [    ] o.e.j.s.Server jetty-9.3.20.v20170531
   [junit4]   2> 1786546 INFO  (jetty-launcher-2795-thread-2) [    ] o.e.j.s.h.ContextHandler Started o.e.j.s.ServletContextHandler@5a94bc{/solr,null,AVAILABLE}
   [junit4]   2> 1786546 INFO  (jetty-launcher-2795-thread-1) [    ] o.e.j.s.AbstractConnector Started ServerConnector@1a134cf{SSL,[ssl, http/1.1]}{127.0.0.1:35801}
   [junit4]   2> 1786546 INFO  (jetty-launcher-2795-thread-1) [    ] o.e.j.s.Server Started @1788220ms
   [junit4]   2> 1786546 INFO  (jetty-launcher-2795-thread-1) [    ] o.a.s.c.s.e.JettySolrRunner Jetty properties: {hostContext=/solr, hostPort=35801}
   [junit4]   2> 1786547 ERROR (jetty-launcher-2795-thread-1) [    ] o.a.s.u.StartupLoggingUtils Missing Java Option solr.log.dir. Logging may be missing or incomplete.
   [junit4]   2> 1786548 INFO  (jetty-launcher-2795-thread-1) [    ] o.a.s.s.SolrDispatchFilter  ___      _       Welcome to Apache Solr? version 7.2.0
   [junit4]   2> 1786549 INFO  (jetty-launcher-2795-thread-1) [    ] o.a.s.s.SolrDispatchFilter / __| ___| |_ _   Starting in cloud mode on port null
   [junit4]   2> 1786549 INFO  (jetty-launcher-2795-thread-1) [    ] o.a.s.s.SolrDispatchFilter \__ \/ _ \ | '_|  Install dir: null
   [junit4]   2> 1786549 INFO  (jetty-launcher-2795-thread-1) [    ] o.a.s.s.SolrDispatchFilter |___/\___/_|_|    Start time: 2017-11-07T14:50:21.045Z
   [junit4]   2> 1786552 INFO  (jetty-launcher-2795-thread-4) [    ] o.e.j.s.h.ContextHandler Started o.e.j.s.ServletContextHandler@12b30e3{/solr,null,AVAILABLE}
   [junit4]   2> 1786552 INFO  (jetty-launcher-2795-thread-4) [    ] o.e.j.s.AbstractConnector Started ServerConnector@ff6f4c{SSL,[ssl, http/1.1]}{127.0.0.1:46841}
   [junit4]   2> 1786553 INFO  (jetty-launcher-2795-thread-4) [    ] o.e.j.s.Server Started @1788226ms
   [junit4]   2> 1786553 INFO  (jetty-launcher-2795-thread-4) [    ] o.a.s.c.s.e.JettySolrRunner Jetty properties: {hostContext=/solr, hostPort=46841}
   [junit4]   2> 1786553 ERROR (jetty-launcher-2795-thread-4) [    ] o.a.s.u.StartupLoggingUtils Missing Java Option solr.log.dir. Logging may be missing or incomplete.
   [junit4]   2> 1786553 INFO  (jetty-launcher-2795-thread-4) [    ] o.a.s.s.SolrDispatchFilter  ___      _       Welcome to Apache Solr? version 7.2.0
   [junit4]   2> 1786553 INFO  (jetty-launcher-2795-thread-4) [    ] o.a.s.s.SolrDispatchFilter / __| ___| |_ _   Starting in cloud mode on port null
   [junit4]   2> 1786553 INFO  (jetty-launcher-2795-thread-4) [    ] o.a.s.s.SolrDispatchFilter \__ \/ _ \ | '_|  Install dir: null
   [junit4]   2> 1786553 INFO  (jetty-launcher-2795-thread-4) [    ] o.a.s.s.SolrDispatchFilter |___/\___/_|_|    Start time: 2017-11-07T14:50:21.049Z
   [junit4]   2> 1786553 INFO  (jetty-launcher-2795-thread-2) [    ] o.e.j.s.AbstractConnector Started ServerConnector@19e1a4d{SSL,[ssl, http/1.1]}{127.0.0.1:35065}
   [junit4]   2> 1786553 INFO  (jetty-launcher-2795-thread-2) [    ] o.e.j.s.Server Started @1788227ms
   [junit4]   2> 1786554 INFO  (jetty-launcher-2795-thread-2) [    ] o.a.s.c.s.e.JettySolrRunner Jetty properties: {hostContext=/solr, hostPort=35065}
   [junit4]   2> 1786554 ERROR (jetty-launcher-2795-thread-2) [    ] o.a.s.u.StartupLoggingUtils Missing Java Option solr.log.dir. Logging may be missing or incomplete.
   [junit4]   2> 1786554 INFO  (jetty-launcher-2795-thread-2) [    ] o.a.s.s.SolrDispatchFilter  ___      _       Welcome to Apache Solr? version 7.2.0
   [junit4]   2> 1786554 INFO  (jetty-launcher-2795-thread-2) [    ] o.a.s.s.SolrDispatchFilter / __| ___| |_ _   Starting in cloud mode on port null
   [junit4]   2> 1786554 INFO  (jetty-launcher-2795-thread-2) [    ] o.a.s.s.SolrDispatchFilter \__ \/ _ \ | '_|  Install dir: null
   [junit4]   2> 1786554 INFO  (jetty-launcher-2795-thread-2) [    ] o.a.s.s.SolrDispatchFilter |___/\___/_|_|    Start time: 2017-11-07T14:50:21.050Z
   [junit4]   2> 1786554 INFO  (jetty-launcher-2795-thread-4) [    ] o.a.s.s.SolrDispatchFilter solr.xml found in ZooKeeper. Loading...
   [junit4]   2> 1786554 INFO  (jetty-launcher-2795-thread-1) [    ] o.a.s.s.SolrDispatchFilter solr.xml found in ZooKeeper. Loading...
   [junit4]   2> 1786555 INFO  (jetty-launcher-2795-thread-3) [    ] o.e.j.s.h.ContextHandler Started o.e.j.s.ServletContextHandler@1187b06{/solr,null,AVAILABLE}
   [junit4]   2> 1786555 INFO  (jetty-launcher-2795-thread-2) [    ] o.a.s.s.SolrDispatchFilter solr.xml found in ZooKeeper. Loading...
   [junit4]   2> 1786555 INFO  (jetty-launcher-2795-thread-3) [    ] o.e.j.s.AbstractConnector Started ServerConnector@116d564{SSL,[ssl, http/1.1]}{127.0.0.1:40847}
   [junit4]   2> 1786555 INFO  (jetty-launcher-2795-thread-3) [    ] o.e.j.s.Server Started @1788228ms
   [junit4]   2> 1786555 INFO  (jetty-launcher-2795-thread-3) [    ] o.a.s.c.s.e.JettySolrRunner Jetty properties: {hostContext=/solr, hostPort=40847}
   [junit4]   2> 1786555 ERROR (jetty-launcher-2795-thread-3) [    ] o.a.s.u.StartupLoggingUtils Missing Java Option solr.log.dir. Logging may be missing or incomplete.
   [junit4]   2> 1786555 INFO  (jetty-launcher-2795-thread-3) [    ] o.a.s.s.SolrDispatchFilter  ___      _       Welcome to Apache Solr? version 7.2.0
   [junit4]   2> 1786555 INFO  (jetty-launcher-2795-thread-3) [    ] o.a.s.s.SolrDispatchFilter / __| ___| |_ _   Starting in cloud mode on port null
   [junit4]   2> 1786555 INFO  (jetty-launcher-2795-thread-3) [    ] o.a.s.s.SolrDispatchFilter \__ \/ _ \ | '_|  Install dir: null
   [junit4]   2> 1786555 INFO  (jetty-launcher-2795-thread-3) [    ] o.a.s.s.SolrDispatchFilter |___/\___/_|_|    Start time: 2017-11-07T14:50:21.051Z
   [junit4]   2> 1786559 INFO  (jetty-launcher-2795-thread-3) [    ] o.a.s.s.SolrDispatchFilter solr.xml found in ZooKeeper. Loading...
   [junit4]   2> 1786570 INFO  (jetty-launcher-2795-thread-4) [    ] o.a.s.c.ZkContainer Zookeeper client=127.0.0.1:33825/solr
   [junit4]   2> 1786571 INFO  (jetty-launcher-2795-thread-2) [    ] o.a.s.c.ZkContainer Zookeeper client=127.0.0.1:33825/solr
   [junit4]   2> 1786572 INFO  (jetty-launcher-2795-thread-1) [    ] o.a.s.c.ZkContainer Zookeeper client=127.0.0.1:33825/solr
   [junit4]   2> 1786572 INFO  (jetty-launcher-2795-thread-3) [    ] o.a.s.c.ZkContainer Zookeeper client=127.0.0.1:33825/solr
   [junit4]   2> 1786574 WARN  (NIOServerCxn.Factory:0.0.0.0/0.0.0.0:0) [    ] o.a.z.s.NIOServerCnxn caught end of stream exception
   [junit4]   2> EndOfStreamException: Unable to read additional data from client sessionid 0x15f96f5ef870008, likely client has closed socket
   [junit4]   2> 	at org.apache.zookeeper.server.NIOServerCnxn.doIO(NIOServerCnxn.java:239)
   [junit4]   2> 	at org.apache.zookeeper.server.NIOServerCnxnFactory.run(NIOServerCnxnFactory.java:203)
   [junit4]   2> 	at java.lang.Thread.run(Thread.java:748)
   [junit4]   2> 1786585 INFO  (jetty-launcher-2795-thread-2) [n:127.0.0.1:35065_solr    ] o.a.s.c.Overseer Overseer (id=null) closing
   [junit4]   2> 1786586 INFO  (jetty-launcher-2795-thread-2) [n:127.0.0.1:35065_solr    ] o.a.s.c.OverseerElectionContext I am going to be the leader 127.0.0.1:35065_solr
   [junit4]   2> 1786586 INFO  (jetty-launcher-2795-thread-3) [n:127.0.0.1:40847_solr    ] o.a.s.c.Overseer Overseer (id=null) closing
   [junit4]   2> 1786586 INFO  (jetty-launcher-2795-thread-2) [n:127.0.0.1:35065_solr    ] o.a.s.c.Overseer Overseer (id=98963699855196170-127.0.0.1:35065_solr-n_0000000000) starting
   [junit4]   2> 1786586 INFO  (jetty-launcher-2795-thread-3) [n:127.0.0.1:40847_solr    ] o.a.s.c.ZkController Register node as live in ZooKeeper:/live_nodes/127.0.0.1:40847_solr
   [junit4]   2> 1786587 INFO  (zkCallback-2817-thread-1-processing-n:127.0.0.1:40847_solr) [n:127.0.0.1:40847_solr    ] o.a.s.c.c.ZkStateReader Updated live nodes from ZooKeeper... (0) -> (1)
   [junit4]   2> 1786587 INFO  (zkCallback-2814-thread-1-processing-n:127.0.0.1:35065_solr) [n:127.0.0.1:35065_solr    ] o.a.s.c.c.ZkStateReader Updated live nodes from ZooKeeper... (0) -> (1)
   [junit4]   2> 1786605 INFO  (jetty-launcher-2795-thread-2) [n:127.0.0.1:35065_solr    ] o.a.s.c.ZkController Register node as live in ZooKeeper:/live_nodes/127.0.0.1:35065_solr
   [junit4]   2> 1786606 INFO  (jetty-launcher-2795-thread-4) [n:127.0.0.1:46841_solr    ] o.a.s.c.c.ZkStateReader Updated live nodes from ZooKeeper... (0) -> (2)
   [junit4]   2> 1786607 INFO  (jetty-launcher-2795-thread-1) [n:127.0.0.1:35801_solr    ] o.a.s.c.c.ZkStateReader Updated live nodes from ZooKeeper... (0) -> (2)
   [junit4]   2> 1786607 INFO  (jetty-launcher-2795-thread-4) [n:127.0.0.1:46841_solr    ] o.a.s.c.Overseer Overseer (id=null) closing
   [junit4]   2> 1786608 INFO  (jetty-launcher-2795-thread-4) [n:127.0.0.1:46841_solr    ] o.a.s.c.ZkController Register node as live in ZooKeeper:/live_nodes/127.0.0.1:46841_solr
   [junit4]   2> 1786608 INFO  (jetty-launcher-2795-thread-1) [n:127.0.0.1:35801_solr    ] o.a.s.c.Overseer Overseer (id=null) closing
   [junit4]   2> 1786612 INFO  (zkCallback-2816-thread-1-processing-n:127.0.0.1:46841_solr) [n:127.0.0.1:46841_solr    ] o.a.s.c.c.ZkStateReader Updated live nodes from ZooKeeper... (2) -> (3)
   [junit4]   2> 1786616 INFO  (zkCallback-2817-thread-1-processing-n:127.0.0.1:40847_solr) [n:127.0.0.1:40847_solr    ] o.a.s.c.c.ZkStateReader Updated live nodes from ZooKeeper... (1) -> (3)
   [junit4]   2> 1786616 INFO  (zkCallback-2814-thread-1-processing-n:127.0.0.1:35065_solr) [n:127.0.0.1:35065_solr    ] o.a.s.c.c.ZkStateReader Updated live nodes from ZooKeeper... (1) -> (3)
   [junit4]   2> 1786616 INFO  (zkCallback-2815-thread-1-processing-n:127.0.0.1:35801_solr) [n:127.0.0.1:35801_solr    ] o.a.s.c.c.ZkStateReader Updated live nodes from ZooKeeper... (2) -> (3)
   [junit4]   2> 1786617 INFO  (jetty-launcher-2795-thread-1) [n:127.0.0.1:35801_solr    ] o.a.s.c.ZkController Register node as live in ZooKeeper:/live_nodes/127.0.0.1:35801_solr
   [junit4]   2> 1786617 INFO  (zkCallback-2816-thread-1-processing-n:127.0.0.1:46841_solr) [n:127.0.0.1:46841_solr    ] o.a.s.c.c.ZkStateReader Updated live nodes from ZooKeeper... (3) -> (4)
   [junit4]   2> 1786621 INFO  (zkCallback-2817-thread-1-processing-n:127.0.0.1:40847_solr) [n:127.0.0.1:40847_solr    ] o.a.s.c.c.ZkStateReader Updated live nodes from ZooKeeper... (3) -> (4)
   [junit4]   2> 1786621 INFO  (zkCallback-2814-thread-1-processing-n:127.0.0.1:35065_solr) [n:127.0.0.1:35065_solr    ] o.a.s.c.c.ZkStateReader Updated live nodes from ZooKeeper... (3) -> (4)
   [junit4]   2> 1786622 INFO  (zkCallback-2815-thread-1-processing-n:127.0.0.1:35801_solr) [n:127.0.0.1:35801_solr    ] o.a.s.c.c.ZkStateReader Updated live nodes from ZooKeeper... (3) -> (4)
   [junit4]   2> 1786706 INFO  (jetty-launcher-2795-thread-3) [n:127.0.0.1:40847_solr    ] o.a.s.m.r.SolrJmxReporter JMX monitoring for 'solr_40847.solr.node' (registry 'solr.node') enabled at server: com.sun.jmx.mbeanserver.JmxMBeanServer@14cbe4e
   [junit4]   2> 1786712 INFO  (jetty-launcher-2795-thread-3) [n:127.0.0.1:40847_solr    ] o.a.s.m.r.SolrJmxReporter JMX monitoring for 'solr_40847.solr.jvm' (registry 'solr.jvm') enabled at server: com.sun.jmx.mbeanserver.JmxMBeanServer@14cbe4e
   [junit4]   2> 1786712 INFO  (jetty-launcher-2795-thread-3) [n:127.0.0.1:40847_solr    ] o.a.s.m.r.SolrJmxReporter JMX monitoring for 'solr_40847.solr.jetty' (registry 'solr.jetty') enabled at server: com.sun.jmx.mbeanserver.JmxMBeanServer@14cbe4e
   [junit4]   2> 1786713 INFO  (jetty-launcher-2795-thread-3) [n:127.0.0.1:40847_solr    ] o.a.s.c.CorePropertiesLocator Found 0 core definitions underneath /home/jenkins/workspace/Lucene-Solr-7.x-Linux/solr/build/solr-core/test/J0/temp/solr.cloud.MoveReplicaHDFSTest_BB43A9802663F944-001/tempDir-001/node3/.
   [junit4]   2> 1786741 INFO  (jetty-launcher-2795-thread-2) [n:127.0.0.1:35065_solr    ] o.a.s.m.r.SolrJmxReporter JMX monitoring for 'solr_35065.solr.node' (registry 'solr.node') enabled at server: com.sun.jmx.mbeanserver.JmxMBeanServer@14cbe4e
   [junit4]   2> 1786746 INFO  (jetty-launcher-2795-thread-2) [n:127.0.0.1:35065_solr    ] o.a.s.m.r.SolrJmxReporter JMX monitoring for 'solr_35065.solr.jvm' (registry 'solr.jvm') enabled at server: com.sun.jmx.mbeanserver.JmxMBeanServer@14cbe4e
   [junit4]   2> 1786746 INFO  (jetty-launcher-2795-thread-2) [n:127.0.0.1:35065_solr    ] o.a.s.m.r.SolrJmxReporter JMX monitoring for 'solr_35065.solr.jetty' (registry 'solr.jetty') enabled at server: com.sun.jmx.mbeanserver.JmxMBeanServer@14cbe4e
   [junit4]   2> 1786747 INFO  (jetty-launcher-2795-thread-2) [n:127.0.0.1:35065_solr    ] o.a.s.c.CorePropertiesLocator Found 0 core definitions underneath /home/jenkins/workspace/Lucene-Solr-7.x-Linux/solr/build/solr-core/test/J0/temp/solr.cloud.MoveReplicaHDFSTest_BB43A9802663F944-001/tempDir-001/node2/.
   [junit4]   2> 1786778 INFO  (jetty-launcher-2795-thread-4) [n:127.0.0.1:46841_solr    ] o.a.s.m.r.SolrJmxReporter JMX monitoring for 'solr_46841.solr.node' (registry 'solr.node') enabled at server: com.sun.jmx.mbeanserver.JmxMBeanServer@14cbe4e
   [junit4]   2> 1786779 INFO  (jetty-launcher-2795-thread-1) [n:127.0.0.1:35801_solr    ] o.a.s.m.r.SolrJmxReporter JMX monitoring for 'solr_35801.solr.node' (registry 'solr.node') enabled at server: com.sun.jmx.mbeanserver.JmxMBeanServer@14cbe4e
   [junit4]   2> 1786785 INFO  (jetty-launcher-2795-thread-4) [n:127.0.0.1:46841_solr    ] o.a.s.m.r.SolrJmxReporter JMX monitoring for 'solr_46841.solr.jvm' (registry 'solr.jvm') enabled at server: com.sun.jmx.mbeanserver.JmxMBeanServer@14cbe4e
   [junit4]   2> 1786785 INFO  (jetty-launcher-2795-thread-4) [n:127.0.0.1:46841_solr    ] o.a.s.m.r.SolrJmxReporter JMX monitoring for 'solr_46841.solr.jetty' (registry 'solr.jetty') enabled at server: com.sun.jmx.mbeanserver.JmxMBeanServer@14cbe4e
   [junit4]   2> 1786786 INFO  (jetty-launcher-2795-thread-4) [n:127.0.0.1:46841_solr    ] o.a.s.c.CorePropertiesLocator Found 0 core definitions underneath /home/jenkins/workspace/Lucene-Solr-7.x-Linux/solr/build/solr-core/test/J0/temp/solr.cloud.MoveReplicaHDFSTest_BB43A9802663F944-001/tempDir-001/node4/.
   [junit4]   2> 1786786 INFO  (jetty-launcher-2795-thread-1) [n:127.0.0.1:35801_solr    ] o.a.s.m.r.SolrJmxReporter JMX monitoring for 'solr_35801.solr.jvm' (registry 'solr.jvm') enabled at server: com.sun.jmx.mbeanserver.JmxMBeanServer@14cbe4e
   [junit4]   2> 1786786 INFO  (jetty-launcher-2795-thread-1) [n:127.0.0.1:35801_solr    ] o.a.s.m.r.SolrJmxReporter JMX monitoring for 'solr_35801.solr.jetty' (registry 'solr.jetty') enabled at server: com.sun.jmx.mbeanserver.JmxMBeanServer@14cbe4e
   [junit4]   2> 1786787 INFO  (jetty-launcher-2795-thread-1) [n:127.0.0.1:35801_solr    ] o.a.s.c.CorePropertiesLocator Found 0 core definitions underneath /home/jenkins/workspace/Lucene-Solr-7.x-Linux/solr/build/solr-core/test/J0/temp/solr.cloud.MoveReplicaHDFSTest_BB43A9802663F944-001/tempDir-001/node1/.
   [junit4]   2> 1786836 INFO  (SUITE-MoveReplicaHDFSTest-seed#[BB43A9802663F944]-worker) [    ] o.a.s.c.c.ZkStateReader Updated live nodes from ZooKeeper... (0) -> (4)
   [junit4]   2> 1786836 INFO  (SUITE-MoveReplicaHDFSTest-seed#[BB43A9802663F944]-worker) [    ] o.a.s.c.s.i.ZkClientClusterStateProvider Cluster at 127.0.0.1:33825/solr ready
   [junit4]   2> 1786875 INFO  (qtp21011199-14519) [n:127.0.0.1:35801_solr    ] o.a.s.h.a.CollectionsHandler Invoked Collection Action :overseerstatus with params action=OVERSEERSTATUS&wt=javabin&version=2 and sendToOCPQueue=true
   [junit4]   2> 1786882 INFO  (qtp21011199-14519) [n:127.0.0.1:35801_solr    ] o.a.s.s.HttpSolrCall [admin] webapp=null path=/admin/collections params={action=OVERSEERSTATUS&wt=javabin&version=2} status=0 QTime=6
   [junit4]   2> 1787309 WARN  (SUITE-MoveReplicaHDFSTest-seed#[BB43A9802663F944]-worker) [    ] o.a.h.u.NativeCodeLoader Unable to load native-hadoop library for your platform... using builtin-java classes where applicable
   [junit4]   1> Formatting using clusterid: testClusterID
   [junit4]   2> 1787918 WARN  (SUITE-MoveReplicaHDFSTest-seed#[BB43A9802663F944]-worker) [    ] o.a.h.m.i.MetricsConfig Cannot locate configuration: tried hadoop-metrics2-namenode.properties,hadoop-metrics2.properties
   [junit4]   2> 1788071 INFO  (SUITE-MoveReplicaHDFSTest-seed#[BB43A9802663F944]-worker) [    ] o.m.log Logging to org.slf4j.impl.Log4jLoggerAdapter(org.mortbay.log) via org.mortbay.log.Slf4jLog
   [junit4]   2> 1788083 WARN  (SUITE-MoveReplicaHDFSTest-seed#[BB43A9802663F944]-worker) [    ] o.a.h.h.HttpRequestLog Jetty request log can only be enabled using Log4j
   [junit4]   2> 1788129 INFO  (SUITE-MoveReplicaHDFSTest-seed#[BB43A9802663F944]-worker) [    ] o.m.log jetty-6.1.26
   [junit4]   2> 1788158 INFO  (SUITE-MoveReplicaHDFSTest-seed#[BB43A9802663F944]-worker) [    ] o.m.log Extract jar:file:/home/jenkins/.ivy2/cache/org.apache.hadoop/hadoop-hdfs/tests/hadoop-hdfs-2.7.4-tests.jar!/webapps/hdfs to ./temp/Jetty_localhost_localdomain_42193_hdfs____.r6qx5l/webapp
   [junit4]   2> 1788824 INFO  (SUITE-MoveReplicaHDFSTest-seed#[BB43A9802663F944]-worker) [    ] o.m.log Started HttpServer2$SelectChannelConnectorWithSafeStartup@localhost.localdomain:42193
   [junit4]   2> 1788878 INFO  (OverseerCollectionConfigSetProcessor-98963699855196170-127.0.0.1:35065_solr-n_0000000000) [n:127.0.0.1:35065_solr    ] o.a.s.c.OverseerTaskQueue Response ZK path: /overseer/collection-queue-work/qnr-0000000000 doesn't exist.  Requestor may have disconnected from ZooKeeper
   [junit4]   2> 1789477 WARN  (SUITE-MoveReplicaHDFSTest-seed#[BB43A9802663F944]-worker) [    ] o.a.h.h.HttpRequestLog Jetty request log can only be enabled using Log4j
   [junit4]   2> 1789480 INFO  (SUITE-MoveReplicaHDFSTest-seed#[BB43A9802663F944]-worker) [    ] o.m.log jetty-6.1.26
   [junit4]   2> 1789489 INFO  (SUITE-MoveReplicaHDFSTest-seed#[BB43A9802663F944]-worker) [    ] o.m.log Extract jar:file:/home/jenkins/.ivy2/cache/org.apache.hadoop/hadoop-hdfs/tests/hadoop-hdfs-2.7.4-tests.jar!/webapps/datanode to ./temp/Jetty_localhost_40329_datanode____rjjlph/webapp
   [junit4]   2> 1789940 INFO  (SUITE-MoveReplicaHDFSTest-seed#[BB43A9802663F944]-worker) [    ] o.m.log Started HttpServer2$SelectChannelConnectorWithSafeStartup@localhost:40329
   [junit4]   2> 1790173 WARN  (SUITE-MoveReplicaHDFSTest-seed#[BB43A9802663F944]-worker) [    ] o.a.h.h.HttpRequestLog Jetty request log can only be enabled using Log4j
   [junit4]   2> 1790174 INFO  (SUITE-MoveReplicaHDFSTest-seed#[BB43A9802663F944]-worker) [    ] o.m.log jetty-6.1.26
   [junit4]   2> 1790187 INFO  (SUITE-MoveReplicaHDFSTest-seed#[BB43A9802663F944]-worker) [    ] o.m.log Extract jar:file:/home/jenkins/.ivy2/cache/org.apache.hadoop/hadoop-hdfs/tests/hadoop-hdfs-2.7.4-tests.jar!/webapps/datanode to ./temp/Jetty_localhost_38889_datanode____c3yemz/webapp
   [junit4]   2> 1790603 ERROR (DataNode: [[[DISK]file:/home/jenkins/workspace/Lucene-Solr-7.x-Linux/solr/build/solr-core/test/J0/temp/solr.cloud.MoveReplicaHDFSTest_BB43A9802663F944-001/tempDir-002/hdfsBaseDir/data/data1/, [DISK]file:/home/jenkins/workspace/Lucene-Solr-7.x-Linux/solr/build/solr-core/test/J0/temp/solr.cloud.MoveReplicaHDFSTest_BB43A9802663F944-001/tempDir-002/hdfsBaseDir/data/data2/]]  heartbeating to localhost.localdomain/127.0.0.1:42155) [    ] o.a.h.h.s.d.DirectoryScanner dfs.datanode.directoryscan.throttle.limit.ms.per.sec set to value below 1 ms/sec. Assuming default value of 1000
   [junit4]   2> 1790658 INFO  (SUITE-MoveReplicaHDFSTest-seed#[BB43A9802663F944]-worker) [    ] o.m.log Started HttpServer2$SelectChannelConnectorWithSafeStartup@localhost:38889
   [junit4]   2> 1790723 INFO  (Block report processor) [    ] BlockStateChange BLOCK* processReport 0x2cfee89cc71c8: from storage DS-a08f7cde-8f16-401c-b960-72e5839e38d7 node DatanodeRegistration(127.0.0.1:40817, datanodeUuid=ecc682fd-df1e-4233-b7ca-1511cb319bb1, infoPort=36009, infoSecurePort=0, ipcPort=37117, storageInfo=lv=-56;cid=testClusterID;nsid=2002491883;c=0), blocks: 0, hasStaleStorage: true, processing time: 3 msecs
   [junit4]   2> 1790724 INFO  (Block report processor) [    ] BlockStateChange BLOCK* processReport 0x2cfee89cc71c8: from storage DS-7ae3c01f-7f68-4a2c-9d78-55e93c53ddc8 node DatanodeRegistration(127.0.0.1:40817, datanodeUuid=ecc682fd-df1e-4233-b7ca-1511cb319bb1, infoPort=36009, infoSecurePort=0, ipcPort=37117, storageInfo=lv=-56;cid=testClusterID;nsid=2002491883;c=0), blocks: 0, hasStaleStorage: false, processing time: 0 msecs
   [junit4]   2> 1790781 ERROR (DataNode: [[[DISK]file:/home/jenkins/workspace/Lucene-Solr-7.x-Linux/solr/build/solr-core/test/J0/temp/solr.cloud.MoveReplicaHDFSTest_BB43A9802663F944-001/tempDir-002/hdfsBaseDir/data/data3/, [DISK]file:/home/jenkins/workspace/Lucene-Solr-7.x-Linux/solr/build/solr-core/test/J0/temp/solr.cloud.MoveReplicaHDFSTest_BB43A9802663F944-001/tempDir-002/hdfsBaseDir/data/data4/]]  heartbeating to localhost.localdomain/127.0.0.1:42155) [    ] o.a.h.h.s.d.DirectoryScanner dfs.datanode.directoryscan.throttle.limit.ms.per.sec set to value below 1 ms/sec. Assuming default value of 1000
   [junit4]   2> 1790790 INFO  (Block report processor) [    ] BlockStateChange BLOCK* processReport 0x2cfee8ea71d25: from storage DS-f010d640-4bc3-4e36-a07a-4d4300ba22cf node DatanodeRegistration(127.0.0.1:40073, datanodeUuid=2940f0b4-df66-4f7b-b2a7-06f42f97b403, infoPort=33387, infoSecurePort=0, ipcPort=35885, storageInfo=lv=-56;cid=testClusterID;nsid=2002491883;c=0), blocks: 0, hasStaleStorage: true, processing time: 0 msecs
   [junit4]   2> 1790790 INFO  (Block report processor) [    ] BlockStateChange BLOCK* processReport 0x2cfee8ea71d25: from storage DS-cba06ec0-c669-4b41-93fc-2a97dcc88f81 node DatanodeRegistration(127.0.0.1:40073, datanodeUuid=2940f0b4-df66-4f7b-b2a7-06f42f97b403, infoPort=33387, infoSecurePort=0, ipcPort=35885, storageInfo=lv=-56;cid=testClusterID;nsid=2002491883;c=0), blocks: 0, hasStaleStorage: false, processing time: 0 msecs
   [junit4]   2> 1791153 INFO  (TEST-MoveReplicaHDFSTest.testFailedMove-seed#[BB43A9802663F944]) [    ] o.a.s.SolrTestCaseJ4 ###Starting testFailedMove
   [junit4]   2> 1791153 INFO  (TEST-MoveReplicaHDFSTest.testFailedMove-seed#[BB43A9802663F944]) [    ] o.a.s.c.c.ZkStateReader Updated live nodes from ZooKeeper... (0) -> (4)
   [junit4]   2> 1791156 INFO  (qtp21011199-14529) [n:127.0.0.1:35801_solr    ] o.a.s.h.a.CollectionsHandler Invoked Collection Action :create with params replicationFactor=2&collection.configName=conf1&name=movereplicatest_failed_coll&nrtReplicas=2&action=CREATE&numShards=2&wt=javabin&version=2 and sendToOCPQueue=true
   [junit4]   2> 1791157 INFO  (OverseerThreadFactory-6134-thread-2-processing-n:127.0.0.1:35065_solr) [n:127.0.0.1:35065_solr    ] o.a.s.c.CreateCollectionCmd Create collection movereplicatest_failed_coll
   [junit4]   2> 1791261 INFO  (OverseerStateUpdate-98963699855196170-127.0.0.1:35065_solr-n_0000000000) [n:127.0.0.1:35065_solr    ] o.a.s.c.o.SliceMutator createReplica() {
   [junit4]   2>   "operation":"ADDREPLICA",
   [junit4]   2>   "collection":"movereplicatest_failed_coll",
   [junit4]   2>   "shard":"shard1",
   [junit4]   2>   "core":"movereplicatest_failed_coll_shard1_replica_n1",
   [junit4]   2>   "state":"down",
   [junit4]   2>   "base_url":"https://127.0.0.1:35801/solr",
   [junit4]   2>   "type":"NRT",
   [junit4]   2>   "waitForFinalState":"false"} 
   [junit4]   2> 1791262 INFO  (OverseerStateUpdate-98963699855196170-127.0.0.1:35065_solr-n_0000000000) [n:127.0.0.1:35065_solr    ] o.a.s.c.o.SliceMutator createReplica() {
   [junit4]   2>   "operation":"ADDREPLICA",
   [junit4]   2>   "collection":"movereplicatest_failed_coll",
   [junit4]   2>   "shard":"shard1",
   [junit4]   2>   "core":"movereplicatest_failed_coll_shard1_replica_n2",
   [junit4]   2>   "state":"down",
   [junit4]   2>   "base_url":"https://127.0.0.1:35065/solr",
   [junit4]   2>   "type":"NRT",
   [junit4]   2>   "waitForFinalState":"false"} 
   [junit4]   2> 1791262 INFO  (OverseerStateUpdate-98963699855196170-127.0.0.1:35065_solr-n_0000000000) [n:127.0.0.1:35065_solr    ] o.a.s.c.o.SliceMutator createReplica() {
   [junit4]   2>   "operation":"ADDREPLICA",
   [junit4]   2>   "collection":"movereplicatest_failed_coll",
   [junit4]   2>   "shard":"shard2",
   [junit4]   2>   "core":"movereplicatest_failed_coll_shard2_replica_n4",
   [junit4]   2>   "state":"down",
   [junit4]   2>   "base_url":"https://127.0.0.1:46841/solr",
   [junit4]   2>   "type":"NRT",
   [junit4]   2>   "waitForFinalState":"false"} 
   [junit4]   2> 1791263 INFO  (OverseerStateUpdate-98963699855196170-127.0.0.1:35065_solr-n_0000000000) [n:127.0.0.1:35065_solr    ] o.a.s.c.o.SliceMutator createReplica() {
   [junit4]   2>   "operation":"ADDREPLICA",
   [junit4]   2>   "collection":"movereplicatest_failed_coll",
   [junit4]   2>   "shard":"shard2",
   [junit4]   2>   "core":"movereplicatest_failed_coll_shard2_replica_n6",
   [junit4]   2>   "state":"down",
   [junit4]   2>   "base_url":"https://127.0.0.1:40847/solr",
   [junit4]   2>   "type":"NRT",
   [junit4]   2>   "waitForFinalState":"false"} 
   [junit4]   2> 1791470 INFO  (qtp21011199-14531) [n:127.0.0.1:35801_solr    ] o.a.s.h.a.CoreAdminOperation core create command qt=/admin/cores&coreNodeName=core_node3&collection.configName=conf1&newCollection=true&name=movereplicatest_failed_coll_shard1_replica_n1&action=CREATE&numShards=2&collection=movereplicatest_failed_coll&shard=shard1&wt=javabin&version=2&replicaType=NRT
   [junit4]   2> 1791471 INFO  (qtp21011199-14531) [n:127.0.0.1:35801_solr    ] o.a.s.c.TransientSolrCoreCacheDefault Allocating transient cache for 2147483647 transient cores
   [junit4]   2> 1791522 INFO  (qtp11094084-14543) [n:127.0.0.1:40847_solr    ] o.a.s.h.a.CoreAdminOperation core create command qt=/admin/cores&coreNodeName=core_node8&collection.configName=conf1&newCollection=true&name=movereplicatest_failed_coll_shard2_replica_n6&action=CREATE&numShards=2&collection=movereplicatest_failed_coll&shard=shard2&wt=javabin&version=2&replicaType=NRT
   [junit4]   2> 1791522 INFO  (qtp11094084-14543) [n:127.0.0.1:40847_solr    ] o.a.s.c.TransientSolrCoreCacheDefault Allocating transient cache for 2147483647 transient cores
   [junit4]   2> 1791531 INFO  (qtp14148151-14535) [n:127.0.0.1:35065_solr    ] o.a.s.h.a.CoreAdminOperation core create command qt=/admin/cores&coreNodeName=core_node5&collection.configName=conf1&newCollection=true&name=movereplicatest_failed_coll_shard1_replica_n2&action=CREATE&numShards=2&collection=movereplicatest_failed_coll&shard=shard1&wt=javabin&version=2&replicaType=NRT
   [junit4]   2> 1791532 INFO  (qtp14148151-14535) [n:127.0.0.1:35065_solr    ] o.a.s.c.TransientSolrCoreCacheDefault Allocating transient cache for 2147483647 transient cores
   [junit4]   2> 1791534 INFO  (qtp26537701-14547) [n:127.0.0.1:46841_solr    ] o.a.s.h.a.CoreAdminOperation core create command qt=/admin/cores&coreNodeName=core_node7&collection.configName=conf1&newCollection=true&name=movereplicatest_failed_coll_shard2_replica_n4&action=CREATE&numShards=2&collection=movereplicatest_failed_coll&shard=shard2&wt=javabin&version=2&replicaType=NRT
   [junit4]   2> 1791535 INFO  (qtp26537701-14547) [n:127.0.0.1:46841_solr    ] o.a.s.c.TransientSolrCoreCacheDefault Allocating transient cache for 2147483647 transient cores
   [junit4]   2> 1791638 INFO  (zkCallback-2814-thread-1-processing-n:127.0.0.1:35065_solr) [n:127.0.0.1:35065_solr    ] o.a.s.c.c.ZkStateReader A cluster state change: [WatchedEvent state:SyncConnected type:NodeDataChanged path:/collections/movereplicatest_failed_coll/state.json] for collection [movereplicatest_failed_coll] has occurred - updating... (live nodes size: [4])
   [junit4]   2> 1791638 INFO  (zkCallback-2814-thread-2-processing-n:127.0.0.1:35065_solr) [n:127.0.0.1:35065_solr    ] o.a.s.c.c.ZkStateReader A cluster state change: [WatchedEvent state:SyncConnected type:NodeDataChanged path:/collections/movereplicatest_failed_coll/state.json] for collection [movereplicatest_failed_coll] has occurred - updating... (live nodes size: [4])
   [junit4]   2> 1791638 INFO  (zkCallback-2815-thread-2-processing-n:127.0.0.1:35801_solr) [n:127.0.0.1:35801_solr    ] o.a.s.c.c.ZkStateReader A cluster state change: [WatchedEvent state:SyncConnected type:NodeDataChanged path:/collections/movereplicatest_failed_coll/state.json] for collection [movereplicatest_failed_coll] has occurred - updating... (live nodes size: [4])
   [junit4]   2> 1791638 INFO  (zkCallback-2817-thread-2-processing-n:127.0.0.1:40847_solr) [n:127.0.0.1:40847_solr    ] o.a.s.c.c.ZkStateReader A cluster state change: [WatchedEvent state:SyncConnected type:NodeDataChanged path:/collections/movereplicatest_failed_coll/state.json] for collection [movereplicatest_failed_coll] has occurred - updating... (live nodes size: [4])
   [junit4]   2> 1791639 INFO  (zkCallback-2816-thread-2-processing-n:127.0.0.1:46841_solr) [n:127.0.0.1:46841_solr    ] o.a.s.c.c.ZkStateReader A cluster state change: [WatchedEvent state:SyncConnected type:NodeDataChanged path:/collections/movereplicatest_failed_coll/state.json] for collection [movereplicatest_failed_coll] has occurred - updating... (live nodes size: [4])
   [junit4]   2> 1791638 INFO  (zkCallback-2816-thread-1-processing-n:127.0.0.1:46841_solr) [n:127.0.0.1:46841_solr    ] o.a.s.c.c.ZkStateReader A cluster state change: [WatchedEvent state:SyncConnected type:NodeDataChanged path:/collections/movereplicatest_failed_coll/state.json] for collection [movereplicatest_failed_coll] has occurred - updating... (live nodes size: [4])
   [junit4]   2> 1791638 INFO  (zkCallback-2817-thread-1-processing-n:127.0.0.1:40847_solr) [n:127.0.0.1:40847_solr    ] o.a.s.c.c.ZkStateReader A cluster state change: [WatchedEvent state:SyncConnected type:NodeDataChanged path:/collections/movereplicatest_failed_coll/state.json] for collection [movereplicatest_failed_coll] has occurred - updating... (live nodes size: [4])
   [junit4]   2> 1791638 INFO  (zkCallback-2815-thread-1-processing-n:127.0.0.1:35801_solr) [n:127.0.0.1:35801_solr    ] o.a.s.c.c.ZkStateReader A cluster state change: [WatchedEvent state:SyncConnected type:NodeDataChanged path:/collections/movereplicatest_failed_coll/state.json] for collection [movereplicatest_failed_coll] has occurred - updating... (live nodes size: [4])
   [junit4]   2> 1792486 INFO  (qtp21011199-14531) [n:127.0.0.1:35801_solr c:movereplicatest_failed_coll s:shard1 r:core_node3 x:movereplicatest_failed_coll_shard1_replica_n1] o.a.s.c.SolrConfig Using Lucene MatchVersion: 7.2.0
   [junit4]   2> 1792494 INFO  (qtp21011199-14531) [n:127.0.0.1:35801_solr c:movereplicatest_failed_coll s:shard1 r:core_node3 x:movereplicatest_failed_coll_shard1_replica_n1] o.a.s.s.IndexSchema [movereplicatest_failed_coll_shard1_replica_n1] Schema name=minimal
   [junit4]   2> 1792497 INFO  (qtp21011199-14531) [n:127.0.0.1:35801_solr c:movereplicatest_failed_coll s:shard1 r:core_node3 x:movereplicatest_failed_coll_shard1_replica_n1] o.a.s.s.IndexSchema Loaded schema minimal/1.1 with uniqueid field id
   [junit4]   2> 1792497 INFO  (qtp21011199-14531) [n:127.0.0.1:35801_solr c:movereplicatest_failed_coll s:shard1 r:core_node3 x:movereplicatest_failed_coll_shard1_replica_n1] o.a.s.c.CoreContainer Creating SolrCore 'movereplicatest_failed_coll_shard1_replica_n1' using configuration from collection movereplicatest_failed_coll, trusted=true
   [junit4]   2> 1792498 INFO  (qtp21011199-14531) [n:127.0.0.1:35801_solr c:movereplicatest_failed_coll s:shard1 r:core_node3 x:movereplicatest_failed_coll_shard1_replica_n1] o.a.s.m.r.SolrJmxReporter JMX monitoring for 'solr_35801.solr.core.movereplicatest_failed_coll.shard1.replica_n1' (registry 'solr.core.movereplicatest_failed_coll.shard1.replica_n1') enabled at server: com.sun.jmx.mbeanserver.JmxMBeanServer@14cbe4e
   [junit4]   2> 1792520 INFO  (qtp21011199-14531) [n:127.0.0.1:35801_solr c:movereplicatest_failed_coll s:shard1 r:core_node3 x:movereplicatest_failed_coll_shard1_replica_n1] o.a.s.c.HdfsDirectoryFactory solr.hdfs.home=hdfs://localhost.localdomain:42155/data
   [junit4]   2> 1792520 INFO  (qtp21011199-14531) [n:127.0.0.1:35801_solr c:movereplicatest_failed_coll s:shard1 r:core_node3 x:movereplicatest_failed_coll_shard1_replica_n1] o.a.s.c.HdfsDirectoryFactory Solr Kerberos Authentication disabled
   [junit4]   2> 1792520 INFO  (qtp21011199-14531) [n:127.0.0.1:35801_solr c:movereplicatest_failed_coll s:shard1 r:core_node3 x:movereplicatest_failed_coll_shard1_replica_n1] o.a.s.c.SolrCore solr.RecoveryStrategy.Builder
   [junit4]   2> 1792521 INFO  (qtp21011199-14531) [n:127.0.0.1:35801_solr c:movereplicatest_failed_coll s:shard1 r:core_node3 x:movereplicatest_failed_coll_shard1_replica_n1] o.a.s.c.SolrCore [[movereplicatest_failed_coll_shard1_replica_n1] ] Opening new SolrCore at [/home/jenkins/workspace/Lucene-Solr-7.x-Linux/solr/build/solr-core/test/J0/temp/solr.cloud.MoveReplicaHDFSTest_BB43A9802663F944-001/tempDir-001/node1/movereplicatest_failed_coll_shard1_replica_n1], dataDir=[hdfs://localhost.localdomain:42155/data/movereplicatest_failed_coll/core_node3/data/]
   [junit4]   2> 1792525 INFO  (qtp21011199-14531) [n:127.0.0.1:35801_solr c:movereplicatest_failed_coll s:shard1 r:core_node3 x:movereplicatest_failed_coll_shard1_replica_n1] o.a.s.c.HdfsDirectoryFactory creating directory factory for path hdfs://localhost.localdomain:42155/data/movereplicatest_failed_coll/core_node3/data/snapshot_metadata
   [junit4]   2> 1792534 INFO  (qtp11094084-14543) [n:127.0.0.1:40847_solr c:movereplicatest_failed_coll s:shard2 r:core_node8 x:movereplicatest_failed_coll_shard2_replica_n6] o.a.s.c.SolrConfig Using Lucene MatchVersion: 7.2.0
   [junit4]   2> 1792547 INFO  (qtp11094084-14543) [n:127.0.0.1:40847_solr c:movereplicatest_failed_coll s:shard2 r:core_node8 x:movereplicatest_failed_coll_shard2_replica_n6] o.a.s.s.IndexSchema [movereplicatest_failed_coll_shard2_replica_n6] Schema name=minimal
   [junit4]   2> 1792549 INFO  (qtp26537701-14547) [n:127.0.0.1:46841_solr c:movereplicatest_failed_coll s:shard2 r:core_node7 x:movereplicatest_failed_coll_shard2_replica_n4] o.a.s.c.SolrConfig Using Lucene MatchVersion: 7.2.0
   [junit4]   2> 1792552 INFO  (qtp14148151-14535) [n:127.0.0.1:35065_solr c:movereplicatest_failed_coll s:shard1 r:core_node5 x:movereplicatest_failed_coll_shard1_replica_n2] o.a.s.c.SolrConfig Using Lucene MatchVersion: 7.2.0
   [junit4]   2> 1792566 INFO  (qtp11094084-14543) [n:127.0.0.1:40847_solr c:movereplicatest_failed_coll s:shard2 r:core_node8 x:movereplicatest_failed_coll_shard2_replica_n6] o.a.s.s.IndexSchema Loaded schema minimal/1.1 with uniqueid field id
   [junit4]   2> 1792566 INFO  (qtp11094084-14543) [n:127.0.0.1:40847_solr c:movereplicatest_failed_coll s:shard2 r:core_node8 x:movereplicatest_failed_coll_shard2_replica_n6] o.a.s.c.CoreContainer Creating SolrCore 'movereplicatest_failed_coll_shard2_replica_n6' using configuration from collection movereplicatest_failed_coll, trusted=true
   [junit4]   2> 1792567 INFO  (qtp26537701-14547) [n:127.0.0.1:46841_solr c:movereplicatest_failed_coll s:shard2 r:core_node7 x:movereplicatest_failed_coll_shard2_replica_n4] o.a.s.s.IndexSchema [movereplicatest_failed_coll_shard2_replica_n4] Schema name=minimal
   [junit4]   2> 1792567 INFO  (qtp11094084-14543) [n:127.0.0.1:40847_solr c:movereplicatest_failed_coll s:shard2 r:core_node8 x:movereplicatest_failed_coll_shard2_replica_n6] o.a.s.m.r.SolrJmxReporter JMX monitoring for 'solr_40847.solr.core.movereplicatest_failed_coll.shard2.replica_n6' (registry 'solr.core.movereplicatest_failed_coll.shard2.replica_n6') enabled at server: com.sun.jmx.mbeanserver.JmxMBeanServer@14cbe4e
   [junit4]   2> 1792567 INFO  (qtp11094084-14543) [n:127.0.0.1:40847_solr c:movereplicatest_failed_coll s:shard2 r:core_node8 x:movereplicatest_failed_coll_shard2_replica_n6] o.a.s.c.HdfsDirectoryFactory solr.hdfs.home=hdfs://localhost.localdomain:42155/data
   [junit4]   2> 1792568 INFO  (qtp11094084-14543) [n:127.0.0.1:40847_solr c:movereplicatest_failed_coll s:shard2 r:core_node8 x:movereplicatest_failed_coll_shard2_replica_n6] o.a.s.c.HdfsDirectoryFactory Solr Kerberos Authentication disabled
   [junit4]   2> 1792568 INFO  (qtp11094084-14543) [n:127.0.0.1:40847_solr c:movereplicatest_failed_coll s:shard2 r:core_node8 x:movereplicatest_failed_coll_shard2_replica_n6] o.a.s.c.SolrCore solr.RecoveryStrategy.Builder
   [junit4]   2> 1792568 INFO  (qtp11094084-14543) [n:127.0.0.1:40847_solr c:movereplicatest_failed_coll s:shard2 r:core_node8 x:movereplicatest_failed_coll_shard2_replica_n6] o.a.s.c.SolrCore [[movereplicatest_failed_coll_shard2_replica_n6] ] Opening new SolrCore at [/home/jenkins/workspace/Lucene-Solr-7.x-Linux/solr/build/solr-core/test/J0/temp/solr.cloud.MoveReplicaHDFSTest_BB43A9802663F944-001/tempDir-001/node3/movereplicatest_failed_coll_shard2_replica_n6], dataDir=[hdfs://localhost.localdomain:42155/data/movereplicatest_failed_coll/core_node8/data/]
   [junit4]   2> 1792569 INFO  (qtp26537701-14547) [n:127.0.0.1:46841_solr c:movereplicatest_failed_coll s:shard2 r:core_node7 x:movereplicatest_failed_coll_shard2_replica_n4] o.a.s.s.IndexSchema Loaded schema minimal/1.1 with uniqueid field id
   [junit4]   2> 1792569 INFO  (qtp26537701-14547) [n:127.0.0.1:46841_solr c:movereplicatest_failed_coll s:shard2 r:core_node7 x:movereplicatest_failed_coll_shard2_replica_n4] o.a.s.c.CoreContainer Creating SolrCore 'movereplicatest_failed_coll_shard2_replica_n4' using configuration from collection movereplicatest_failed_coll, trusted=true
   [junit4]   2> 1792571 INFO  (qtp14148151-14535) [n:127.0.0.1:35065_solr c:movereplicatest_failed_coll s:shard1 r:core_node5 x:movereplicatest_failed_coll_shard1_replica_n2] o.a.s.s.IndexSchema [movereplicatest_failed_coll_shard1_replica_n2] Schema name=minimal
   [junit4]   2> 1792571 INFO  (qtp26537701-14547) [n:127.0.0.1:46841_solr c:movereplicatest_failed_coll s:shard2 r:core_node7 x:movereplicatest_failed_coll_shard2_replica_n4] o.a.s.m.r.SolrJmxReporter JMX monitoring for 'solr_46841.solr.core.movereplicatest_failed_coll.shard2.replica_n4' (registry 'solr.core.movereplicatest_failed_coll.shard2.replica_n4') enabled at server: com.sun.jmx.mbeanserver.JmxMBeanServer@14cbe4e
   [junit4]   2> 1792571 INFO  (qtp26537701-14547) [n:127.0.0.1:46841_solr c:movereplicatest_failed_coll s:shard2 r:core_node7 x:movereplicatest_failed_coll_shard2_replica_n4] o.a.s.c.HdfsDirectoryFactory solr.hdfs.home=hdfs://localhost.localdomain:42155/data
   [junit4]   2> 1792571 INFO  (qtp26537701-14547) [n:127.0.0.1:46841_solr c:movereplicatest_failed_coll s:shard2 r:core_node7 x:movereplicatest_failed_coll_shard2_replica_n4] o.a.s.c.HdfsDirectoryFactory Solr Kerberos Authentication disabled
   [junit4]   2> 1792571 INFO  (qtp26537701-14547) [n:127.0.0.1:46841_solr c:movereplicatest_failed_coll s:shard2 r:core_node7 x:movereplicatest_failed_coll_shard2_replica_n4] o.a.s.c.SolrCore solr.RecoveryStrategy.Builder
   [junit4]   2> 1792571 INFO  (qtp26537701-14547) [n:127.0.0.1:46841_solr c:movereplicatest_failed_coll s:shard2 r:core_node7 x:movereplicatest_failed_coll_shard2_replica_n4] o.a.s.c.SolrCore [[movereplicatest_failed_coll_shard2_replica_n4] ] Opening new SolrCore at [/home/jenkins/workspace/Lucene-Solr-7.x-Linux/solr/build/solr-core/test/J0/temp/solr.cloud.MoveReplicaHDFSTest_BB43A9802663F944-001/tempDir-001/node4/movereplicatest_failed_coll_shard2_replica_n4], dataDir=[hdfs://localhost.localdomain:42155/data/movereplicatest_failed_coll/core_node7/data/]
   [junit4]   2> 1792572 INFO  (qtp14148151-14535) [n:127.0.0.1:35065_solr c:movereplicatest_failed_coll s:shard1 r:core_node5 x:movereplicatest_failed_coll_shard1_replica_n2] o.a.s.s.IndexSchema Loaded schema minimal/1.1 with uniqueid field id
   [junit4]   2> 1792572 INFO  (qtp14148151-14535) [n:127.0.0.1:35065_solr c:movereplicatest_failed_coll s:shard1 r:core_node5 x:movereplicatest_failed_coll_shard1_replica_n2] o.a.s.c.CoreContainer Creating SolrCore 'movereplicatest_failed_coll_shard1_replica_n2' using configuration from collection movereplicatest_failed_coll, trusted=true
   [junit4]   2> 1792573 INFO  (qtp14148151-14535) [n:127.0.0.1:35065_solr c:movereplicatest_failed_coll s:shard1 r:core_node5 x:movereplicatest_failed_coll_shard1_replica_n2] o.a.s.m.r.SolrJmxReporter JMX monitoring for 'solr_35065.solr.core.movereplicatest_failed_coll.shard1.replica_n2' (registry 'solr.core.movereplicatest_failed_coll.shard1.replica_n2') enabled at server: com.sun.jmx.mbeanserver.JmxMBeanServer@14cbe4e
   [junit4]   2> 1792573 INFO  (qtp26537701-14547) [n:127.0.0.1:46841_solr c:movereplicatest_failed_coll s:shard2 r:core_node7 x:movereplicatest_failed_coll_shard2_replica_n4] o.a.s.c.HdfsDirectoryFactory creating directory factory for path hdfs://localhost.localdomain:42155/data/movereplicatest_failed_coll/core_node7/data/snapshot_metadata
   [junit4]   2> 1792573 INFO  (qtp14148151-14535) [n:127.0.0.1:35065_solr c:movereplicatest_failed_coll s:shard1 r:core_node5 x:movereplicatest_failed_coll_shard1_replica_n2] o.a.s.c.HdfsDirectoryFactory solr.hdfs.home=hdfs://localhost.localdomain:42155/data
   [junit4]   2> 1792573 INFO  (qtp14148151-14535) [n:127.0.0.1:35065_solr c:movereplicatest_failed_coll s:shard1 r:core_node5 x:movereplicatest_failed_coll_shard1_replica_n2] o.a.s.c.HdfsDirectoryFactory Solr Kerberos Authentication disabled
   [junit4]   2> 1792573 INFO  (qtp14148151-14535) [n:127.0.0.1:35065_solr c:movereplicatest_failed_coll s:shard1 r:core_node5 x:movereplicatest_failed_coll_shard1_replica_n2] o.a.s.c.SolrCore solr.RecoveryStrategy.Builder
   [junit4]   2> 1792573 INFO  (qtp14148151-14535) [n:127.0.0.1:35065_solr c:movereplicatest_failed_coll s:shard1 r:core_node5 x:movereplicatest_failed_coll_shard1_replica_n2] o.a.s.c.SolrCore [[movereplicatest_failed_coll_shard1_replica_n2] ] Opening new SolrCore at [/home/jenkins/workspace/Lucene-Solr-7.x-Linux/solr/build/solr-core/test/J0/temp/solr.cloud.MoveReplicaHDFSTest_BB43A9802663F944-001/tempDir-001/node2/movereplicatest_failed_coll_shard1_replica_n2], dataDir=[hdfs://localhost.localdomain:42155/data/movereplicatest_failed_coll/core_node5/data/]
   [junit4]   2> 1792575 INFO  (qtp14148151-14535) [n:127.0.0.1:35065_solr c:movereplicatest_failed_coll s:shard1 r:core_node5 x:movereplicatest_failed_coll_shard1_replica_n2] o.a.s.c.HdfsDirectoryFactory creating directory factory for path hdfs://localhost.localdomain:42155/data/movereplicatest_failed_coll/core_node5/data/snapshot_metadata
   [junit4]   2> 1792578 INFO  (qtp11094084-14543) [n:127.0.0.1:40847_solr c:movereplicatest_failed_coll s:shard2 r:core_node8 x:movereplicatest_failed_coll_shard2_replica_n6] o.a.s.c.HdfsDirectoryFactory creating directory factory for path hdfs://localhost.localdomain:42155/data/movereplicatest_failed_coll/core_node8/data/snapshot_metadata
   [junit4]   2> 1792586 WARN  (qtp21011199-14531) [n:127.0.0.1:35801_solr c:movereplicatest_failed_coll s:shard1 r:core_node3 x:movereplicatest_failed_coll_shard1_replica_n1] o.a.s.s.h.HdfsDirectory The NameNode is in SafeMode - Solr will wait 5 seconds and try again.
   [junit4]   2> 1792586 WARN  (qtp26537701-14547) [n:127.0.0.1:46841_solr c:movereplicatest_failed_coll s:shard2 r:core_node7 x:movereplicatest_failed_coll_shard2_replica_n4] o.a.s.s.h.HdfsDirectory The NameNode is in SafeMode - Solr will wait 5 seconds and try again.
   [junit4]   2> 1792590 WARN  (qtp14148151-14535) [n:127.0.0.1:35065_solr c:movereplicatest_failed_coll s:shard1 r:core_node5 x:movereplicatest_failed_coll_shard1_replica_n2] o.a.s.s.h.HdfsDirectory The NameNode is in SafeMode - Solr will wait 5 seconds and try again.
   [junit4]   2> 1792594 WARN  (qtp11094084-14543) [n:127.0.0.1:40847_solr c:movereplicatest_failed_coll s:shard2 r:core_node8 x:movereplicatest_failed_coll_shard2_replica_n6] o.a.s.s.h.HdfsDirectory The NameNode is in SafeMode - Solr will wait 5 seconds and try again.
   [junit4]   2> 1797587 WARN  (qtp21011199-14531) [n:127.0.0.1:35801_solr c:movereplicatest_failed_coll s:shard1 r:core_node3 x:movereplicatest_failed_coll_shard1_replica_n1] o.a.s.s.h.HdfsDirectory The NameNode is in SafeMode - Solr will wait 5 seconds and try again.
   [junit4]   2> 1797589 WARN  (qtp26537701-14547) [n:127.0.0.1:46841_solr c:movereplicatest_failed_coll s:shard2 r:core_node7 x:movereplicatest_failed_coll_shard2_replica_n4] o.a.s.s.h.HdfsDirectory The NameNode is in SafeMode - Solr will wait 5 seconds and try again.
   [junit4]   2> 1797590 WARN  (qtp14148151-14535) [n:127.0.0.1:35065_solr c:movereplicatest_failed_coll s:shard1 r:core_node5 x:movereplicatest_failed_coll_shard1_replica_n2] o.a.s.s.h.HdfsDirectory The NameNode is in SafeMode - Solr will wait 5 seconds and try again.
   [junit4]   2> 1797595 WARN  (qtp11094084-14543) [n:127.0.0.1:40847_solr c:movereplicatest_failed_coll s:shard2 r:core_node8 x:movereplicatest_failed_coll_shard2_replica_n6] o.a.s.s.h.HdfsDirectory The NameNode is in SafeMode - Solr will wait 5 seconds and try again.
   [junit4]   2> 1802649 INFO  (qtp26537701-14547) [n:127.0.0.1:46841_solr c:movereplicatest_failed_coll s:shard2 r:core_node7 x:movereplicatest_failed_coll_shard2_replica_n4] o.a.s.c.HdfsDirectoryFactory creating directory factory for path hdfs://localhost.localdomain:42155/data/movereplicatest_failed_coll/core_node7/data
   [junit4]   2> 1802649 INFO  (qtp14148151-14535) [n:127.0.0.1:35065_solr c:movereplicatest_failed_coll s:shard1 r:core_node5 x:movereplicatest_failed_coll_shard1_replica_n2] o.a.s.c.HdfsDirectoryFactory creating directory factory for path hdfs://localhost.localdomain:42155/data/movereplicatest_failed_coll/core_node5/data
   [junit4]   2> 1802649 INFO  (qtp11094084-14543) [n:127.0.0.1:40847_solr c:movereplicatest_failed_coll s:shard2 r:core_node8 x:movereplicatest_failed_coll_shard2_replica_n6] o.a.s.c.HdfsDirectoryFactory creating directory factory for path hdfs://localhost.localdomain:42155/data/movereplicatest_failed_coll/core_node8/data
   [junit4]   2> 1802652 INFO  (qtp21011199-14531) [n:127.0.0.1:35801_solr c:movereplicatest_failed_coll s:shard1 r:core_node3 x:movereplicatest_failed_coll_shard1_replica_n1] o.a.s.c.HdfsDirectoryFactory creating directory factory for path hdfs://localhost.localdomain:42155/data/movereplicatest_failed_coll/core_node3/data
   [junit4]   2> 1802683 INFO  (qtp21011199-14531) [n:127.0.0.1:35801_solr c:movereplicatest_failed_coll s:shard1 r:core_node3 x:movereplicatest_failed_coll_shard1_replica_n1] o.a.s.c.HdfsDirectoryFactory creating directory factory for path hdfs://localhost.localdomain:42155/data/movereplicatest_failed_coll/core_node3/data/index
   [junit4]   2> 1802689 INFO  (qtp14148151-14535) [n:127.0.0.1:35065_solr c:movereplicatest_failed_coll s:shard1 r:core_node5 x:movereplicatest_failed_coll_shard1_replica_n2] o.a.s.c.HdfsDirectoryFactory creating directory factory for path hdfs://localhost.localdomain:42155/data/movereplicatest_failed_coll/core_node5/data/index
   [junit4]   2> 1802693 INFO  (qtp26537701-14547) [n:127.0.0.1:46841_solr c:movereplicatest_failed_coll s:shard2 r:core_node7 x:movereplicatest_failed_coll_shard2_replica_n4] o.a.s.c.HdfsDirectoryFactory creating directory factory for path hdfs://localhost.localdomain:42155/data/movereplicatest_failed_coll/core_node7/data/index
   [junit4]   2> 1802698 INFO  (qtp11094084-14543) [n:127.0.0.1:40847_solr c:movereplicatest_failed_coll s:shard2 r:core_node8 x:movereplicatest_failed_coll_shard2_replica_n6] o.a.s.c.HdfsDirectoryFactory creating directory factory for path hdfs://localhost.localdomain:42155/data/movereplicatest_failed_coll/core_node8/data/index
   [junit4]   2> 1803032 INFO  (Block report processor) [    ] BlockStateChange BLOCK* addStoredBlock: blockMap updated: 127.0.0.1:40817 is added to blk_1073741828_1004{UCState=COMMITTED, truncateBlock=null, primaryNodeIndex=-1, replicas=[ReplicaUC[[DISK]DS-f010d640-4bc3-4e36-a07a-4d4300ba22cf:NORMAL:127.0.0.1:40073|RBW], ReplicaUC[[DISK]DS-7ae3c01f-7f68-4a2c-9d78-55e93c53ddc8:NORMAL:127.0.0.1:40817|RBW]]} size 69
   [junit4]   2> 1803032 INFO  (Block report processor) [    ] BlockStateChange BLOCK* addStoredBlock: blockMap updated: 127.0.0.1:40073 is added to blk_1073741827_1003{UCState=COMMITTED, truncateBlock=null, primaryNodeIndex=-1, replicas=[ReplicaUC[[DISK]DS-7ae3c01f-7f68-4a2c-9d78-55e93c53ddc8:NORMAL:127.0.0.1:40817|RBW], ReplicaUC[[DISK]DS-f010d640-4bc3-4e36-a07a-4d4300ba22cf:NORMAL:127.0.0.1:40073|RBW]]} size 69
   [junit4]   2> 1803032 INFO  (Block report processor) [    ] BlockStateChange BLOCK* addStoredBlock: blockMap updated: 127.0.0.1:40817 is added to blk_1073741826_1002{UCState=COMMITTED, truncateBlock=null, primaryNodeIndex=-1, replicas=[ReplicaUC[[DISK]DS-a08f7cde-8f16-401c-b960-72e5839e38d7:NORMAL:127.0.0.1:40817|RBW], ReplicaUC[[DISK]DS-cba06ec0-c669-4b41-93fc-2a97dcc88f81:NORMAL:127.0.0.1:40073|RBW]]} size 69
   [junit4]   2> 1803033 INFO  (Block report processor) [    ] BlockStateChange BLOCK* addStoredBlock: blockMap updated: 127.0.0.1:40817 is added to blk_1073741825_1001{UCState=COMMITTED, truncateBlock=null, primaryNodeIndex=-1, replicas=[ReplicaUC[[DISK]DS-7ae3c01f-7f68-4a2c-9d78-55e93c53ddc8:NORMAL:127.0.0.1:40817|RBW], ReplicaUC[[DISK]DS-f010d640-4bc3-4e36-a07a-4d4300ba22cf:NORMAL:127.0.0.1:40073|RBW]]} size 69
   [junit4]   2> 1803033 INFO  (Block report processor) [    ] BlockStateChange BLOCK* addStoredBlock: blockMap updated: 127.0.0.1:40817 is added to blk_1073741827_1003 size 69
   [junit4]   2> 1803033 INFO  (Block report processor) [    ] BlockStateChange BLOCK* addStoredBlock: blockMap updated: 127.0.0.1:40073 is added to blk_1073741825_1001 size 69
   [junit4]   2> 1803033 INFO  (Block report processor) [    ] BlockStateChange BLOCK* addStoredBlock: blockMap updated: 127.0.0.1:40073 is added to blk_1073741828_1004 size 69
   [junit4]   2> 1803033 INFO  (Block report processor) [    ] BlockStateChange BLOCK* addStoredBlock: blockMap updated: 127.0.0.1:40073 is added to blk_1073741826_1002 size 69
   [junit4]   2> 1803511 INFO  (qtp21011199-14531) [n:127.0.0.1:35801_solr c:movereplicatest_failed_coll s:shard1 r:core_node3 x:movereplicatest_failed_coll_shard1_replica_n1] o.a.s.u.UpdateHandler Using UpdateLog implementation: org.apache.solr.update.HdfsUpdateLog
   [junit4]   2> 1803512 INFO  (qtp21011199-14531) [n:127.0.0.1:35801_solr c:movereplicatest_failed_coll s:shard1 r:core_node3 x:movereplicatest_failed_coll_shard1_replica_n1] o.a.s.u.UpdateLog Initializing UpdateLog: dataDir=null defaultSyncLevel=FLUSH numRecordsToKeep=100 maxNumLogsToKeep=10 numVersionBuckets=65536
   [junit4]   2> 1803512 INFO  (qtp21011199-14531) [n:127.0.0.1:35801_solr c:movereplicatest_failed_coll s:shard1 r:core_node3 x:movereplicatest_failed_coll_shard1_replica_n1] o.a.s.u.HdfsUpdateLog Initializing HdfsUpdateLog: tlogDfsReplication=3
   [junit4]   2> 1803513 INFO  (qtp26537701-14547) [n:127.0.0.1:46841_solr c:movereplicatest_failed_coll s:shard2 r:core_node7 x:movereplicatest_failed_coll_shard2_replica_n4] o.a.s.u.UpdateHandler Using UpdateLog implementation: org.apache.solr.update.HdfsUpdateLog
   [junit4]   2> 1803513 INFO  (qtp26537701-14547) [n:127.0.0.1:46841_solr c:movereplicatest_failed_coll s:shard2 r:core_node7 x:movereplicatest_failed_coll_shard2_replica_n4] o.a.s.u.UpdateLog Initializing UpdateLog: dataDir=null defaultSyncLevel=FLUSH numRecordsToKeep=100 maxNumLogsToKeep=10 numVersionBuckets=65536
   [junit4]   2> 1803514 INFO  (qtp26537701-14547) [n:127.0.0.1:46841_solr c:movereplicatest_failed_coll s:shard2 r:core_node7 x:movereplicatest_failed_coll_shard2_replica_n4] o.a.s.u.HdfsUpdateLog Initializing HdfsUpdateLog: tlogDfsReplication=3
   [junit4]   2> 1803518 INFO  (qtp11094084-14543) [n:127.0.0.1:40847_solr c:movereplicatest_failed_coll s:shard2 r:core_node8 x:movereplicatest_failed_coll_shard2_replica_n6] o.a.s.u.UpdateHandler Using UpdateLog implementation: org.apache.solr.update.HdfsUpdateLog
   [junit4]   2> 1803518 INFO  (qtp11094084-14543) [n:127.0.0.1:40847_solr c:movereplicatest_failed_coll s:shard2 r:core_node8 x:movereplicatest_failed_coll_shard2_replica_n6] o.a.s.u.UpdateLog Initializing UpdateLog: dataDir=null defaultSyncLevel=FLUSH numRecordsToKeep=100 maxNumLogsToKeep=10 numVersionBuckets=65536
   [junit4]   2> 1803518 INFO  (qtp11094084-14543) [n:127.0.0.1:40847_solr c:movereplicatest_failed_coll s:shard2 r:core_node8 x:movereplicatest_failed_coll_shard2_replica_n6] o.a.s.u.HdfsUpdateLog Initializing HdfsUpdateLog: tlogDfsReplication=3
   [junit4]   2> 1803535 INFO  (qtp26537701-14547) [n:127.0.0.1:46841_solr c:movereplicatest_failed_coll s:shard2 r:core_node7 x:movereplicatest_failed_coll_shard2_replica_n4] o.a.s.u.CommitTracker Hard AutoCommit: disabled
   [junit4]   2> 1803535 INFO  (qtp26537701-14547) [n:127.0.0.1:46841_solr c:movereplicatest_failed_coll s:shard2 r:core_node7 x:movereplicatest_failed_coll_shard2_replica_n4] o.a.s.u.CommitTracker Soft AutoCommit: disabled
   [junit4]   2> 1803535 INFO  (qtp21011199-14531) [n:127.0.0.1:35801_solr c:movereplicatest_failed_coll s:shard1 r:core_node3 x:movereplicatest_failed_coll_shard1_replica_n1] o.a.s.u.CommitTracker Hard AutoCommit: disabled
   [junit4]   2> 1803535 INFO  (qtp21011199-14531) [n:127.0.0.1:35801_solr c:movereplicatest_failed_coll s:shard1 r:core_node3 x:movereplicatest_failed_coll_shard1_replica_n1] o.a.s.u.CommitTracker Soft AutoCommit: disabled
   [junit4]   2> 1803535 INFO  (qtp11094084-14543) [n:127.0.0.1:40847_solr c:movereplicatest_failed_coll s:shard2 r:core_node8 x:movereplicatest_failed_coll_shard2_replica_n6] o.a.s.u.CommitTracker Hard AutoCommit: disabled
   [junit4]   2> 1803536 INFO  (qtp11094084-14543) [n:127.0.0.1:40847_solr c:movereplicatest_failed_coll s:shard2 r:core_node8 x:movereplicatest_failed_coll_shard2_replica_n6] o.a.s.u.CommitTracker Soft AutoCommit: disabled
   [junit4]   2> 1803569 INFO  (qtp14148151-14535) [n:127.0.0.1:35065_solr c:movereplicatest_failed_coll s:shard1 r:core_node5 x:movereplicatest_failed_coll_shard1_replica_n2] o.a.s.u.UpdateHandler Using UpdateLog implementation: org.apache.solr.update.HdfsUpdateLog
   [junit4]   2> 1803570 INFO  (qtp14148151-14535) [n:127.0.0.1:35065_solr c:movereplicatest_failed_coll s:shard1 r:core_node5 x:movereplicatest_failed_coll_shard1_replica_n2] o.a.s.u.UpdateLog Initializing UpdateLog: dataDir=null defaultSyncLevel=FLUSH numRecordsToKeep=100 maxNumLogsToKeep=10 numVersionBuckets=65536
   [junit4]   2> 1803570 INFO  (qtp14148151-14535) [n:127.0.0.1:35065_solr c:movereplicatest_failed_coll s:shard1 r:core_node5 x:movereplicatest_failed_coll_shard1_replica_n2] o.a.s.u.HdfsUpdateLog Initializing HdfsUpdateLog: tlogDfsReplication=3
   [junit4]   2> 1803582 INFO  (qtp14148151-14535) [n:127.0.0.1:35065_solr c:movereplicatest_failed_coll s:shard1 r:core_node5 x:movereplicatest_failed_coll_shard1_replica_n2] o.a.s.u.CommitTracker Hard AutoCommit: disabled
   [junit4]   2> 1803582 INFO  (qtp14148151-14535) [n:127.0.0.1:35065_solr c:movereplicatest_failed_coll s:shard1 r:core_node5 x:movereplicatest_failed_coll_shard1_replica_n2] o.a.s.u.CommitTracker Soft AutoCommit: disabled
   [junit4]   2> 1803616 INFO  (qtp11094084-14543) [n:127.0.0.1:40847_solr c:movereplicatest_failed_coll s:shard2 r:core_node8 x:movereplicatest_failed_coll_shard2_replica_n6] o.a.s.s.SolrIndexSearcher Opening [Searcher@1cbf9fa[movereplicatest_failed_coll_shard2_replica_n6] main]
   [junit4]   2> 1803616 INFO  (qtp26537701-14547) [n:127.0.0.1:46841_solr c:movereplicatest_failed_coll s:shard2 r:core_node7 x:movereplicatest_failed_coll_shard2_replica_n4] o.a.s.s.SolrIndexSearcher Opening [Searcher@dc8354[movereplicatest_failed_coll_shard2_replica_n4] main]
   [junit4]   2> 1803618 INFO  (qtp14148151-14535) [n:127.0.0.1:35065_solr c:movereplicatest_failed_coll s:shard1 r:core_node5 x:movereplicatest_failed_coll_shard1_replica_n2] o.a.s.s.SolrIndexSearcher Opening [Searcher@109327b[movereplicatest_failed_coll_shard1_replica_n2] main]
   [junit4]   2> 1803619 INFO  (qtp21011199-14531) [n:127.0.0.1:35801_solr c:movereplicatest_failed_coll s:shard1 r:core_node3 x:movereplicatest_failed_coll_shard1_replica_n1] o.a.s.s.SolrIndexSearcher Opening [Searcher@140af7d[movereplicatest_failed_coll_shard1_replica_n1] main]
   [junit4]   2> 1803622 INFO  (qtp14148151-14535) [n:127.0.0.1:35065_solr c:movereplicatest_failed_coll s:shard1 r:core_node5 x:movereplicatest_failed_coll_shard1_replica_n2] o.a.s.r.ManagedResourceStorage Configured ZooKeeperStorageIO with znodeBase: /configs/conf1
   [junit4]   2> 1803622 INFO  (qtp21011199-14531) [n:127.0.0.1:35801_solr c:movereplicatest_failed_coll s:shard1 r:core_node3 x:movereplicatest_failed_coll_shard1_replica_n1] o.a.s.r.ManagedResourceStorage Configured ZooKeeperStorageIO with znodeBase: /configs/conf1
   [junit4]   2> 1803622 INFO  (qtp14148151-14535) [n:127.0.0.1:35065_solr c:movereplicatest_failed_coll s:shard1 r:core_node5 x:movereplicatest_failed_coll_shard1_replica_n2] o.a.s.r.ManagedResourceStorage Loaded null at path _rest_managed.json using ZooKeeperStorageIO:path=/configs/conf1
   [junit4]   2> 1803622 INFO  (qtp26537701-14547) [n:127.0.0.1:46841_solr c:movereplicatest_failed_coll s:shard2 r:core_node7 x:movereplicatest_failed_coll_shard2_replica_n4] o.a.s.r.ManagedResourceStorage Configured ZooKeeperStorageIO with znodeBase: /configs/conf1
   [junit4]   2> 1803622 INFO  (qtp26537701-14547) [n:127.0.0.1:46841_solr c:movereplicatest_failed_coll s:shard2 r:core_node7 x:movereplicatest_failed_coll_shard2_replica_n4] o.a.s.r.ManagedResourceStorage Loaded null at path _rest_managed.json using ZooKeeperStorageIO:path=/configs/conf1
   [junit4]   2> 1803622 INFO  (qtp11094084-14543) [n:127.0.0.1:40847_solr c:movereplicatest_failed_coll s:shard2 r:core_node8 x:movereplicatest_failed_coll_shard2_replica_n6] o.a.s.r.ManagedResourceStorage Configured ZooKeeperStorageIO with znodeBase: /configs/conf1
   [junit4]   2> 1803622 INFO  (qtp21011199-14531) [n:127.0.0.1:35801_solr c:movereplicatest_failed_coll s:shard1 r:core_node3 x:movereplicatest_failed_coll_shard1_replica_n1] o.a.s.r.ManagedResourceStorage Loaded null at path _rest_managed.json using ZooKeeperStorageIO:path=/configs/conf1
   [junit4]   2> 1803623 INFO  (qtp11094084-14543) [n:127.0.0.1:40847_solr c:movereplicatest_failed_coll s:shard2 r:core_node8 x:movereplicatest_failed_coll_shard2_replica_n6] o.a.s.r.ManagedResourceStorage Loaded null at path _rest_managed.json using ZooKeeperStorageIO:path=/configs/conf1
   [junit4]   2> 1803624 INFO  (qtp14148151-14535) [n:127.0.0.1:35065_solr c:movereplicatest_failed_coll s:shard1 r:core_node5 x:movereplicatest_failed_coll_shard1_replica_n2] o.a.s.h.ReplicationHandler Commits will be reserved for 10000ms.
   [junit4]   2> 1803624 INFO  (qtp11094084-14543) [n:127.0.0.1:40847_solr c:movereplicatest_failed_coll s:shard2 r:core_node8 x:movereplicatest_failed_coll_shard2_replica_n6] o.a.s.h.ReplicationHandler Commits will be reserved for 10000ms.
   [junit4]   2> 1803624 INFO  (qtp26537701-14547) [n:127.0.0.1:46841_solr c:movereplicatest_failed_coll s:shard2 r:core_node7 x:movereplicatest_failed_coll_shard2_replica_n4] o.a.s.h.ReplicationHandler Commits will be reserved for 10000ms.
   [junit4]   2> 1803625 INFO  (qtp21011199-14531) [n:127.0.0.1:35801_solr c:movereplicatest_failed_coll s:shard1 r:core_node3 x:movereplicatest_failed_coll_shard1_replica_n1] o.a.s.h.ReplicationHandler Commits will be reserved for 10000ms.
   [junit4]   2> 1803625 INFO  (searcherExecutor-6144-thread-1-processing-n:127.0.0.1:40847_solr x:movereplicatest_failed_coll_shard2_replica_n6 s:shard2 c:movereplicatest_failed_coll r:core_node8) [n:127.0.0.1:40847_solr c:movereplicatest_failed_coll s:shard2 r:core_node8 x:movereplicatest_failed_coll_shard2_replica_n6] o.a.s.c.SolrCore [movereplicatest_failed_coll_shard2_replica_n6] Registered new searcher Searcher@1cbf9fa[movereplicatest_failed_coll_shard2_replica_n6] main{ExitableDirectoryReader(UninvertingDirectoryReader())}
   [junit4]   2> 1803628 INFO  (qtp21011199-14531) [n:127.0.0.1:35801_solr c:movereplicatest_failed_coll s:shard1 r:core_node3 x:movereplicatest_failed_coll_shard1_replica_n1] o.a.s.u.UpdateLog Could not find max version in index or recent updates, using new clock 1583419215707111424
   [junit4]   2> 1803628 INFO  (searcherExecutor-6145-thread-1-processing-n:127.0.0.1:46841_solr x:movereplicatest_failed_coll_shard2_replica_n4 s:shard2 c:movereplicatest_failed_coll r:core_node7) [n:127.0.0.1:46841_solr c:movereplicatest_failed_coll s:shard2 r:core_node7 x:movereplicatest_failed_coll_shard2_replica_n4] o.a.s.c.SolrCore [movereplicatest_failed_coll_shard2_replica_n4] Registered new searcher Searcher@dc8354[movereplicatest_failed_coll_shard2_replica_n4] main{ExitableDirectoryReader(UninvertingDirectoryReader())}
   [junit4]   2> 1803628 INFO  (qtp11094084-14543) [n:127.0.0.1:40847_solr c:movereplicatest_failed_coll s:shard2 r:core_node8 x:movereplicatest_failed_coll_shard2_replica_n6] o.a.s.u.UpdateLog Could not find max version in index or recent updates, using new clock 1583419215707111424
   [junit4]   2> 1803628 INFO  (searcherExecutor-6146-thread-1-processing-n:127.0.0.1:35065_solr x:movereplicatest_failed_coll_shard1_replica_n2 s:shard1 c:movereplicatest_failed_coll r:core_node5) [n:127.0.0.1:35065_solr c:movereplicatest_failed_coll s:shard1 r:core_node5 x:movereplicatest_failed_coll_shard1_replica_n2] o.a.s.c.SolrCore [movereplicatest_failed_coll_shard1_replica_n2] Registered new searcher Searcher@109327b[movereplicatest_failed_coll_shard1_replica_n2] main{ExitableDirectoryReader(UninvertingDirectoryReader())}
   [junit4]   2> 1803628 INFO  (qtp14148151-14535) [n:127.0.0.1:35065_solr c:movereplicatest_failed_coll s:shard1 r:core_node5 x:movereplicatest_failed_coll_shard1_replica_n2] o.a.s.u.UpdateLog Could not find max version in index or recent updates, using new clock 1583419215707111424
   [junit4]   2> 1803628 INFO  (qtp26537701-14547) [n:127.0.0.1:46841_solr c:movereplicatest_failed_coll s:shard2 r:core_node7 x:movereplicatest_failed_coll_shard2_replica_n4] o.a.s.u.UpdateLog Could not find max version in index or recent updates, using new clock 1583419215707111424
   [junit4]   2> 1803630 INFO  (searcherExecutor-6143-thread-1-processing-n:127.0.0.1:35801_solr x:movereplicatest_failed_coll_shard1_replica_n1 s:shard1 c:movereplicatest_failed_coll r:core_node3) [n:127.0.0.1:35801_solr c:movereplicatest_failed_coll s:shard1 r:core_node3 x:movereplicatest_failed_coll_shard1_replica_n1] o.a.s.c.SolrCore [movereplicatest_failed_coll_shard1_replica_n1] Registered new searcher Searcher@140af7d[movereplicatest_failed_coll_shard1_replica_n1] main{ExitableDirectoryReader(UninvertingDirectoryReader())}
   [junit4]   2> 1803632 INFO  (qtp21011199-14531) [n:127.0.0.1:35801_solr c:movereplicatest_failed_coll s:shard1 r:core_node3 x:movereplicatest_failed_coll_shard1_replica_n1] o.a.s.c.ShardLeaderElectionContext Enough replicas found to continue.
   [junit4]   2> 1803632 INFO  (qtp21011199-14531) [n:127.0.0.1:35801_solr c:movereplicatest_failed_coll s:shard1 r:core_node3 x:movereplicatest_failed_coll_shard1_replica_n1] o.a.s.c.ShardLeaderElectionContext I may be the new leader - try and sync
   [junit4]   2> 1803632 INFO  (qtp21011199-14531) [n:127.0.0.1:35801_solr c:movereplicatest_failed_coll s:shard1 r:core_node3 x:movereplicatest_failed_coll_shard1_replica_n1] o.a.s.c.SyncStrategy Sync replicas to https://127.0.0.1:35801/solr/movereplicatest_failed_coll_shard1_replica_n1/
   [junit4]   2> 1803632 INFO  (qtp21011199-14531) [n:127.0.0.1:35801_solr c:movereplicatest_failed_coll s:shard1 r:core_node3 x:movereplicatest_failed_coll_shard1_replica_n1] o.a.s.u.PeerSync PeerSync: core=movereplicatest_failed_coll_shard1_replica_n1 url=https://127.0.0.1:35801/solr START replicas=[https://127.0.0.1:35065/solr/movereplicatest_failed_coll_shard1_replica_n2/] nUpdates=100
   [junit4]   2> 1803633 INFO  (zkCallback-2815-thread-2-processing-n:127.0.0.1:35801_solr) [n:127.0.0.1:35801_solr    ] o.a.s.c.c.ZkStateReader A cluster state change: [WatchedEvent state:SyncConnected type:NodeDataChanged path:/collections/movereplicatest_failed_coll/state.json] for collection [movereplicatest_failed_coll] has occurred - updating... (live nodes size: [4])
   [junit4]   2> 1803633 INFO  (zkCallback-2816-thread-2-processing-n:127.0.0.1:46841_solr) [n:127.0.0.1:46841_solr    ] o.a.s.c.c.ZkStateReader A cluster state change: [WatchedEvent state:SyncConnected type:NodeDataChanged path:/collections/movereplicatest_failed_coll/state.json] for collection [movereplicatest_failed_coll] has occurred - updating... (live nodes size: [4])
   [junit4]   2> 1803633 INFO  (zkCallback-2817-thread-1-processing-n:127.0.0.1:40847_solr) [n:127.0.0.1:40847_solr    ] o.a.s.c.c.ZkStateReader A cluster state change: [WatchedEvent state:SyncConnected type:NodeDataChanged path:/collections/movereplicatest_failed_coll/state.json] for collection [movereplicatest_failed_coll] has occurred - updating... (live nodes size: [4])
   [junit4]   2> 1803633 INFO  (zkCallback-2814-thread-2-processing-n:127.0.0.1:35065_solr) [n:127.0.0.1:35065_solr    ] o.a.s.c.c.ZkStateReader A cluster state change: [WatchedEvent state:SyncConnected type:NodeDataChanged path:/collections/movereplicatest_failed_coll/state.json] for collection [movereplicatest_failed_coll] has occurred - updating... (live nodes size: [4])
   [junit4]   2> 1803633 INFO  (zkCallback-2817-thread-2-processing-n:127.0.0.1:40847_solr) [n:127.0.0.1:40847_solr    ] o.a.s.c.c.ZkStateReader A cluster state change: [WatchedEvent state:SyncConnected type:NodeDataChanged path:/collections/movereplicatest_failed_coll/state.json] for collection [movereplicatest_failed_coll] has occurred - updating... (live nodes size: [4])
   [junit4]   2> 1803633 INFO  (zkCallback-2815-thread-1-processing-n:127.0.0.1:35801_solr) [n:127.0.0.1:35801_solr    ] o.a.s.c.c.ZkStateReader A cluster state change: [WatchedEvent state:SyncConnected type:NodeDataChanged path:/collections/movereplicatest_failed_coll/state.json] for collection [movereplicatest_failed_coll] has occurred - updating... (live nodes size: [4])
   [junit4]   2> 1803633 INFO  (zkCallback-2814-thread-1-processing-n:127.0.0.1:35065_solr) [n:127.0.0.1:35065_solr    ] o.a.s.c.c.ZkStateReader A cluster state change: [WatchedEvent state:SyncConnected type:NodeDataChanged path:/collections/movereplicatest_failed_coll/state.json] for collection [movereplicatest_failed_coll] has occurred - updating... (live nodes size: [4])
   [junit4]   2> 1803633 INFO  (zkCallback-2816-thread-1-processing-n:127.0.0.1:46841_solr) [n:127.0.0.1:46841_solr    ] o.a.s.c.c.ZkStateReader A cluster state change: [WatchedEvent state:SyncConnected type:NodeDataChanged path:/collections/movereplicatest_failed_coll/state.json] for collection [movereplicatest_failed_coll] has occurred - updating... (live nodes size: [4])
   [junit4]   2> 1803634 INFO  (qtp26537701-14547) [n:127.0.0.1:46841_solr c:movereplicatest_failed_coll s:shard2 r:core_node7 x:movereplicatest_failed_coll_shard2_replica_n4] o.a.s.c.ShardLeaderElectionContext Enough replicas found to continue.
   [junit4]   2> 1803634 INFO  (qtp26537701-14547) [n:127.0.0.1:46841_solr c:movereplicatest_failed_coll s:shard2 r:core_node7 x:movereplicatest_failed_coll_shard2_replica_n4] o.a.s.c.ShardLeaderElectionContext I may be the new leader - try and sync
   [junit4]   2> 1803634 INFO  (qtp26537701-14547) [n:127.0.0.1:46841_solr c:movereplicatest_failed_coll s:shard2 r:core_node7 x:movereplicatest_failed_coll_shard2_replica_n4] o.a.s.c.SyncStrategy Sync replicas to https://127.0.0.1:46841/solr/movereplicatest_failed_coll_shard2_replica_n4/
   [junit4]   2> 1803635 INFO  (qtp26537701-14547) [n:127.0.0.1:46841_solr c:movereplicatest_failed_coll s:shard2 r:core_node7 x:movereplicatest_failed_coll_shard2_replica_n4] o.a.s.u.PeerSync PeerSync: core=movereplicatest_failed_coll_shard2_replica_n4 url=https://127.0.0.1:46841/solr START replicas=[https://127.0.0.1:40847/solr/movereplicatest_failed_coll_shard2_replica_n6/] nUpdates=100
   [junit4]   2> 1803640 INFO  (qtp11094084-14562) [n:127.0.0.1:40847_solr c:movereplicatest_failed_coll s:shard2 r:core_node8 x:movereplicatest_failed_coll_shard2_replica_n6] o.a.s.c.S.Request [movereplicatest_failed_coll_shard2_replica_n6]  webapp=/solr path=/get params={distrib=false&qt=/get&fingerprint=false&getVersions=100&wt=javabin&version=2} status=0 QTime=0
   [junit4]   2> 1803643 INFO  (qtp14148151-14534) [n:127.0.0.1:35065_solr c:movereplicatest_failed_coll s:shard1 r:core_node5 x:movereplicatest_failed_coll_shard1_replica_n2] o.a.s.c.S.Request [movereplicatest_failed_coll_shard1_replica_n2]  webapp=/solr path=/get params={distrib=false&qt=/get&fingerprint=false&getVersions=100&wt=javabin&version=2} status=0 QTime=0
   [junit4]   2> 1803735 INFO  (zkCallback-2816-thread-1-processing-n:127.0.0.1:46841_solr) [n:127.0.0.1:46841_solr    ] o.a.s.c.c.ZkStateReader A cluster state change: [WatchedEvent state:SyncConnected type:NodeDataChanged path:/collections/movereplicatest_failed_coll/state.json] for collection [movereplicatest_failed_coll] has occurred - updating... (live nodes size: [4])
   [junit4]   2> 1803735 INFO  (zkCallback-2815-thread-1-processing-n:127.0.0.1:35801_solr) [n:127.0.0.1:35801_solr    ] o.a.s.c.c.ZkStateReader A cluster state change: [WatchedEvent state:SyncConnected type:NodeDataChanged path:/collections/movereplicatest_failed_coll/state.json] for collection [movereplicatest_failed_coll] has occurred - updating... (live nodes size: [4])
   [junit4]   2> 1803735 INFO  (zkCallback-2817-thread-2-processing-n:127.0.0.1:40847_solr) [n:127.0.0.1:40847_solr    ] o.a.s.c.c.ZkStateReader A cluster state change: [WatchedEvent state:SyncConnected type:NodeDataChanged path:/collections/movereplicatest_failed_coll/state.json] for collection [movereplicatest_failed_coll] has occurred - updating... (live nodes size: [4])
   [junit4]   2> 1803735 INFO  (zkCallback-2815-thread-2-processing-n:127.0.0.1:35801_solr) [n:127.0.0.1:35801_solr    ] o.a.s.c.c.ZkStateReader A cluster state change: [WatchedEvent state:SyncConnected type:NodeDataChanged path:/collections/movereplicatest_failed_coll/state.json] for collection [movereplicatest_failed_coll] has occurred - updating... (live nodes size: [4])
   [junit4]   2> 1803735 INFO  (zkCallback-2814-thread-3-processing-n:127.0.0.1:35065_solr) [n:127.0.0.1:35065_solr    ] o.a.s.c.c.ZkStateReader A cluster state change: [WatchedEvent state:SyncConnected type:NodeDataChanged path:/collections/movereplicatest_failed_coll/state.json] for collection [movereplicatest_failed_coll] has occurred - updating... (live nodes size: [4])
   [junit4]   2> 1803735 INFO  (zkCallback-2816-thread-2-processing-n:127.0.0.1:46841_solr) [n:127.0.0.1:46841_solr    ] o.a.s.c.c.ZkStateReader A cluster state change: [WatchedEvent state:SyncConnected type:NodeDataChanged path:/collections/movereplicatest_failed_coll/state.json] for collection [movereplicatest_failed_coll] has occurred - updating... (live nodes size: [4])
   [junit4]   2> 1803735 INFO  (zkCallback-2814-thread-1-processing-n:127.0.0.1:35065_solr) [n:127.0.0.1:35065_solr    ] o.a.s.c.c.ZkStateReader A cluster state change: [WatchedEvent state:SyncConnected type:NodeDataChanged path:/collections/movereplicatest_failed_coll/state.json] for collection [movereplicatest_failed_coll] has occurred - updating... (live nodes size: [4])
   [junit4]   2> 1803735 INFO  (zkCallback-2817-thread-1-processing-n:127.0.0.1:40847_solr) [n:127.0.0.1:40847_solr    ] o.a.s.c.c.ZkStateReader A cluster state change: [WatchedEvent state:SyncConnected type:NodeDataChanged path:/collections/movereplicatest_failed_coll/state.json] for collection [movereplicatest_failed_coll] has occurred - updating... (live nodes size: [4])
   [junit4]   2> 1803933 INFO  (qtp21011199-14531) [n:127.0.0.1:35801_solr c:movereplicatest_failed_coll s:shard1 r:core_node3 x:movereplicatest_failed_coll_shard1_replica_n1] o.a.s.u.PeerSync PeerSync: core=movereplicatest_failed_coll_shard1_replica_n1 url=https://127.0.0.1:35801/solr DONE.  We have no versions.  sync failed.
   [junit4]   2> 1803933 INFO  (qtp21011199-14531) [n:127.0.0.1:35801_solr c:movereplicatest_failed_coll s:shard1 r:core_node3 x:movereplicatest_failed_coll_shard1_replica_n1] o.a.s.c.SyncStrategy Leader's attempt to sync with shard failed, moving to t

[...truncated too long message...]

, service url = null, agent id = null] for registry solr.jvm / com.codahale.metrics.MetricRegistry@519136
   [junit4]   2> 158595 INFO  (jetty-closer-167-thread-1) [    ] o.a.s.m.SolrMetricManager Closing metric reporters for registry=solr.jvm, tag=null
   [junit4]   2> 158595 INFO  (jetty-closer-167-thread-1) [    ] o.a.s.m.r.SolrJmxReporter Closing reporter [org.apache.solr.metrics.reporters.SolrJmxReporter@dc92ef: rootName = solr_36225, domain = solr.jvm, service url = null, agent id = null] for registry solr.jvm / com.codahale.metrics.MetricRegistry@519136
   [junit4]   2> 158600 INFO  (jetty-closer-167-thread-1) [    ] o.a.s.m.SolrMetricManager Closing metric reporters for registry=solr.jetty, tag=null
   [junit4]   2> 158600 INFO  (jetty-closer-167-thread-1) [    ] o.a.s.m.r.SolrJmxReporter Closing reporter [org.apache.solr.metrics.reporters.SolrJmxReporter@121197c: rootName = solr_36225, domain = solr.jetty, service url = null, agent id = null] for registry solr.jetty / com.codahale.metrics.MetricRegistry@18a3147
   [junit4]   2> 158600 INFO  (jetty-closer-167-thread-2) [    ] o.a.s.m.SolrMetricManager Closing metric reporters for registry=solr.jetty, tag=null
   [junit4]   2> 158600 INFO  (jetty-closer-167-thread-2) [    ] o.a.s.m.r.SolrJmxReporter Closing reporter [org.apache.solr.metrics.reporters.SolrJmxReporter@49ee94: rootName = solr_38161, domain = solr.jetty, service url = null, agent id = null] for registry solr.jetty / com.codahale.metrics.MetricRegistry@18a3147
   [junit4]   2> 158600 INFO  (jetty-closer-167-thread-1) [    ] o.a.s.c.ZkController Remove node as live in ZooKeeper:/live_nodes/127.0.0.1:36225_solr
   [junit4]   2> 158601 INFO  (jetty-closer-167-thread-1) [    ] o.a.s.m.SolrMetricManager Closing metric reporters for registry=solr.cluster, tag=null
   [junit4]   2> 158601 INFO  (jetty-closer-167-thread-2) [    ] o.a.s.c.ZkController Remove node as live in ZooKeeper:/live_nodes/127.0.0.1:38161_solr
   [junit4]   2> 158601 INFO  (zkCallback-174-thread-3-processing-n:127.0.0.1:36225_solr) [n:127.0.0.1:36225_solr    ] o.a.s.c.c.ZkStateReader Updated live nodes from ZooKeeper... (2) -> (1)
   [junit4]   2> 158602 INFO  (zkCallback-178-thread-4-processing-n:127.0.0.1:38161_solr) [n:127.0.0.1:38161_solr    ] o.a.s.c.c.ZkStateReader Updated live nodes from ZooKeeper... (2) -> (1)
   [junit4]   2> 158602 INFO  (coreCloseExecutor-480-thread-1) [n:127.0.0.1:36225_solr c:collection1 s:shard2 r:core_node4 x:collection1_shard2_replica_n3] o.a.s.c.SolrCore [collection1_shard2_replica_n3]  CLOSING SolrCore org.apache.solr.core.SolrCore@15f05d3
   [junit4]   2> 158602 INFO  (coreCloseExecutor-480-thread-1) [n:127.0.0.1:36225_solr c:collection1 s:shard2 r:core_node4 x:collection1_shard2_replica_n3] o.a.s.m.SolrMetricManager Closing metric reporters for registry=solr.core.collection1.shard2.replica_n3, tag=23004627
   [junit4]   2> 158602 INFO  (coreCloseExecutor-480-thread-1) [n:127.0.0.1:36225_solr c:collection1 s:shard2 r:core_node4 x:collection1_shard2_replica_n3] o.a.s.m.r.SolrJmxReporter Closing reporter [org.apache.solr.metrics.reporters.SolrJmxReporter@82da08: rootName = solr_36225, domain = solr.core.collection1.shard2.replica_n3, service url = null, agent id = null] for registry solr.core.collection1.shard2.replica_n3 / com.codahale.metrics.MetricRegistry@144018
   [junit4]   2> 158603 INFO  (zkCallback-178-thread-5-processing-n:127.0.0.1:38161_solr) [n:127.0.0.1:38161_solr    ] o.a.s.c.c.ZkStateReader Updated live nodes from ZooKeeper... (1) -> (0)
   [junit4]   2> 158603 INFO  (zkCallback-174-thread-4-processing-n:127.0.0.1:36225_solr) [n:127.0.0.1:36225_solr    ] o.a.s.c.c.ZkStateReader Updated live nodes from ZooKeeper... (1) -> (0)
   [junit4]   2> 158603 INFO  (jetty-closer-167-thread-2) [    ] o.a.s.m.SolrMetricManager Closing metric reporters for registry=solr.cluster, tag=null
   [junit4]   2> 158607 INFO  (coreCloseExecutor-481-thread-1) [n:127.0.0.1:38161_solr c:collection1 s:shard1 r:core_node2 x:collection1_shard1_replica_n1] o.a.s.c.SolrCore [collection1_shard1_replica_n1]  CLOSING SolrCore org.apache.solr.core.SolrCore@198b923
   [junit4]   2> 158607 INFO  (coreCloseExecutor-481-thread-1) [n:127.0.0.1:38161_solr c:collection1 s:shard1 r:core_node2 x:collection1_shard1_replica_n1] o.a.s.m.SolrMetricManager Closing metric reporters for registry=solr.core.collection1.shard1.replica_n1, tag=26786083
   [junit4]   2> 158607 INFO  (coreCloseExecutor-481-thread-1) [n:127.0.0.1:38161_solr c:collection1 s:shard1 r:core_node2 x:collection1_shard1_replica_n1] o.a.s.m.r.SolrJmxReporter Closing reporter [org.apache.solr.metrics.reporters.SolrJmxReporter@e00003: rootName = solr_38161, domain = solr.core.collection1.shard1.replica_n1, service url = null, agent id = null] for registry solr.core.collection1.shard1.replica_n1 / com.codahale.metrics.MetricRegistry@9b911
   [junit4]   2> 158610 INFO  (coreCloseExecutor-480-thread-1) [n:127.0.0.1:36225_solr c:collection1 s:shard2 r:core_node4 x:collection1_shard2_replica_n3] o.a.s.m.SolrMetricManager Closing metric reporters for registry=solr.collection.collection1.shard2.leader, tag=23004627
   [junit4]   2> 158614 INFO  (coreCloseExecutor-481-thread-1) [n:127.0.0.1:38161_solr c:collection1 s:shard1 r:core_node2 x:collection1_shard1_replica_n1] o.a.s.m.SolrMetricManager Closing metric reporters for registry=solr.collection.collection1.shard1.leader, tag=26786083
   [junit4]   2> 158617 INFO  (jetty-closer-167-thread-2) [    ] o.a.s.c.Overseer Overseer (id=98963765312815110-127.0.0.1:38161_solr-n_0000000000) closing
   [junit4]   2> 158617 INFO  (OverseerStateUpdate-98963765312815110-127.0.0.1:38161_solr-n_0000000000) [n:127.0.0.1:38161_solr    ] o.a.s.c.Overseer Overseer Loop exiting : 127.0.0.1:38161_solr
   [junit4]   2> 158617 WARN  (OverseerAutoScalingTriggerThread-98963765312815110-127.0.0.1:38161_solr-n_0000000000) [n:127.0.0.1:38161_solr    ] o.a.s.c.a.OverseerTriggerThread OverseerTriggerThread woken up but we are closed, exiting.
   [junit4]   2> 158618 INFO  (jetty-closer-167-thread-1) [    ] o.e.j.s.h.ContextHandler Stopped o.e.j.s.ServletContextHandler@13fcab2{/solr,null,UNAVAILABLE}
   [junit4]   2> 158623 INFO  (jetty-closer-167-thread-2) [    ] o.e.j.s.h.ContextHandler Stopped o.e.j.s.ServletContextHandler@f5e755{/solr,null,UNAVAILABLE}
   [junit4]   2> 158623 ERROR (SUITE-GraphTest-seed#[90D73DD5B929599B]-worker) [    ] o.a.z.s.ZooKeeperServer ZKShutdownHandler is not registered, so ZooKeeper server won't take any action on ERROR or SHUTDOWN server state changes
   [junit4]   2> 158623 INFO  (SUITE-GraphTest-seed#[90D73DD5B929599B]-worker) [    ] o.a.s.c.ZkTestServer connecting to 127.0.0.1:44659 44659
   [junit4]   2> 164424 INFO  (Thread-240) [    ] o.a.s.c.ZkTestServer connecting to 127.0.0.1:44659 44659
   [junit4]   2> 164424 WARN  (Thread-240) [    ] o.a.s.c.ZkTestServer Watch limit violations: 
   [junit4]   2> Maximum concurrent create/delete watches above limit:
   [junit4]   2> 
   [junit4]   2> 	3	/solr/aliases.json
   [junit4]   2> 	3	/solr/clusterprops.json
   [junit4]   2> 	2	/solr/security.json
   [junit4]   2> 	2	/solr/configs/conf
   [junit4]   2> 
   [junit4]   2> Maximum concurrent data watches above limit:
   [junit4]   2> 
   [junit4]   2> 	8	/solr/collections/collection1/state.json
   [junit4]   2> 	3	/solr/clusterstate.json
   [junit4]   2> 
   [junit4]   2> Maximum concurrent children watches above limit:
   [junit4]   2> 
   [junit4]   2> 	3	/solr/live_nodes
   [junit4]   2> 	3	/solr/collections
   [junit4]   2> 
   [junit4]   2> 164425 INFO  (SUITE-GraphTest-seed#[90D73DD5B929599B]-worker) [    ] o.a.s.SolrTestCaseJ4 ------------------------------------------------------- Done waiting for tracked resources to be released
   [junit4]   2> NOTE: test params are: codec=Asserting(Lucene70): {}, docValues:{}, maxPointsInLeafNode=363, maxMBSortInHeap=6.650320870371437, sim=RandomSimilarity(queryNorm=false): {}, locale=ar-OM, timezone=America/St_Johns
   [junit4]   2> NOTE: Linux 4.10.0-37-generic i386/Oracle Corporation 1.8.0_144 (32-bit)/cpus=8,threads=1,free=18559648,total=92979200
   [junit4]   2> NOTE: All tests run in this JVM: [SolrDocumentTest, CollectionAdminRequestRequiredParamsTest, TestFastInputStream, ClientUtilsTest, QueryResponseTest, EqualToEvaluatorTest, CorrelationEvaluatorTest, SolrZkClientTest, SubtractEvaluatorTest, AppendEvaluatorTest, SolrExampleEmbeddedTest, TestV2Request, LengthEvaluatorTest, TestDelegationTokenRequest, CommonAdminParamsTest, MergeIndexesEmbeddedTest, SolrQueryTest, TestDocumentObjectBinder, ModuloEvaluatorTest, RoundEvaluatorTest, TestUpdateRequestCodec, HyperbolicCosineEvaluatorTest, FloorEvaluatorTest, SolrExampleStreamingBinaryTest, SolrExampleBinaryTest, TestBatchUpdate, TestSolrProperties, TestEmbeddedSolrServer, NamedListTest, FacetFieldTest, GetByIdTest, TestLBHttpSolrClient, TestPolicy, BasicHttpSolrClientTest, CloudSolrClientBuilderTest, CloudSolrClientCacheTest, CloudSolrClientMultiConstructorTest, ConcurrentUpdateSolrClientBuilderTest, ConcurrentUpdateSolrClientTest, GraphTest]
   [junit4]   2> NOTE: reproduce with: ant test  -Dtestcase=GraphTest -Dtests.seed=90D73DD5B929599B -Dtests.multiplier=3 -Dtests.slow=true -Dtests.locale=ar-OM -Dtests.timezone=America/St_Johns -Dtests.asserts=true -Dtests.file.encoding=UTF-8
   [junit4] ERROR   0.00s J1 | GraphTest (suite) <<<
   [junit4]    > Throwable #1: java.lang.AssertionError: There are still nodes recoverying - waited for 30 seconds
   [junit4]    > 	at __randomizedtesting.SeedInfo.seed([90D73DD5B929599B]:0)
   [junit4]    > 	at org.apache.solr.cloud.AbstractDistribZkTestBase.waitForRecoveriesToFinish(AbstractDistribZkTestBase.java:185)
   [junit4]    > 	at org.apache.solr.client.solrj.io.graph.GraphTest.setupCluster(GraphTest.java:63)
   [junit4]    > 	at java.lang.Thread.run(Thread.java:748)
   [junit4] Completed [139/146 (1!)] on J1 in 68.20s, 0 tests, 1 failure <<< FAILURES!

[...truncated 42210 lines...]

Mime
View raw message