lucene-dev mailing list archives

Site index · List index
Message view « Date » · « Thread »
Top « Date » · « Thread »
From Policeman Jenkins Server <jenk...@thetaphi.de>
Subject [JENKINS] Lucene-Solr-master-Solaris (64bit/jdk1.8.0) - Build # 1465 - Still Unstable!
Date Wed, 11 Oct 2017 03:26:31 GMT
Build: https://jenkins.thetaphi.de/job/Lucene-Solr-master-Solaris/1465/
Java: 64bit/jdk1.8.0 -XX:+UseCompressedOops -XX:+UseG1GC

2 tests failed.
FAILED:  junit.framework.TestSuite.org.apache.solr.cloud.TestSolrCloudWithSecureImpersonation

Error Message:
2 threads leaked from SUITE scope at org.apache.solr.cloud.TestSolrCloudWithSecureImpersonation:     1) Thread[id=3872, name=jetty-launcher-1760-thread-2-EventThread, state=TIMED_WAITING, group=TGRP-TestSolrCloudWithSecureImpersonation]         at sun.misc.Unsafe.park(Native Method)         at java.util.concurrent.locks.LockSupport.parkNanos(LockSupport.java:215)         at java.util.concurrent.locks.AbstractQueuedSynchronizer.doAcquireSharedNanos(AbstractQueuedSynchronizer.java:1037)         at java.util.concurrent.locks.AbstractQueuedSynchronizer.tryAcquireSharedNanos(AbstractQueuedSynchronizer.java:1328)         at java.util.concurrent.CountDownLatch.await(CountDownLatch.java:277)         at org.apache.curator.CuratorZookeeperClient.internalBlockUntilConnectedOrTimedOut(CuratorZookeeperClient.java:323)         at org.apache.curator.RetryLoop.callWithRetry(RetryLoop.java:105)         at org.apache.curator.framework.imps.GetDataBuilderImpl.pathInForeground(GetDataBuilderImpl.java:288)         at org.apache.curator.framework.imps.GetDataBuilderImpl.forPath(GetDataBuilderImpl.java:279)         at org.apache.curator.framework.imps.GetDataBuilderImpl.forPath(GetDataBuilderImpl.java:41)         at org.apache.curator.framework.recipes.shared.SharedValue.readValue(SharedValue.java:244)         at org.apache.curator.framework.recipes.shared.SharedValue.access$100(SharedValue.java:44)         at org.apache.curator.framework.recipes.shared.SharedValue$1.process(SharedValue.java:61)         at org.apache.curator.framework.imps.NamespaceWatcher.process(NamespaceWatcher.java:67)         at org.apache.zookeeper.ClientCnxn$EventThread.processEvent(ClientCnxn.java:530)         at org.apache.zookeeper.ClientCnxn$EventThread.run(ClientCnxn.java:505)    2) Thread[id=3870, name=jetty-launcher-1760-thread-1-EventThread, state=TIMED_WAITING, group=TGRP-TestSolrCloudWithSecureImpersonation]         at sun.misc.Unsafe.park(Native Method)         at java.util.concurrent.locks.LockSupport.parkNanos(LockSupport.java:215)         at java.util.concurrent.locks.AbstractQueuedSynchronizer.doAcquireSharedNanos(AbstractQueuedSynchronizer.java:1037)         at java.util.concurrent.locks.AbstractQueuedSynchronizer.tryAcquireSharedNanos(AbstractQueuedSynchronizer.java:1328)         at java.util.concurrent.CountDownLatch.await(CountDownLatch.java:277)         at org.apache.curator.CuratorZookeeperClient.internalBlockUntilConnectedOrTimedOut(CuratorZookeeperClient.java:323)         at org.apache.curator.RetryLoop.callWithRetry(RetryLoop.java:105)         at org.apache.curator.framework.imps.GetDataBuilderImpl.pathInForeground(GetDataBuilderImpl.java:288)         at org.apache.curator.framework.imps.GetDataBuilderImpl.forPath(GetDataBuilderImpl.java:279)         at org.apache.curator.framework.imps.GetDataBuilderImpl.forPath(GetDataBuilderImpl.java:41)         at org.apache.curator.framework.recipes.shared.SharedValue.readValue(SharedValue.java:244)         at org.apache.curator.framework.recipes.shared.SharedValue.access$100(SharedValue.java:44)         at org.apache.curator.framework.recipes.shared.SharedValue$1.process(SharedValue.java:61)         at org.apache.curator.framework.imps.NamespaceWatcher.process(NamespaceWatcher.java:67)         at org.apache.zookeeper.ClientCnxn$EventThread.processEvent(ClientCnxn.java:530)         at org.apache.zookeeper.ClientCnxn$EventThread.run(ClientCnxn.java:505)

Stack Trace:
com.carrotsearch.randomizedtesting.ThreadLeakError: 2 threads leaked from SUITE scope at org.apache.solr.cloud.TestSolrCloudWithSecureImpersonation: 
   1) Thread[id=3872, name=jetty-launcher-1760-thread-2-EventThread, state=TIMED_WAITING, group=TGRP-TestSolrCloudWithSecureImpersonation]
        at sun.misc.Unsafe.park(Native Method)
        at java.util.concurrent.locks.LockSupport.parkNanos(LockSupport.java:215)
        at java.util.concurrent.locks.AbstractQueuedSynchronizer.doAcquireSharedNanos(AbstractQueuedSynchronizer.java:1037)
        at java.util.concurrent.locks.AbstractQueuedSynchronizer.tryAcquireSharedNanos(AbstractQueuedSynchronizer.java:1328)
        at java.util.concurrent.CountDownLatch.await(CountDownLatch.java:277)
        at org.apache.curator.CuratorZookeeperClient.internalBlockUntilConnectedOrTimedOut(CuratorZookeeperClient.java:323)
        at org.apache.curator.RetryLoop.callWithRetry(RetryLoop.java:105)
        at org.apache.curator.framework.imps.GetDataBuilderImpl.pathInForeground(GetDataBuilderImpl.java:288)
        at org.apache.curator.framework.imps.GetDataBuilderImpl.forPath(GetDataBuilderImpl.java:279)
        at org.apache.curator.framework.imps.GetDataBuilderImpl.forPath(GetDataBuilderImpl.java:41)
        at org.apache.curator.framework.recipes.shared.SharedValue.readValue(SharedValue.java:244)
        at org.apache.curator.framework.recipes.shared.SharedValue.access$100(SharedValue.java:44)
        at org.apache.curator.framework.recipes.shared.SharedValue$1.process(SharedValue.java:61)
        at org.apache.curator.framework.imps.NamespaceWatcher.process(NamespaceWatcher.java:67)
        at org.apache.zookeeper.ClientCnxn$EventThread.processEvent(ClientCnxn.java:530)
        at org.apache.zookeeper.ClientCnxn$EventThread.run(ClientCnxn.java:505)
   2) Thread[id=3870, name=jetty-launcher-1760-thread-1-EventThread, state=TIMED_WAITING, group=TGRP-TestSolrCloudWithSecureImpersonation]
        at sun.misc.Unsafe.park(Native Method)
        at java.util.concurrent.locks.LockSupport.parkNanos(LockSupport.java:215)
        at java.util.concurrent.locks.AbstractQueuedSynchronizer.doAcquireSharedNanos(AbstractQueuedSynchronizer.java:1037)
        at java.util.concurrent.locks.AbstractQueuedSynchronizer.tryAcquireSharedNanos(AbstractQueuedSynchronizer.java:1328)
        at java.util.concurrent.CountDownLatch.await(CountDownLatch.java:277)
        at org.apache.curator.CuratorZookeeperClient.internalBlockUntilConnectedOrTimedOut(CuratorZookeeperClient.java:323)
        at org.apache.curator.RetryLoop.callWithRetry(RetryLoop.java:105)
        at org.apache.curator.framework.imps.GetDataBuilderImpl.pathInForeground(GetDataBuilderImpl.java:288)
        at org.apache.curator.framework.imps.GetDataBuilderImpl.forPath(GetDataBuilderImpl.java:279)
        at org.apache.curator.framework.imps.GetDataBuilderImpl.forPath(GetDataBuilderImpl.java:41)
        at org.apache.curator.framework.recipes.shared.SharedValue.readValue(SharedValue.java:244)
        at org.apache.curator.framework.recipes.shared.SharedValue.access$100(SharedValue.java:44)
        at org.apache.curator.framework.recipes.shared.SharedValue$1.process(SharedValue.java:61)
        at org.apache.curator.framework.imps.NamespaceWatcher.process(NamespaceWatcher.java:67)
        at org.apache.zookeeper.ClientCnxn$EventThread.processEvent(ClientCnxn.java:530)
        at org.apache.zookeeper.ClientCnxn$EventThread.run(ClientCnxn.java:505)
	at __randomizedtesting.SeedInfo.seed([6D0099E53257ACF1]:0)


FAILED:  junit.framework.TestSuite.org.apache.solr.security.hadoop.TestImpersonationWithHadoopAuth

Error Message:
2 threads leaked from SUITE scope at org.apache.solr.security.hadoop.TestImpersonationWithHadoopAuth:     1) Thread[id=38063, name=jetty-launcher-6911-thread-2-EventThread, state=TIMED_WAITING, group=TGRP-TestImpersonationWithHadoopAuth]         at sun.misc.Unsafe.park(Native Method)         at java.util.concurrent.locks.LockSupport.parkNanos(LockSupport.java:215)         at java.util.concurrent.locks.AbstractQueuedSynchronizer.doAcquireSharedNanos(AbstractQueuedSynchronizer.java:1037)         at java.util.concurrent.locks.AbstractQueuedSynchronizer.tryAcquireSharedNanos(AbstractQueuedSynchronizer.java:1328)         at java.util.concurrent.CountDownLatch.await(CountDownLatch.java:277)         at org.apache.curator.CuratorZookeeperClient.internalBlockUntilConnectedOrTimedOut(CuratorZookeeperClient.java:323)         at org.apache.curator.RetryLoop.callWithRetry(RetryLoop.java:105)         at org.apache.curator.framework.imps.GetDataBuilderImpl.pathInForeground(GetDataBuilderImpl.java:288)         at org.apache.curator.framework.imps.GetDataBuilderImpl.forPath(GetDataBuilderImpl.java:279)         at org.apache.curator.framework.imps.GetDataBuilderImpl.forPath(GetDataBuilderImpl.java:41)         at org.apache.curator.framework.recipes.shared.SharedValue.readValue(SharedValue.java:244)         at org.apache.curator.framework.recipes.shared.SharedValue.access$100(SharedValue.java:44)         at org.apache.curator.framework.recipes.shared.SharedValue$1.process(SharedValue.java:61)         at org.apache.curator.framework.imps.NamespaceWatcher.process(NamespaceWatcher.java:67)         at org.apache.zookeeper.ClientCnxn$EventThread.processEvent(ClientCnxn.java:530)         at org.apache.zookeeper.ClientCnxn$EventThread.run(ClientCnxn.java:505)    2) Thread[id=38075, name=jetty-launcher-6911-thread-1-EventThread, state=TIMED_WAITING, group=TGRP-TestImpersonationWithHadoopAuth]         at sun.misc.Unsafe.park(Native Method)         at java.util.concurrent.locks.LockSupport.parkNanos(LockSupport.java:215)         at java.util.concurrent.locks.AbstractQueuedSynchronizer.doAcquireSharedNanos(AbstractQueuedSynchronizer.java:1037)         at java.util.concurrent.locks.AbstractQueuedSynchronizer.tryAcquireSharedNanos(AbstractQueuedSynchronizer.java:1328)         at java.util.concurrent.CountDownLatch.await(CountDownLatch.java:277)         at org.apache.curator.CuratorZookeeperClient.internalBlockUntilConnectedOrTimedOut(CuratorZookeeperClient.java:323)         at org.apache.curator.RetryLoop.callWithRetry(RetryLoop.java:105)         at org.apache.curator.framework.imps.GetDataBuilderImpl.pathInForeground(GetDataBuilderImpl.java:288)         at org.apache.curator.framework.imps.GetDataBuilderImpl.forPath(GetDataBuilderImpl.java:279)         at org.apache.curator.framework.imps.GetDataBuilderImpl.forPath(GetDataBuilderImpl.java:41)         at org.apache.curator.framework.recipes.shared.SharedValue.readValue(SharedValue.java:244)         at org.apache.curator.framework.recipes.shared.SharedValue.access$100(SharedValue.java:44)         at org.apache.curator.framework.recipes.shared.SharedValue$1.process(SharedValue.java:61)         at org.apache.curator.framework.imps.NamespaceWatcher.process(NamespaceWatcher.java:67)         at org.apache.zookeeper.ClientCnxn$EventThread.processEvent(ClientCnxn.java:530)         at org.apache.zookeeper.ClientCnxn$EventThread.run(ClientCnxn.java:505)

Stack Trace:
com.carrotsearch.randomizedtesting.ThreadLeakError: 2 threads leaked from SUITE scope at org.apache.solr.security.hadoop.TestImpersonationWithHadoopAuth: 
   1) Thread[id=38063, name=jetty-launcher-6911-thread-2-EventThread, state=TIMED_WAITING, group=TGRP-TestImpersonationWithHadoopAuth]
        at sun.misc.Unsafe.park(Native Method)
        at java.util.concurrent.locks.LockSupport.parkNanos(LockSupport.java:215)
        at java.util.concurrent.locks.AbstractQueuedSynchronizer.doAcquireSharedNanos(AbstractQueuedSynchronizer.java:1037)
        at java.util.concurrent.locks.AbstractQueuedSynchronizer.tryAcquireSharedNanos(AbstractQueuedSynchronizer.java:1328)
        at java.util.concurrent.CountDownLatch.await(CountDownLatch.java:277)
        at org.apache.curator.CuratorZookeeperClient.internalBlockUntilConnectedOrTimedOut(CuratorZookeeperClient.java:323)
        at org.apache.curator.RetryLoop.callWithRetry(RetryLoop.java:105)
        at org.apache.curator.framework.imps.GetDataBuilderImpl.pathInForeground(GetDataBuilderImpl.java:288)
        at org.apache.curator.framework.imps.GetDataBuilderImpl.forPath(GetDataBuilderImpl.java:279)
        at org.apache.curator.framework.imps.GetDataBuilderImpl.forPath(GetDataBuilderImpl.java:41)
        at org.apache.curator.framework.recipes.shared.SharedValue.readValue(SharedValue.java:244)
        at org.apache.curator.framework.recipes.shared.SharedValue.access$100(SharedValue.java:44)
        at org.apache.curator.framework.recipes.shared.SharedValue$1.process(SharedValue.java:61)
        at org.apache.curator.framework.imps.NamespaceWatcher.process(NamespaceWatcher.java:67)
        at org.apache.zookeeper.ClientCnxn$EventThread.processEvent(ClientCnxn.java:530)
        at org.apache.zookeeper.ClientCnxn$EventThread.run(ClientCnxn.java:505)
   2) Thread[id=38075, name=jetty-launcher-6911-thread-1-EventThread, state=TIMED_WAITING, group=TGRP-TestImpersonationWithHadoopAuth]
        at sun.misc.Unsafe.park(Native Method)
        at java.util.concurrent.locks.LockSupport.parkNanos(LockSupport.java:215)
        at java.util.concurrent.locks.AbstractQueuedSynchronizer.doAcquireSharedNanos(AbstractQueuedSynchronizer.java:1037)
        at java.util.concurrent.locks.AbstractQueuedSynchronizer.tryAcquireSharedNanos(AbstractQueuedSynchronizer.java:1328)
        at java.util.concurrent.CountDownLatch.await(CountDownLatch.java:277)
        at org.apache.curator.CuratorZookeeperClient.internalBlockUntilConnectedOrTimedOut(CuratorZookeeperClient.java:323)
        at org.apache.curator.RetryLoop.callWithRetry(RetryLoop.java:105)
        at org.apache.curator.framework.imps.GetDataBuilderImpl.pathInForeground(GetDataBuilderImpl.java:288)
        at org.apache.curator.framework.imps.GetDataBuilderImpl.forPath(GetDataBuilderImpl.java:279)
        at org.apache.curator.framework.imps.GetDataBuilderImpl.forPath(GetDataBuilderImpl.java:41)
        at org.apache.curator.framework.recipes.shared.SharedValue.readValue(SharedValue.java:244)
        at org.apache.curator.framework.recipes.shared.SharedValue.access$100(SharedValue.java:44)
        at org.apache.curator.framework.recipes.shared.SharedValue$1.process(SharedValue.java:61)
        at org.apache.curator.framework.imps.NamespaceWatcher.process(NamespaceWatcher.java:67)
        at org.apache.zookeeper.ClientCnxn$EventThread.processEvent(ClientCnxn.java:530)
        at org.apache.zookeeper.ClientCnxn$EventThread.run(ClientCnxn.java:505)
	at __randomizedtesting.SeedInfo.seed([6D0099E53257ACF1]:0)




Build Log:
[...truncated 11551 lines...]
   [junit4] Suite: org.apache.solr.cloud.TestSolrCloudWithSecureImpersonation
   [junit4]   2> Creating dataDir: /export/home/jenkins/workspace/Lucene-Solr-master-Solaris/solr/build/solr-core/test/J1/temp/solr.cloud.TestSolrCloudWithSecureImpersonation_6D0099E53257ACF1-001/init-core-data-001
   [junit4]   2> 173340 WARN  (SUITE-TestSolrCloudWithSecureImpersonation-seed#[6D0099E53257ACF1]-worker) [    ] o.a.s.SolrTestCaseJ4 startTrackingSearchers: numOpens=1 numCloses=1
   [junit4]   2> 173340 INFO  (SUITE-TestSolrCloudWithSecureImpersonation-seed#[6D0099E53257ACF1]-worker) [    ] o.a.s.SolrTestCaseJ4 Using TrieFields (NUMERIC_POINTS_SYSPROP=false) w/NUMERIC_DOCVALUES_SYSPROP=false
   [junit4]   2> 173342 INFO  (SUITE-TestSolrCloudWithSecureImpersonation-seed#[6D0099E53257ACF1]-worker) [    ] o.a.s.SolrTestCaseJ4 Randomized ssl (false) and clientAuth (false) via: @org.apache.solr.util.RandomizeSSL(reason=, value=NaN, ssl=NaN, clientAuth=NaN)
   [junit4]   2> 173343 INFO  (SUITE-TestSolrCloudWithSecureImpersonation-seed#[6D0099E53257ACF1]-worker) [    ] o.a.s.SolrTestCaseJ4 SecureRandom sanity checks: test.solr.allowed.securerandom=null & java.security.egd=file:/dev/./urandom
   [junit4]   2> 173416 WARN  (SUITE-TestSolrCloudWithSecureImpersonation-seed#[6D0099E53257ACF1]-worker) [    ] o.a.h.u.NativeCodeLoader Unable to load native-hadoop library for your platform... using builtin-java classes where applicable
   [junit4]   2> 173599 INFO  (SUITE-TestSolrCloudWithSecureImpersonation-seed#[6D0099E53257ACF1]-worker) [    ] o.a.s.c.MiniSolrCloudCluster Starting cluster of 2 servers in /export/home/jenkins/workspace/Lucene-Solr-master-Solaris/solr/build/solr-core/test/J1/temp/solr.cloud.TestSolrCloudWithSecureImpersonation_6D0099E53257ACF1-001/tempDir-001
   [junit4]   2> 173599 INFO  (SUITE-TestSolrCloudWithSecureImpersonation-seed#[6D0099E53257ACF1]-worker) [    ] o.a.s.c.ZkTestServer STARTING ZK TEST SERVER
   [junit4]   2> 173600 INFO  (Thread-386) [    ] o.a.s.c.ZkTestServer client port:0.0.0.0/0.0.0.0:0
   [junit4]   2> 173600 INFO  (Thread-386) [    ] o.a.s.c.ZkTestServer Starting server
   [junit4]   2> 173602 ERROR (Thread-386) [    ] o.a.z.s.ZooKeeperServer ZKShutdownHandler is not registered, so ZooKeeper server won't take any action on ERROR or SHUTDOWN server state changes
   [junit4]   2> 173700 INFO  (SUITE-TestSolrCloudWithSecureImpersonation-seed#[6D0099E53257ACF1]-worker) [    ] o.a.s.c.ZkTestServer start zk server on port:44799
   [junit4]   2> 173710 INFO  (jetty-launcher-1760-thread-2) [    ] o.e.j.s.Server jetty-9.3.20.v20170531
   [junit4]   2> 173710 INFO  (jetty-launcher-1760-thread-1) [    ] o.e.j.s.Server jetty-9.3.20.v20170531
   [junit4]   2> 173712 INFO  (jetty-launcher-1760-thread-1) [    ] o.e.j.s.h.ContextHandler Started o.e.j.s.ServletContextHandler@303d7173{/solr,null,AVAILABLE}
   [junit4]   2> 173713 INFO  (jetty-launcher-1760-thread-2) [    ] o.e.j.s.h.ContextHandler Started o.e.j.s.ServletContextHandler@551ac2e4{/solr,null,AVAILABLE}
   [junit4]   2> 173714 INFO  (jetty-launcher-1760-thread-1) [    ] o.e.j.s.AbstractConnector Started ServerConnector@7df696bc{HTTP/1.1,[http/1.1]}{127.0.0.1:61798}
   [junit4]   2> 173715 INFO  (jetty-launcher-1760-thread-1) [    ] o.e.j.s.Server Started @175601ms
   [junit4]   2> 173715 INFO  (jetty-launcher-1760-thread-2) [    ] o.e.j.s.AbstractConnector Started ServerConnector@336f236e{HTTP/1.1,[http/1.1]}{127.0.0.1:54500}
   [junit4]   2> 173715 INFO  (jetty-launcher-1760-thread-1) [    ] o.a.s.c.s.e.JettySolrRunner Jetty properties: {hostContext=/solr, hostPort=61798}
   [junit4]   2> 173715 INFO  (jetty-launcher-1760-thread-2) [    ] o.e.j.s.Server Started @175601ms
   [junit4]   2> 173715 INFO  (jetty-launcher-1760-thread-2) [    ] o.a.s.c.s.e.JettySolrRunner Jetty properties: {hostContext=/solr, hostPort=54500}
   [junit4]   2> 173715 ERROR (jetty-launcher-1760-thread-1) [    ] o.a.s.u.StartupLoggingUtils Missing Java Option solr.log.dir. Logging may be missing or incomplete.
   [junit4]   2> 173715 INFO  (jetty-launcher-1760-thread-1) [    ] o.a.s.s.SolrDispatchFilter  ___      _       Welcome to Apache Solr™ version 8.0.0
   [junit4]   2> 173715 INFO  (jetty-launcher-1760-thread-1) [    ] o.a.s.s.SolrDispatchFilter / __| ___| |_ _   Starting in cloud mode on port null
   [junit4]   2> 173715 INFO  (jetty-launcher-1760-thread-1) [    ] o.a.s.s.SolrDispatchFilter \__ \/ _ \ | '_|  Install dir: null, Default config dir: null
   [junit4]   2> 173715 INFO  (jetty-launcher-1760-thread-1) [    ] o.a.s.s.SolrDispatchFilter |___/\___/_|_|    Start time: 2017-10-11T02:01:07.593Z
   [junit4]   2> 173715 ERROR (jetty-launcher-1760-thread-2) [    ] o.a.s.u.StartupLoggingUtils Missing Java Option solr.log.dir. Logging may be missing or incomplete.
   [junit4]   2> 173716 INFO  (jetty-launcher-1760-thread-2) [    ] o.a.s.s.SolrDispatchFilter  ___      _       Welcome to Apache Solr™ version 8.0.0
   [junit4]   2> 173716 INFO  (jetty-launcher-1760-thread-2) [    ] o.a.s.s.SolrDispatchFilter / __| ___| |_ _   Starting in cloud mode on port null
   [junit4]   2> 173716 INFO  (jetty-launcher-1760-thread-2) [    ] o.a.s.s.SolrDispatchFilter \__ \/ _ \ | '_|  Install dir: null, Default config dir: null
   [junit4]   2> 173716 INFO  (jetty-launcher-1760-thread-2) [    ] o.a.s.s.SolrDispatchFilter |___/\___/_|_|    Start time: 2017-10-11T02:01:07.594Z
   [junit4]   2> 173720 INFO  (jetty-launcher-1760-thread-1) [    ] o.a.s.s.SolrDispatchFilter solr.xml found in ZooKeeper. Loading...
   [junit4]   2> 173720 INFO  (jetty-launcher-1760-thread-2) [    ] o.a.s.s.SolrDispatchFilter solr.xml found in ZooKeeper. Loading...
   [junit4]   2> 173754 INFO  (jetty-launcher-1760-thread-1) [    ] o.a.s.c.ZkContainer Zookeeper client=127.0.0.1:44799/solr
   [junit4]   2> 173755 INFO  (jetty-launcher-1760-thread-2) [    ] o.a.s.c.ZkContainer Zookeeper client=127.0.0.1:44799/solr
   [junit4]   2> 173942 INFO  (jetty-launcher-1760-thread-1) [n:127.0.0.1:61798_solr    ] o.a.s.c.Overseer Overseer (id=null) closing
   [junit4]   2> 173943 INFO  (jetty-launcher-1760-thread-1) [n:127.0.0.1:61798_solr    ] o.a.s.c.OverseerElectionContext I am going to be the leader 127.0.0.1:61798_solr
   [junit4]   2> 173945 INFO  (jetty-launcher-1760-thread-2) [n:127.0.0.1:54500_solr    ] o.a.s.c.Overseer Overseer (id=null) closing
   [junit4]   2> 173945 INFO  (jetty-launcher-1760-thread-1) [n:127.0.0.1:61798_solr    ] o.a.s.c.Overseer Overseer (id=98807792761503750-127.0.0.1:61798_solr-n_0000000000) starting
   [junit4]   2> 173947 INFO  (jetty-launcher-1760-thread-2) [n:127.0.0.1:54500_solr    ] o.a.s.c.ZkController Register node as live in ZooKeeper:/live_nodes/127.0.0.1:54500_solr
   [junit4]   2> 173950 INFO  (zkCallback-1772-thread-1-processing-n:127.0.0.1:61798_solr) [n:127.0.0.1:61798_solr    ] o.a.s.c.c.ZkStateReader Updated live nodes from ZooKeeper... (0) -> (1)
   [junit4]   2> 173950 INFO  (zkCallback-1771-thread-1-processing-n:127.0.0.1:54500_solr) [n:127.0.0.1:54500_solr    ] o.a.s.c.c.ZkStateReader Updated live nodes from ZooKeeper... (0) -> (1)
   [junit4]   2> 173959 INFO  (jetty-launcher-1760-thread-1) [n:127.0.0.1:61798_solr    ] o.a.s.c.ZkController Register node as live in ZooKeeper:/live_nodes/127.0.0.1:61798_solr
   [junit4]   2> 173961 INFO  (zkCallback-1772-thread-1-processing-n:127.0.0.1:61798_solr) [n:127.0.0.1:61798_solr    ] o.a.s.c.c.ZkStateReader Updated live nodes from ZooKeeper... (1) -> (2)
   [junit4]   2> 173962 INFO  (zkCallback-1771-thread-1-processing-n:127.0.0.1:54500_solr) [n:127.0.0.1:54500_solr    ] o.a.s.c.c.ZkStateReader Updated live nodes from ZooKeeper... (1) -> (2)
   [junit4]   2> 173997 INFO  (jetty-launcher-1760-thread-1) [n:127.0.0.1:61798_solr    ] o.a.s.c.CoreContainer Initializing authentication plugin: org.apache.solr.security.HttpParamDelegationTokenPlugin
   [junit4]   2> 174000 WARN  (jetty-launcher-1760-thread-1) [n:127.0.0.1:61798_solr    ] o.a.s.c.s.i.Krb5HttpClientBuilder org.apache.solr.client.solrj.impl.Krb5HttpClientBuilder is configured without specifying system property 'java.security.auth.login.config'
   [junit4]   2> 174020 INFO  (jetty-launcher-1760-thread-1) [n:127.0.0.1:61798_solr    ] o.a.s.s.KerberosPlugin Params: {solr.kerberos.impersonator.user.noGroups.hosts=*, solr.kerberos.impersonator.user.bogusGroup.groups=__some_bogus_group, token.valid=30, cookie.domain=127.0.0.1, solr.kerberos.impersonator.user.anyHostAnyUser.groups=*, solr.kerberos.impersonator.user.bogusGroup.hosts=*, solr.kerberos.impersonator.user.anyHostAnyUser.hosts=*, token.validity=36000, solr.kerberos.impersonator.user.noHosts.groups=*, type=kerberos, solr.kerberos.impersonator.user.localHostAnyGroup.groups=*, delegation-token.token-kind=solr-dt, solr.kerberos.impersonator.user.wrongHost.hosts=1.1.1.1.1.1, cookie.path=/, zk-dt-secret-manager.znodeWorkingPath=solr/security/zkdtsm, solr.kerberos.impersonator.user.localHostAnyGroup.hosts=serv1-vm3,localhost,127.0.0.1, signer.secret.provider.zookeeper.path=/token, solr.kerberos.impersonator.user.anyHostUsersGroup.groups=staff, zk-dt-secret-manager.enable=true, solr.kerberos.impersonator.user.wrongHost.groups=*, kerberos.name.rules=DEFAULT, signer.secret.provider=zookeeper, solr.kerberos.impersonator.user.anyHostUsersGroup.hosts=*}
   [junit4]   2> 174047 INFO  (jetty-launcher-1760-thread-2) [n:127.0.0.1:54500_solr    ] o.a.s.c.CoreContainer Initializing authentication plugin: org.apache.solr.security.HttpParamDelegationTokenPlugin
   [junit4]   2> 174047 WARN  (jetty-launcher-1760-thread-2) [n:127.0.0.1:54500_solr    ] o.a.s.c.s.i.Krb5HttpClientBuilder org.apache.solr.client.solrj.impl.Krb5HttpClientBuilder is configured without specifying system property 'java.security.auth.login.config'
   [junit4]   2> 174048 INFO  (jetty-launcher-1760-thread-2) [n:127.0.0.1:54500_solr    ] o.a.s.s.KerberosPlugin Params: {solr.kerberos.impersonator.user.noGroups.hosts=*, solr.kerberos.impersonator.user.bogusGroup.groups=__some_bogus_group, token.valid=30, cookie.domain=127.0.0.1, solr.kerberos.impersonator.user.anyHostAnyUser.groups=*, solr.kerberos.impersonator.user.bogusGroup.hosts=*, solr.kerberos.impersonator.user.anyHostAnyUser.hosts=*, token.validity=36000, solr.kerberos.impersonator.user.noHosts.groups=*, type=kerberos, solr.kerberos.impersonator.user.localHostAnyGroup.groups=*, delegation-token.token-kind=solr-dt, solr.kerberos.impersonator.user.wrongHost.hosts=1.1.1.1.1.1, cookie.path=/, zk-dt-secret-manager.znodeWorkingPath=solr/security/zkdtsm, solr.kerberos.impersonator.user.localHostAnyGroup.hosts=serv1-vm3,localhost,127.0.0.1, signer.secret.provider.zookeeper.path=/token, solr.kerberos.impersonator.user.anyHostUsersGroup.groups=staff, zk-dt-secret-manager.enable=true, solr.kerberos.impersonator.user.wrongHost.groups=*, kerberos.name.rules=DEFAULT, signer.secret.provider=zookeeper, solr.kerberos.impersonator.user.anyHostUsersGroup.hosts=*}
   [junit4]   2> 174114 INFO  (jetty-launcher-1760-thread-2) [n:127.0.0.1:54500_solr    ] o.a.c.f.i.CuratorFrameworkImpl Starting
   [junit4]   2> 174114 INFO  (jetty-launcher-1760-thread-1) [n:127.0.0.1:61798_solr    ] o.a.c.f.i.CuratorFrameworkImpl Starting
   [junit4]   2> 174141 INFO  (jetty-launcher-1760-thread-1-EventThread) [n:127.0.0.1:61798_solr    ] o.a.c.f.s.ConnectionStateManager State change: CONNECTED
   [junit4]   2> 174141 INFO  (jetty-launcher-1760-thread-2-EventThread) [n:127.0.0.1:54500_solr    ] o.a.c.f.s.ConnectionStateManager State change: CONNECTED
   [junit4]   2> 174319 WARN  (jetty-launcher-1760-thread-2) [n:127.0.0.1:54500_solr    ] o.a.s.c.s.i.Krb5HttpClientBuilder org.apache.solr.client.solrj.impl.Krb5HttpClientBuilder is configured without specifying system property 'java.security.auth.login.config'
   [junit4]   2> 174320 WARN  (jetty-launcher-1760-thread-1) [n:127.0.0.1:61798_solr    ] o.a.s.c.s.i.Krb5HttpClientBuilder org.apache.solr.client.solrj.impl.Krb5HttpClientBuilder is configured without specifying system property 'java.security.auth.login.config'
   [junit4]   2> 174368 INFO  (jetty-launcher-1760-thread-2) [n:127.0.0.1:54500_solr    ] o.a.s.m.r.SolrJmxReporter JMX monitoring for 'solr_54500.solr.node' (registry 'solr.node') enabled at server: com.sun.jmx.mbeanserver.JmxMBeanServer@4d3c692a
   [junit4]   2> 174376 INFO  (jetty-launcher-1760-thread-1) [n:127.0.0.1:61798_solr    ] o.a.s.m.r.SolrJmxReporter JMX monitoring for 'solr_61798.solr.node' (registry 'solr.node') enabled at server: com.sun.jmx.mbeanserver.JmxMBeanServer@4d3c692a
   [junit4]   2> 174380 INFO  (jetty-launcher-1760-thread-2) [n:127.0.0.1:54500_solr    ] o.a.s.m.r.SolrJmxReporter JMX monitoring for 'solr_54500.solr.jvm' (registry 'solr.jvm') enabled at server: com.sun.jmx.mbeanserver.JmxMBeanServer@4d3c692a
   [junit4]   2> 174386 INFO  (jetty-launcher-1760-thread-1) [n:127.0.0.1:61798_solr    ] o.a.s.m.r.SolrJmxReporter JMX monitoring for 'solr_61798.solr.jvm' (registry 'solr.jvm') enabled at server: com.sun.jmx.mbeanserver.JmxMBeanServer@4d3c692a
   [junit4]   2> 174387 INFO  (jetty-launcher-1760-thread-1) [n:127.0.0.1:61798_solr    ] o.a.s.m.r.SolrJmxReporter JMX monitoring for 'solr_61798.solr.jetty' (registry 'solr.jetty') enabled at server: com.sun.jmx.mbeanserver.JmxMBeanServer@4d3c692a
   [junit4]   2> 174387 INFO  (jetty-launcher-1760-thread-1) [n:127.0.0.1:61798_solr    ] o.a.s.c.CorePropertiesLocator Found 0 core definitions underneath /export/home/jenkins/workspace/Lucene-Solr-master-Solaris/solr/build/solr-core/test/J1/temp/solr.cloud.TestSolrCloudWithSecureImpersonation_6D0099E53257ACF1-001/tempDir-001/node1/.
   [junit4]   2> 174390 INFO  (jetty-launcher-1760-thread-2) [n:127.0.0.1:54500_solr    ] o.a.s.m.r.SolrJmxReporter JMX monitoring for 'solr_54500.solr.jetty' (registry 'solr.jetty') enabled at server: com.sun.jmx.mbeanserver.JmxMBeanServer@4d3c692a
   [junit4]   2> 174391 INFO  (jetty-launcher-1760-thread-2) [n:127.0.0.1:54500_solr    ] o.a.s.c.CorePropertiesLocator Found 0 core definitions underneath /export/home/jenkins/workspace/Lucene-Solr-master-Solaris/solr/build/solr-core/test/J1/temp/solr.cloud.TestSolrCloudWithSecureImpersonation_6D0099E53257ACF1-001/tempDir-001/node2/.
   [junit4]   2> 174465 INFO  (TEST-TestSolrCloudWithSecureImpersonation.testProxyNoConfigHosts-seed#[6D0099E53257ACF1]) [    ] o.a.s.SolrTestCaseJ4 ###Starting testProxyNoConfigHosts
   [junit4]   2> 174901 WARN  (TEST-TestSolrCloudWithSecureImpersonation.testProxyNoConfigHosts-seed#[6D0099E53257ACF1]) [    ] o.a.h.c.p.ResponseProcessCookies Invalid cookie header: "Set-Cookie: hadoop.auth="u=noHosts&p=noHosts&t=test&e=1507723268363&s=Yja8wVQt0ddKirUFACm/Di0QvXA="; Path=/; Domain=127.0.0.1; Expires=   , 11-   -2017 12:01:08 GMT; HttpOnly". Invalid 'expires' attribute: , 11- -2017 12:01:08 GMT
   [junit4]   2> 174902 INFO  (TEST-TestSolrCloudWithSecureImpersonation.testProxyNoConfigHosts-seed#[6D0099E53257ACF1]) [    ] o.a.s.SolrTestCaseJ4 ###Ending testProxyNoConfigHosts
   [junit4]   2> 174920 INFO  (TEST-TestSolrCloudWithSecureImpersonation.testProxyWrongHost-seed#[6D0099E53257ACF1]) [    ] o.a.s.SolrTestCaseJ4 ###Starting testProxyWrongHost
   [junit4]   2> 184065 WARN  (TEST-TestSolrCloudWithSecureImpersonation.testProxyWrongHost-seed#[6D0099E53257ACF1]) [    ] o.a.h.c.p.ResponseProcessCookies Invalid cookie header: "Set-Cookie: hadoop.auth="u=wrongHost&p=wrongHost&t=test&e=1507723268799&s=eIBXORlOQMbfixHELIVSoYcVJBA="; Path=/; Domain=127.0.0.1; Expires=   , 11-   -2017 12:01:08 GMT; HttpOnly". Invalid 'expires' attribute: , 11- -2017 12:01:08 GMT
   [junit4]   2> 184066 INFO  (TEST-TestSolrCloudWithSecureImpersonation.testProxyWrongHost-seed#[6D0099E53257ACF1]) [    ] o.a.s.SolrTestCaseJ4 ###Ending testProxyWrongHost
   [junit4]   2> 184088 INFO  (TEST-TestSolrCloudWithSecureImpersonation.testProxyValidateAnyHostAnyUser-seed#[6D0099E53257ACF1]) [    ] o.a.s.SolrTestCaseJ4 ###Starting testProxyValidateAnyHostAnyUser
   [junit4]   2> 184093 INFO  (qtp343197219-3828) [n:127.0.0.1:54500_solr    ] o.a.s.h.a.CollectionsHandler Invoked Collection Action :list with params doAs=bar&action=LIST&wt=javabin&version=2 and sendToOCPQueue=true
   [junit4]   2> 184093 INFO  (qtp343197219-3828) [n:127.0.0.1:54500_solr    ] o.a.s.s.HttpSolrCall [admin] webapp=null path=/admin/collections params={doAs=bar&action=LIST&wt=javabin&version=2} status=0 QTime=0
   [junit4]   2> 184094 WARN  (TEST-TestSolrCloudWithSecureImpersonation.testProxyValidateAnyHostAnyUser-seed#[6D0099E53257ACF1]) [    ] o.a.h.c.p.ResponseProcessCookies Invalid cookie header: "Set-Cookie: hadoop.auth="u=anyHostAnyUser&p=anyHostAnyUser&t=test&e=1507723277967&s=s9NriPahttkQLL32uAlXu4prrJc="; Path=/; Domain=127.0.0.1; Expires=   , 11-   -2017 12:01:17 GMT; HttpOnly". Invalid 'expires' attribute: , 11- -2017 12:01:17 GMT
   [junit4]   2> 184094 INFO  (TEST-TestSolrCloudWithSecureImpersonation.testProxyValidateAnyHostAnyUser-seed#[6D0099E53257ACF1]) [    ] o.a.s.SolrTestCaseJ4 ###Ending testProxyValidateAnyHostAnyUser
   [junit4]   2> 184111 INFO  (TEST-TestSolrCloudWithSecureImpersonation.testProxyInvalidProxyUser-seed#[6D0099E53257ACF1]) [    ] o.a.s.SolrTestCaseJ4 ###Starting testProxyInvalidProxyUser
   [junit4]   2> 184115 WARN  (TEST-TestSolrCloudWithSecureImpersonation.testProxyInvalidProxyUser-seed#[6D0099E53257ACF1]) [    ] o.a.h.c.p.ResponseProcessCookies Invalid cookie header: "Set-Cookie: hadoop.auth="u=bar&p=bar&t=test&e=1507723277990&s=HEeTzaDvNVqkIK1UpYs7iArdtbk="; Path=/; Domain=127.0.0.1; Expires=   , 11-   -2017 12:01:17 GMT; HttpOnly". Invalid 'expires' attribute: , 11- -2017 12:01:17 GMT
   [junit4]   2> 184115 INFO  (TEST-TestSolrCloudWithSecureImpersonation.testProxyInvalidProxyUser-seed#[6D0099E53257ACF1]) [    ] o.a.s.SolrTestCaseJ4 ###Ending testProxyInvalidProxyUser
   [junit4]   2> 184143 INFO  (TEST-TestSolrCloudWithSecureImpersonation.testProxyNullProxyUser-seed#[6D0099E53257ACF1]) [    ] o.a.s.SolrTestCaseJ4 ###Starting testProxyNullProxyUser
   [junit4]   2> 184144 INFO  (qtp343197219-3830) [    ] o.a.s.s.SolrDispatchFilter Error authenticating
   [junit4]   2> java.lang.IllegalArgumentException: userName is NULL, empty or contains a '&'
   [junit4]   2> 	at org.apache.hadoop.security.authentication.util.AuthToken.checkForIllegalArgument(AuthToken.java:87)
   [junit4]   2> 	at org.apache.hadoop.security.authentication.util.AuthToken.<init>(AuthToken.java:70)
   [junit4]   2> 	at org.apache.hadoop.security.authentication.server.AuthenticationToken.<init>(AuthenticationToken.java:58)
   [junit4]   2> 	at org.apache.solr.security.HttpParamDelegationTokenPlugin$HttpParamDelegationTokenAuthenticationHandler$HttpParamAuthenticationHandler.authenticate(HttpParamDelegationTokenPlugin.java:213)
   [junit4]   2> 	at org.apache.hadoop.security.token.delegation.web.DelegationTokenAuthenticationHandler.authenticate(DelegationTokenAuthenticationHandler.java:348)
   [junit4]   2> 	at org.apache.solr.security.RequestContinuesRecorderAuthenticationHandler.authenticate(RequestContinuesRecorderAuthenticationHandler.java:69)
   [junit4]   2> 	at org.apache.hadoop.security.authentication.server.AuthenticationFilter.doFilter(AuthenticationFilter.java:518)
   [junit4]   2> 	at org.apache.solr.security.DelegationTokenKerberosFilter.doFilter(DelegationTokenKerberosFilter.java:134)
   [junit4]   2> 	at org.apache.solr.security.HttpParamDelegationTokenPlugin$HttpParamToRequestFilter.doFilter(HttpParamDelegationTokenPlugin.java:245)
   [junit4]   2> 	at org.apache.solr.security.KerberosPlugin.doAuthenticate(KerberosPlugin.java:243)
   [junit4]   2> 	at org.apache.solr.servlet.SolrDispatchFilter.authenticateRequest(SolrDispatchFilter.java:451)
   [junit4]   2> 	at org.apache.solr.servlet.SolrDispatchFilter.doFilter(SolrDispatchFilter.java:347)
   [junit4]   2> 	at org.apache.solr.servlet.SolrDispatchFilter.doFilter(SolrDispatchFilter.java:326)
   [junit4]   2> 	at org.eclipse.jetty.servlet.ServletHandler$CachedChain.doFilter(ServletHandler.java:1759)
   [junit4]   2> 	at org.apache.solr.client.solrj.embedded.JettySolrRunner$DebugFilter.doFilter(JettySolrRunner.java:139)
   [junit4]   2> 	at org.eclipse.jetty.servlet.ServletHandler$CachedChain.doFilter(ServletHandler.java:1759)
   [junit4]   2> 	at org.eclipse.jetty.servlet.ServletHandler.doHandle(ServletHandler.java:582)
   [junit4]   2> 	at org.eclipse.jetty.server.session.SessionHandler.doHandle(SessionHandler.java:224)
   [junit4]   2> 	at org.eclipse.jetty.server.handler.ContextHandler.doHandle(ContextHandler.java:1180)
   [junit4]   2> 	at org.eclipse.jetty.servlet.ServletHandler.doScope(ServletHandler.java:512)
   [junit4]   2> 	at org.eclipse.jetty.server.session.SessionHandler.doScope(SessionHandler.java:185)
   [junit4]   2> 	at org.eclipse.jetty.server.handler.ContextHandler.doScope(ContextHandler.java:1112)
   [junit4]   2> 	at org.eclipse.jetty.server.handler.ScopedHandler.handle(ScopedHandler.java:141)
   [junit4]   2> 	at org.eclipse.jetty.server.handler.gzip.GzipHandler.handle(GzipHandler.java:493)
   [junit4]   2> 	at org.eclipse.jetty.server.handler.HandlerWrapper.handle(HandlerWrapper.java:134)
   [junit4]   2> 	at org.eclipse.jetty.server.Server.handle(Server.java:534)
   [junit4]   2> 	at org.eclipse.jetty.server.HttpChannel.handle(HttpChannel.java:320)
   [junit4]   2> 	at org.eclipse.jetty.server.HttpConnection.onFillable(HttpConnection.java:251)
   [junit4]   2> 	at org.eclipse.jetty.io.AbstractConnection$ReadCallback.succeeded(AbstractConnection.java:283)
   [junit4]   2> 	at org.eclipse.jetty.io.FillInterest.fillable(FillInterest.java:108)
   [junit4]   2> 	at org.eclipse.jetty.io.SelectChannelEndPoint$2.run(SelectChannelEndPoint.java:93)
   [junit4]   2> 	at org.eclipse.jetty.util.thread.strategy.ExecuteProduceConsume.executeProduceConsume(ExecuteProduceConsume.java:303)
   [junit4]   2> 	at org.eclipse.jetty.util.thread.strategy.ExecuteProduceConsume.produceConsume(ExecuteProduceConsume.java:148)
   [junit4]   2> 	at org.eclipse.jetty.util.thread.strategy.ExecuteProduceConsume.run(ExecuteProduceConsume.java:136)
   [junit4]   2> 	at org.eclipse.jetty.util.thread.QueuedThreadPool.runJob(QueuedThreadPool.java:671)
   [junit4]   2> 	at org.eclipse.jetty.util.thread.QueuedThreadPool$2.run(QueuedThreadPool.java:589)
   [junit4]   2> 	at java.lang.Thread.run(Thread.java:748)
   [junit4]   2> 184145 WARN  (qtp343197219-3830) [    ] o.e.j.s.ServletHandler /solr/admin/collections
   [junit4]   2> org.apache.solr.common.SolrException: Error during request authentication, 
   [junit4]   2> 	at org.apache.solr.servlet.SolrDispatchFilter.authenticateRequest(SolrDispatchFilter.java:457)
   [junit4]   2> 	at org.apache.solr.servlet.SolrDispatchFilter.doFilter(SolrDispatchFilter.java:347)
   [junit4]   2> 	at org.apache.solr.servlet.SolrDispatchFilter.doFilter(SolrDispatchFilter.java:326)
   [junit4]   2> 	at org.eclipse.jetty.servlet.ServletHandler$CachedChain.doFilter(ServletHandler.java:1759)
   [junit4]   2> 	at org.apache.solr.client.solrj.embedded.JettySolrRunner$DebugFilter.doFilter(JettySolrRunner.java:139)
   [junit4]   2> 	at org.eclipse.jetty.servlet.ServletHandler$CachedChain.doFilter(ServletHandler.java:1759)
   [junit4]   2> 	at org.eclipse.jetty.servlet.ServletHandler.doHandle(ServletHandler.java:582)
   [junit4]   2> 	at org.eclipse.jetty.server.session.SessionHandler.doHandle(SessionHandler.java:224)
   [junit4]   2> 	at org.eclipse.jetty.server.handler.ContextHandler.doHandle(ContextHandler.java:1180)
   [junit4]   2> 	at org.eclipse.jetty.servlet.ServletHandler.doScope(ServletHandler.java:512)
   [junit4]   2> 	at org.eclipse.jetty.server.session.SessionHandler.doScope(SessionHandler.java:185)
   [junit4]   2> 	at org.eclipse.jetty.server.handler.ContextHandler.doScope(ContextHandler.java:1112)
   [junit4]   2> 	at org.eclipse.jetty.server.handler.ScopedHandler.handle(ScopedHandler.java:141)
   [junit4]   2> 	at org.eclipse.jetty.server.handler.gzip.GzipHandler.handle(GzipHandler.java:493)
   [junit4]   2> 	at org.eclipse.jetty.server.handler.HandlerWrapper.handle(HandlerWrapper.java:134)
   [junit4]   2> 	at org.eclipse.jetty.server.Server.handle(Server.java:534)
   [junit4]   2> 	at org.eclipse.jetty.server.HttpChannel.handle(HttpChannel.java:320)
   [junit4]   2> 	at org.eclipse.jetty.server.HttpConnection.onFillable(HttpConnection.java:251)
   [junit4]   2> 	at org.eclipse.jetty.io.AbstractConnection$ReadCallback.succeeded(AbstractConnection.java:283)
   [junit4]   2> 	at org.eclipse.jetty.io.FillInterest.fillable(FillInterest.java:108)
   [junit4]   2> 	at org.eclipse.jetty.io.SelectChannelEndPoint$2.run(SelectChannelEndPoint.java:93)
   [junit4]   2> 	at org.eclipse.jetty.util.thread.strategy.ExecuteProduceConsume.executeProduceConsume(ExecuteProduceConsume.java:303)
   [junit4]   2> 	at org.eclipse.jetty.util.thread.strategy.ExecuteProduceConsume.produceConsume(ExecuteProduceConsume.java:148)
   [junit4]   2> 	at org.eclipse.jetty.util.thread.strategy.ExecuteProduceConsume.run(ExecuteProduceConsume.java:136)
   [junit4]   2> 	at org.eclipse.jetty.util.thread.QueuedThreadPool.runJob(QueuedThreadPool.java:671)
   [junit4]   2> 	at org.eclipse.jetty.util.thread.QueuedThreadPool$2.run(QueuedThreadPool.java:589)
   [junit4]   2> 	at java.lang.Thread.run(Thread.java:748)
   [junit4]   2> Caused by: java.lang.IllegalArgumentException: userName is NULL, empty or contains a '&'
   [junit4]   2> 	at org.apache.hadoop.security.authentication.util.AuthToken.checkForIllegalArgument(AuthToken.java:87)
   [junit4]   2> 	at org.apache.hadoop.security.authentication.util.AuthToken.<init>(AuthToken.java:70)
   [junit4]   2> 	at org.apache.hadoop.security.authentication.server.AuthenticationToken.<init>(AuthenticationToken.java:58)
   [junit4]   2> 	at org.apache.solr.security.HttpParamDelegationTokenPlugin$HttpParamDelegationTokenAuthenticationHandler$HttpParamAuthenticationHandler.authenticate(HttpParamDelegationTokenPlugin.java:213)
   [junit4]   2> 	at org.apache.hadoop.security.token.delegation.web.DelegationTokenAuthenticationHandler.authenticate(DelegationTokenAuthenticationHandler.java:348)
   [junit4]   2> 	at org.apache.solr.security.RequestContinuesRecorderAuthenticationHandler.authenticate(RequestContinuesRecorderAuthenticationHandler.java:69)
   [junit4]   2> 	at org.apache.hadoop.security.authentication.server.AuthenticationFilter.doFilter(AuthenticationFilter.java:518)
   [junit4]   2> 	at org.apache.solr.security.DelegationTokenKerberosFilter.doFilter(DelegationTokenKerberosFilter.java:134)
   [junit4]   2> 	at org.apache.solr.security.HttpParamDelegationTokenPlugin$HttpParamToRequestFilter.doFilter(HttpParamDelegationTokenPlugin.java:245)
   [junit4]   2> 	at org.apache.solr.security.KerberosPlugin.doAuthenticate(KerberosPlugin.java:243)
   [junit4]   2> 	at org.apache.solr.servlet.SolrDispatchFilter.authenticateRequest(SolrDispatchFilter.java:451)
   [junit4]   2> 	... 26 more
   [junit4]   2> 184149 INFO  (TEST-TestSolrCloudWithSecureImpersonation.testProxyNullProxyUser-seed#[6D0099E53257ACF1]) [    ] o.a.s.SolrTestCaseJ4 ###Ending testProxyNullProxyUser
   [junit4]   2> 184167 INFO  (TEST-TestSolrCloudWithSecureImpersonation.testProxyValidateGroup-seed#[6D0099E53257ACF1]) [    ] o.a.s.SolrTestCaseJ4 ###Starting testProxyValidateGroup
   [junit4]   2> 184214 INFO  (qtp343197219-3834) [n:127.0.0.1:54500_solr    ] o.a.s.h.a.CollectionsHandler Invoked Collection Action :list with params doAs=jenkins&action=LIST&wt=javabin&version=2 and sendToOCPQueue=true
   [junit4]   2> 184214 INFO  (qtp343197219-3834) [n:127.0.0.1:54500_solr    ] o.a.s.s.HttpSolrCall [admin] webapp=null path=/admin/collections params={doAs=jenkins&action=LIST&wt=javabin&version=2} status=0 QTime=0
   [junit4]   2> 184215 WARN  (TEST-TestSolrCloudWithSecureImpersonation.testProxyValidateGroup-seed#[6D0099E53257ACF1]) [    ] o.a.h.c.p.ResponseProcessCookies Invalid cookie header: "Set-Cookie: hadoop.auth="u=anyHostUsersGroup&p=anyHostUsersGroup&t=test&e=1507723278046&s=ggb3V7AKfCiJ0Ru7rQmoFF3l5Dk="; Path=/; Domain=127.0.0.1; Expires=   , 11-   -2017 12:01:18 GMT; HttpOnly". Invalid 'expires' attribute: , 11- -2017 12:01:18 GMT
   [junit4]   2> 184215 INFO  (TEST-TestSolrCloudWithSecureImpersonation.testProxyValidateGroup-seed#[6D0099E53257ACF1]) [    ] o.a.s.SolrTestCaseJ4 ###Ending testProxyValidateGroup
   [junit4]   2> 184262 INFO  (TEST-TestSolrCloudWithSecureImpersonation.testProxyInvalidGroup-seed#[6D0099E53257ACF1]) [    ] o.a.s.SolrTestCaseJ4 ###Starting testProxyInvalidGroup
   [junit4]   2> 184280 WARN  (qtp343197219-3824) [    ] o.a.h.s.ShellBasedUnixGroupsMapping got exception trying to get groups for user bar: id: invalid user name: "bar"
   [junit4]   2> id: invalid user name: "bar"
   [junit4]   2> 
   [junit4]   2> 184283 WARN  (TEST-TestSolrCloudWithSecureImpersonation.testProxyInvalidGroup-seed#[6D0099E53257ACF1]) [    ] o.a.h.c.p.ResponseProcessCookies Invalid cookie header: "Set-Cookie: hadoop.auth="u=bogusGroup&p=bogusGroup&t=test&e=1507723278141&s=jTVo5qEdCbjv1sWEF1xvfPocOCk="; Path=/; Domain=127.0.0.1; Expires=   , 11-   -2017 12:01:18 GMT; HttpOnly". Invalid 'expires' attribute: , 11- -2017 12:01:18 GMT
   [junit4]   2> 184283 INFO  (TEST-TestSolrCloudWithSecureImpersonation.testProxyInvalidGroup-seed#[6D0099E53257ACF1]) [    ] o.a.s.SolrTestCaseJ4 ###Ending testProxyInvalidGroup
   [junit4]   2> 184314 INFO  (TEST-TestSolrCloudWithSecureImpersonation.testProxyInvalidRemote-seed#[6D0099E53257ACF1]) [    ] o.a.s.SolrTestCaseJ4 ###Starting testProxyInvalidRemote
   [junit4]   2> 184324 WARN  (TEST-TestSolrCloudWithSecureImpersonation.testProxyInvalidRemote-seed#[6D0099E53257ACF1]) [    ] o.a.h.c.p.ResponseProcessCookies Invalid cookie header: "Set-Cookie: hadoop.auth="u=localHostAnyGroup&p=localHostAnyGroup&t=test&e=1507723278194&s=ZHJMhnljW1CkrOy41c8p95qcoOA="; Path=/; Domain=127.0.0.1; Expires=   , 11-   -2017 12:01:18 GMT; HttpOnly". Invalid 'expires' attribute: , 11- -2017 12:01:18 GMT
   [junit4]   2> 184324 INFO  (TEST-TestSolrCloudWithSecureImpersonation.testProxyInvalidRemote-seed#[6D0099E53257ACF1]) [    ] o.a.s.SolrTestCaseJ4 ###Ending testProxyInvalidRemote
   [junit4]   2> 184404 INFO  (TEST-TestSolrCloudWithSecureImpersonation.testProxyNoConfigGroups-seed#[6D0099E53257ACF1]) [    ] o.a.s.SolrTestCaseJ4 ###Starting testProxyNoConfigGroups
   [junit4]   2> 184407 WARN  (TEST-TestSolrCloudWithSecureImpersonation.testProxyNoConfigGroups-seed#[6D0099E53257ACF1]) [    ] o.a.h.c.p.ResponseProcessCookies Invalid cookie header: "Set-Cookie: hadoop.auth="u=noGroups&p=noGroups&t=test&e=1507723278282&s=YvnvSySleiJA2fzdhAydujD8GoA="; Path=/; Domain=127.0.0.1; Expires=   , 11-   -2017 12:01:18 GMT; HttpOnly". Invalid 'expires' attribute: , 11- -2017 12:01:18 GMT
   [junit4]   2> 184407 INFO  (TEST-TestSolrCloudWithSecureImpersonation.testProxyNoConfigGroups-seed#[6D0099E53257ACF1]) [    ] o.a.s.SolrTestCaseJ4 ###Ending testProxyNoConfigGroups
   [junit4]   2> 184438 INFO  (TEST-TestSolrCloudWithSecureImpersonation.testForwarding-seed#[6D0099E53257ACF1]) [    ] o.a.s.SolrTestCaseJ4 ###Starting testForwarding
   [junit4]   2> 185342 INFO  (TEST-TestSolrCloudWithSecureImpersonation.testForwarding-seed#[6D0099E53257ACF1]) [    ] o.a.s.c.c.ZkStateReader Updated live nodes from ZooKeeper... (0) -> (2)
   [junit4]   2> 185343 INFO  (TEST-TestSolrCloudWithSecureImpersonation.testForwarding-seed#[6D0099E53257ACF1]) [    ] o.a.s.c.s.i.ZkClientClusterStateProvider Cluster at 127.0.0.1:44799/solr ready
   [junit4]   2> 185344 INFO  (qtp343197219-3828) [n:127.0.0.1:54500_solr    ] o.a.s.h.a.CollectionsHandler Invoked Collection Action :create with params pullReplicas=0&replicationFactor=1&collection.configName=conf1&maxShardsPerNode=1&name=forwardingCollection&nrtReplicas=1&action=CREATE&numShards=1&tlogReplicas=0&wt=javabin&version=2 and sendToOCPQueue=true
   [junit4]   2> 185353 INFO  (OverseerThreadFactory-1049-thread-1-processing-n:127.0.0.1:61798_solr) [n:127.0.0.1:61798_solr    ] o.a.s.c.CreateCollectionCmd Create collection forwardingCollection
   [junit4]   2> 185487 INFO  (OverseerStateUpdate-98807792761503750-127.0.0.1:61798_solr-n_0000000000) [n:127.0.0.1:61798_solr    ] o.a.s.c.o.SliceMutator createReplica() {
   [junit4]   2>   "operation":"ADDREPLICA",
   [junit4]   2>   "collection":"forwardingCollection",
   [junit4]   2>   "shard":"shard1",
   [junit4]   2>   "core":"forwardingCollection_shard1_replica_n1",
   [junit4]   2>   "state":"down",
   [junit4]   2>   "base_url":"http://127.0.0.1:54500/solr",
   [junit4]   2>   "type":"NRT"} 
   [junit4]   2> 185691 INFO  (qtp343197219-3830) [n:127.0.0.1:54500_solr    ] o.a.s.h.a.CoreAdminOperation core create command qt=/admin/cores&coreNodeName=core_node2&collection.configName=conf1&newCollection=true&name=forwardingCollection_shard1_replica_n1&action=CREATE&numShards=1&collection=forwardingCollection&shard=shard1&wt=javabin&version=2&replicaType=NRT
   [junit4]   2> 185692 INFO  (qtp343197219-3830) [n:127.0.0.1:54500_solr    ] o.a.s.c.TransientSolrCoreCacheDefault Allocating transient cache for 2147483647 transient cores
   [junit4]   2> 185802 INFO  (zkCallback-1771-thread-1-processing-n:127.0.0.1:54500_solr) [n:127.0.0.1:54500_solr    ] o.a.s.c.c.ZkStateReader A cluster state change: [WatchedEvent state:SyncConnected type:NodeDataChanged path:/collections/forwardingCollection/state.json] for collection [forwardingCollection] has occurred - updating... (live nodes size: [2])
   [junit4]   2> 185803 INFO  (zkCallback-1771-thread-2-processing-n:127.0.0.1:54500_solr) [n:127.0.0.1:54500_solr    ] o.a.s.c.c.ZkStateReader A cluster state change: [WatchedEvent state:SyncConnected type:NodeDataChanged path:/collections/forwardingCollection/state.json] for collection [forwardingCollection] has occurred - updating... (live nodes size: [2])
   [junit4]   2> 186745 INFO  (qtp343197219-3830) [n:127.0.0.1:54500_solr c:forwardingCollection s:shard1 r:core_node2 x:forwardingCollection_shard1_replica_n1] o.a.s.c.SolrConfig Using Lucene MatchVersion: 8.0.0
   [junit4]   2> 186768 INFO  (qtp343197219-3830) [n:127.0.0.1:54500_solr c:forwardingCollection s:shard1 r:core_node2 x:forwardingCollection_shard1_replica_n1] o.a.s.s.IndexSchema [forwardingCollection_shard1_replica_n1] Schema name=test
   [junit4]   2> 186868 INFO  (qtp343197219-3830) [n:127.0.0.1:54500_solr c:forwardingCollection s:shard1 r:core_node2 x:forwardingCollection_shard1_replica_n1] o.a.s.s.IndexSchema Loaded schema test/1.0 with uniqueid field id
   [junit4]   2> 187070 INFO  (qtp343197219-3830) [n:127.0.0.1:54500_solr c:forwardingCollection s:shard1 r:core_node2 x:forwardingCollection_shard1_replica_n1] o.a.s.c.CoreContainer Creating SolrCore 'forwardingCollection_shard1_replica_n1' using configuration from collection forwardingCollection, trusted=true
   [junit4]   2> 187070 INFO  (qtp343197219-3830) [n:127.0.0.1:54500_solr c:forwardingCollection s:shard1 r:core_node2 x:forwardingCollection_shard1_replica_n1] o.a.s.m.r.SolrJmxReporter JMX monitoring for 'solr_54500.solr.core.forwardingCollection.shard1.replica_n1' (registry 'solr.core.forwardingCollection.shard1.replica_n1') enabled at server: com.sun.jmx.mbeanserver.JmxMBeanServer@4d3c692a
   [junit4]   2> 187071 INFO  (qtp343197219-3830) [n:127.0.0.1:54500_solr c:forwardingCollection s:shard1 r:core_node2 x:forwardingCollection_shard1_replica_n1] o.a.s.c.SolrCore solr.RecoveryStrategy.Builder
   [junit4]   2> 187071 INFO  (qtp343197219-3830) [n:127.0.0.1:54500_solr c:forwardingCollection s:shard1 r:core_node2 x:forwardingCollection_shard1_replica_n1] o.a.s.c.SolrCore [[forwardingCollection_shard1_replica_n1] ] Opening new SolrCore at [/export/home/jenkins/workspace/Lucene-Solr-master-Solaris/solr/build/solr-core/test/J1/temp/solr.cloud.TestSolrCloudWithSecureImpersonation_6D0099E53257ACF1-001/tempDir-001/node2/forwardingCollection_shard1_replica_n1], dataDir=[/export/home/jenkins/workspace/Lucene-Solr-master-Solaris/solr/build/solr-core/test/J1/temp/solr.cloud.TestSolrCloudWithSecureImpersonation_6D0099E53257ACF1-001/tempDir-001/node2/./forwardingCollection_shard1_replica_n1/data/]
   [junit4]   2> 187074 INFO  (qtp343197219-3830) [n:127.0.0.1:54500_solr c:forwardingCollection s:shard1 r:core_node2 x:forwardingCollection_shard1_replica_n1] o.a.s.u.RandomMergePolicy RandomMergePolicy wrapping class org.apache.lucene.index.TieredMergePolicy: [TieredMergePolicy: maxMergeAtOnce=30, maxMergeAtOnceExplicit=13, maxMergedSegmentMB=67.5302734375, floorSegmentMB=0.3037109375, forceMergeDeletesPctAllowed=29.787116229889943, segmentsPerTier=23.0, maxCFSSegmentSizeMB=8.796093022207999E12, noCFSRatio=0.0
   [junit4]   2> 187161 INFO  (qtp343197219-3830) [n:127.0.0.1:54500_solr c:forwardingCollection s:shard1 r:core_node2 x:forwardingCollection_shard1_replica_n1] o.a.s.u.UpdateHandler Using UpdateLog implementation: org.apache.solr.update.UpdateLog
   [junit4]   2> 187162 INFO  (qtp343197219-3830) [n:127.0.0.1:54500_solr c:forwardingCollection s:shard1 r:core_node2 x:forwardingCollection_shard1_replica_n1] o.a.s.u.UpdateLog Initializing UpdateLog: dataDir= defaultSyncLevel=FLUSH numRecordsToKeep=100 maxNumLogsToKeep=10 numVersionBuckets=65536
   [junit4]   2> 187163 INFO  (qtp343197219-3830) [n:127.0.0.1:54500_solr c:forwardingCollection s:shard1 r:core_node2 x:forwardingCollection_shard1_replica_n1] o.a.s.u.CommitTracker Hard AutoCommit: disabled
   [junit4]   2> 187163 INFO  (qtp343197219-3830) [n:127.0.0.1:54500_solr c:forwardingCollection s:shard1 r:core_node2 x:forwardingCollection_shard1_replica_n1] o.a.s.u.CommitTracker Soft AutoCommit: disabled
   [junit4]   2> 187164 INFO  (qtp343197219-3830) [n:127.0.0.1:54500_solr c:forwardingCollection s:shard1 r:core_node2 x:forwardingCollection_shard1_replica_n1] o.a.s.u.RandomMergePolicy RandomMergePolicy wrapping class org.apache.lucene.index.TieredMergePolicy: [TieredMergePolicy: maxMergeAtOnce=34, maxMergeAtOnceExplicit=49, maxMergedSegmentMB=33.2431640625, floorSegmentMB=0.490234375, forceMergeDeletesPctAllowed=8.854958678711423, segmentsPerTier=47.0, maxCFSSegmentSizeMB=8.796093022207999E12, noCFSRatio=0.0
   [junit4]   2> 187164 INFO  (qtp343197219-3830) [n:127.0.0.1:54500_solr c:forwardingCollection s:shard1 r:core_node2 x:forwardingCollection_shard1_replica_n1] o.a.s.s.SolrIndexSearcher Opening [Searcher@62e1ab25[forwardingCollection_shard1_replica_n1] main]
   [junit4]   2> 187167 INFO  (qtp343197219-3830) [n:127.0.0.1:54500_solr c:forwardingCollection s:shard1 r:core_node2 x:forwardingCollection_shard1_replica_n1] o.a.s.h.c.SpellCheckComponent Initializing spell checkers
   [junit4]   2> 187171 INFO  (qtp343197219-3830) [n:127.0.0.1:54500_solr c:forwardingCollection s:shard1 r:core_node2 x:forwardingCollection_shard1_replica_n1] o.a.s.s.DirectSolrSpellChecker init: {name=direct,classname=DirectSolrSpellChecker,field=lowerfilt,minQueryLength=3}
   [junit4]   2> 187202 INFO  (qtp343197219-3830) [n:127.0.0.1:54500_solr c:forwardingCollection s:shard1 r:core_node2 x:forwardingCollection_shard1_replica_n1] o.a.s.h.ReplicationHandler Commits will be reserved for 10000ms.
   [junit4]   2> 187202 INFO  (searcherExecutor-1054-thread-1-processing-n:127.0.0.1:54500_solr x:forwardingCollection_shard1_replica_n1 s:shard1 c:forwardingCollection r:core_node2) [n:127.0.0.1:54500_solr c:forwardingCollection s:shard1 r:core_node2 x:forwardingCollection_shard1_replica_n1] o.a.s.h.c.SpellCheckComponent Loading spell index for spellchecker: default
   [junit4]   2> 187202 INFO  (qtp343197219-3830) [n:127.0.0.1:54500_solr c:forwardingCollection s:shard1 r:core_node2 x:forwardingCollection_shard1_replica_n1] o.a.s.u.UpdateLog Could not find max version in index or recent updates, using new clock 1580924698445742080
   [junit4]   2> 187203 INFO  (searcherExecutor-1054-thread-1-processing-n:127.0.0.1:54500_solr x:forwardingCollection_shard1_replica_n1 s:shard1 c:forwardingCollection r:core_node2) [n:127.0.0.1:54500_solr c:forwardingCollection s:shard1 r:core_node2 x:forwardingCollection_shard1_replica_n1] o.a.s.h.c.SpellCheckComponent Loading spell index for spellchecker: direct
   [junit4]   2> 187203 INFO  (searcherExecutor-1054-thread-1-processing-n:127.0.0.1:54500_solr x:forwardingCollection_shard1_replica_n1 s:shard1 c:forwardingCollection r:core_node2) [n:127.0.0.1:54500_solr c:forwardingCollection s:shard1 r:core_node2 x:forwardingCollection_shard1_replica_n1] o.a.s.h.c.SpellCheckComponent Loading spell index for spellchecker: wordbreak
   [junit4]   2> 187203 INFO  (searcherExecutor-1054-thread-1-processing-n:127.0.0.1:54500_solr x:forwardingCollection_shard1_replica_n1 s:shard1 c:forwardingCollection r:core_node2) [n:127.0.0.1:54500_solr c:forwardingCollection s:shard1 r:core_node2 x:forwardingCollection_shard1_replica_n1] o.a.s.h.c.SpellCheckComponent Loading spell index for spellchecker: multipleFields
   [junit4]   2> 187204 INFO  (searcherExecutor-1054-thread-1-processing-n:127.0.0.1:54500_solr x:forwardingCollection_shard1_replica_n1 s:shard1 c:forwardingCollection r:core_node2) [n:127.0.0.1:54500_solr c:forwardingCollection s:shard1 r:core_node2 x:forwardingCollection_shard1_replica_n1] o.a.s.h.c.SpellCheckComponent Loading spell index for spellchecker: jarowinkler
   [junit4]   2> 187204 INFO  (searcherExecutor-1054-thread-1-processing-n:127.0.0.1:54500_solr x:forwardingCollection_shard1_replica_n1 s:shard1 c:forwardingCollection r:core_node2) [n:127.0.0.1:54500_solr c:forwardingCollection s:shard1 r:core_node2 x:forwardingCollection_shard1_replica_n1] o.a.s.h.c.SpellCheckComponent Loading spell index for spellchecker: external
   [junit4]   2> 187205 INFO  (searcherExecutor-1054-thread-1-processing-n:127.0.0.1:54500_solr x:forwardingCollection_shard1_replica_n1 s:shard1 c:forwardingCollection r:core_node2) [n:127.0.0.1:54500_solr c:forwardingCollection s:shard1 r:core_node2 x:forwardingCollection_shard1_replica_n1] o.a.s.h.c.SpellCheckComponent Loading spell index for spellchecker: freq
   [junit4]   2> 187205 INFO  (searcherExecutor-1054-thread-1-processing-n:127.0.0.1:54500_solr x:forwardingCollection_shard1_replica_n1 s:shard1 c:forwardingCollection r:core_node2) [n:127.0.0.1:54500_solr c:forwardingCollection s:shard1 r:core_node2 x:forwardingCollection_shard1_replica_n1] o.a.s.h.c.SpellCheckComponent Loading spell index for spellchecker: fqcn
   [junit4]   2> 187206 INFO  (searcherExecutor-1054-thread-1-processing-n:127.0.0.1:54500_solr x:forwardingCollection_shard1_replica_n1 s:shard1 c:forwardingCollection r:core_node2) [n:127.0.0.1:54500_solr c:forwardingCollection s:shard1 r:core_node2 x:forwardingCollection_shard1_replica_n1] o.a.s.h.c.SpellCheckComponent Loading spell index for spellchecker: perDict
   [junit4]   2> 187207 INFO  (searcherExecutor-1054-thread-1-processing-n:127.0.0.1:54500_solr x:forwardingCollection_shard1_replica_n1 s:shard1 c:forwardingCollection r:core_node2) [n:127.0.0.1:54500_solr c:forwardingCollection s:shard1 r:core_node2 x:forwardingCollection_shard1_replica_n1] o.a.s.c.SolrCore [forwardingCollection_shard1_replica_n1] Registered new searcher Searcher@62e1ab25[forwardingCollection_shard1_replica_n1] main{ExitableDirectoryReader(UninvertingDirectoryReader())}
   [junit4]   2> 187208 INFO  (qtp343197219-3830) [n:127.0.0.1:54500_solr c:forwardingCollection s:shard1 r:core_node2 x:forwardingCollection_shard1_replica_n1] o.a.s.c.ShardLeaderElectionContext Enough replicas found to continue.
   [junit4]   2> 187209 INFO  (qtp343197219-3830) [n:127.0.0.1:54500_solr c:forwardingCollection s:shard1 r:core_node2 x:forwardingCollection_shard1_replica_n1] o.a.s.c.ShardLeaderElectionContext I may be the new leader - try and sync
   [junit4]   2> 187209 INFO  (qtp343197219-3830) [n:127.0.0.1:54500_solr c:forwardingCollection s:shard1 r:core_node2 x:forwardingCollection_shard1_replica_n1] o.a.s.c.SyncStrategy Sync replicas to http://127.0.0.1:54500/solr/forwardingCollection_shard1_replica_n1/
   [junit4]   2> 187209 INFO  (qtp343197219-3830) [n:127.0.0.1:54500_solr c:forwardingCollection s:shard1 r:core_node2 x:forwardingCollection_shard1_replica_n1] o.a.s.c.SyncStrategy Sync Success - now sync replicas to me
   [junit4]   2> 187209 INFO  (qtp343197219-3830) [n:127.0.0.1:54500_solr c:forwardingCollection s:shard1 r:core_node2 x:forwardingCollection_shard1_replica_n1] o.a.s.c.SyncStrategy http://127.0.0.1:54500/solr/forwardingCollection_shard1_replica_n1/ has no replicas
   [junit4]   2> 187209 INFO  (qtp343197219-3830) [n:127.0.0.1:54500_solr c:forwardingCollection s:shard1 r:core_node2 x:forwardingCollection_shard1_replica_n1] o.a.s.c.ShardLeaderElectionContext Found all replicas participating in election, clear LIR
   [junit4]   2> 187215 INFO  (qtp343197219-3830) [n:127.0.0.1:54500_solr c:forwardingCollection s:shard1 r:core_node2 x:forwardingCollection_shard1_replica_n1] o.a.s.c.ShardLeaderElectionContext I am the new leader: http://127.0.0.1:54500/solr/forwardingCollection_shard1_replica_n1/ shard1
   [junit4]   2> 187325 INFO  (zkCallback-1771-thread-1-processing-n:127.0.0.1:54500_solr) [n:127.0.0.1:54500_solr    ] o.a.s.c.c.ZkStateReader A cluster state change: [WatchedEvent state:SyncConnected type:NodeDataChanged path:/collections/forwardingCollection/state.json] for collection [forwardingCollection] has occurred - updating... (live nodes size: [2])
   [junit4]   2> 187325 INFO  (zkCallback-1771-thread-2-processing-n:127.0.0.1:54500_solr) [n:127.0.0.1:54500_solr    ] o.a.s.c.c.ZkStateReader A cluster state change: [WatchedEvent state:SyncConnected type:NodeDataChanged path:/collections/forwardingCollection/state.json] for collection [forwardingCollection] has occurred - updating... (live nodes size: [2])
   [junit4]   2> 187329 INFO  (qtp343197219-3830) [n:127.0.0.1:54500_solr c:forwardingCollection s:shard1 r:core_node2 x:forwardingCollection_shard1_replica_n1] o.a.s.c.ZkController I am the leader, no recovery necessary
   [junit4]   2> 187336 INFO  (qtp343197219-3830) [n:127.0.0.1:54500_solr c:forwardingCollection s:shard1 r:core_node2 x:forwardingCollection_shard1_replica_n1] o.a.s.s.HttpSolrCall [admin] webapp=null path=/admin/cores params={qt=/admin/cores&coreNodeName=core_node2&collection.configName=conf1&newCollection=true&name=forwardingCollection_shard1_replica_n1&action=CREATE&numShards=1&collection=forwardingCollection&shard=shard1&wt=javabin&version=2&replicaType=NRT} status=0 QTime=1646
   [junit4]   2> 187337 WARN  (httpShardExecutor-1045-thread-1-processing-n:127.0.0.1:61798_solr [http:////127.0.0.1:54500//solr] http:////127.0.0.1:54500//solr) [n:127.0.0.1:61798_solr    ] o.a.h.c.p.ResponseProcessCookies Invalid cookie header: "Set-Cookie: hadoop.auth="u=$&p=$&t=test&e=1507723279568&s=np14XNJRgXB7NspvbgqREX/sWVQ="; Path=/; Domain=127.0.0.1; Expires=   , 11-   -2017 12:01:19 GMT; HttpOnly". Invalid 'expires' attribute: , 11- -2017 12:01:19 GMT
   [junit4]   2> 187353 INFO  (qtp343197219-3828) [n:127.0.0.1:54500_solr    ] o.a.s.h.a.CollectionsHandler Wait for new collection to be active for at most 30 seconds. Check all shard replicas
   [junit4]   2> 187365 INFO  (OverseerCollectionConfigSetProcessor-98807792761503750-127.0.0.1:61798_solr-n_0000000000) [n:127.0.0.1:61798_solr    ] o.a.s.c.OverseerTaskQueue Response ZK path: /overseer/collection-queue-work/qnr-0000000000 doesn't exist.  Requestor may have disconnected from ZooKeeper
   [junit4]   2> 187437 INFO  (zkCallback-1771-thread-1-processing-n:127.0.0.1:54500_solr) [n:127.0.0.1:54500_solr    ] o.a.s.c.c.ZkStateReader A cluster state change: [WatchedEvent state:SyncConnected type:NodeDataChanged path:/collections/forwardingCollection/state.json] for collection [forwardingCollection] has occurred - updating... (live nodes size: [2])
   [junit4]   2> 187437 INFO  (zkCallback-1771-thread-2-processing-n:127.0.0.1:54500_solr) [n:127.0.0.1:54500_solr    ] o.a.s.c.c.ZkStateReader A cluster state change: [WatchedEvent state:SyncConnected type:NodeDataChanged path:/collections/forwardingCollection/state.json] for collection [forwardingCollection] has occurred - updating... (live nodes size: [2])
   [junit4]   2> 188356 INFO  (qtp343197219-3828) [n:127.0.0.1:54500_solr    ] o.a.s.s.HttpSolrCall [admin] webapp=null path=/admin/collections params={pullReplicas=0&replicationFactor=1&collection.configName=conf1&maxShardsPerNode=1&name=forwardingCollection&nrtReplicas=1&action=CREATE&numShards=1&tlogReplicas=0&wt=javabin&version=2} status=0 QTime=3012
   [junit4]   2> 188356 WARN  (TEST-TestSolrCloudWithSecureImpersonation.testForwarding-seed#[6D0099E53257ACF1]) [    ] o.a.h.c.p.ResponseProcessCookies Invalid cookie header: "Set-Cookie: hadoop.auth="u=user&p=user&t=test&e=1507723279222&s=EWwESR1oc7Dn0hE8PbGU3Wb9IB8="; Path=/; Domain=127.0.0.1; Expires=   , 11-   -2017 12:01:19 GMT; HttpOnly". Invalid 'expires' attribute: , 11- -2017 12:01:19 GMT
   [junit4]   2> 188357 INFO  (TEST-TestSolrCloudWithSecureImpersonation.testForwarding-seed#[6D0099E53257ACF1]) [    ] o.a.s.c.AbstractDistribZkTestBase Wait for recoveries to finish - collection: forwardingCollection failOnTimeout:true timeout (sec):100
   [junit4]   2> 188367 INFO  (TEST-TestSolrCloudWithSecureImpersonation.testForwarding-seed#[6D0099E53257ACF1]) [    ] o.a.s.c.AbstractDistribZkTestBase Recoveries finished - collection: forwardingCollection
   [junit4]   2> 188371 INFO  (qtp343197219-3824) [n:127.0.0.1:54500_solr c:forwardingCollection s:shard1 r:core_node2 x:forwardingCollection_shard1_replica_n1] o.a.s.c.S.Request [forwardingCollection_shard1_replica_n1]  webapp=/solr path=/select params={q=*:*&wt=javabin&version=2} hits=0 status=0 QTime=0
   [junit4]   2> 188371 WARN  (TEST-TestSolrCloudWithSecureImpersonation.testForwarding-seed#[6D0099E53257ACF1]) [    ] o.a.h.c.p.ResponseProcessCookies Invalid cookie header: "Set-Cookie: hadoop.auth="u=user&p=user&t=test&e=1507723282248&s=Nr0UutrdSQs3czHXI4Gscy8AGIU="; Path=/; Domain=127.0.0.1; Expires=   , 11-   -2017 12:01:22 GMT; HttpOnly". Invalid 'expires' attribute: , 11- -2017 12:01:22 GMT
   [junit4]   2> 188374 INFO  (qtp1615052480-3827) [n:127.0.0.1:61798_solr    ] o.a.s.c.TransientSolrCoreCacheDefault Allocating transient cache for 2147483647 transient cores
   [junit4]   2> 188380 INFO  (qtp343197219-3822) [n:127.0.0.1:54500_solr c:forwardingCollection s:shard1 r:core_node2 x:forwardingCollection_shard1_replica_n1] o.a.s.c.S.Request [forwardingCollection_shard1_replica_n1]  webapp=/solr path=/select params={q=*:*&wt=javabin&version=2} hits=0 status=0 QTime=0
   [junit4]   2> 188381 WARN  (qtp1615052480-3827) [n:127.0.0.1:61798_solr    ] o.a.h.c.p.ResponseProcessCookies Invalid cookie header: "Set-Cookie: hadoop.auth="u=$&p=$&t=test&e=1507723282257&s=M07uMN1ZKDfFO23p4DpnhCbzwAc="; Path=/; Domain=127.0.0.1; Expires=   , 11-   -2017 12:01:22 GMT; HttpOnly". Invalid 'expires' attribute: , 11- -2017 12:01:22 GMT
   [junit4]   2> 188381 WARN  (TEST-TestSolrCloudWithSecureImpersonation.testForwarding-seed#[6D0099E53257ACF1]) [    ] o.a.h.c.p.ResponseProcessCookies Invalid cookie header: "Set-Cookie: hadoop.auth="u=user&p=user&t=test&e=1507723282252&s=PfiBitHFR4rN4/ggyW1H4N3MC/g="; Path=/; Domain=127.0.0.1; Expires=   , 11-   -2017 12:01:22 GMT; HttpOnly". Invalid 'expires' attribute: , 11- -2017 12:01:22 GMT
   [junit4]   2> 188381 WARN  (TEST-TestSolrCloudWithSecureImpersonation.testForwarding-seed#[6D0099E53257ACF1]) [    ] o.a.h.c.p.ResponseProcessCookies Invalid cookie header: "Set-Cookie: hadoop.auth="u=$&p=$&t=test&e=1507723282257&s=M07uMN1ZKDfFO23p4DpnhCbzwAc="; Path=/; Domain=127.0.0.1; Expires=   , 11-   -2017 12:01:22 GMT; HttpOnly". Invalid 'expires' attribute: , 11- -2017 12:01:22 GMT
   [junit4]   2> 188382 INFO  (TEST-TestSolrCloudWithSecureImpersonation.testForwarding-seed#[6D0099E53257ACF1]) [    ] o.a.s.SolrTestCaseJ4 ###Ending testForwarding
   [junit4]   2> 188434 INFO  (TEST-TestSolrCloudWithSecureImpersonation.testProxyValidateHost-seed#[6D0099E53257ACF1]) [    ] o.a.s.SolrTestCaseJ4 ###Starting testProxyValidateHost
   [junit4]   2> 188441 INFO  (qtp343197219-3830) [n:127.0.0.1:54500_solr    ] o.a.s.h.a.CollectionsHandler Invoked Collection Action :list with params doAs=bar&action=LIST&wt=javabin&version=2 and sendToOCPQueue=true
   [junit4]   2> 188441 INFO  (qtp343197219-3830) [n:127.0.0.1:54500_solr    ] o.a.s.s.HttpSolrCall [admin] webapp=null path=/admin/collections params={doAs=bar&action=LIST&wt=javabin&version=2} status=0 QTime=0
   [junit4]   2> 188441 WARN  (TEST-TestSolrCloudWithSecureImpersonation.testProxyValidateHost-seed#[6D0099E53257ACF1]) [    ] o.a.h.c.p.ResponseProcessCookies Invalid cookie header: "Set-Cookie: hadoop.auth="u=localHostAnyGroup&p=localHostAnyGroup&t=test&e=1507723282318&s=3cAEdAFjlDiDtXjGNsQD+3qfxDs="; Path=/; Domain=127.0.0.1; Expires=   , 11-   -2017 12:01:22 GMT; HttpOnly". Invalid 'expires' attribute: , 11- -2017 12:01:22 GMT
   [junit4]   2> 188441 INFO  (TEST-TestSolrCloudWithSecureImpersonation.testProxyValidateHost-seed#[6D0099E53257ACF1]) [    ] o.a.s.SolrTestCaseJ4 ###Ending testProxyValidateHost
   [junit4]   2> 188468 INFO  (TEST-TestSolrCloudWithSecureImpersonation.testProxyUnknownRemote-seed#[6D0099E53257ACF1]) [    ] o.a.s.SolrTestCaseJ4 ###Starting testProxyUnknownRemote
   [junit4]   2> 203598 WARN  (jetty-launcher-1760-thread-2-SendThread(127.0.0.1:44799)) [n:127.0.0.1:54500_solr    ] o.a.z.ClientCnxn Client session timed out, have not heard from server in 16160ms for sessionid 0x15f0929fc970005
   [junit4]   2> 203598 WARN  (NIOServerCxn.Factory:0.0.0.0/0.0.0.0:0) [    ] o.a.z.s.NIOServerCnxn caught end of stream exception
   [junit4]   2> EndOfStreamException: Unable to read additional data from client sessionid 0x15f0929fc970005, likely client has closed socket
   [junit4]   2> 	at org.apache.zookeeper.server.NIOServerCnxn.doIO(NIOServerCnxn.java:239)
   [junit4]   2> 	at org.apache.zookeeper.server.NIOServerCnxnFactory.run(NIOServerCnxnFactory.java:203)
   [junit4]   2> 	at java.lang.Thread.run(Thread.java:748)
   [junit4]   2> 203599 WARN  (jetty-launcher-1760-thread-2-SendThread(127.0.0.1:44799)) [n:127.0.0.1:54500_solr    ] o.a.z.ClientCnxn Client session timed out, have not heard from server in 19538ms for sessionid 0x15f0929fc970008
   [junit4]   2> 203599 WARN  (NIOServerCxn.Factory:0.0.0.0/0.0.0.0:0) [    ] o.a.z.s.NIOServerCnxn caught end of stream exception
   [junit4]   2> EndOfStreamException: Unable to read additional data from client sessionid 0x15f0929fc970008, likely client has closed socket
   [junit4]   2> 	at org.apache.zookeeper.server.NIOServerCnxn.doIO(NIOServerCnxn.java:239)
   [junit4]   2> 	at org.apache.zookeeper.server.NIOServerCnxnFactory.run(NIOServerCnxnFactory.java:203)
   [junit4]   2> 	at java.lang.Thread.run(Thread.java:748)
   [junit4]   2> 203600 WARN  (jetty-launcher-1760-thread-1-SendThread(127.0.0.1:44799)) [n:127.0.0.1:61798_solr    ] o.a.z.ClientCnxn Client session timed out, have not heard from server in 19539ms for sessionid 0x15f0929fc970007
   [junit4]   2> 203600 WARN  (jetty-launcher-1760-thread-1-SendThread(127.0.0.1:44799)) [n:127.0.0.1:61798_solr    ] o.a.z.ClientCnxn Client session timed out, have not heard from server in 15222ms for sessionid 0x15f0929fc970006
   [junit4]   2> 203601 WARN  (TEST-TestSolrCloudWithSecureImpersonation.testProxyUnknownRemote-seed#[6D0099E53257ACF1]) [    ] o.a.h.c.p.ResponseProcessCookies Invalid cookie header: "Set-Cookie: hadoop.auth="u=localHostAnyGroup&p=localHostAnyGroup&t=test&e=1507723282347&s=iS6o+zOHGfNO8O8MoBIRm2EqKVs="; Path=/; Domain=127.0.0.1; Expires=   , 11-   -2017 12:01:22 GMT; HttpOnly". Invalid 'expires' attribute: , 11- -2017 12:01:22 GMT
   [junit4]   2> 203601 WARN  (NIOServerCxn.Factory:0.0.0.0/0.0.0.0:0) [    ] o.a.z.s.NIOServerCnxn caught end of stream exception
   [junit4]   2> EndOfStreamException: Unable to read additional data from client sessionid 0x15f0929fc970007, likely client has closed socket
   [junit4]   2> 	at org.apache.zookeeper.server.NIOServerCnxn.doIO(NIOServerCnxn.java:239)
   [junit4]   2> 	at org.apache.zookeeper.server.NIOServerCnxnFactory.run(NIOServerCnxnFactory.java:203)
   [junit4]   2> 	at java.lang.Thread.run(Thread.java:748)
   [junit4]   2> 203601 WARN  (NIOServerCxn.Factory:0.0.0.0/0.0.0.0:0) [    ] o.a.z.s.NIOServerCnxn caught end of stream exception
   [junit4]   2> EndOfStreamException: Unable to read additional data from client sessionid 0x15f0929fc970006, likely client has closed socket
   [junit4]   2> 	at org.apache.zookeeper.server.NIOServerCnxn.doIO(NIOServerCnxn.java:239)
   [junit4]   2> 	at org.apache.zookeeper.server.NIOServerCnxnFactory.run(NIOServerCnxnFactory.java:203)
   [junit4]   2> 	at java.lang.Thread.run(Thread.java:748)
   [junit4]   2> 203601 INFO  (TEST-TestSolrCloudWithSecureImpersonation.testProxyUnknownRemote-seed#[6D0099E53257ACF1]) [    ] o.a.s.SolrTestCaseJ4 ###Ending testProxyUnknownRemote
   [junit4]   2> 203699 WARN  (zkCallback-1771-thread-1-processing-n:127.0.0.1:54500_solr) [n:127.0.0.1:54500_solr    ] o.a.s.c.c.ConnectionManager Watcher org.apache.solr.common.cloud.ConnectionManager@684f2407 name: ZooKeeperConnection Watcher:127.0.0.1:44799/solr got event WatchedEvent state:Disconnected type:None path:null path: null type: None
   [junit4]   2> 203699 WARN  (zkCallback-1771-thread-1-processing-n:127.0.0.1:54500_solr) [n:127.0.0.1:54500_solr    ] o.a.s.c.c.ConnectionManager zkClient has disconnected
   [junit4]   2> 203702 INFO  (jetty-launcher-1760-thread-1-EventThread) [n:127.0.0.1:61798_solr    ] o.a.c.f.s.ConnectionStateManager State change: SUSPENDED
   [junit4]   2> 203703 INFO  (jetty-closer-1761-thread-1) [    ] o.e.j.s.AbstractConnector Stopped ServerConnector@336f236e{HTTP/1.1,[http/1.1]}{127.0.0.1:0}
   [junit4]   2> 203705 INFO  (jetty-closer-1761-thread-2) [    ] o.e.j.s.AbstractConnector Stopped ServerConnector@7df696bc{HTTP/1.1,[http/1.1]}{127.0.0.1:0}
   [junit4]   2> 203703 WARN  (zkCallback-1772-thread-1-processing-n:127.0.0.1:61798_solr) [n:127.0.0.1:61798_solr    ] o.a.s.c.c.ConnectionManager Watcher org.apache.solr.common.cloud.ConnectionManager@7de5f3ba name: ZooKeeperConnection Watcher:127.0.0.1:44799/solr got event WatchedEvent state:Disconnected type:None path:null path: null type: None
   [junit4]   2> 203706 WARN  (zkCallback-1772-thread-1-processing-n:127.0.0.1:61798_solr) [n:127.0.0.1:61798_solr    ] o.a.s.c.c.ConnectionManager zkClient has disconnected
   [junit4]   2> 203706 INFO  (jetty-closer-1761-thread-1) [    ] o.a.s.c.CoreContainer Shutting down CoreContainer instance=691101511
   [junit4]   2> 203706 INFO  (jetty-closer-1761-thread-2) [    ] o.a.s.c.CoreContainer Shutting down CoreContainer instance=1922055609
   [junit4]   2> 203706 INFO  (jetty-closer-1761-thread-1) [    ] o.a.s.m.SolrMetricManager Closing metric reporters for registry=solr.node, tag=null
   [junit4]   2> 203706 INFO  (jetty-closer-1761-thread-1) [    ] o.a.s.m.r.SolrJmxReporter Closing reporter [org.apache.solr.metrics.reporters.SolrJmxReporter@29c5ba53: rootName = solr_54500, domain = solr.node, service url = null, agent id = null] for registry solr.node / com.codahale.metrics.MetricRegistry@c157223
   [junit4]   2> 203708 INFO  (jetty-closer-1761-thread-2) [    ] o.a.s.m.SolrMetricManager Closing metric reporters for registry=solr.node, tag=null
   [junit4]   2> 203708 INFO  (jetty-closer-1761-thread-2) [    ] o.a.s.m.r.SolrJmxReporter Closing reporter [org.apache.solr.metrics.reporters.SolrJmxReporter@421eb468: rootName = solr_61798, domain = solr.node, service url = null, agent id = null] for registry solr.node / com.codahale.metrics.MetricRegistry@58b16d75
   [junit4]   2> 203715 INFO  (jetty-closer-1761-thread-1) [    ] o.a.s.m.SolrMetricManager Closing metric reporters for registry=solr.jvm, tag=null
   [junit4]   2> 203715 INFO  (jetty-closer-1761-thread-1) [    ] o.a.s.m.r.SolrJmxReporter Closing reporter [org.apache.solr.metrics.reporters.SolrJmxReporter@8dbb706: rootName = solr_54500, domain = solr.jvm, service url = null, agent id = null] for registry solr.jvm / com.codahale.metrics.MetricRegistry@d15887b
   [junit4]   2> 203715 INFO  (jetty-closer-1761-thread-2) [    ] o.a.s.m.SolrMetricManager Closing metric reporters for registry=solr.jvm, tag=null
   [junit4]   2> 203715 INFO  (jetty-closer-1761-thread-2) [    ] o.a.s.m.r.SolrJmxReporter Closing reporter [org.apache.solr.metrics.reporters.SolrJmxReporter@4fd58702: rootName = solr_61798, domain = solr.jvm, service url = null, agent id = null] for registry solr.jvm / com.codahale.metrics.MetricRegistry@d15887b
   [junit4]   2> 203724 INFO  (jetty-closer-1761-thread-2) [    ] o.a.s.m.SolrMetricManager Closing metric reporters for registry=solr.jetty, tag=null
   [junit4]   2> 203724 INFO  (jetty-closer-1761-thread-2) [    ] o.a.s.m.r.SolrJmxReporter Closing reporter [org.apache.solr.metrics.reporters.SolrJmxReporter@194494f9: rootName = solr_61798, domain = solr.jetty, service url = null, agent id = null] for registry solr.jetty / com.codahale.metrics.MetricRegistry@92a0d01
   [junit4]   2> 203725 INFO  (jetty-closer-1761-thread-1) [    ] o.a.s.m.SolrMetricManager Closing metric reporters for registry=solr.jetty, tag=null
   [junit4]   2> 203725 INFO  (jetty-closer-1761-thread-1) [    ] o.a.s.m.r.SolrJmxReporter Closing reporter [org.apache.solr.metrics.reporters.SolrJmxReporter@339c05ea: rootName = solr_54500, domain = solr.jetty, service url = null, agent id = null] for registry solr.jetty / com.codahale.metrics.MetricRegistry@92a0d01
   [junit4]   2> 204736 INFO  (jetty-closer-1761-thread-1) [    ] o.a.s.m.SolrMetricManager Closing metric reporters for registry=solr.cluster, tag=null
   [junit4]   2> 204737 INFO  (coreCloseExecutor-1059-thread-1) [n:127.0.0.1:54500_solr c:forwardingCollection s:shard1 r:core_node2 x:forwardingCollection_shard1_replica_n1] o.a.s.c.SolrCore [forwardingCollection_shard1_replica_n1]  CLOSING SolrCore org.apache.solr.core.SolrCore@555c85c4
   [junit4]   2> 204737 INFO  (coreCloseExecutor-1059-thread-1) [n:127.0.0.1:54500_solr c:forwardingCollection s:shard1 r:core_node2 x:forwardingCollection_shard1_replica_n1] o.a.s.m.SolrMetricManager Closing metric reporters for registry=solr.core.forwardingCollection.shard1.replica_n1, tag=1432126916
   [junit4]   2> 204737 INFO  (coreCloseExecutor-1059-thread-1) [n:127.0.0.1:54500_solr c:forwardingCollection s:shard1 r:core_node2 x:forwardingCollection_shard1_replica_n1] o.a.s.m.r.SolrJmxReporter Closing reporter [org.apache.solr.metrics.reporters.SolrJmxReporter@700edc7c: rootName = solr_54500, domain = solr.core.forwardingCollection.shard1.replica_n1, service url = null, agent id = null] for registry solr.core.forwardingCollection.shard1.replica_n1 / com.codahale.metrics.MetricRegistry@14fb9bfc
   [junit4]   2> 204745 INFO  (coreCloseExecutor-1059-thread-1) [n:127.0.0.1:54500_solr c:forwardingCollection s:shard1 r:core_node2 x:forwardingCollection_shard1_replica_n1] o.a.s.m.SolrMetricManager Closing metric reporters for registry=solr.collection.forwardingCollection.shard1.leader, tag=1432126916
   [junit4]   2> 204749 ERROR (Thread[Thread-403,5,TGRP-TestSolrCloudWithSecureImpersonation]) [n:127.0.0.1:54500_solr    ] o.a.h.s.t.d.AbstractDelegationTokenSecretManager ExpiredTokenRemover received java.lang.InterruptedException: sleep interrupted
   [junit4]   2> 204915 WARN  (jetty-launcher-1760-thread-2-SendThread(127.0.0.1:44799)) [n:127.0.0.1:54500_solr    ] o.a.z.ClientCnxn Unable to reconnect to ZooKeeper service, session 0x15f0929fc970008 has expired
   [junit4]   2> 205017 INFO  (jetty-closer-1761-thread-1) [    ] o.e.j.s.h.ContextHandler Stopped o.e.j.s.ServletContextHandler@551ac2e4{/solr,null,UNAVAILABLE}
   [junit4]   2> 205438 WARN  (jetty-launcher-1760-thread-1-SendThread(127.0.0.1:44799)) [n:127.0.0.1:61798_solr    ] o.a.z.ClientCnxn Unable to reconnect to ZooKeeper service, session 0x15f0929fc970007 has expired
   [junit4]   2> 205669 INFO  (zkCallback-1772-thread-7-processing-n:127.0.0.1:61798_solr) [n:127.0.0.1:61798_solr    ] o.a.s.c.c.ZkStateReader Updated live nodes from ZooKeeper... (2) -> (1)
   [junit4]   2> 205671 INFO  (jetty-closer-1761-thread-2) [    ] o.a.s.m.SolrMetricManager Closing metric reporters for registry=solr.cluster, tag=null
   [junit4]   2> 205671 INFO  (jetty-closer-1761-thread-2) [    ] o.a.s.c.Overseer Overseer (id=98807792761503750-127.0.0.1:61798_solr-n_0000000000) closing
   [junit4]   2> 205672 INFO  (OverseerStateUpdate-98807792761503750-127.0.0.1:61798_solr-n_0000000000) [n:127.0.0.1:61798_solr    ] o.a.s.c.Overseer Overseer Loop exiting : 127.0.0.1:61798_solr
   [junit4]   2> 205673 WARN  (OverseerAutoScalingTriggerThread-98807792761503750-127.0.0.1:61798_solr-n_0000000000) [n:127.0.0.1:61798_solr    ] o.a.s.c.a.OverseerTriggerThread OverseerTriggerThread woken up but we are closed, exiting.
   [junit4]   2> 205681 ERROR (Thread[Thread-404,5,TGRP-TestSolrCloudWithSecureImpersonation]) [n:127.0.0.1:61798_solr    ] o.a.h.s.t.d.AbstractDelegationTokenSecretManager ExpiredTokenRemover received java.lang.InterruptedException: sleep interrupted
   [junit4]   2> 205683 INFO  (jetty-closer-1761-thread-2) [    ] o.e.j.s.h.ContextHandler Stopped o.e.j.s.ServletContextHandler@303d7173{/solr,null,UNAVAILABLE}
   [junit4]   2> 205688 ERROR (SUITE-TestSolrCloudWithSecureImpersonation-seed#[6D0099E53257ACF1]-worker) [    ] o.a.z.s.ZooKeeperServer ZKShutdownHandler is not registered, so ZooKeeper server won't take any action on ERROR or SHUTDOWN server state changes
   [junit4]   2> 205689 INFO  (SUITE-TestSolrCloudWithSecureImpersonation-seed#[6D0099E53257ACF1]-worker) [    ] o.a.s.c.ZkTestServer connecting to 127.0.0.1:44799 44799
   [junit4]   2> 205748 INFO  (Thread-386) [    ] o.a.s.c.ZkTestServer connecting to 127.0.0.1:44799 44799
   [junit4]   2> 205749 WARN  (Thread-386) [    ] o.a.s.c.ZkTestServer Watch limit violations: 
   [junit4]   2> Maximum concurrent create/delete watches above limit:
   [junit4]   2> 
   [junit4]   2> 	3	/solr/aliases.json
   [junit4]   2> 	3	/solr/clusterprops.json
   [junit4]   2> 	2	/solr/security.json
   [junit4]   2> 
   [junit4]   2> Maximum concurrent data watches above limit:
   [junit4]   2> 
   [junit4]   2> 	5	/solr/collections/forwardingCollection/state.json
   [junit4]   2> 	4	/solr/security/zkdtsm/ZKDTSMRoot/ZKDTSMKeyIdRoot
   [junit4]   2> 	3	/solr/clusterstate.json
   [junit4]   2> 	2	/solr/security/zkdtsm/ZKDTSMRoot/ZKDTSMMasterKeyRoot/DK_1
   [junit4]   2> 	2	/solr/security/zkdtsm/ZKDTSMRoot/ZKDTSMMasterKeyRoot/DK_3
   [junit4]   2> 	2	/solr/security/zkdtsm/ZKDTSMRoot/ZKDTSMMasterKeyRoot/DK_2
   [junit4]   2> 	2	/solr/security/zkdtsm/ZKDTSMRoot/ZKDTSMMasterKeyRoot/DK_4
   [junit4]   2> 	2	/solr/security/zkdtsm/ZKDTSMRoot/ZKDTSMSeqNumRoot
   [junit4]   2> 
   [junit4]   2> Maximum concurrent children watches above limit:
   [junit4]   2> 
   [junit4]   2> 	3	/solr/live_nodes
   [junit4]   2> 	3	/solr/collections
   [junit4]   2> 	2	/solr/security/zkdtsm/ZKDTSMRoot/ZKDTSMMasterKeyRoot
   [junit4]   2> 	2	/solr/security/zkdtsm/ZKDTSMRoot/ZKDTSMTokensRoot
   [junit4]   2> 
   [junit4]   2> 205779 INFO  (SUITE-TestSolrCloudWithSecureImpersonation-seed#[6D0099E53257ACF1]-worker) [    ] o.a.s.SolrTestCaseJ4 ------------------------------------------------------- Done waiting for tracked resources to be released
   [junit4]   2> Oct 11, 2017 2:01:39 AM com.carrotsearch.randomizedtesting.ThreadLeakControl checkThreadLeaks
   [junit4]   2> WARNING: Will linger awaiting termination of 3 leaked thread(s).
   [junit4]   2> Oct 11, 2017 2:01:59 AM com.carrotsearch.randomizedtesting.ThreadLeakControl checkThreadLeaks
   [junit4]   2> SEVERE: 2 threads leaked from SUITE scope at org.apache.solr.cloud.TestSolrCloudWithSecureImpersonation: 
   [junit4]   2>    1) Thread[id=3872, name=jetty-launcher-1760-thread-2-EventThread, state=TIMED_WAITING, group=TGRP-TestSolrCloudWithSecureImpersonation]
   [junit4]   2>         at sun.misc.Unsafe.park(Native Method)
   [junit4]   2>         at java.util.concurrent.locks.LockSupport.parkNanos(LockSupport.java:215)
   [junit4]   2>         at java.util.concurrent.locks.AbstractQueuedSynchronizer.doAcquireSharedNanos(AbstractQueuedSynchronizer.java:1037)
   [junit4]   2>         at java.util.concurrent.locks.AbstractQueuedSynchronizer.tryAcquireSharedNanos(AbstractQueuedSynchronizer.java:1328)
   [junit4]   2>         at java.util.concurrent.CountDownLatch.await(CountDownLatch.java:277)
   [junit4]   2>         at org.apache.curator.CuratorZookeeperClient.internalBlockUntilConnectedOrTimedOut(CuratorZookeeperClient.java:323)
   [junit4]   2>         at org.apache.curator.RetryLoop.callWithRetry(RetryLoop.java:105)
   [junit4]   2>         at org.apache.curator.framework.imps.GetDataBuilderImpl.pathInForeground(GetDataBuilderImpl.java:288)
   [junit4]   2>         at org.apache.curator.framework.imps.GetDataBuilderImpl.forPath(GetDataBuilderImpl.java:279)
   [junit4]   2>         at org.apache.curator.framework.imps.GetDataBuilderImpl.forPath(GetDataBuilderImpl.java:41)
   [junit4]   2>         at org.apache.curator.framework.recipes.shared.SharedValue.readValue(SharedValue.java:244)
   [junit4]   2>         at org.apache.curator.framework.recipes.shared.SharedValue.access$100(SharedValue.java:44)
   [junit4]   2>         at org.apache.curator.framework.recipes.shared.SharedValue$1.process(SharedValue.java:61)
   [junit4]   2>         at org.apache.curator.framework.imps.NamespaceWatcher.process(NamespaceWatcher.java:67)
   [junit4]   2>         at org.apache.zookeeper.ClientCnxn$EventThread.processEvent(ClientCnxn.java:530)
   [junit4]   2>         at org.apache.zookeeper.ClientCnxn$EventThread.run(ClientCnxn.java:505)
   [junit4]   2>    2) Thread[id=3870, name=jetty-launcher-1760-thread-1-EventThread, state=TIMED_WAITING, group=TGRP-TestSolrCloudWithSecureImpersonation]
   [junit4]   2>         at sun.misc.Unsafe.park(Native Method)
   [junit4]   2>         at java.util.concurrent.locks.LockSupport.parkNanos(LockSupport.java:215)
   [junit4]   2>         at java.util.concurrent.locks.AbstractQueuedSynchronizer.doAcquireSharedNanos(AbstractQueuedSynchronizer.java:1037)
   [junit4]   2>         at java.util.concurrent.locks.AbstractQueuedSynchronizer.tryAcquireSharedNanos(AbstractQueuedSynchronizer.java:1328)
   [junit4]   2>         at java.util.concurrent.CountDownLatch.await(CountDownLatch.java:277)
   [junit4]   2>         at org.apache.curator.CuratorZookeeperClient.internalBlockUntilConnectedOrTimedOut(CuratorZookeeperClient.java:323)
   [junit4]   2>         at org.apache.curator.RetryLoop.callWithRetry(RetryLoop.java:105)
   [junit4]   2>         at org.apache.curator.framework.imps.GetDataBuilderImpl.pathInForeground(GetDataBuilderImpl.java:288)
   [junit4]   2>         at org.apache.curator.framework.imps.GetDataBuilderImpl.forPath(GetDataBuilderImpl.java:279)
   [junit4]   2>         at org.apache.curator.framework.imps.GetDataBuilderImpl.forPath(GetDataBuilderImpl.java:41)
   [junit4]   2>         at org.apache.curator.framework.recipes.shared.SharedValue.readValue(SharedValue.java:244)
   [junit4]   2>         at org.apache.curator.framework.recipes.shared.SharedValue.access$100(SharedValue.java:44)
   [junit4]   2>         at org.apache.curator.framework.recipes.shared.SharedValue$1.process(SharedValue.java:61)
   [junit4]   2>         at org.apache.curator.framework.imps.NamespaceWatcher.process(NamespaceWatcher.java:67)
   [junit4]   2>         at org.apache.zookeeper.ClientCnxn$EventThread.processEvent(ClientCnxn.java:530)
   [junit4]   2>         at org.apache.zookeeper.ClientCnxn$EventThread.run(ClientCnxn.java:505)
   [junit4]   2> Oct 11, 2017 2:01:59 AM com.carrotsearch.randomizedtesting.ThreadLeakControl tryToInterruptAll
   [junit4]   2> INFO: Starting to interrupt leaked threads:
   [junit4]   2>    1) Thread[id=3872, name=jetty-launcher-1760-thread-2-EventThread, state=TIMED_WAITING, group=TGRP-TestSolrCloudWithSecureImpersonation]
   [junit4]   2>    2) Thread[id=3870, name=jetty-launcher-1760-thread-1-EventThread, state=TIMED_WAITING, group=TGRP-TestSolrCloudWithSecureImpersonation]
   [junit4]   2> 225987 ERROR (jetty-launcher-1760-thread-1-EventThread) [n:127.0.0.1:61798_solr    ] o.a.c.f.i.CuratorFrameworkImpl Watcher exception
   [junit4]   2> java.lang.InterruptedException
   [junit4]   2> 	at java.util.concurrent.locks.AbstractQueuedSynchronizer.doAcquireSharedNanos(AbstractQueuedSynchronizer.java:1039)
   [junit4]   2> 	at java.util.concurrent.locks.AbstractQueuedSynchronizer.tryAcquireSharedNanos(AbstractQueuedSynchronizer.java:1328)
   [junit4]   2> 	at java.util.concurrent.CountDownLatch.await(CountDownLatch.java:277)
   [junit4]   2> 	at org.apache.curator.CuratorZookeeperClient.internalBlockUntilConnectedOrTimedOut(CuratorZookeeperClient.java:323)
   [junit4]   2> 	at org.apache.curator.RetryLoop.callWithRetry(RetryLoop.java:105)
   [junit4]   2> 	at org.apache.curator.framework.imps.GetDataBuilderImpl.pathInForeground(GetDataBuilderImpl.java:288)
   [junit4]   2> 	at org.apache.curator.framework.imps.GetDataBuilderImpl.forPath(GetDataBuilderImpl.java:279)
   [junit4]   2> 	at org.apache.curator.framework.imps.GetDataBuilderImpl.forPath(GetDataBuilderImpl.java:41)
   [junit4]   2> 	at org.apache.curator.framework.recipes.shared.SharedValue.readValue(SharedValue.java:244)
   [junit4]   2> 	at org.apache.curator.framework.recipes.shared.SharedValue.access$100(SharedValue.java:44)
   [junit4]   2> 	at org.apache.curator.framework.recipes.shared.SharedValue$1.process(SharedValue.java:61)
   [junit4]   2> 	at org.apache.curator.framework.imps.NamespaceWatcher.process(NamespaceWatcher.java:67)
   [junit4]   2> 	at org.apache.zookeeper.ClientCnxn$EventThread.processEvent(ClientCnxn.java:530)
   [junit4]   2> 	at org.apache.zookeeper.ClientCnxn$EventThread.run(ClientCnxn.java:505)
   [junit4]   2> 225987 ERROR (jetty-launcher-1760-thread-2-EventThread) [n:127.0.0.1:54500_solr    ] o.a.c.f.i.CuratorFrameworkImpl Watcher exception
   [junit4]   2> java.lang.InterruptedException
   [junit4]   2> 	at java.util.concurrent.locks.AbstractQueuedSynchronizer.doAcquireSharedNanos(AbstractQueuedSynchronizer.java:1039)
   [junit4]   2> 	at java.util.concurrent.locks.AbstractQueuedSynchronizer.tryAcquireSharedNanos(AbstractQueuedSynchronizer.java:1328)
   [junit4]   2> 	at java.util.concurrent.CountDownLatch.await(CountDownLatch.java:277)
   [junit4]   2> 	at org.apache.curator.CuratorZookeeperClient.internalBlockUntilConnectedOrTimedOut(CuratorZookeeperClient.java:323)
   [junit4]   2> 	at org.apache.curator.RetryLoop.callWithRetry(RetryLoop.java:105)
   [junit4]   2> 	at org.apache.curator.framework.imps.GetDataBuilderImpl.pathInForeground(GetDataBuilderImpl.java:288)
   [junit4]   2> 	at org.apache.curator.framework.imps.GetDataBuilderImpl.forPath(GetDataBuilderImpl.java:279)
   [junit4]   2> 	at org.apache.curator.framework.imps.GetDataBuilderImpl.forPath(GetDataBuilderImpl.java:41)
   [junit4]   2> 	at org.apache.curator.framework.recipes.shared.SharedValue.readValue(SharedValue.java:244)
   [junit4]   2> 	at org.apache.curator.framework.recipes.shared.SharedValue.access$100(SharedValue.java:44)
   [junit4]   2> 	at org.apache.curator.framework.recipes.shared.SharedValue$1.process(SharedValue.java:61)
   [junit4]   2> 	at org.apache.curator.framework.imps.NamespaceWatcher.process(NamespaceWatcher.java:67)
   [junit4]   2> 	at org.apache.zookeeper.ClientCnxn$EventThread.processEvent(Cli

[...truncated too long message...]

oreAdminApis, UpdateRequestProcessorFactoryTest, PolyFieldTest, TestFieldSortValues, TestCustomDocTransformer, TestDocTermOrds, TestJettySolrRunner, SolrIndexConfigTest, FileUtilsTest, TestDocumentBuilder, TestInfoStreamLogging, TestLuceneIndexBackCompat, TestExceedMaxTermLength, DistributedVersionInfoTest, CacheHeaderTest, TriLevelCompositeIdRoutingTest, TestGraphTermsQParserPlugin, TestCopyFieldCollectionResource, TestShardHandlerFactory, TestUninvertingReader, TestInPlaceUpdatesDistrib, HdfsBasicDistributedZkTest, StatelessScriptUpdateProcessorFactoryTest, DistributedQueryComponentOptimizationTest, FieldMutatingUpdateProcessorTest, ConfigSetsAPITest, TestNumericTerms32, TestComponentsName, LeaderElectionIntegrationTest, TestScoreJoinQPNoScore, AssignBackwardCompatibilityTest, SharedFSAutoReplicaFailoverTest, SolrRequestParserTest, DocumentBuilderTest, CachingDirectoryFactoryTest, AutoCommitTest, SolrMetricReporterTest, TestPostingsSolrHighlighter, MBeansHandlerTest, NodeMutatorTest, PeerSyncReplicationTest, ReplicationFactorTest, CdcrVersionReplicationTest, TestRemoteStreaming, TestHighFrequencyDictionaryFactory, TestStressUserVersions, TestPrepRecovery, TestSolrDeletionPolicy1, UninvertDocValuesMergePolicyTest, TestLRUStatsCache, TestRequestStatusCollectionAPI, MigrateRouteKeyTest, TestIndexSearcher, HdfsNNFailoverTest, BadComponentTest, TestDistributedMissingSort, TestStressLucene, AsyncCallRequestStatusResponseTest, ShowFileRequestHandlerTest, SimpleMLTQParserTest, HttpPartitionTest, OverseerModifyCollectionTest, RollingRestartTest, LeaderFailoverAfterPartitionTest, MergeStrategyTest, HttpSolrCallGetCoreTest, TemplateUpdateProcessorTest, TestCorePropertiesReload, ForceLeaderTest, SolrCoreCheckLockOnStartupTest, EchoParamsTest, MetricUtilsTest, HdfsSyncSliceTest, ClassificationUpdateProcessorIntegrationTest, TestJoin, HdfsDirectoryTest, ShardRoutingCustomTest, BlobRepositoryCloudTest, DeleteNodeTest, TestElisionMultitermQuery, SpellingQueryConverterTest, SystemLogListenerTest, TestMinMaxOnMultiValuedField, SpellCheckCollatorTest, CollectionsAPISolrJTest, DeleteReplicaTest, DistribJoinFromCollectionTest, LeaderElectionContextKeyTest, LeaderInitiatedRecoveryOnShardRestartTest, MissingSegmentRecoveryTest, MoveReplicaHDFSFailoverTest, OutOfBoxZkACLAndCredentialsProvidersTest, OverseerCollectionConfigSetProcessorTest, OverseerStatusTest, OverseerTaskQueueTest, RemoteQueryErrorTest, ReplaceNodeTest, RestartWhileUpdatingTest, ShardSplitTest, TestConfigSetsAPIExclusivity, TestCryptoKeys, TestDownShardTolerantSearch, TestHdfsCloudBackupRestore, TestLeaderElectionZkExpiry, TestLeaderInitiatedRecoveryThread, TestPullReplica, TestSegmentSorting, TestSizeLimitedDistributedMap, TestStressCloudBlindAtomicUpdates, TestTolerantUpdateProcessorCloud, TestTolerantUpdateProcessorRandomCloud, TlogReplayBufferedWhileIndexingTest, AutoAddReplicasIntegrationTest, ExecutePlanActionTest, NodeAddedTriggerTest, TestPolicyCloud, TriggerIntegrationTest, ConfigureRecoveryStrategyTest, ExitableDirectoryReaderTest, TestBackupRepositoryFactory, TestConfigOverlay, TestConfigSets, TestCustomStream, TestInitParams, TestSimpleTextCodec, TestSolrXml, RequestLoggingTest, SearchHandlerTest, TestConfigReload, TestReplicationHandlerBackup, TestRestoreCore, TestSQLHandlerNonCloud, TestSolrConfigHandlerConcurrent, V2ApiIntegrationTest, CoreAdminCreateDiscoverTest, CoreAdminRequestStatusTest, InfoHandlerTest, MetricsHandlerTest, PropertiesRequestHandlerTest, SegmentsInfoRequestHandlerTest, TestApiFramework, TestCollectionAPIs, TestConfigsApi, DistributedDebugComponentTest, DistributedExpandComponentTest, DistributedFacetPivotLargeTest, DistributedFacetPivotSmallAdvancedTest, DistributedFacetPivotSmallTest, DistributedFacetPivotWhiteBoxTest, DistributedSuggestComponentTest, FacetPivotSmallTest, ReplicaListTransformerTest, ShufflingReplicaListTransformerTest, SpatialHeatmapFacetsTest, SuggestComponentTest, TestDistributedStatsComponentCardinality, TestUnifiedSolrHighlighter, TestLegacyTerms, TestMultiValuedNumericRangeQuery, TestNumericRangeQuery64, SolrJmxReporterCloudTest, SubstringBytesRefFilterTest, TestStreamBody, JSONWriterTest, SmileWriterTest, TestBinaryResponseWriter, TestGeoJSONResponseWriter, TestRawResponseWriter, TestSolrQueryResponse, TestChildDocTransformer, TestSubQueryTransformerCrossCore, TestManagedResource, TestManagedResourceStorage, TestRestManager, TestDynamicFieldResource, TestFieldCollectionResource, TestFieldResource, TestFieldTypeCollectionResource, TestFieldTypeResource, TestSchemaResource, TestManagedSynonymFilterFactory, BadCopyFieldTest, BooleanFieldTest, ChangedSchemaMergeTest, CurrencyFieldTypeTest, DateRangeFieldTest, DocValuesMissingTest, PreAnalyzedFieldManagedSchemaCloudTest, TestBulkSchemaConcurrent, TestCloudSchemaless, LargeFieldTest, RankQueryTest, TestAddFieldRealTimeGet, TestComplexPhraseLeadingWildcard, TestComplexPhraseQParserPlugin, TestFilteredDocIdSet, TestInitQParser, TestLegacyNumericRangeQueryBuilder, TestMaxScoreQueryParser, TestMissingGroups, TestMultiWordSynonyms, TestOverriddenPrefixQueryForCustomFieldType, TestPayloadCheckQParserPlugin, TestRandomCollapseQParserPlugin, BlockJoinFacetSimpleTest, TestJsonRequest, TestDFISimilarityFactory, TestPerFieldSimilarityWithDefaultOverride, TestExactSharedStatsCache, TestExactStatsCache, BasicAuthIntegrationTest, TestImpersonationWithHadoopAuth]
   [junit4]   2> NOTE: reproduce with: ant test  -Dtestcase=TestImpersonationWithHadoopAuth -Dtests.seed=6D0099E53257ACF1 -Dtests.slow=true -Dtests.locale=de-CH -Dtests.timezone=Asia/Kabul -Dtests.asserts=true -Dtests.file.encoding=UTF-8
   [junit4] ERROR   0.00s J1 | TestImpersonationWithHadoopAuth (suite) <<<
   [junit4]    > Throwable #1: com.carrotsearch.randomizedtesting.ThreadLeakError: 2 threads leaked from SUITE scope at org.apache.solr.security.hadoop.TestImpersonationWithHadoopAuth: 
   [junit4]    >    1) Thread[id=38063, name=jetty-launcher-6911-thread-2-EventThread, state=TIMED_WAITING, group=TGRP-TestImpersonationWithHadoopAuth]
   [junit4]    >         at sun.misc.Unsafe.park(Native Method)
   [junit4]    >         at java.util.concurrent.locks.LockSupport.parkNanos(LockSupport.java:215)
   [junit4]    >         at java.util.concurrent.locks.AbstractQueuedSynchronizer.doAcquireSharedNanos(AbstractQueuedSynchronizer.java:1037)
   [junit4]    >         at java.util.concurrent.locks.AbstractQueuedSynchronizer.tryAcquireSharedNanos(AbstractQueuedSynchronizer.java:1328)
   [junit4]    >         at java.util.concurrent.CountDownLatch.await(CountDownLatch.java:277)
   [junit4]    >         at org.apache.curator.CuratorZookeeperClient.internalBlockUntilConnectedOrTimedOut(CuratorZookeeperClient.java:323)
   [junit4]    >         at org.apache.curator.RetryLoop.callWithRetry(RetryLoop.java:105)
   [junit4]    >         at org.apache.curator.framework.imps.GetDataBuilderImpl.pathInForeground(GetDataBuilderImpl.java:288)
   [junit4]    >         at org.apache.curator.framework.imps.GetDataBuilderImpl.forPath(GetDataBuilderImpl.java:279)
   [junit4]    >         at org.apache.curator.framework.imps.GetDataBuilderImpl.forPath(GetDataBuilderImpl.java:41)
   [junit4]    >         at org.apache.curator.framework.recipes.shared.SharedValue.readValue(SharedValue.java:244)
   [junit4]    >         at org.apache.curator.framework.recipes.shared.SharedValue.access$100(SharedValue.java:44)
   [junit4]    >         at org.apache.curator.framework.recipes.shared.SharedValue$1.process(SharedValue.java:61)
   [junit4]    >         at org.apache.curator.framework.imps.NamespaceWatcher.process(NamespaceWatcher.java:67)
   [junit4]    >         at org.apache.zookeeper.ClientCnxn$EventThread.processEvent(ClientCnxn.java:530)
   [junit4]    >         at org.apache.zookeeper.ClientCnxn$EventThread.run(ClientCnxn.java:505)
   [junit4]    >    2) Thread[id=38075, name=jetty-launcher-6911-thread-1-EventThread, state=TIMED_WAITING, group=TGRP-TestImpersonationWithHadoopAuth]
   [junit4]    >         at sun.misc.Unsafe.park(Native Method)
   [junit4]    >         at java.util.concurrent.locks.LockSupport.parkNanos(LockSupport.java:215)
   [junit4]    >         at java.util.concurrent.locks.AbstractQueuedSynchronizer.doAcquireSharedNanos(AbstractQueuedSynchronizer.java:1037)
   [junit4]    >         at java.util.concurrent.locks.AbstractQueuedSynchronizer.tryAcquireSharedNanos(AbstractQueuedSynchronizer.java:1328)
   [junit4]    >         at java.util.concurrent.CountDownLatch.await(CountDownLatch.java:277)
   [junit4]    >         at org.apache.curator.CuratorZookeeperClient.internalBlockUntilConnectedOrTimedOut(CuratorZookeeperClient.java:323)
   [junit4]    >         at org.apache.curator.RetryLoop.callWithRetry(RetryLoop.java:105)
   [junit4]    >         at org.apache.curator.framework.imps.GetDataBuilderImpl.pathInForeground(GetDataBuilderImpl.java:288)
   [junit4]    >         at org.apache.curator.framework.imps.GetDataBuilderImpl.forPath(GetDataBuilderImpl.java:279)
   [junit4]    >         at org.apache.curator.framework.imps.GetDataBuilderImpl.forPath(GetDataBuilderImpl.java:41)
   [junit4]    >         at org.apache.curator.framework.recipes.shared.SharedValue.readValue(SharedValue.java:244)
   [junit4]    >         at org.apache.curator.framework.recipes.shared.SharedValue.access$100(SharedValue.java:44)
   [junit4]    >         at org.apache.curator.framework.recipes.shared.SharedValue$1.process(SharedValue.java:61)
   [junit4]    >         at org.apache.curator.framework.imps.NamespaceWatcher.process(NamespaceWatcher.java:67)
   [junit4]    >         at org.apache.zookeeper.ClientCnxn$EventThread.processEvent(ClientCnxn.java:530)
   [junit4]    >         at org.apache.zookeeper.ClientCnxn$EventThread.run(ClientCnxn.java:505)
   [junit4]    > 	at __randomizedtesting.SeedInfo.seed([6D0099E53257ACF1]:0)
   [junit4] Completed [735/745 (2!)] on J1 in 43.30s, 10 tests, 1 error, 1 skipped <<< FAILURES!

[...truncated 46916 lines...]

Mime
View raw message