lucene-dev mailing list archives

Site index · List index
Message view « Date » · « Thread »
Top « Date » · « Thread »
From Policeman Jenkins Server <jenk...@thetaphi.de>
Subject [JENKINS] Lucene-Solr-master-Linux (32bit/jdk1.8.0_144) - Build # 20693 - Still Unstable!
Date Thu, 19 Oct 2017 02:26:47 GMT
Build: https://jenkins.thetaphi.de/job/Lucene-Solr-master-Linux/20693/
Java: 32bit/jdk1.8.0_144 -client -XX:+UseSerialGC

6 tests failed.
FAILED:  org.apache.solr.cloud.hdfs.HdfsNNFailoverTest.test

Error Message:
Timeout occured while waiting response from server at: http://127.0.0.1:45255

Stack Trace:
org.apache.solr.client.solrj.SolrServerException: Timeout occured while waiting response from server at: http://127.0.0.1:45255
	at __randomizedtesting.SeedInfo.seed([54AE0B94B655135E:DCFA344E18A97EA6]:0)
	at org.apache.solr.client.solrj.impl.HttpSolrClient.executeMethod(HttpSolrClient.java:637)
	at org.apache.solr.client.solrj.impl.HttpSolrClient.request(HttpSolrClient.java:253)
	at org.apache.solr.client.solrj.impl.HttpSolrClient.request(HttpSolrClient.java:242)
	at org.apache.solr.client.solrj.impl.LBHttpSolrClient.doRequest(LBHttpSolrClient.java:483)
	at org.apache.solr.client.solrj.impl.LBHttpSolrClient.request(LBHttpSolrClient.java:413)
	at org.apache.solr.client.solrj.impl.CloudSolrClient.sendRequest(CloudSolrClient.java:1121)
	at org.apache.solr.client.solrj.impl.CloudSolrClient.requestWithRetryOnStaleState(CloudSolrClient.java:862)
	at org.apache.solr.client.solrj.impl.CloudSolrClient.request(CloudSolrClient.java:793)
	at org.apache.solr.client.solrj.SolrRequest.process(SolrRequest.java:178)
	at org.apache.solr.client.solrj.SolrRequest.process(SolrRequest.java:195)
	at org.apache.solr.cloud.AbstractFullDistribZkTestBase.createServers(AbstractFullDistribZkTestBase.java:315)
	at org.apache.solr.BaseDistributedSearchTestCase$ShardsRepeatRule$ShardsFixedStatement.callStatement(BaseDistributedSearchTestCase.java:991)
	at org.apache.solr.BaseDistributedSearchTestCase$ShardsRepeatRule$ShardsStatement.evaluate(BaseDistributedSearchTestCase.java:968)
	at com.carrotsearch.randomizedtesting.rules.SystemPropertiesRestoreRule$1.evaluate(SystemPropertiesRestoreRule.java:57)
	at org.apache.lucene.util.TestRuleSetupTeardownChained$1.evaluate(TestRuleSetupTeardownChained.java:49)
	at org.apache.lucene.util.AbstractBeforeAfterRule$1.evaluate(AbstractBeforeAfterRule.java:45)
	at org.apache.lucene.util.TestRuleThreadAndTestName$1.evaluate(TestRuleThreadAndTestName.java:48)
	at org.apache.lucene.util.TestRuleIgnoreAfterMaxFailures$1.evaluate(TestRuleIgnoreAfterMaxFailures.java:64)
	at org.apache.lucene.util.TestRuleMarkFailure$1.evaluate(TestRuleMarkFailure.java:47)
	at com.carrotsearch.randomizedtesting.rules.StatementAdapter.evaluate(StatementAdapter.java:36)
	at com.carrotsearch.randomizedtesting.ThreadLeakControl$StatementRunner.run(ThreadLeakControl.java:368)
	at com.carrotsearch.randomizedtesting.ThreadLeakControl.forkTimeoutingTask(ThreadLeakControl.java:817)
	at com.carrotsearch.randomizedtesting.ThreadLeakControl$3.evaluate(ThreadLeakControl.java:468)
	at com.carrotsearch.randomizedtesting.RandomizedRunner.runSingleTest(RandomizedRunner.java:943)
	at com.carrotsearch.randomizedtesting.RandomizedRunner$5.evaluate(RandomizedRunner.java:829)
	at com.carrotsearch.randomizedtesting.RandomizedRunner$6.evaluate(RandomizedRunner.java:879)
	at com.carrotsearch.randomizedtesting.RandomizedRunner$7.evaluate(RandomizedRunner.java:890)
	at com.carrotsearch.randomizedtesting.rules.StatementAdapter.evaluate(StatementAdapter.java:36)
	at com.carrotsearch.randomizedtesting.rules.SystemPropertiesRestoreRule$1.evaluate(SystemPropertiesRestoreRule.java:57)
	at org.apache.lucene.util.AbstractBeforeAfterRule$1.evaluate(AbstractBeforeAfterRule.java:45)
	at com.carrotsearch.randomizedtesting.rules.StatementAdapter.evaluate(StatementAdapter.java:36)
	at org.apache.lucene.util.TestRuleStoreClassName$1.evaluate(TestRuleStoreClassName.java:41)
	at com.carrotsearch.randomizedtesting.rules.NoShadowingOrOverridesOnMethodsRule$1.evaluate(NoShadowingOrOverridesOnMethodsRule.java:40)
	at com.carrotsearch.randomizedtesting.rules.NoShadowingOrOverridesOnMethodsRule$1.evaluate(NoShadowingOrOverridesOnMethodsRule.java:40)
	at com.carrotsearch.randomizedtesting.rules.StatementAdapter.evaluate(StatementAdapter.java:36)
	at com.carrotsearch.randomizedtesting.rules.StatementAdapter.evaluate(StatementAdapter.java:36)
	at com.carrotsearch.randomizedtesting.rules.StatementAdapter.evaluate(StatementAdapter.java:36)
	at org.apache.lucene.util.TestRuleAssertionsRequired$1.evaluate(TestRuleAssertionsRequired.java:53)
	at org.apache.lucene.util.TestRuleMarkFailure$1.evaluate(TestRuleMarkFailure.java:47)
	at org.apache.lucene.util.TestRuleIgnoreAfterMaxFailures$1.evaluate(TestRuleIgnoreAfterMaxFailures.java:64)
	at org.apache.lucene.util.TestRuleIgnoreTestSuites$1.evaluate(TestRuleIgnoreTestSuites.java:54)
	at com.carrotsearch.randomizedtesting.rules.StatementAdapter.evaluate(StatementAdapter.java:36)
	at com.carrotsearch.randomizedtesting.ThreadLeakControl$StatementRunner.run(ThreadLeakControl.java:368)
	at java.lang.Thread.run(Thread.java:748)
Caused by: java.net.SocketTimeoutException: Read timed out
	at java.net.SocketInputStream.socketRead0(Native Method)
	at java.net.SocketInputStream.socketRead(SocketInputStream.java:116)
	at java.net.SocketInputStream.read(SocketInputStream.java:171)
	at java.net.SocketInputStream.read(SocketInputStream.java:141)
	at org.apache.http.impl.io.SessionInputBufferImpl.streamRead(SessionInputBufferImpl.java:137)
	at org.apache.http.impl.io.SessionInputBufferImpl.fillBuffer(SessionInputBufferImpl.java:153)
	at org.apache.http.impl.io.SessionInputBufferImpl.readLine(SessionInputBufferImpl.java:282)
	at org.apache.http.impl.conn.DefaultHttpResponseParser.parseHead(DefaultHttpResponseParser.java:138)
	at org.apache.http.impl.conn.DefaultHttpResponseParser.parseHead(DefaultHttpResponseParser.java:56)
	at org.apache.http.impl.io.AbstractMessageParser.parse(AbstractMessageParser.java:259)
	at org.apache.http.impl.DefaultBHttpClientConnection.receiveResponseHeader(DefaultBHttpClientConnection.java:163)
	at org.apache.http.impl.conn.CPoolProxy.receiveResponseHeader(CPoolProxy.java:165)
	at org.apache.http.protocol.HttpRequestExecutor.doReceiveResponse(HttpRequestExecutor.java:273)
	at org.apache.http.protocol.HttpRequestExecutor.execute(HttpRequestExecutor.java:125)
	at org.apache.http.impl.execchain.MainClientExec.execute(MainClientExec.java:272)
	at org.apache.http.impl.execchain.ProtocolExec.execute(ProtocolExec.java:185)
	at org.apache.http.impl.execchain.RetryExec.execute(RetryExec.java:89)
	at org.apache.http.impl.execchain.RedirectExec.execute(RedirectExec.java:111)
	at org.apache.http.impl.client.InternalHttpClient.doExecute(InternalHttpClient.java:185)
	at org.apache.http.impl.client.CloseableHttpClient.execute(CloseableHttpClient.java:83)
	at org.apache.http.impl.client.CloseableHttpClient.execute(CloseableHttpClient.java:56)
	at org.apache.solr.client.solrj.impl.HttpSolrClient.executeMethod(HttpSolrClient.java:525)
	... 43 more


FAILED:  org.apache.solr.cloud.hdfs.HdfsRecoveryZkTest.test

Error Message:
Error from server at https://127.0.0.1:34129/solr: create the collection time out:180s

Stack Trace:
org.apache.solr.client.solrj.impl.HttpSolrClient$RemoteSolrException: Error from server at https://127.0.0.1:34129/solr: create the collection time out:180s
	at org.apache.solr.client.solrj.impl.HttpSolrClient.executeMethod(HttpSolrClient.java:626)
	at org.apache.solr.client.solrj.impl.HttpSolrClient.request(HttpSolrClient.java:253)
	at org.apache.solr.client.solrj.impl.HttpSolrClient.request(HttpSolrClient.java:242)
	at org.apache.solr.client.solrj.impl.LBHttpSolrClient.doRequest(LBHttpSolrClient.java:483)
	at org.apache.solr.client.solrj.impl.LBHttpSolrClient.request(LBHttpSolrClient.java:413)
	at org.apache.solr.client.solrj.impl.CloudSolrClient.sendRequest(CloudSolrClient.java:1121)
	at org.apache.solr.client.solrj.impl.CloudSolrClient.requestWithRetryOnStaleState(CloudSolrClient.java:862)
	at org.apache.solr.client.solrj.impl.CloudSolrClient.request(CloudSolrClient.java:793)
	at org.apache.solr.client.solrj.SolrRequest.process(SolrRequest.java:178)
	at org.apache.solr.client.solrj.SolrRequest.process(SolrRequest.java:195)
	at org.apache.solr.cloud.RecoveryZkTest.test(RecoveryZkTest.java:68)
	at sun.reflect.NativeMethodAccessorImpl.invoke0(Native Method)
	at sun.reflect.NativeMethodAccessorImpl.invoke(NativeMethodAccessorImpl.java:62)
	at sun.reflect.DelegatingMethodAccessorImpl.invoke(DelegatingMethodAccessorImpl.java:43)
	at java.lang.reflect.Method.invoke(Method.java:498)
	at com.carrotsearch.randomizedtesting.RandomizedRunner.invoke(RandomizedRunner.java:1737)
	at com.carrotsearch.randomizedtesting.RandomizedRunner$8.evaluate(RandomizedRunner.java:934)
	at com.carrotsearch.randomizedtesting.RandomizedRunner$9.evaluate(RandomizedRunner.java:970)
	at com.carrotsearch.randomizedtesting.RandomizedRunner$10.evaluate(RandomizedRunner.java:984)
	at com.carrotsearch.randomizedtesting.rules.SystemPropertiesRestoreRule$1.evaluate(SystemPropertiesRestoreRule.java:57)
	at org.apache.lucene.util.TestRuleSetupTeardownChained$1.evaluate(TestRuleSetupTeardownChained.java:49)
	at org.apache.lucene.util.AbstractBeforeAfterRule$1.evaluate(AbstractBeforeAfterRule.java:45)
	at org.apache.lucene.util.TestRuleThreadAndTestName$1.evaluate(TestRuleThreadAndTestName.java:48)
	at org.apache.lucene.util.TestRuleIgnoreAfterMaxFailures$1.evaluate(TestRuleIgnoreAfterMaxFailures.java:64)
	at org.apache.lucene.util.TestRuleMarkFailure$1.evaluate(TestRuleMarkFailure.java:47)
	at com.carrotsearch.randomizedtesting.rules.StatementAdapter.evaluate(StatementAdapter.java:36)
	at com.carrotsearch.randomizedtesting.ThreadLeakControl$StatementRunner.run(ThreadLeakControl.java:368)
	at com.carrotsearch.randomizedtesting.ThreadLeakControl.forkTimeoutingTask(ThreadLeakControl.java:817)
	at com.carrotsearch.randomizedtesting.ThreadLeakControl$3.evaluate(ThreadLeakControl.java:468)
	at com.carrotsearch.randomizedtesting.RandomizedRunner.runSingleTest(RandomizedRunner.java:943)
	at com.carrotsearch.randomizedtesting.RandomizedRunner$5.evaluate(RandomizedRunner.java:829)
	at com.carrotsearch.randomizedtesting.RandomizedRunner$6.evaluate(RandomizedRunner.java:879)
	at com.carrotsearch.randomizedtesting.RandomizedRunner$7.evaluate(RandomizedRunner.java:890)
	at com.carrotsearch.randomizedtesting.rules.StatementAdapter.evaluate(StatementAdapter.java:36)
	at com.carrotsearch.randomizedtesting.rules.SystemPropertiesRestoreRule$1.evaluate(SystemPropertiesRestoreRule.java:57)
	at org.apache.lucene.util.AbstractBeforeAfterRule$1.evaluate(AbstractBeforeAfterRule.java:45)
	at com.carrotsearch.randomizedtesting.rules.StatementAdapter.evaluate(StatementAdapter.java:36)
	at org.apache.lucene.util.TestRuleStoreClassName$1.evaluate(TestRuleStoreClassName.java:41)
	at com.carrotsearch.randomizedtesting.rules.NoShadowingOrOverridesOnMethodsRule$1.evaluate(NoShadowingOrOverridesOnMethodsRule.java:40)
	at com.carrotsearch.randomizedtesting.rules.NoShadowingOrOverridesOnMethodsRule$1.evaluate(NoShadowingOrOverridesOnMethodsRule.java:40)
	at com.carrotsearch.randomizedtesting.rules.StatementAdapter.evaluate(StatementAdapter.java:36)
	at com.carrotsearch.randomizedtesting.rules.StatementAdapter.evaluate(StatementAdapter.java:36)
	at com.carrotsearch.randomizedtesting.rules.StatementAdapter.evaluate(StatementAdapter.java:36)
	at org.apache.lucene.util.TestRuleAssertionsRequired$1.evaluate(TestRuleAssertionsRequired.java:53)
	at org.apache.lucene.util.TestRuleMarkFailure$1.evaluate(TestRuleMarkFailure.java:47)
	at org.apache.lucene.util.TestRuleIgnoreAfterMaxFailures$1.evaluate(TestRuleIgnoreAfterMaxFailures.java:64)
	at org.apache.lucene.util.TestRuleIgnoreTestSuites$1.evaluate(TestRuleIgnoreTestSuites.java:54)
	at com.carrotsearch.randomizedtesting.rules.StatementAdapter.evaluate(StatementAdapter.java:36)
	at com.carrotsearch.randomizedtesting.ThreadLeakControl$StatementRunner.run(ThreadLeakControl.java:368)
	at java.lang.Thread.run(Thread.java:748)


FAILED:  org.apache.solr.common.cloud.TestCollectionStateWatchers.testWaitForStateWatcherIsRetainedOnPredicateFailure

Error Message:


Stack Trace:
java.util.concurrent.TimeoutException
	at __randomizedtesting.SeedInfo.seed([27744BC7E8F3A9A3:AF42E994305C41B1]:0)
	at org.apache.solr.common.cloud.ZkStateReader.waitForState(ZkStateReader.java:1323)
	at org.apache.solr.client.solrj.impl.CloudSolrClient.waitForState(CloudSolrClient.java:438)
	at org.apache.solr.common.cloud.TestCollectionStateWatchers.testWaitForStateWatcherIsRetainedOnPredicateFailure(TestCollectionStateWatchers.java:228)
	at sun.reflect.NativeMethodAccessorImpl.invoke0(Native Method)
	at sun.reflect.NativeMethodAccessorImpl.invoke(NativeMethodAccessorImpl.java:62)
	at sun.reflect.DelegatingMethodAccessorImpl.invoke(DelegatingMethodAccessorImpl.java:43)
	at java.lang.reflect.Method.invoke(Method.java:498)
	at com.carrotsearch.randomizedtesting.RandomizedRunner.invoke(RandomizedRunner.java:1737)
	at com.carrotsearch.randomizedtesting.RandomizedRunner$8.evaluate(RandomizedRunner.java:934)
	at com.carrotsearch.randomizedtesting.RandomizedRunner$9.evaluate(RandomizedRunner.java:970)
	at com.carrotsearch.randomizedtesting.RandomizedRunner$10.evaluate(RandomizedRunner.java:984)
	at com.carrotsearch.randomizedtesting.rules.SystemPropertiesRestoreRule$1.evaluate(SystemPropertiesRestoreRule.java:57)
	at org.apache.lucene.util.TestRuleSetupTeardownChained$1.evaluate(TestRuleSetupTeardownChained.java:49)
	at org.apache.lucene.util.AbstractBeforeAfterRule$1.evaluate(AbstractBeforeAfterRule.java:45)
	at org.apache.lucene.util.TestRuleThreadAndTestName$1.evaluate(TestRuleThreadAndTestName.java:48)
	at org.apache.lucene.util.TestRuleIgnoreAfterMaxFailures$1.evaluate(TestRuleIgnoreAfterMaxFailures.java:64)
	at org.apache.lucene.util.TestRuleMarkFailure$1.evaluate(TestRuleMarkFailure.java:47)
	at com.carrotsearch.randomizedtesting.rules.StatementAdapter.evaluate(StatementAdapter.java:36)
	at com.carrotsearch.randomizedtesting.ThreadLeakControl$StatementRunner.run(ThreadLeakControl.java:368)
	at com.carrotsearch.randomizedtesting.ThreadLeakControl.forkTimeoutingTask(ThreadLeakControl.java:817)
	at com.carrotsearch.randomizedtesting.ThreadLeakControl$3.evaluate(ThreadLeakControl.java:468)
	at com.carrotsearch.randomizedtesting.RandomizedRunner.runSingleTest(RandomizedRunner.java:943)
	at com.carrotsearch.randomizedtesting.RandomizedRunner$5.evaluate(RandomizedRunner.java:829)
	at com.carrotsearch.randomizedtesting.RandomizedRunner$6.evaluate(RandomizedRunner.java:879)
	at com.carrotsearch.randomizedtesting.RandomizedRunner$7.evaluate(RandomizedRunner.java:890)
	at com.carrotsearch.randomizedtesting.rules.StatementAdapter.evaluate(StatementAdapter.java:36)
	at com.carrotsearch.randomizedtesting.rules.SystemPropertiesRestoreRule$1.evaluate(SystemPropertiesRestoreRule.java:57)
	at org.apache.lucene.util.AbstractBeforeAfterRule$1.evaluate(AbstractBeforeAfterRule.java:45)
	at com.carrotsearch.randomizedtesting.rules.StatementAdapter.evaluate(StatementAdapter.java:36)
	at org.apache.lucene.util.TestRuleStoreClassName$1.evaluate(TestRuleStoreClassName.java:41)
	at com.carrotsearch.randomizedtesting.rules.NoShadowingOrOverridesOnMethodsRule$1.evaluate(NoShadowingOrOverridesOnMethodsRule.java:40)
	at com.carrotsearch.randomizedtesting.rules.NoShadowingOrOverridesOnMethodsRule$1.evaluate(NoShadowingOrOverridesOnMethodsRule.java:40)
	at com.carrotsearch.randomizedtesting.rules.StatementAdapter.evaluate(StatementAdapter.java:36)
	at com.carrotsearch.randomizedtesting.rules.StatementAdapter.evaluate(StatementAdapter.java:36)
	at com.carrotsearch.randomizedtesting.rules.StatementAdapter.evaluate(StatementAdapter.java:36)
	at org.apache.lucene.util.TestRuleAssertionsRequired$1.evaluate(TestRuleAssertionsRequired.java:53)
	at org.apache.lucene.util.TestRuleMarkFailure$1.evaluate(TestRuleMarkFailure.java:47)
	at org.apache.lucene.util.TestRuleIgnoreAfterMaxFailures$1.evaluate(TestRuleIgnoreAfterMaxFailures.java:64)
	at org.apache.lucene.util.TestRuleIgnoreTestSuites$1.evaluate(TestRuleIgnoreTestSuites.java:54)
	at com.carrotsearch.randomizedtesting.rules.StatementAdapter.evaluate(StatementAdapter.java:36)
	at com.carrotsearch.randomizedtesting.ThreadLeakControl$StatementRunner.run(ThreadLeakControl.java:368)
	at java.lang.Thread.run(Thread.java:748)


FAILED:  org.apache.solr.common.cloud.TestCollectionStateWatchers.testDeletionsTriggerWatches

Error Message:
Error from server at http://127.0.0.1:37673/solr: Could not fully create collection: tobedeleted

Stack Trace:
org.apache.solr.client.solrj.impl.HttpSolrClient$RemoteSolrException: Error from server at http://127.0.0.1:37673/solr: Could not fully create collection: tobedeleted
	at __randomizedtesting.SeedInfo.seed([27744BC7E8F3A9A3:85B583486A907FCE]:0)
	at org.apache.solr.client.solrj.impl.HttpSolrClient.executeMethod(HttpSolrClient.java:626)
	at org.apache.solr.client.solrj.impl.HttpSolrClient.request(HttpSolrClient.java:253)
	at org.apache.solr.client.solrj.impl.HttpSolrClient.request(HttpSolrClient.java:242)
	at org.apache.solr.client.solrj.impl.LBHttpSolrClient.doRequest(LBHttpSolrClient.java:483)
	at org.apache.solr.client.solrj.impl.LBHttpSolrClient.request(LBHttpSolrClient.java:413)
	at org.apache.solr.client.solrj.impl.CloudSolrClient.sendRequest(CloudSolrClient.java:1121)
	at org.apache.solr.client.solrj.impl.CloudSolrClient.requestWithRetryOnStaleState(CloudSolrClient.java:862)
	at org.apache.solr.client.solrj.impl.CloudSolrClient.request(CloudSolrClient.java:793)
	at org.apache.solr.client.solrj.SolrRequest.process(SolrRequest.java:178)
	at org.apache.solr.client.solrj.SolrRequest.process(SolrRequest.java:195)
	at org.apache.solr.common.cloud.TestCollectionStateWatchers.testDeletionsTriggerWatches(TestCollectionStateWatchers.java:272)
	at sun.reflect.NativeMethodAccessorImpl.invoke0(Native Method)
	at sun.reflect.NativeMethodAccessorImpl.invoke(NativeMethodAccessorImpl.java:62)
	at sun.reflect.DelegatingMethodAccessorImpl.invoke(DelegatingMethodAccessorImpl.java:43)
	at java.lang.reflect.Method.invoke(Method.java:498)
	at com.carrotsearch.randomizedtesting.RandomizedRunner.invoke(RandomizedRunner.java:1737)
	at com.carrotsearch.randomizedtesting.RandomizedRunner$8.evaluate(RandomizedRunner.java:934)
	at com.carrotsearch.randomizedtesting.RandomizedRunner$9.evaluate(RandomizedRunner.java:970)
	at com.carrotsearch.randomizedtesting.RandomizedRunner$10.evaluate(RandomizedRunner.java:984)
	at com.carrotsearch.randomizedtesting.rules.SystemPropertiesRestoreRule$1.evaluate(SystemPropertiesRestoreRule.java:57)
	at org.apache.lucene.util.TestRuleSetupTeardownChained$1.evaluate(TestRuleSetupTeardownChained.java:49)
	at org.apache.lucene.util.AbstractBeforeAfterRule$1.evaluate(AbstractBeforeAfterRule.java:45)
	at org.apache.lucene.util.TestRuleThreadAndTestName$1.evaluate(TestRuleThreadAndTestName.java:48)
	at org.apache.lucene.util.TestRuleIgnoreAfterMaxFailures$1.evaluate(TestRuleIgnoreAfterMaxFailures.java:64)
	at org.apache.lucene.util.TestRuleMarkFailure$1.evaluate(TestRuleMarkFailure.java:47)
	at com.carrotsearch.randomizedtesting.rules.StatementAdapter.evaluate(StatementAdapter.java:36)
	at com.carrotsearch.randomizedtesting.ThreadLeakControl$StatementRunner.run(ThreadLeakControl.java:368)
	at com.carrotsearch.randomizedtesting.ThreadLeakControl.forkTimeoutingTask(ThreadLeakControl.java:817)
	at com.carrotsearch.randomizedtesting.ThreadLeakControl$3.evaluate(ThreadLeakControl.java:468)
	at com.carrotsearch.randomizedtesting.RandomizedRunner.runSingleTest(RandomizedRunner.java:943)
	at com.carrotsearch.randomizedtesting.RandomizedRunner$5.evaluate(RandomizedRunner.java:829)
	at com.carrotsearch.randomizedtesting.RandomizedRunner$6.evaluate(RandomizedRunner.java:879)
	at com.carrotsearch.randomizedtesting.RandomizedRunner$7.evaluate(RandomizedRunner.java:890)
	at com.carrotsearch.randomizedtesting.rules.StatementAdapter.evaluate(StatementAdapter.java:36)
	at com.carrotsearch.randomizedtesting.rules.SystemPropertiesRestoreRule$1.evaluate(SystemPropertiesRestoreRule.java:57)
	at org.apache.lucene.util.AbstractBeforeAfterRule$1.evaluate(AbstractBeforeAfterRule.java:45)
	at com.carrotsearch.randomizedtesting.rules.StatementAdapter.evaluate(StatementAdapter.java:36)
	at org.apache.lucene.util.TestRuleStoreClassName$1.evaluate(TestRuleStoreClassName.java:41)
	at com.carrotsearch.randomizedtesting.rules.NoShadowingOrOverridesOnMethodsRule$1.evaluate(NoShadowingOrOverridesOnMethodsRule.java:40)
	at com.carrotsearch.randomizedtesting.rules.NoShadowingOrOverridesOnMethodsRule$1.evaluate(NoShadowingOrOverridesOnMethodsRule.java:40)
	at com.carrotsearch.randomizedtesting.rules.StatementAdapter.evaluate(StatementAdapter.java:36)
	at com.carrotsearch.randomizedtesting.rules.StatementAdapter.evaluate(StatementAdapter.java:36)
	at com.carrotsearch.randomizedtesting.rules.StatementAdapter.evaluate(StatementAdapter.java:36)
	at org.apache.lucene.util.TestRuleAssertionsRequired$1.evaluate(TestRuleAssertionsRequired.java:53)
	at org.apache.lucene.util.TestRuleMarkFailure$1.evaluate(TestRuleMarkFailure.java:47)
	at org.apache.lucene.util.TestRuleIgnoreAfterMaxFailures$1.evaluate(TestRuleIgnoreAfterMaxFailures.java:64)
	at org.apache.lucene.util.TestRuleIgnoreTestSuites$1.evaluate(TestRuleIgnoreTestSuites.java:54)
	at com.carrotsearch.randomizedtesting.rules.StatementAdapter.evaluate(StatementAdapter.java:36)
	at com.carrotsearch.randomizedtesting.ThreadLeakControl$StatementRunner.run(ThreadLeakControl.java:368)
	at java.lang.Thread.run(Thread.java:748)


FAILED:  org.apache.solr.common.cloud.TestCollectionStateWatchers.testSimpleCollectionWatch

Error Message:


Stack Trace:
java.util.concurrent.TimeoutException
	at __randomizedtesting.SeedInfo.seed([27744BC7E8F3A9A3:7A4F84B7AFFE369D]:0)
	at org.apache.solr.common.cloud.ZkStateReader.waitForState(ZkStateReader.java:1323)
	at org.apache.solr.client.solrj.impl.CloudSolrClient.waitForState(CloudSolrClient.java:438)
	at org.apache.solr.common.cloud.TestCollectionStateWatchers.testSimpleCollectionWatch(TestCollectionStateWatchers.java:117)
	at sun.reflect.NativeMethodAccessorImpl.invoke0(Native Method)
	at sun.reflect.NativeMethodAccessorImpl.invoke(NativeMethodAccessorImpl.java:62)
	at sun.reflect.DelegatingMethodAccessorImpl.invoke(DelegatingMethodAccessorImpl.java:43)
	at java.lang.reflect.Method.invoke(Method.java:498)
	at com.carrotsearch.randomizedtesting.RandomizedRunner.invoke(RandomizedRunner.java:1737)
	at com.carrotsearch.randomizedtesting.RandomizedRunner$8.evaluate(RandomizedRunner.java:934)
	at com.carrotsearch.randomizedtesting.RandomizedRunner$9.evaluate(RandomizedRunner.java:970)
	at com.carrotsearch.randomizedtesting.RandomizedRunner$10.evaluate(RandomizedRunner.java:984)
	at com.carrotsearch.randomizedtesting.rules.SystemPropertiesRestoreRule$1.evaluate(SystemPropertiesRestoreRule.java:57)
	at org.apache.lucene.util.TestRuleSetupTeardownChained$1.evaluate(TestRuleSetupTeardownChained.java:49)
	at org.apache.lucene.util.AbstractBeforeAfterRule$1.evaluate(AbstractBeforeAfterRule.java:45)
	at org.apache.lucene.util.TestRuleThreadAndTestName$1.evaluate(TestRuleThreadAndTestName.java:48)
	at org.apache.lucene.util.TestRuleIgnoreAfterMaxFailures$1.evaluate(TestRuleIgnoreAfterMaxFailures.java:64)
	at org.apache.lucene.util.TestRuleMarkFailure$1.evaluate(TestRuleMarkFailure.java:47)
	at com.carrotsearch.randomizedtesting.rules.StatementAdapter.evaluate(StatementAdapter.java:36)
	at com.carrotsearch.randomizedtesting.ThreadLeakControl$StatementRunner.run(ThreadLeakControl.java:368)
	at com.carrotsearch.randomizedtesting.ThreadLeakControl.forkTimeoutingTask(ThreadLeakControl.java:817)
	at com.carrotsearch.randomizedtesting.ThreadLeakControl$3.evaluate(ThreadLeakControl.java:468)
	at com.carrotsearch.randomizedtesting.RandomizedRunner.runSingleTest(RandomizedRunner.java:943)
	at com.carrotsearch.randomizedtesting.RandomizedRunner$5.evaluate(RandomizedRunner.java:829)
	at com.carrotsearch.randomizedtesting.RandomizedRunner$6.evaluate(RandomizedRunner.java:879)
	at com.carrotsearch.randomizedtesting.RandomizedRunner$7.evaluate(RandomizedRunner.java:890)
	at com.carrotsearch.randomizedtesting.rules.StatementAdapter.evaluate(StatementAdapter.java:36)
	at com.carrotsearch.randomizedtesting.rules.SystemPropertiesRestoreRule$1.evaluate(SystemPropertiesRestoreRule.java:57)
	at org.apache.lucene.util.AbstractBeforeAfterRule$1.evaluate(AbstractBeforeAfterRule.java:45)
	at com.carrotsearch.randomizedtesting.rules.StatementAdapter.evaluate(StatementAdapter.java:36)
	at org.apache.lucene.util.TestRuleStoreClassName$1.evaluate(TestRuleStoreClassName.java:41)
	at com.carrotsearch.randomizedtesting.rules.NoShadowingOrOverridesOnMethodsRule$1.evaluate(NoShadowingOrOverridesOnMethodsRule.java:40)
	at com.carrotsearch.randomizedtesting.rules.NoShadowingOrOverridesOnMethodsRule$1.evaluate(NoShadowingOrOverridesOnMethodsRule.java:40)
	at com.carrotsearch.randomizedtesting.rules.StatementAdapter.evaluate(StatementAdapter.java:36)
	at com.carrotsearch.randomizedtesting.rules.StatementAdapter.evaluate(StatementAdapter.java:36)
	at com.carrotsearch.randomizedtesting.rules.StatementAdapter.evaluate(StatementAdapter.java:36)
	at org.apache.lucene.util.TestRuleAssertionsRequired$1.evaluate(TestRuleAssertionsRequired.java:53)
	at org.apache.lucene.util.TestRuleMarkFailure$1.evaluate(TestRuleMarkFailure.java:47)
	at org.apache.lucene.util.TestRuleIgnoreAfterMaxFailures$1.evaluate(TestRuleIgnoreAfterMaxFailures.java:64)
	at org.apache.lucene.util.TestRuleIgnoreTestSuites$1.evaluate(TestRuleIgnoreTestSuites.java:54)
	at com.carrotsearch.randomizedtesting.rules.StatementAdapter.evaluate(StatementAdapter.java:36)
	at com.carrotsearch.randomizedtesting.ThreadLeakControl$StatementRunner.run(ThreadLeakControl.java:368)
	at java.lang.Thread.run(Thread.java:748)


FAILED:  org.apache.solr.common.cloud.TestCollectionStateWatchers.testWatchesWorkForStateFormat1

Error Message:
CollectionStateWatcher not notified of stateformat=1 collection creation

Stack Trace:
java.lang.AssertionError: CollectionStateWatcher not notified of stateformat=1 collection creation
	at __randomizedtesting.SeedInfo.seed([27744BC7E8F3A9A3:40B357291C4B8D02]:0)
	at org.junit.Assert.fail(Assert.java:93)
	at org.junit.Assert.assertTrue(Assert.java:43)
	at org.apache.solr.common.cloud.TestCollectionStateWatchers.testWatchesWorkForStateFormat1(TestCollectionStateWatchers.java:290)
	at sun.reflect.NativeMethodAccessorImpl.invoke0(Native Method)
	at sun.reflect.NativeMethodAccessorImpl.invoke(NativeMethodAccessorImpl.java:62)
	at sun.reflect.DelegatingMethodAccessorImpl.invoke(DelegatingMethodAccessorImpl.java:43)
	at java.lang.reflect.Method.invoke(Method.java:498)
	at com.carrotsearch.randomizedtesting.RandomizedRunner.invoke(RandomizedRunner.java:1737)
	at com.carrotsearch.randomizedtesting.RandomizedRunner$8.evaluate(RandomizedRunner.java:934)
	at com.carrotsearch.randomizedtesting.RandomizedRunner$9.evaluate(RandomizedRunner.java:970)
	at com.carrotsearch.randomizedtesting.RandomizedRunner$10.evaluate(RandomizedRunner.java:984)
	at com.carrotsearch.randomizedtesting.rules.SystemPropertiesRestoreRule$1.evaluate(SystemPropertiesRestoreRule.java:57)
	at org.apache.lucene.util.TestRuleSetupTeardownChained$1.evaluate(TestRuleSetupTeardownChained.java:49)
	at org.apache.lucene.util.AbstractBeforeAfterRule$1.evaluate(AbstractBeforeAfterRule.java:45)
	at org.apache.lucene.util.TestRuleThreadAndTestName$1.evaluate(TestRuleThreadAndTestName.java:48)
	at org.apache.lucene.util.TestRuleIgnoreAfterMaxFailures$1.evaluate(TestRuleIgnoreAfterMaxFailures.java:64)
	at org.apache.lucene.util.TestRuleMarkFailure$1.evaluate(TestRuleMarkFailure.java:47)
	at com.carrotsearch.randomizedtesting.rules.StatementAdapter.evaluate(StatementAdapter.java:36)
	at com.carrotsearch.randomizedtesting.ThreadLeakControl$StatementRunner.run(ThreadLeakControl.java:368)
	at com.carrotsearch.randomizedtesting.ThreadLeakControl.forkTimeoutingTask(ThreadLeakControl.java:817)
	at com.carrotsearch.randomizedtesting.ThreadLeakControl$3.evaluate(ThreadLeakControl.java:468)
	at com.carrotsearch.randomizedtesting.RandomizedRunner.runSingleTest(RandomizedRunner.java:943)
	at com.carrotsearch.randomizedtesting.RandomizedRunner$5.evaluate(RandomizedRunner.java:829)
	at com.carrotsearch.randomizedtesting.RandomizedRunner$6.evaluate(RandomizedRunner.java:879)
	at com.carrotsearch.randomizedtesting.RandomizedRunner$7.evaluate(RandomizedRunner.java:890)
	at com.carrotsearch.randomizedtesting.rules.StatementAdapter.evaluate(StatementAdapter.java:36)
	at com.carrotsearch.randomizedtesting.rules.SystemPropertiesRestoreRule$1.evaluate(SystemPropertiesRestoreRule.java:57)
	at org.apache.lucene.util.AbstractBeforeAfterRule$1.evaluate(AbstractBeforeAfterRule.java:45)
	at com.carrotsearch.randomizedtesting.rules.StatementAdapter.evaluate(StatementAdapter.java:36)
	at org.apache.lucene.util.TestRuleStoreClassName$1.evaluate(TestRuleStoreClassName.java:41)
	at com.carrotsearch.randomizedtesting.rules.NoShadowingOrOverridesOnMethodsRule$1.evaluate(NoShadowingOrOverridesOnMethodsRule.java:40)
	at com.carrotsearch.randomizedtesting.rules.NoShadowingOrOverridesOnMethodsRule$1.evaluate(NoShadowingOrOverridesOnMethodsRule.java:40)
	at com.carrotsearch.randomizedtesting.rules.StatementAdapter.evaluate(StatementAdapter.java:36)
	at com.carrotsearch.randomizedtesting.rules.StatementAdapter.evaluate(StatementAdapter.java:36)
	at com.carrotsearch.randomizedtesting.rules.StatementAdapter.evaluate(StatementAdapter.java:36)
	at org.apache.lucene.util.TestRuleAssertionsRequired$1.evaluate(TestRuleAssertionsRequired.java:53)
	at org.apache.lucene.util.TestRuleMarkFailure$1.evaluate(TestRuleMarkFailure.java:47)
	at org.apache.lucene.util.TestRuleIgnoreAfterMaxFailures$1.evaluate(TestRuleIgnoreAfterMaxFailures.java:64)
	at org.apache.lucene.util.TestRuleIgnoreTestSuites$1.evaluate(TestRuleIgnoreTestSuites.java:54)
	at com.carrotsearch.randomizedtesting.rules.StatementAdapter.evaluate(StatementAdapter.java:36)
	at com.carrotsearch.randomizedtesting.ThreadLeakControl$StatementRunner.run(ThreadLeakControl.java:368)
	at java.lang.Thread.run(Thread.java:748)




Build Log:
[...truncated 12307 lines...]
   [junit4] Suite: org.apache.solr.cloud.hdfs.HdfsRecoveryZkTest
   [junit4]   2> 1027660 INFO  (SUITE-HdfsRecoveryZkTest-seed#[54AE0B94B655135E]-worker) [    ] o.a.s.SolrTestCaseJ4 SecureRandom sanity checks: test.solr.allowed.securerandom=null & java.security.egd=file:/dev/./urandom
   [junit4]   2> Creating dataDir: /home/jenkins/workspace/Lucene-Solr-master-Linux/solr/build/solr-core/test/J2/temp/solr.cloud.hdfs.HdfsRecoveryZkTest_54AE0B94B655135E-001/init-core-data-001
   [junit4]   2> 1027660 WARN  (SUITE-HdfsRecoveryZkTest-seed#[54AE0B94B655135E]-worker) [    ] o.a.s.SolrTestCaseJ4 startTrackingSearchers: numOpens=13 numCloses=13
   [junit4]   2> 1027660 INFO  (SUITE-HdfsRecoveryZkTest-seed#[54AE0B94B655135E]-worker) [    ] o.a.s.SolrTestCaseJ4 Using PointFields (NUMERIC_POINTS_SYSPROP=true) w/NUMERIC_DOCVALUES_SYSPROP=true
   [junit4]   2> 1027662 INFO  (SUITE-HdfsRecoveryZkTest-seed#[54AE0B94B655135E]-worker) [    ] o.a.s.SolrTestCaseJ4 Randomized ssl (true) and clientAuth (true) via: @org.apache.solr.util.RandomizeSSL(reason=, ssl=NaN, value=NaN, clientAuth=NaN)
   [junit4]   2> 1027663 INFO  (SUITE-HdfsRecoveryZkTest-seed#[54AE0B94B655135E]-worker) [    ] o.a.s.c.MiniSolrCloudCluster Starting cluster of 2 servers in /home/jenkins/workspace/Lucene-Solr-master-Linux/solr/build/solr-core/test/J2/temp/solr.cloud.hdfs.HdfsRecoveryZkTest_54AE0B94B655135E-001/tempDir-001
   [junit4]   2> 1027663 INFO  (SUITE-HdfsRecoveryZkTest-seed#[54AE0B94B655135E]-worker) [    ] o.a.s.c.ZkTestServer STARTING ZK TEST SERVER
   [junit4]   2> 1027664 INFO  (Thread-4887) [    ] o.a.s.c.ZkTestServer client port:0.0.0.0/0.0.0.0:0
   [junit4]   2> 1027664 INFO  (Thread-4887) [    ] o.a.s.c.ZkTestServer Starting server
   [junit4]   2> 1027665 ERROR (Thread-4887) [    ] o.a.z.s.ZooKeeperServer ZKShutdownHandler is not registered, so ZooKeeper server won't take any action on ERROR or SHUTDOWN server state changes
   [junit4]   2> 1027766 INFO  (SUITE-HdfsRecoveryZkTest-seed#[54AE0B94B655135E]-worker) [    ] o.a.s.c.ZkTestServer start zk server on port:41277
   [junit4]   2> 1027776 INFO  (jetty-launcher-1358-thread-2) [    ] o.e.j.s.Server jetty-9.3.20.v20170531
   [junit4]   2> 1027776 INFO  (jetty-launcher-1358-thread-1) [    ] o.e.j.s.Server jetty-9.3.20.v20170531
   [junit4]   2> 1027789 INFO  (jetty-launcher-1358-thread-1) [    ] o.e.j.s.h.ContextHandler Started o.e.j.s.ServletContextHandler@77396d{/solr,null,AVAILABLE}
   [junit4]   2> 1027789 INFO  (jetty-launcher-1358-thread-2) [    ] o.e.j.s.h.ContextHandler Started o.e.j.s.ServletContextHandler@167b703{/solr,null,AVAILABLE}
   [junit4]   2> 1027798 INFO  (jetty-launcher-1358-thread-1) [    ] o.e.j.s.AbstractConnector Started ServerConnector@13ab606{SSL,[ssl, http/1.1]}{127.0.0.1:34129}
   [junit4]   2> 1027798 INFO  (jetty-launcher-1358-thread-1) [    ] o.e.j.s.Server Started @1028862ms
   [junit4]   2> 1027799 INFO  (jetty-launcher-1358-thread-1) [    ] o.a.s.c.s.e.JettySolrRunner Jetty properties: {hostContext=/solr, hostPort=34129}
   [junit4]   2> 1027799 INFO  (jetty-launcher-1358-thread-2) [    ] o.e.j.s.AbstractConnector Started ServerConnector@d8fbc5{SSL,[ssl, http/1.1]}{127.0.0.1:37709}
   [junit4]   2> 1027799 ERROR (jetty-launcher-1358-thread-1) [    ] o.a.s.u.StartupLoggingUtils Missing Java Option solr.log.dir. Logging may be missing or incomplete.
   [junit4]   2> 1027799 INFO  (jetty-launcher-1358-thread-2) [    ] o.e.j.s.Server Started @1028862ms
   [junit4]   2> 1027799 INFO  (jetty-launcher-1358-thread-1) [    ] o.a.s.s.SolrDispatchFilter  ___      _       Welcome to Apache Solr™ version 8.0.0
   [junit4]   2> 1027799 INFO  (jetty-launcher-1358-thread-2) [    ] o.a.s.c.s.e.JettySolrRunner Jetty properties: {hostContext=/solr, hostPort=37709}
   [junit4]   2> 1027799 INFO  (jetty-launcher-1358-thread-1) [    ] o.a.s.s.SolrDispatchFilter / __| ___| |_ _   Starting in cloud mode on port null
   [junit4]   2> 1027800 INFO  (jetty-launcher-1358-thread-1) [    ] o.a.s.s.SolrDispatchFilter \__ \/ _ \ | '_|  Install dir: null, Default config dir: null
   [junit4]   2> 1027800 INFO  (jetty-launcher-1358-thread-1) [    ] o.a.s.s.SolrDispatchFilter |___/\___/_|_|    Start time: 2017-10-19T01:15:19.291Z
   [junit4]   2> 1027801 ERROR (jetty-launcher-1358-thread-2) [    ] o.a.s.u.StartupLoggingUtils Missing Java Option solr.log.dir. Logging may be missing or incomplete.
   [junit4]   2> 1027801 INFO  (jetty-launcher-1358-thread-2) [    ] o.a.s.s.SolrDispatchFilter  ___      _       Welcome to Apache Solr™ version 8.0.0
   [junit4]   2> 1027801 INFO  (jetty-launcher-1358-thread-2) [    ] o.a.s.s.SolrDispatchFilter / __| ___| |_ _   Starting in cloud mode on port null
   [junit4]   2> 1027801 INFO  (jetty-launcher-1358-thread-2) [    ] o.a.s.s.SolrDispatchFilter \__ \/ _ \ | '_|  Install dir: null, Default config dir: null
   [junit4]   2> 1027801 INFO  (jetty-launcher-1358-thread-2) [    ] o.a.s.s.SolrDispatchFilter |___/\___/_|_|    Start time: 2017-10-19T01:15:19.292Z
   [junit4]   2> 1027803 INFO  (jetty-launcher-1358-thread-2) [    ] o.a.s.s.SolrDispatchFilter solr.xml found in ZooKeeper. Loading...
   [junit4]   2> 1027804 INFO  (jetty-launcher-1358-thread-1) [    ] o.a.s.s.SolrDispatchFilter solr.xml found in ZooKeeper. Loading...
   [junit4]   2> 1027813 INFO  (jetty-launcher-1358-thread-1) [    ] o.a.s.c.ZkContainer Zookeeper client=127.0.0.1:41277/solr
   [junit4]   2> 1027813 INFO  (jetty-launcher-1358-thread-2) [    ] o.a.s.c.ZkContainer Zookeeper client=127.0.0.1:41277/solr
   [junit4]   2> 1027896 INFO  (jetty-launcher-1358-thread-1) [n:127.0.0.1:34129_solr    ] o.a.s.c.Overseer Overseer (id=null) closing
   [junit4]   2> 1027896 INFO  (jetty-launcher-1358-thread-2) [n:127.0.0.1:37709_solr    ] o.a.s.c.Overseer Overseer (id=null) closing
   [junit4]   2> 1027897 INFO  (jetty-launcher-1358-thread-2) [n:127.0.0.1:37709_solr    ] o.a.s.c.OverseerElectionContext I am going to be the leader 127.0.0.1:37709_solr
   [junit4]   2> 1027897 INFO  (jetty-launcher-1358-thread-1) [n:127.0.0.1:34129_solr    ] o.a.s.c.ZkController Register node as live in ZooKeeper:/live_nodes/127.0.0.1:34129_solr
   [junit4]   2> 1027898 INFO  (jetty-launcher-1358-thread-2) [n:127.0.0.1:37709_solr    ] o.a.s.c.Overseer Overseer (id=98852911130542086-127.0.0.1:37709_solr-n_0000000000) starting
   [junit4]   2> 1027899 INFO  (zkCallback-1369-thread-1-processing-n:127.0.0.1:34129_solr) [n:127.0.0.1:34129_solr    ] o.a.s.c.c.ZkStateReader Updated live nodes from ZooKeeper... (0) -> (1)
   [junit4]   2> 1027905 INFO  (zkCallback-1370-thread-1-processing-n:127.0.0.1:37709_solr) [n:127.0.0.1:37709_solr    ] o.a.s.c.c.ZkStateReader Updated live nodes from ZooKeeper... (0) -> (1)
   [junit4]   2> 1027916 INFO  (jetty-launcher-1358-thread-2) [n:127.0.0.1:37709_solr    ] o.a.s.c.ZkController Register node as live in ZooKeeper:/live_nodes/127.0.0.1:37709_solr
   [junit4]   2> 1027919 INFO  (zkCallback-1369-thread-1-processing-n:127.0.0.1:34129_solr) [n:127.0.0.1:34129_solr    ] o.a.s.c.c.ZkStateReader Updated live nodes from ZooKeeper... (1) -> (2)
   [junit4]   2> 1027920 INFO  (zkCallback-1370-thread-1-processing-n:127.0.0.1:37709_solr) [n:127.0.0.1:37709_solr    ] o.a.s.c.c.ZkStateReader Updated live nodes from ZooKeeper... (1) -> (2)
   [junit4]   2> 1028058 INFO  (jetty-launcher-1358-thread-2) [n:127.0.0.1:37709_solr    ] o.a.s.m.r.SolrJmxReporter JMX monitoring for 'solr_37709.solr.node' (registry 'solr.node') enabled at server: com.sun.jmx.mbeanserver.JmxMBeanServer@d90cb3
   [junit4]   2> 1028071 INFO  (jetty-launcher-1358-thread-2) [n:127.0.0.1:37709_solr    ] o.a.s.m.r.SolrJmxReporter JMX monitoring for 'solr_37709.solr.jvm' (registry 'solr.jvm') enabled at server: com.sun.jmx.mbeanserver.JmxMBeanServer@d90cb3
   [junit4]   2> 1028071 INFO  (jetty-launcher-1358-thread-2) [n:127.0.0.1:37709_solr    ] o.a.s.m.r.SolrJmxReporter JMX monitoring for 'solr_37709.solr.jetty' (registry 'solr.jetty') enabled at server: com.sun.jmx.mbeanserver.JmxMBeanServer@d90cb3
   [junit4]   2> 1028072 INFO  (jetty-launcher-1358-thread-2) [n:127.0.0.1:37709_solr    ] o.a.s.c.CorePropertiesLocator Found 0 core definitions underneath /home/jenkins/workspace/Lucene-Solr-master-Linux/solr/build/solr-core/test/J2/temp/solr.cloud.hdfs.HdfsRecoveryZkTest_54AE0B94B655135E-001/tempDir-001/node2/.
   [junit4]   2> 1028120 INFO  (jetty-launcher-1358-thread-1) [n:127.0.0.1:34129_solr    ] o.a.s.m.r.SolrJmxReporter JMX monitoring for 'solr_34129.solr.node' (registry 'solr.node') enabled at server: com.sun.jmx.mbeanserver.JmxMBeanServer@d90cb3
   [junit4]   2> 1028140 INFO  (jetty-launcher-1358-thread-1) [n:127.0.0.1:34129_solr    ] o.a.s.m.r.SolrJmxReporter JMX monitoring for 'solr_34129.solr.jvm' (registry 'solr.jvm') enabled at server: com.sun.jmx.mbeanserver.JmxMBeanServer@d90cb3
   [junit4]   2> 1028140 INFO  (jetty-launcher-1358-thread-1) [n:127.0.0.1:34129_solr    ] o.a.s.m.r.SolrJmxReporter JMX monitoring for 'solr_34129.solr.jetty' (registry 'solr.jetty') enabled at server: com.sun.jmx.mbeanserver.JmxMBeanServer@d90cb3
   [junit4]   2> 1028142 INFO  (jetty-launcher-1358-thread-1) [n:127.0.0.1:34129_solr    ] o.a.s.c.CorePropertiesLocator Found 0 core definitions underneath /home/jenkins/workspace/Lucene-Solr-master-Linux/solr/build/solr-core/test/J2/temp/solr.cloud.hdfs.HdfsRecoveryZkTest_54AE0B94B655135E-001/tempDir-001/node1/.
   [junit4]   2> 1028179 INFO  (SUITE-HdfsRecoveryZkTest-seed#[54AE0B94B655135E]-worker) [    ] o.a.s.c.c.ZkStateReader Updated live nodes from ZooKeeper... (0) -> (2)
   [junit4]   2> 1028180 INFO  (SUITE-HdfsRecoveryZkTest-seed#[54AE0B94B655135E]-worker) [    ] o.a.s.c.s.i.ZkClientClusterStateProvider Cluster at 127.0.0.1:41277/solr ready
   [junit4]   1> Formatting using clusterid: testClusterID
   [junit4]   2> 1028255 WARN  (SUITE-HdfsRecoveryZkTest-seed#[54AE0B94B655135E]-worker) [    ] o.a.h.m.i.MetricsConfig Cannot locate configuration: tried hadoop-metrics2-namenode.properties,hadoop-metrics2.properties
   [junit4]   2> 1028271 WARN  (SUITE-HdfsRecoveryZkTest-seed#[54AE0B94B655135E]-worker) [    ] o.a.h.h.HttpRequestLog Jetty request log can only be enabled using Log4j
   [junit4]   2> 1028274 INFO  (SUITE-HdfsRecoveryZkTest-seed#[54AE0B94B655135E]-worker) [    ] o.m.log jetty-6.1.26
   [junit4]   2> 1028285 INFO  (SUITE-HdfsRecoveryZkTest-seed#[54AE0B94B655135E]-worker) [    ] o.m.log Extract jar:file:/home/jenkins/.ivy2/cache/org.apache.hadoop/hadoop-hdfs/tests/hadoop-hdfs-2.7.4-tests.jar!/webapps/hdfs to ./temp/Jetty_localhost_localdomain_46565_hdfs____pjc8uk/webapp
   [junit4]   2> 1028839 INFO  (SUITE-HdfsRecoveryZkTest-seed#[54AE0B94B655135E]-worker) [    ] o.m.log Started HttpServer2$SelectChannelConnectorWithSafeStartup@localhost.localdomain:46565
   [junit4]   2> 1028924 WARN  (SUITE-HdfsRecoveryZkTest-seed#[54AE0B94B655135E]-worker) [    ] o.a.h.h.HttpRequestLog Jetty request log can only be enabled using Log4j
   [junit4]   2> 1028926 INFO  (SUITE-HdfsRecoveryZkTest-seed#[54AE0B94B655135E]-worker) [    ] o.m.log jetty-6.1.26
   [junit4]   2> 1028938 INFO  (SUITE-HdfsRecoveryZkTest-seed#[54AE0B94B655135E]-worker) [    ] o.m.log Extract jar:file:/home/jenkins/.ivy2/cache/org.apache.hadoop/hadoop-hdfs/tests/hadoop-hdfs-2.7.4-tests.jar!/webapps/datanode to ./temp/Jetty_localhost_34821_datanode____.76z7oj/webapp
   [junit4]   2> 1029458 INFO  (SUITE-HdfsRecoveryZkTest-seed#[54AE0B94B655135E]-worker) [    ] o.m.log Started HttpServer2$SelectChannelConnectorWithSafeStartup@localhost:34821
   [junit4]   2> 1029495 WARN  (SUITE-HdfsRecoveryZkTest-seed#[54AE0B94B655135E]-worker) [    ] o.a.h.h.HttpRequestLog Jetty request log can only be enabled using Log4j
   [junit4]   2> 1029497 INFO  (SUITE-HdfsRecoveryZkTest-seed#[54AE0B94B655135E]-worker) [    ] o.m.log jetty-6.1.26
   [junit4]   2> 1029511 INFO  (SUITE-HdfsRecoveryZkTest-seed#[54AE0B94B655135E]-worker) [    ] o.m.log Extract jar:file:/home/jenkins/.ivy2/cache/org.apache.hadoop/hadoop-hdfs/tests/hadoop-hdfs-2.7.4-tests.jar!/webapps/datanode to ./temp/Jetty_localhost_38011_datanode____.iyxscu/webapp
   [junit4]   2> 1029745 ERROR (DataNode: [[[DISK]file:/home/jenkins/workspace/Lucene-Solr-master-Linux/solr/build/solr-core/test/J2/temp/solr.cloud.hdfs.HdfsRecoveryZkTest_54AE0B94B655135E-001/tempDir-002/hdfsBaseDir/data/data1/, [DISK]file:/home/jenkins/workspace/Lucene-Solr-master-Linux/solr/build/solr-core/test/J2/temp/solr.cloud.hdfs.HdfsRecoveryZkTest_54AE0B94B655135E-001/tempDir-002/hdfsBaseDir/data/data2/]]  heartbeating to localhost.localdomain/127.0.0.1:36659) [    ] o.a.h.h.s.d.DirectoryScanner dfs.datanode.directoryscan.throttle.limit.ms.per.sec set to value below 1 ms/sec. Assuming default value of 1000
   [junit4]   2> 1029777 INFO  (Block report processor) [    ] BlockStateChange BLOCK* processReport 0xf41e3a22ce620: from storage DS-c87db040-0934-4799-87a4-275e72d723c6 node DatanodeRegistration(127.0.0.1:36345, datanodeUuid=bdbe5417-408e-4996-86fc-cd78b10d950b, infoPort=34613, infoSecurePort=0, ipcPort=44207, storageInfo=lv=-56;cid=testClusterID;nsid=1829602174;c=0), blocks: 0, hasStaleStorage: true, processing time: 0 msecs
   [junit4]   2> 1029777 INFO  (Block report processor) [    ] BlockStateChange BLOCK* processReport 0xf41e3a22ce620: from storage DS-ab3bb43d-540f-4d6f-baef-5ca5c8c844cc node DatanodeRegistration(127.0.0.1:36345, datanodeUuid=bdbe5417-408e-4996-86fc-cd78b10d950b, infoPort=34613, infoSecurePort=0, ipcPort=44207, storageInfo=lv=-56;cid=testClusterID;nsid=1829602174;c=0), blocks: 0, hasStaleStorage: false, processing time: 0 msecs
   [junit4]   2> 1030104 INFO  (SUITE-HdfsRecoveryZkTest-seed#[54AE0B94B655135E]-worker) [    ] o.m.log Started HttpServer2$SelectChannelConnectorWithSafeStartup@localhost:38011
   [junit4]   2> 1030215 ERROR (DataNode: [[[DISK]file:/home/jenkins/workspace/Lucene-Solr-master-Linux/solr/build/solr-core/test/J2/temp/solr.cloud.hdfs.HdfsRecoveryZkTest_54AE0B94B655135E-001/tempDir-002/hdfsBaseDir/data/data3/, [DISK]file:/home/jenkins/workspace/Lucene-Solr-master-Linux/solr/build/solr-core/test/J2/temp/solr.cloud.hdfs.HdfsRecoveryZkTest_54AE0B94B655135E-001/tempDir-002/hdfsBaseDir/data/data4/]]  heartbeating to localhost.localdomain/127.0.0.1:36659) [    ] o.a.h.h.s.d.DirectoryScanner dfs.datanode.directoryscan.throttle.limit.ms.per.sec set to value below 1 ms/sec. Assuming default value of 1000
   [junit4]   2> 1030219 INFO  (Block report processor) [    ] BlockStateChange BLOCK* processReport 0xf41e3bc8eb5f5: from storage DS-debca471-feea-4d4e-bd3e-66ac1c76f69f node DatanodeRegistration(127.0.0.1:46407, datanodeUuid=8d208fea-ae3b-4124-98ae-bc067791543c, infoPort=44423, infoSecurePort=0, ipcPort=45763, storageInfo=lv=-56;cid=testClusterID;nsid=1829602174;c=0), blocks: 0, hasStaleStorage: true, processing time: 1 msecs
   [junit4]   2> 1030219 INFO  (Block report processor) [    ] BlockStateChange BLOCK* processReport 0xf41e3bc8eb5f5: from storage DS-62268b0c-2c37-4c3c-bc36-f3bbce74ba53 node DatanodeRegistration(127.0.0.1:46407, datanodeUuid=8d208fea-ae3b-4124-98ae-bc067791543c, infoPort=44423, infoSecurePort=0, ipcPort=45763, storageInfo=lv=-56;cid=testClusterID;nsid=1829602174;c=0), blocks: 0, hasStaleStorage: false, processing time: 0 msecs
   [junit4]   2> 1030264 INFO  (TEST-HdfsRecoveryZkTest.test-seed#[54AE0B94B655135E]) [    ] o.a.s.SolrTestCaseJ4 ###Starting test
   [junit4]   2> 1030357 INFO  (qtp16434227-11683) [n:127.0.0.1:34129_solr    ] o.a.s.h.a.CollectionsHandler Invoked Collection Action :create with params replicationFactor=2&collection.configName=conf&maxShardsPerNode=1&name=recoverytest&nrtReplicas=2&action=CREATE&numShards=1&wt=javabin&version=2 and sendToOCPQueue=true
   [junit4]   2> 1030359 INFO  (OverseerThreadFactory-3262-thread-1-processing-n:127.0.0.1:37709_solr) [n:127.0.0.1:37709_solr    ] o.a.s.c.CreateCollectionCmd Create collection recoverytest
   [junit4]   2> 1030466 INFO  (OverseerStateUpdate-98852911130542086-127.0.0.1:37709_solr-n_0000000000) [n:127.0.0.1:37709_solr    ] o.a.s.c.o.SliceMutator createReplica() {
   [junit4]   2>   "operation":"ADDREPLICA",
   [junit4]   2>   "collection":"recoverytest",
   [junit4]   2>   "shard":"shard1",
   [junit4]   2>   "core":"recoverytest_shard1_replica_n1",
   [junit4]   2>   "state":"down",
   [junit4]   2>   "base_url":"https://127.0.0.1:34129/solr",
   [junit4]   2>   "type":"NRT",
   [junit4]   2>   "waitForFinalState":"false"} 
   [junit4]   2> 1030469 INFO  (OverseerStateUpdate-98852911130542086-127.0.0.1:37709_solr-n_0000000000) [n:127.0.0.1:37709_solr    ] o.a.s.c.o.SliceMutator createReplica() {
   [junit4]   2>   "operation":"ADDREPLICA",
   [junit4]   2>   "collection":"recoverytest",
   [junit4]   2>   "shard":"shard1",
   [junit4]   2>   "core":"recoverytest_shard1_replica_n2",
   [junit4]   2>   "state":"down",
   [junit4]   2>   "base_url":"https://127.0.0.1:37709/solr",
   [junit4]   2>   "type":"NRT",
   [junit4]   2>   "waitForFinalState":"false"} 
   [junit4]   2> 1030690 INFO  (qtp16434227-11698) [n:127.0.0.1:34129_solr    ] o.a.s.h.a.CoreAdminOperation core create command qt=/admin/cores&coreNodeName=core_node3&collection.configName=conf&newCollection=true&name=recoverytest_shard1_replica_n1&action=CREATE&numShards=1&collection=recoverytest&shard=shard1&wt=javabin&version=2&replicaType=NRT
   [junit4]   2> 1030690 INFO  (qtp16434227-11698) [n:127.0.0.1:34129_solr    ] o.a.s.c.TransientSolrCoreCacheDefault Allocating transient cache for 2147483647 transient cores
   [junit4]   2> 1030781 INFO  (qtp12663461-11682) [n:127.0.0.1:37709_solr    ] o.a.s.h.a.CoreAdminOperation core create command qt=/admin/cores&coreNodeName=core_node4&collection.configName=conf&newCollection=true&name=recoverytest_shard1_replica_n2&action=CREATE&numShards=1&collection=recoverytest&shard=shard1&wt=javabin&version=2&replicaType=NRT
   [junit4]   2> 1030782 INFO  (qtp12663461-11682) [n:127.0.0.1:37709_solr    ] o.a.s.c.TransientSolrCoreCacheDefault Allocating transient cache for 2147483647 transient cores
   [junit4]   2> 1030892 INFO  (zkCallback-1369-thread-1-processing-n:127.0.0.1:34129_solr) [n:127.0.0.1:34129_solr    ] o.a.s.c.c.ZkStateReader A cluster state change: [WatchedEvent state:SyncConnected type:NodeDataChanged path:/collections/recoverytest/state.json] for collection [recoverytest] has occurred - updating... (live nodes size: [2])
   [junit4]   2> 1030892 INFO  (zkCallback-1369-thread-2-processing-n:127.0.0.1:34129_solr) [n:127.0.0.1:34129_solr    ] o.a.s.c.c.ZkStateReader A cluster state change: [WatchedEvent state:SyncConnected type:NodeDataChanged path:/collections/recoverytest/state.json] for collection [recoverytest] has occurred - updating... (live nodes size: [2])
   [junit4]   2> 1030892 INFO  (zkCallback-1370-thread-1-processing-n:127.0.0.1:37709_solr) [n:127.0.0.1:37709_solr    ] o.a.s.c.c.ZkStateReader A cluster state change: [WatchedEvent state:SyncConnected type:NodeDataChanged path:/collections/recoverytest/state.json] for collection [recoverytest] has occurred - updating... (live nodes size: [2])
   [junit4]   2> 1030892 INFO  (zkCallback-1370-thread-2-processing-n:127.0.0.1:37709_solr) [n:127.0.0.1:37709_solr    ] o.a.s.c.c.ZkStateReader A cluster state change: [WatchedEvent state:SyncConnected type:NodeDataChanged path:/collections/recoverytest/state.json] for collection [recoverytest] has occurred - updating... (live nodes size: [2])
   [junit4]   2> 1031718 INFO  (qtp16434227-11698) [n:127.0.0.1:34129_solr c:recoverytest s:shard1 r:core_node3 x:recoverytest_shard1_replica_n1] o.a.s.c.SolrConfig Using Lucene MatchVersion: 8.0.0
   [junit4]   2> 1031732 INFO  (qtp16434227-11698) [n:127.0.0.1:34129_solr c:recoverytest s:shard1 r:core_node3 x:recoverytest_shard1_replica_n1] o.a.s.s.IndexSchema [recoverytest_shard1_replica_n1] Schema name=minimal
   [junit4]   2> 1031737 INFO  (qtp16434227-11698) [n:127.0.0.1:34129_solr c:recoverytest s:shard1 r:core_node3 x:recoverytest_shard1_replica_n1] o.a.s.s.IndexSchema Loaded schema minimal/1.1 with uniqueid field id
   [junit4]   2> 1031737 INFO  (qtp16434227-11698) [n:127.0.0.1:34129_solr c:recoverytest s:shard1 r:core_node3 x:recoverytest_shard1_replica_n1] o.a.s.c.CoreContainer Creating SolrCore 'recoverytest_shard1_replica_n1' using configuration from collection recoverytest, trusted=true
   [junit4]   2> 1031738 INFO  (qtp16434227-11698) [n:127.0.0.1:34129_solr c:recoverytest s:shard1 r:core_node3 x:recoverytest_shard1_replica_n1] o.a.s.m.r.SolrJmxReporter JMX monitoring for 'solr_34129.solr.core.recoverytest.shard1.replica_n1' (registry 'solr.core.recoverytest.shard1.replica_n1') enabled at server: com.sun.jmx.mbeanserver.JmxMBeanServer@d90cb3
   [junit4]   2> 1031745 INFO  (qtp16434227-11698) [n:127.0.0.1:34129_solr c:recoverytest s:shard1 r:core_node3 x:recoverytest_shard1_replica_n1] o.a.s.c.HdfsDirectoryFactory solr.hdfs.home=hdfs://localhost.localdomain:36659/data
   [junit4]   2> 1031745 INFO  (qtp16434227-11698) [n:127.0.0.1:34129_solr c:recoverytest s:shard1 r:core_node3 x:recoverytest_shard1_replica_n1] o.a.s.c.HdfsDirectoryFactory Solr Kerberos Authentication disabled
   [junit4]   2> 1031745 INFO  (qtp16434227-11698) [n:127.0.0.1:34129_solr c:recoverytest s:shard1 r:core_node3 x:recoverytest_shard1_replica_n1] o.a.s.c.SolrCore solr.RecoveryStrategy.Builder
   [junit4]   2> 1031745 INFO  (qtp16434227-11698) [n:127.0.0.1:34129_solr c:recoverytest s:shard1 r:core_node3 x:recoverytest_shard1_replica_n1] o.a.s.c.SolrCore [[recoverytest_shard1_replica_n1] ] Opening new SolrCore at [/home/jenkins/workspace/Lucene-Solr-master-Linux/solr/build/solr-core/test/J2/temp/solr.cloud.hdfs.HdfsRecoveryZkTest_54AE0B94B655135E-001/tempDir-001/node1/recoverytest_shard1_replica_n1], dataDir=[hdfs://localhost.localdomain:36659/data/recoverytest/core_node3/data/]
   [junit4]   2> 1031748 INFO  (qtp16434227-11698) [n:127.0.0.1:34129_solr c:recoverytest s:shard1 r:core_node3 x:recoverytest_shard1_replica_n1] o.a.s.c.HdfsDirectoryFactory creating directory factory for path hdfs://localhost.localdomain:36659/data/recoverytest/core_node3/data/snapshot_metadata
   [junit4]   2> 1031782 INFO  (qtp16434227-11698) [n:127.0.0.1:34129_solr c:recoverytest s:shard1 r:core_node3 x:recoverytest_shard1_replica_n1] o.a.s.c.HdfsDirectoryFactory Number of slabs of block cache [1] with direct memory allocation set to [true]
   [junit4]   2> 1031782 INFO  (qtp16434227-11698) [n:127.0.0.1:34129_solr c:recoverytest s:shard1 r:core_node3 x:recoverytest_shard1_replica_n1] o.a.s.c.HdfsDirectoryFactory Block cache target memory usage, slab size of [16777216] will allocate [1] slabs and use ~[16777216] bytes
   [junit4]   2> 1031782 INFO  (qtp16434227-11698) [n:127.0.0.1:34129_solr c:recoverytest s:shard1 r:core_node3 x:recoverytest_shard1_replica_n1] o.a.s.c.HdfsDirectoryFactory Creating new global HDFS BlockCache
   [junit4]   2> 1031796 INFO  (qtp12663461-11682) [n:127.0.0.1:37709_solr c:recoverytest s:shard1 r:core_node4 x:recoverytest_shard1_replica_n2] o.a.s.c.SolrConfig Using Lucene MatchVersion: 8.0.0
   [junit4]   2> 1032057 INFO  (qtp16434227-11698) [n:127.0.0.1:34129_solr c:recoverytest s:shard1 r:core_node3 x:recoverytest_shard1_replica_n1] o.a.s.s.b.BlockDirectory Block cache on write is disabled
   [junit4]   2> 1032059 INFO  (qtp16434227-11698) [n:127.0.0.1:34129_solr c:recoverytest s:shard1 r:core_node3 x:recoverytest_shard1_replica_n1] o.a.s.c.HdfsDirectoryFactory creating directory factory for path hdfs://localhost.localdomain:36659/data/recoverytest/core_node3/data
   [junit4]   2> 1032062 INFO  (qtp12663461-11682) [n:127.0.0.1:37709_solr c:recoverytest s:shard1 r:core_node4 x:recoverytest_shard1_replica_n2] o.a.s.s.IndexSchema [recoverytest_shard1_replica_n2] Schema name=minimal
   [junit4]   2> 1032068 INFO  (qtp12663461-11682) [n:127.0.0.1:37709_solr c:recoverytest s:shard1 r:core_node4 x:recoverytest_shard1_replica_n2] o.a.s.s.IndexSchema Loaded schema minimal/1.1 with uniqueid field id
   [junit4]   2> 1032068 INFO  (qtp12663461-11682) [n:127.0.0.1:37709_solr c:recoverytest s:shard1 r:core_node4 x:recoverytest_shard1_replica_n2] o.a.s.c.CoreContainer Creating SolrCore 'recoverytest_shard1_replica_n2' using configuration from collection recoverytest, trusted=true
   [junit4]   2> 1032069 INFO  (qtp12663461-11682) [n:127.0.0.1:37709_solr c:recoverytest s:shard1 r:core_node4 x:recoverytest_shard1_replica_n2] o.a.s.m.r.SolrJmxReporter JMX monitoring for 'solr_37709.solr.core.recoverytest.shard1.replica_n2' (registry 'solr.core.recoverytest.shard1.replica_n2') enabled at server: com.sun.jmx.mbeanserver.JmxMBeanServer@d90cb3
   [junit4]   2> 1032069 INFO  (qtp12663461-11682) [n:127.0.0.1:37709_solr c:recoverytest s:shard1 r:core_node4 x:recoverytest_shard1_replica_n2] o.a.s.c.HdfsDirectoryFactory solr.hdfs.home=hdfs://localhost.localdomain:36659/data
   [junit4]   2> 1032069 INFO  (qtp12663461-11682) [n:127.0.0.1:37709_solr c:recoverytest s:shard1 r:core_node4 x:recoverytest_shard1_replica_n2] o.a.s.c.HdfsDirectoryFactory Solr Kerberos Authentication disabled
   [junit4]   2> 1032069 INFO  (qtp12663461-11682) [n:127.0.0.1:37709_solr c:recoverytest s:shard1 r:core_node4 x:recoverytest_shard1_replica_n2] o.a.s.c.SolrCore solr.RecoveryStrategy.Builder
   [junit4]   2> 1032069 INFO  (qtp12663461-11682) [n:127.0.0.1:37709_solr c:recoverytest s:shard1 r:core_node4 x:recoverytest_shard1_replica_n2] o.a.s.c.SolrCore [[recoverytest_shard1_replica_n2] ] Opening new SolrCore at [/home/jenkins/workspace/Lucene-Solr-master-Linux/solr/build/solr-core/test/J2/temp/solr.cloud.hdfs.HdfsRecoveryZkTest_54AE0B94B655135E-001/tempDir-001/node2/recoverytest_shard1_replica_n2], dataDir=[hdfs://localhost.localdomain:36659/data/recoverytest/core_node4/data/]
   [junit4]   2> 1032073 INFO  (qtp12663461-11682) [n:127.0.0.1:37709_solr c:recoverytest s:shard1 r:core_node4 x:recoverytest_shard1_replica_n2] o.a.s.c.HdfsDirectoryFactory creating directory factory for path hdfs://localhost.localdomain:36659/data/recoverytest/core_node4/data/snapshot_metadata
   [junit4]   2> 1032085 INFO  (qtp12663461-11682) [n:127.0.0.1:37709_solr c:recoverytest s:shard1 r:core_node4 x:recoverytest_shard1_replica_n2] o.a.s.c.HdfsDirectoryFactory Number of slabs of block cache [1] with direct memory allocation set to [true]
   [junit4]   2> 1032085 INFO  (qtp12663461-11682) [n:127.0.0.1:37709_solr c:recoverytest s:shard1 r:core_node4 x:recoverytest_shard1_replica_n2] o.a.s.c.HdfsDirectoryFactory Block cache target memory usage, slab size of [16777216] will allocate [1] slabs and use ~[16777216] bytes
   [junit4]   2> 1032090 INFO  (qtp12663461-11682) [n:127.0.0.1:37709_solr c:recoverytest s:shard1 r:core_node4 x:recoverytest_shard1_replica_n2] o.a.s.s.b.BlockDirectory Block cache on write is disabled
   [junit4]   2> 1032091 INFO  (qtp16434227-11698) [n:127.0.0.1:34129_solr c:recoverytest s:shard1 r:core_node3 x:recoverytest_shard1_replica_n1] o.a.s.c.HdfsDirectoryFactory creating directory factory for path hdfs://localhost.localdomain:36659/data/recoverytest/core_node3/data/index
   [junit4]   2> 1032092 INFO  (qtp12663461-11682) [n:127.0.0.1:37709_solr c:recoverytest s:shard1 r:core_node4 x:recoverytest_shard1_replica_n2] o.a.s.c.HdfsDirectoryFactory creating directory factory for path hdfs://localhost.localdomain:36659/data/recoverytest/core_node4/data
   [junit4]   2> 1032102 INFO  (qtp16434227-11698) [n:127.0.0.1:34129_solr c:recoverytest s:shard1 r:core_node3 x:recoverytest_shard1_replica_n1] o.a.s.c.HdfsDirectoryFactory Number of slabs of block cache [1] with direct memory allocation set to [true]
   [junit4]   2> 1032102 INFO  (qtp16434227-11698) [n:127.0.0.1:34129_solr c:recoverytest s:shard1 r:core_node3 x:recoverytest_shard1_replica_n1] o.a.s.c.HdfsDirectoryFactory Block cache target memory usage, slab size of [16777216] will allocate [1] slabs and use ~[16777216] bytes
   [junit4]   2> 1032107 INFO  (qtp16434227-11698) [n:127.0.0.1:34129_solr c:recoverytest s:shard1 r:core_node3 x:recoverytest_shard1_replica_n1] o.a.s.s.b.BlockDirectory Block cache on write is disabled
   [junit4]   2> 1032123 INFO  (qtp12663461-11682) [n:127.0.0.1:37709_solr c:recoverytest s:shard1 r:core_node4 x:recoverytest_shard1_replica_n2] o.a.s.c.HdfsDirectoryFactory creating directory factory for path hdfs://localhost.localdomain:36659/data/recoverytest/core_node4/data/index
   [junit4]   2> 1032130 INFO  (Block report processor) [    ] BlockStateChange BLOCK* addStoredBlock: blockMap updated: 127.0.0.1:46407 is added to blk_1073741825_1001{UCState=UNDER_CONSTRUCTION, truncateBlock=null, primaryNodeIndex=-1, replicas=[ReplicaUC[[DISK]DS-c87db040-0934-4799-87a4-275e72d723c6:NORMAL:127.0.0.1:36345|RBW], ReplicaUC[[DISK]DS-62268b0c-2c37-4c3c-bc36-f3bbce74ba53:NORMAL:127.0.0.1:46407|FINALIZED]]} size 0
   [junit4]   2> 1032131 INFO  (Block report processor) [    ] BlockStateChange BLOCK* addStoredBlock: blockMap updated: 127.0.0.1:36345 is added to blk_1073741825_1001{UCState=UNDER_CONSTRUCTION, truncateBlock=null, primaryNodeIndex=-1, replicas=[ReplicaUC[[DISK]DS-c87db040-0934-4799-87a4-275e72d723c6:NORMAL:127.0.0.1:36345|RBW], ReplicaUC[[DISK]DS-62268b0c-2c37-4c3c-bc36-f3bbce74ba53:NORMAL:127.0.0.1:46407|FINALIZED]]} size 0
   [junit4]   2> 1032138 INFO  (qtp12663461-11682) [n:127.0.0.1:37709_solr c:recoverytest s:shard1 r:core_node4 x:recoverytest_shard1_replica_n2] o.a.s.c.HdfsDirectoryFactory Number of slabs of block cache [1] with direct memory allocation set to [true]
   [junit4]   2> 1032138 INFO  (qtp12663461-11682) [n:127.0.0.1:37709_solr c:recoverytest s:shard1 r:core_node4 x:recoverytest_shard1_replica_n2] o.a.s.c.HdfsDirectoryFactory Block cache target memory usage, slab size of [16777216] will allocate [1] slabs and use ~[16777216] bytes
   [junit4]   2> 1032142 INFO  (qtp12663461-11682) [n:127.0.0.1:37709_solr c:recoverytest s:shard1 r:core_node4 x:recoverytest_shard1_replica_n2] o.a.s.s.b.BlockDirectory Block cache on write is disabled
   [junit4]   2> 1032164 INFO  (Block report processor) [    ] BlockStateChange BLOCK* addStoredBlock: blockMap updated: 127.0.0.1:36345 is added to blk_1073741826_1002{UCState=UNDER_CONSTRUCTION, truncateBlock=null, primaryNodeIndex=-1, replicas=[ReplicaUC[[DISK]DS-debca471-feea-4d4e-bd3e-66ac1c76f69f:NORMAL:127.0.0.1:46407|RBW], ReplicaUC[[DISK]DS-ab3bb43d-540f-4d6f-baef-5ca5c8c844cc:NORMAL:127.0.0.1:36345|FINALIZED]]} size 0
   [junit4]   2> 1032165 INFO  (Block report processor) [    ] BlockStateChange BLOCK* addStoredBlock: blockMap updated: 127.0.0.1:46407 is added to blk_1073741826_1002{UCState=UNDER_CONSTRUCTION, truncateBlock=null, primaryNodeIndex=-1, replicas=[ReplicaUC[[DISK]DS-debca471-feea-4d4e-bd3e-66ac1c76f69f:NORMAL:127.0.0.1:46407|RBW], ReplicaUC[[DISK]DS-ab3bb43d-540f-4d6f-baef-5ca5c8c844cc:NORMAL:127.0.0.1:36345|FINALIZED]]} size 0
   [junit4]   2> 1032227 INFO  (qtp16434227-11698) [n:127.0.0.1:34129_solr c:recoverytest s:shard1 r:core_node3 x:recoverytest_shard1_replica_n1] o.a.s.u.UpdateHandler Using UpdateLog implementation: org.apache.solr.update.HdfsUpdateLog
   [junit4]   2> 1032228 INFO  (qtp16434227-11698) [n:127.0.0.1:34129_solr c:recoverytest s:shard1 r:core_node3 x:recoverytest_shard1_replica_n1] o.a.s.u.UpdateLog Initializing UpdateLog: dataDir=null defaultSyncLevel=FLUSH numRecordsToKeep=100 maxNumLogsToKeep=10 numVersionBuckets=65536
   [junit4]   2> 1032228 INFO  (qtp16434227-11698) [n:127.0.0.1:34129_solr c:recoverytest s:shard1 r:core_node3 x:recoverytest_shard1_replica_n1] o.a.s.u.HdfsUpdateLog Initializing HdfsUpdateLog: tlogDfsReplication=3
   [junit4]   2> 1032237 INFO  (qtp12663461-11682) [n:127.0.0.1:37709_solr c:recoverytest s:shard1 r:core_node4 x:recoverytest_shard1_replica_n2] o.a.s.u.UpdateHandler Using UpdateLog implementation: org.apache.solr.update.HdfsUpdateLog
   [junit4]   2> 1032237 INFO  (qtp12663461-11682) [n:127.0.0.1:37709_solr c:recoverytest s:shard1 r:core_node4 x:recoverytest_shard1_replica_n2] o.a.s.u.UpdateLog Initializing UpdateLog: dataDir=null defaultSyncLevel=FLUSH numRecordsToKeep=100 maxNumLogsToKeep=10 numVersionBuckets=65536
   [junit4]   2> 1032237 INFO  (qtp12663461-11682) [n:127.0.0.1:37709_solr c:recoverytest s:shard1 r:core_node4 x:recoverytest_shard1_replica_n2] o.a.s.u.HdfsUpdateLog Initializing HdfsUpdateLog: tlogDfsReplication=3
   [junit4]   2> 1032242 INFO  (qtp16434227-11698) [n:127.0.0.1:34129_solr c:recoverytest s:shard1 r:core_node3 x:recoverytest_shard1_replica_n1] o.a.s.u.CommitTracker Hard AutoCommit: disabled
   [junit4]   2> 1032243 INFO  (qtp16434227-11698) [n:127.0.0.1:34129_solr c:recoverytest s:shard1 r:core_node3 x:recoverytest_shard1_replica_n1] o.a.s.u.CommitTracker Soft AutoCommit: disabled
   [junit4]   2> 1032251 INFO  (qtp12663461-11682) [n:127.0.0.1:37709_solr c:recoverytest s:shard1 r:core_node4 x:recoverytest_shard1_replica_n2] o.a.s.u.CommitTracker Hard AutoCommit: disabled
   [junit4]   2> 1032251 INFO  (qtp12663461-11682) [n:127.0.0.1:37709_solr c:recoverytest s:shard1 r:core_node4 x:recoverytest_shard1_replica_n2] o.a.s.u.CommitTracker Soft AutoCommit: disabled
   [junit4]   2> 1032258 INFO  (qtp16434227-11698) [n:127.0.0.1:34129_solr c:recoverytest s:shard1 r:core_node3 x:recoverytest_shard1_replica_n1] o.a.s.s.SolrIndexSearcher Opening [Searcher@9f397b[recoverytest_shard1_replica_n1] main]
   [junit4]   2> 1032259 INFO  (qtp16434227-11698) [n:127.0.0.1:34129_solr c:recoverytest s:shard1 r:core_node3 x:recoverytest_shard1_replica_n1] o.a.s.r.ManagedResourceStorage Configured ZooKeeperStorageIO with znodeBase: /configs/conf
   [junit4]   2> 1032260 INFO  (qtp16434227-11698) [n:127.0.0.1:34129_solr c:recoverytest s:shard1 r:core_node3 x:recoverytest_shard1_replica_n1] o.a.s.r.ManagedResourceStorage Loaded null at path _rest_managed.json using ZooKeeperStorageIO:path=/configs/conf
   [junit4]   2> 1032261 INFO  (qtp16434227-11698) [n:127.0.0.1:34129_solr c:recoverytest s:shard1 r:core_node3 x:recoverytest_shard1_replica_n1] o.a.s.h.ReplicationHandler Commits will be reserved for 10000ms.
   [junit4]   2> 1032264 WARN  (qtp16434227-11698) [n:127.0.0.1:34129_solr c:recoverytest s:shard1 r:core_node3 x:recoverytest_shard1_replica_n1] o.a.s.s.h.HdfsLocalityReporter Could not retrieve locality information for hdfs://localhost.localdomain:42995/solr3 due to exception: java.net.ConnectException: Call From serv1.sd-datasolutions.de/88.99.242.108 to localhost.localdomain:42995 failed on connection exception: java.net.ConnectException: Connection refused; For more details see:  http://wiki.apache.org/hadoop/ConnectionRefused
   [junit4]   2> 1032265 INFO  (searcherExecutor-3267-thread-1-processing-n:127.0.0.1:34129_solr x:recoverytest_shard1_replica_n1 s:shard1 c:recoverytest r:core_node3) [n:127.0.0.1:34129_solr c:recoverytest s:shard1 r:core_node3 x:recoverytest_shard1_replica_n1] o.a.s.c.SolrCore [recoverytest_shard1_replica_n1] Registered new searcher Searcher@9f397b[recoverytest_shard1_replica_n1] main{ExitableDirectoryReader(UninvertingDirectoryReader())}
   [junit4]   2> 1032265 INFO  (qtp16434227-11698) [n:127.0.0.1:34129_solr c:recoverytest s:shard1 r:core_node3 x:recoverytest_shard1_replica_n1] o.a.s.u.UpdateLog Could not find max version in index or recent updates, using new clock 1581646582913171456
   [junit4]   2> 1032268 INFO  (qtp12663461-11682) [n:127.0.0.1:37709_solr c:recoverytest s:shard1 r:core_node4 x:recoverytest_shard1_replica_n2] o.a.s.s.SolrIndexSearcher Opening [Searcher@a479b4[recoverytest_shard1_replica_n2] main]
   [junit4]   2> 1032272 INFO  (qtp12663461-11682) [n:127.0.0.1:37709_solr c:recoverytest s:shard1 r:core_node4 x:recoverytest_shard1_replica_n2] o.a.s.r.ManagedResourceStorage Configured ZooKeeperStorageIO with znodeBase: /configs/conf
   [junit4]   2> 1032272 INFO  (qtp12663461-11682) [n:127.0.0.1:37709_solr c:recoverytest s:shard1 r:core_node4 x:recoverytest_shard1_replica_n2] o.a.s.r.ManagedResourceStorage Loaded null at path _rest_managed.json using ZooKeeperStorageIO:path=/configs/conf
   [junit4]   2> 1032273 INFO  (qtp12663461-11682) [n:127.0.0.1:37709_solr c:recoverytest s:shard1 r:core_node4 x:recoverytest_shard1_replica_n2] o.a.s.h.ReplicationHandler Commits will be reserved for 10000ms.
   [junit4]   2> 1032281 WARN  (qtp12663461-11682) [n:127.0.0.1:37709_solr c:recoverytest s:shard1 r:core_node4 x:recoverytest_shard1_replica_n2] o.a.s.s.h.HdfsLocalityReporter Could not retrieve locality information for hdfs://localhost.localdomain:42995/solr3 due to exception: java.net.ConnectException: Call From serv1.sd-datasolutions.de/88.99.242.108 to localhost.localdomain:42995 failed on connection exception: java.net.ConnectException: Connection refused; For more details see:  http://wiki.apache.org/hadoop/ConnectionRefused
   [junit4]   2> 1032282 INFO  (searcherExecutor-3268-thread-1-processing-n:127.0.0.1:37709_solr x:recoverytest_shard1_replica_n2 s:shard1 c:recoverytest r:core_node4) [n:127.0.0.1:37709_solr c:recoverytest s:shard1 r:core_node4 x:recoverytest_shard1_replica_n2] o.a.s.c.SolrCore [recoverytest_shard1_replica_n2] Registered new searcher Searcher@a479b4[recoverytest_shard1_replica_n2] main{ExitableDirectoryReader(UninvertingDirectoryReader())}
   [junit4]   2> 1032283 INFO  (qtp12663461-11682) [n:127.0.0.1:37709_solr c:recoverytest s:shard1 r:core_node4 x:recoverytest_shard1_replica_n2] o.a.s.u.UpdateLog Could not find max version in index or recent updates, using new clock 1581646582932045824
   [junit4]   2> 1032284 INFO  (qtp16434227-11698) [n:127.0.0.1:34129_solr c:recoverytest s:shard1 r:core_node3 x:recoverytest_shard1_replica_n1] o.a.s.c.ShardLeaderElectionContext Waiting until we see more replicas up for shard shard1: total=2 found=1 timeoutin=9999ms
   [junit4]   2> 1032785 INFO  (qtp16434227-11698) [n:127.0.0.1:34129_solr c:recoverytest s:shard1 r:core_node3 x:recoverytest_shard1_replica_n1] o.a.s.c.ShardLeaderElectionContext Enough replicas found to continue.
   [junit4]   2> 1032785 INFO  (qtp16434227-11698) [n:127.0.0.1:34129_solr c:recoverytest s:shard1 r:core_node3 x:recoverytest_shard1_replica_n1] o.a.s.c.ShardLeaderElectionContext I may be the new leader - try and sync
   [junit4]   2> 1032785 INFO  (qtp16434227-11698) [n:127.0.0.1:34129_solr c:recoverytest s:shard1 r:core_node3 x:recoverytest_shard1_replica_n1] o.a.s.c.SyncStrategy Sync replicas to https://127.0.0.1:34129/solr/recoverytest_shard1_replica_n1/
   [junit4]   2> 1032786 INFO  (qtp16434227-11698) [n:127.0.0.1:34129_solr c:recoverytest s:shard1 r:core_node3 x:recoverytest_shard1_replica_n1] o.a.s.u.PeerSync PeerSync: core=recoverytest_shard1_replica_n1 url=https://127.0.0.1:34129/solr START replicas=[https://127.0.0.1:37709/solr/recoverytest_shard1_replica_n2/] nUpdates=100
   [junit4]   2> 1032791 INFO  (qtp12663461-11684) [n:127.0.0.1:37709_solr c:recoverytest s:shard1 r:core_node4 x:recoverytest_shard1_replica_n2] o.a.s.c.S.Request [recoverytest_shard1_replica_n2]  webapp=/solr path=/get params={distrib=false&qt=/get&fingerprint=false&getVersions=100&wt=javabin&version=2} status=0 QTime=0
   [junit4]   2> 1033086 INFO  (qtp16434227-11698) [n:127.0.0.1:34129_solr c:recoverytest s:shard1 r:core_node3 x:recoverytest_shard1_replica_n1] o.a.s.u.PeerSync PeerSync: core=recoverytest_shard1_replica_n1 url=https://127.0.0.1:34129/solr DONE.  We have no versions.  sync failed.
   [junit4]   2> 1033086 INFO  (qtp16434227-11698) [n:127.0.0.1:34129_solr c:recoverytest s:shard1 r:core_node3 x:recoverytest_shard1_replica_n1] o.a.s.c.SyncStrategy Leader's attempt to sync with shard failed, moving to the next candidate
   [junit4]   2> 1033086 INFO  (qtp16434227-11698) [n:127.0.0.1:34129_solr c:recoverytest s:shard1 r:core_node3 x:recoverytest_shard1_replica_n1] o.a.s.c.ShardLeaderElectionContext We failed sync, but we have no versions - we can't sync in that case - we were active before, so become leader anyway
   [junit4]   2> 1033086 INFO  (qtp16434227-11698) [n:127.0.0.1:34129_solr c:recoverytest s:shard1 r:core_node3 x:recoverytest_shard1_replica_n1] o.a.s.c.ShardLeaderElectionContext Found all replicas participating in election, clear LIR
   [junit4]   2> 1033090 INFO  (qtp16434227-11698) [n:127.0.0.1:34129_solr c:recoverytest s:shard1 r:core_node3 x:recoverytest_shard1_replica_n1] o.a.s.c.ShardLeaderElectionContext I am the new leader: https://127.0.0.1:34129/solr/recoverytest_shard1_replica_n1/ shard1
   [junit4]   2> 1210360 ERROR (qtp16434227-11683) [n:127.0.0.1:34129_solr    ] o.a.s.h.RequestHandlerBase org.apache.solr.common.SolrException: create the collection time out:180s
   [junit4]   2> 	at org.apache.solr.handler.admin.CollectionsHandler.handleResponse(CollectionsHandler.java:312)
   [junit4]   2> 	at org.apache.solr.handler.admin.CollectionsHandler.invokeAction(CollectionsHandler.java:244)
   [junit4]   2> 	at org.apache.solr.handler.admin.CollectionsHandler.handleRequestBody(CollectionsHandler.java:222)
   [junit4]   2> 	at org.apache.solr.handler.RequestHandlerBase.handleRequest(RequestHandlerBase.java:177)
   [junit4]   2> 	at org.apache.solr.servlet.HttpSolrCall.handleAdmin(HttpSolrCall.java:745)
   [junit4]   2> 	at org.apache.solr.servlet.HttpSolrCall.handleAdminRequest(HttpSolrCall.java:726)
   [junit4]   2> 	at org.apache.solr.servlet.HttpSolrCall.call(HttpSolrCall.java:507)
   [junit4]   2> 	at org.apache.solr.servlet.SolrDispatchFilter.doFilter(SolrDispatchFilter.java:382)
   [junit4]   2> 	at org.apache.solr.servlet.SolrDispatchFilter.doFilter(SolrDispatchFilter.java:326)
   [junit4]   2> 	at org.eclipse.jetty.servlet.ServletHandler$CachedChain.doFilter(ServletHandler.java:1759)
   [junit4]   2> 	at org.apache.solr.client.solrj.embedded.JettySolrRunner$DebugFilter.doFilter(JettySolrRunner.java:139)
   [junit4]   2> 	at org.eclipse.jetty.servlet.ServletHandler$CachedChain.doFilter(ServletHandler.java:1759)
   [junit4]   2> 	at org.eclipse.jetty.servlet.ServletHandler.doHandle(ServletHandler.java:582)
   [junit4]   2> 	at org.eclipse.jetty.server.session.SessionHandler.doHandle(SessionHandler.java:224)
   [junit4]   2> 	at org.eclipse.jetty.server.handler.ContextHandler.doHandle(ContextHandler.java:1180)
   [junit4]   2> 	at org.eclipse.jetty.servlet.ServletHandler.doScope(ServletHandler.java:512)
   [junit4]   2> 	at org.eclipse.jetty.server.session.SessionHandler.doScope(SessionHandler.java:185)
   [junit4]   2> 	at org.eclipse.jetty.server.handler.ContextHandler.doScope(ContextHandler.java:1112)
   [junit4]   2> 	at org.eclipse.jetty.server.handler.ScopedHandler.handle(ScopedHandler.java:141)
   [junit4]   2> 	at org.eclipse.jetty.server.handler.gzip.GzipHandler.handle(GzipHandler.java:493)
   [junit4]   2> 	at org.eclipse.jetty.server.handler.HandlerWrapper.handle(HandlerWrapper.java:134)
   [junit4]   2> 	at org.eclipse.jetty.server.Server.handle(Server.java:534)
   [junit4]   2> 	at org.eclipse.jetty.server.HttpChannel.handle(HttpChannel.java:320)
   [junit4]   2> 	at org.eclipse.jetty.server.HttpConnection.onFillable(HttpConnection.java:251)
   [junit4]   2> 	at org.eclipse.jetty.io.AbstractConnection$ReadCallback.succeeded(AbstractConnection.java:283)
   [junit4]   2> 	at org.eclipse.jetty.io.FillInterest.fillable(FillInterest.java:108)
   [junit4]   2> 	at org.eclipse.jetty.io.ssl.SslConnection.onFillable(SslConnection.java:251)
   [junit4]   2> 	at org.eclipse.jetty.io.AbstractConnection$ReadCallback.succeeded(AbstractConnection.java:283)
   [junit4]   2> 	at org.eclipse.jetty.io.FillInterest.fillable(FillInterest.java:108)
   [junit4]   2> 	at org.eclipse.jetty.io.SelectChannelEndPoint$2.run(SelectChannelEndPoint.java:93)
   [junit4]   2> 	at org.eclipse.jetty.util.thread.strategy.ExecuteProduceConsume.executeProduceConsume(ExecuteProduceConsume.java:303)
   [junit4]   2> 	at org.eclipse.jetty.util.thread.strategy.ExecuteProduceConsume.produceConsume(ExecuteProduceConsume.java:148)
   [junit4]   2> 	at org.eclipse.jetty.util.thread.strategy.ExecuteProduceConsume.run(ExecuteProduceConsume.java:136)
   [junit4]   2> 	at org.eclipse.jetty.util.thread.QueuedThreadPool.runJob(QueuedThreadPool.java:671)
   [junit4]   2> 	at org.eclipse.jetty.util.thread.QueuedThreadPool$2.run(QueuedThreadPool.java:589)
   [junit4]   2> 	at java.lang.Thread.run(Thread.java:748)
   [junit4]   2> 
   [junit4]   2> 1210360 INFO  (qtp16434227-11683) [n:127.0.0.1:34129_solr    ] o.a.s.s.HttpSolrCall [admin] webapp=null path=/admin/collections params={replicationFactor=2&collection.configName=conf&maxShardsPerNode=1&name=recoverytest&nrtReplicas=2&action=CREATE&numShards=1&wt=javabin&version=2} status=500 QTime=180004
   [junit4]   2> 1210361 ERROR (qtp16434227-11683) [n:127.0.0.1:34129_solr    ] o.a.s.s.HttpSolrCall null:org.apache.solr.common.SolrException: create the collection time out:180s
   [junit4]   2> 	at org.apache.solr.handler.admin.CollectionsHandler.handleResponse(CollectionsHandler.java:312)
   [junit4]   2> 	at org.apache.solr.handler.admin.CollectionsHandler.invokeAction(CollectionsHandler.java:244)
   [junit4]   2> 	at org.apache.solr.handler.admin.CollectionsHandler.handleRequestBody(CollectionsHandler.java:222)
   [junit4]   2> 	at org.apache.solr.handler.RequestHandlerBase.handleRequest(RequestHandlerBase.java:177)
   [junit4]   2> 	at org.apache.solr.servlet.HttpSolrCall.handleAdmin(HttpSolrCall.java:745)
   [junit4]   2> 	at org.apache.solr.servlet.HttpSolrCall.handleAdminRequest(HttpSolrCall.java:726)
   [junit4]   2> 	at org.apache.solr.servlet.HttpSolrCall.call(HttpSolrCall.java:507)
   [junit4]   2> 	at org.apache.solr.servlet.SolrDispatchFilter.doFilter(SolrDispatchFilter.java:382)
   [junit4]   2> 	at org.apache.solr.servlet.SolrDispatchFilter.doFilter(SolrDispatchFilter.java:326)
   [junit4]   2> 	at org.eclipse.jetty.servlet.ServletHandler$CachedChain.doFilter(ServletHandler.java:1759)
   [junit4]   2> 	at org.apache.solr.client.solrj.embedded.JettySolrRunner$DebugFilter.doFilter(JettySolrRunner.java:139)
   [junit4]   2> 	at org.eclipse.jetty.servlet.ServletHandler$CachedChain.doFilter(ServletHandler.java:1759)
   [junit4]   2> 	at org.eclipse.jetty.servlet.ServletHandler.doHandle(ServletHandler.java:582)
   [junit4]   2> 	at org.eclipse.jetty.server.session.SessionHandler.doHandle(SessionHandler.java:224)
   [junit4]   2> 	at org.eclipse.jetty.server.handler.ContextHandler.doHandle(ContextHandler.java:1180)
   [junit4]   2> 	at org.eclipse.jetty.servlet.ServletHandler.doScope(ServletHandler.java:512)
   [junit4]   2> 	at org.eclipse.jetty.server.session.SessionHandler.doScope(SessionHandler.java:185)
   [junit4]   2> 	at org.eclipse.jetty.server.handler.ContextHandler.doScope(ContextHandler.java:1112)
   [junit4]   2> 	at org.eclipse.jetty.server.handler.ScopedHandler.handle(ScopedHandler.java:141)
   [junit4]   2> 	at org.eclipse.jetty.server.handler.gzip.GzipHandler.handle(GzipHandler.java:493)
   [junit4]   2> 	at org.eclipse.jetty.server.handler.HandlerWrapper.handle(HandlerWrapper.java:134)
   [junit4]   2> 	at org.eclipse.jetty.server.Server.handle(Server.java:534)
   [junit4]   2> 	at org.eclipse.jetty.server.HttpChannel.handle(HttpChannel.java:320)
   [junit4]   2> 	at org.eclipse.jetty.server.HttpConnection.onFillable(HttpConnection.java:251)
   [junit4]   2> 	at org.eclipse.jetty.io.AbstractConnection$ReadCallback.succeeded(AbstractConnection.java:283)
   [junit4]   2> 	at org.eclipse.jetty.io.FillInterest.fillable(FillInterest.java:108)
   [junit4]   2> 	at org.eclipse.jetty.io.ssl.SslConnection.onFillable(SslConnection.java:251)
   [junit4]   2> 	at org.eclipse.jetty.io.AbstractConnection$ReadCallback.succeeded(AbstractConnection.java:283)
   [junit4]   2> 	at org.eclipse.jetty.io.FillInterest.fillable(FillInterest.java:108)
   [junit4]   2> 	at org.eclipse.jetty.io.SelectChannelEndPoint$2.run(SelectChannelEndPoint.java:93)
   [junit4]   2> 	at org.eclipse.jetty.util.thread.strategy.ExecuteProduceConsume.executeProduceConsume(ExecuteProduceConsume.java:303)
   [junit4]   2> 	at org.eclipse.jetty.util.thread.strategy.ExecuteProduceConsume.produceConsume(ExecuteProduceConsume.java:148)
   [junit4]   2> 	at org.eclipse.jetty.util.thread.strategy.ExecuteProduceConsume.run(ExecuteProduceConsume.java:136)
   [junit4]   2> 	at org.eclipse.jetty.util.thread.QueuedThreadPool.runJob(QueuedThreadPool.java:671)
   [junit4]   2> 	at org.eclipse.jetty.util.thread.QueuedThreadPool$2.run(QueuedThreadPool.java:589)
   [junit4]   2> 	at java.lang.Thread.run(Thread.java:748)
   [junit4]   2> 
   [junit4]   2> 1210363 INFO  (TEST-HdfsRecoveryZkTest.test-seed#[54AE0B94B655135E]) [    ] o.a.s.SolrTestCaseJ4 ###Ending test
   [junit4]   2> NOTE: reproduce with: ant test  -Dtestcase=HdfsRecoveryZkTest -Dtests.method=test -Dtests.seed=54AE0B94B655135E -Dtests.multiplier=3 -Dtests.slow=true -Dtests.locale=id-ID -Dtests.timezone=Africa/Lubumbashi -Dtests.asserts=true -Dtests.file.encoding=UTF-8
   [junit4] ERROR    180s J2 | HdfsRecoveryZkTest.test <<<
   [junit4]    > Throwable #1: org.apache.solr.client.solrj.impl.HttpSolrClient$RemoteSolrException: Error from server at https://127.0.0.1:34129/solr: create the collection time out:180s
   [junit4]    > 	at org.apache.solr.client.solrj.impl.HttpSolrClient.executeMethod(HttpSolrClient.java:626)
   [junit4]    > 	at org.apache.solr.client.solrj.impl.HttpSolrClient.request(HttpSolrClient.java:253)
   [junit4]    > 	at org.apache.solr.client.solrj.impl.HttpSolrClient.request(HttpSolrClient.java:242)
   [junit4]    > 	at org.apache.solr.client.solrj.impl.LBHttpSolrClient.doRequest(LBHttpSolrClient.java:483)
   [junit4]    > 	at org.apache.solr.client.solrj.impl.LBHttpSolrClient.request(LBHttpSolrClient.java:413)
   [junit4]    > 	at org.apache.solr.client.solrj.impl.CloudSolrClient.sendRequest(CloudSolrClient.java:1121)
   [junit4]    > 	at org.apache.solr.client.solrj.impl.CloudSolrClient.requestWithRetryOnStaleState(CloudSolrClient.java:862)
   [junit4]    > 	at org.apache.solr.client.solrj.impl.CloudSolrClient.request(CloudSolrClient.java:793)
   [junit4]    > 	at org.apache.solr.client.solrj.SolrRequest.process(SolrRequest.java:178)
   [junit4]    > 	at org.apache.solr.client.solrj.SolrRequest.process(SolrRequest.java:195)
   [junit4]    > 	at org.apache.solr.cloud.RecoveryZkTest.test(RecoveryZkTest.java:68)
   [junit4]    > 	at java.lang.Thread.run(Thread.java:748)Throwable #2: java.lang.NullPointerException
   [junit4]    > 	at org.apache.solr.cloud.RecoveryZkTest.stopThreads(RecoveryZkTest.java:55)
   [junit4]    > 	at java.lang.Thread.run(Thread.java:748)
   [junit4]   2> 1210367 INFO  (jetty-closer-1359-thread-2) [    ] o.e.j.s.AbstractConnector Stopped ServerConnector@13ab606{SSL,[ssl, http/1.1]}{127.0.0.1:0}
   [junit4]   2> 1210368 INFO  (jetty-closer-1359-thread-1) [    ] o.e.j.s.AbstractConnector Stopped ServerConnector@d8fbc5{SSL,[ssl, http/1.1]}{127.0.0.1:0}
   [junit4]   2> 1210368 ERROR (OverseerThreadFactory-3262-thread-1-processing-n:127.0.0.1:37709_solr) [n:127.0.0.1:37709_solr    ] o.a.s.c.OverseerCollectionMessageHandler Error from shard: https://127.0.0.1:34129/solr
   [junit4]   2> org.apache.solr.client.solrj.SolrServerException: IOException occured when talking to server at: https://127.0.0.1:34129/solr
   [junit4]   2> 	at org.apache.solr.client.solrj.impl.HttpSolrClient.executeMethod(HttpSolrClient.java:640)
   [junit4]   2> 	at org.apache.solr.client.solrj.impl.HttpSolrClient.request(HttpSolrClient.java:253)
   [junit4]   2> 	at org.apache.solr.client.solrj.impl.HttpSolrClient.request(HttpSolrClient.java:242)
   [junit4]   2> 	at org.apache.solr.client.solrj.SolrClient.request(SolrClient.java:1219)
   [junit4]   2> 	at org.apache.solr.handler.component.HttpShardHandler.lambda$submit$0(HttpShardHandler.java:172)
   [junit4]   2> 	at java.util.concurrent.FutureTask.run(FutureTask.java:266)
   [junit4]   2> 	at java.util.concurrent.Executors$RunnableAdapter.call(Executors.java:511)
   [junit4]   2> 	at java.util.concurrent.FutureTask.run(FutureTask.java:266)
   [junit4]   2> 	at com.codahale.metrics.InstrumentedExecutorService$InstrumentedRunnable.run(InstrumentedExecutorService.java:176)
   [junit4]   2> 	at org.apache.solr.common.util.ExecutorUtil$MDCAwareThreadPoolExecutor.lambda$execute$0(ExecutorUtil.java:188)
   [junit4]   2> 	at java.util.concurrent.ThreadPoolExecutor.runWorker(ThreadPoolExecutor.java:1149)
   [junit4]   2> 	at java.util.concurrent.ThreadPoolExecutor$Worker.run(ThreadPoolExecutor.java:624)
   [junit4]   2> 	at java.lang.Thread.run(Thread.java:748)
   [junit4]   2> Caused by: org.apache.http.NoHttpResponseException: 127.0.0.1:34129 failed to respond
   [junit4]   2> 	at org.apache.http.impl.conn.DefaultHttpResponseParser.parseHead(DefaultHttpResponseParser.java:141)
   [junit4]   2> 	at org.apache.http.impl.conn.DefaultHttpResponseParser.parseHead(DefaultHttpResponseParser.java:56)
   [junit4]   2> 	at org.apache.http.impl.io.AbstractMessageParser.parse(AbstractMessageParser.java:259)
   [junit4]   2> 	at org.apache.http.impl.DefaultBHttpClientConnection.receiveResponseHeader(DefaultBHttpClientConnection.java:163)
   [junit4]   2> 	at org.apache.http.impl.conn.CPoolProxy.receiveResponseHeader(CPoolProxy.java:165)
   [junit4]   2> 	at org.apache.http.protocol.HttpRequestExecutor.doReceiveResponse(HttpRequestExecutor.java:273)
   [junit4]   2> 	at org.apache.http.protocol.HttpRequestExecutor.execute(HttpRequestExecutor.java:125)
   [junit4]   2> 	at org.apache.solr.util.stats.InstrumentedHttpRequestExecutor.execute(InstrumentedHttpRequestExecutor.java:118)
   [junit4]   2> 	at org.apache.http.impl.execchain.MainClientExec.execute(MainClientExec.java:272)
   [junit4]   2> 	at org.apache.http.impl.execchain.ProtocolExec.execute(ProtocolExec.java:185)
   [junit4]   2> 	at org.apache.http.impl.execchain.RetryExec.execute(RetryExec.java:89)
   [junit4]   2> 	at org.apache.http.impl.execchain.RedirectExec.execute(RedirectExec.java:111)
   [junit4]   2> 	at org.apache.http.impl.client.InternalHttpClient.doExecute(InternalHttpClient.java:185)
   [junit4]   2> 	at org.apache.http.impl.client.CloseableHttpClient.execute(CloseableHttpClient.java:83)
   [junit4]   2> 	at org.apache.http.impl.client.CloseableHttpClient.execute(CloseableHttpClient.java:56)
   [junit4]   2> 	at org.apache.solr.client.solrj.impl.HttpSolrClient.executeMethod(HttpSolrClient.java:525)
   [junit4]   2> 	... 12 more
   [junit4]   2> 1210368 INFO  (jetty-closer-1359-thread-2) [    ] o.a.s.c.CoreContainer Shutting down CoreContainer instance=32413208
   [junit4]   2> 1210369 ERROR (OverseerThreadFactory-3262-thread-1-processing-n:127.0.0.1:37709_solr) [n:127.0.0.1:37709_solr    ] o.a.s.c.OverseerCollectionMessageHandler Error from shard: https://127.0.0.1:37709/solr
   [junit4]   2> org.apache.solr.client.solrj.SolrServerException: IOException occured when talking to server at: https://127.0.0.1:37709/solr
   [junit4]   2> 	at org.apache.solr.client.solrj.impl.HttpSolrClient.executeMethod(HttpSolrClient.java:640)
   [junit4]   2> 	at org.apache.solr.client.solrj.impl.HttpSolrClient.request(HttpSolrClient.java:253)
   [junit4]   2> 	at org.apache.solr.client.solrj.impl.HttpSolrClient.request(HttpSolrClient.java:242)
   [junit4]   2> 	at org.apache.solr.client.solrj.SolrClient.request(SolrClient.java:1219)
   [junit4]   2> 	at org.apache.solr.handler.component.HttpShardHandler.lambda$submit$0(HttpShardHandler.java:172)
   [junit4]   2> 	at java.util.concurrent.FutureTask.run(FutureTask.java:266)
   [junit4]   2> 	at java.util.concurrent.Executors$RunnableAdapter.call(Executors.java:511)
   [junit4]   2> 	at java.util.concurrent.FutureTask.run(FutureTask.java:266)
   [junit4]   2> 	at com.codahale.metrics.InstrumentedExecutorService$InstrumentedRunnable.run(InstrumentedExecutorService.java:176)
   [junit4]   2> 	at org.apache.solr.common.util.ExecutorUtil$MDCAwareThreadPoolExecutor.lambda$execute$0(ExecutorUtil.java:188)
   [junit4]   2> 	at java.util.concurrent.ThreadPoolExecutor.runWorker(ThreadPoolExecutor.java:1149)
   [junit4]   2> 	at java.util.concurrent.ThreadPoolExecutor$Worker.run(ThreadPoolExecutor.java:624)
   [junit4]   2> 	at java.lang.Thread.run(Thread.java:748)
   [junit4]   2> Caused by: org.apache.http.NoHttpResponseException: 127.0.0.1:37709 failed to respond
   [junit4]   2> 	at org.apache.http.impl.conn.DefaultHttpResponseParser.parseHead(DefaultHttpResponseParser.java:141)
   [junit4]   2> 	at org.apache.http.impl.conn.DefaultHttpResponseParser.parseHead(DefaultHttpResponseParser.java:56)
   [junit4]   2> 	at org.apache.http.impl.io.AbstractMessageParser.parse(AbstractMessageParser.java:259)
   [junit4]   2> 	at org.apache.http.impl.DefaultBHttpClientConnection.receiveResponseHeader(DefaultBHttpClientConnection.java:163)
   [junit4]   2> 	at org.apache.http.impl.conn.CPoolProxy.receiveResponseHeader(CPoolProxy.java:165)
   [junit4]   2> 	at org.apache.http.protocol.HttpRequestExecutor.doReceiveResponse(HttpRequestExecutor.java:273)
   [junit4]   2> 	at org.apache.http.protocol.HttpRequestExecutor.execute(HttpRequestExecutor.java:125)
   [junit4]   2> 	at org.apache.solr.util.stats.InstrumentedHttpRequestExecutor.execute(InstrumentedHttpRequestExecutor.java:118)
   [junit4]   2> 	at org.apache.http.impl.execchain.MainClientExec.execute(MainClientExec.java:272)
   [junit4]   2> 	at org.apache.http.impl.execchain.ProtocolExec.execute(ProtocolExec.java:185)
   [junit4]   2> 	at org.apache.http.impl.execchain.RetryExec.execute(RetryExec.java:89)
   [junit4]   2> 	at org.apache.http.impl.execchain.RedirectExec.execute(RedirectExec.java:111)
   [junit4]   2> 	at org.apache.http.impl.client.InternalHttpClient.doExecute(InternalHttpClient.java:185)
   [junit4]   2> 	at org.apache.http.impl.client.CloseableHttpClient.execute(CloseableHttpClient.java:83)
   [junit4]   2> 	at org.apache.http.impl.client.CloseableHttpClient.execute(CloseableHttpClient.java:56)
   [junit4]   2> 	at org.apache.solr.client.solrj.impl.HttpSolrClient.executeMethod(HttpSolrClient.java:525)
   [junit4]   2> 	... 12 more
   [junit4]   2> 1210368 INFO  (jetty-closer-1359-thread-1) [    ] o.a.s.c.CoreContainer Shutting down CoreContainer instance=15196303
   [junit4]   2> 1210370 ERROR (OverseerThreadFactory-3262-thread-1-processing-n:127.0.0.1:37709_solr) [n:127.0.0.1:37709_solr    ] o.a.s.c.OverseerCollectionMessageHandler Cleaning up collection [recoverytest].
   [junit4]   2> 1210370 INFO  (jetty-closer-1359-thread-1) [    ] o.a.s.m.SolrMetricManager Closing metric reporters for registry=solr.node, tag=null
   [junit4]   2> 1210369 INFO  (jetty-closer-1359-thread-2) [    ] o.a.s.m.SolrMetricManager Closing metric reporters for registry=solr.node, tag=null
   [junit4]   2> 1210370 INFO  (jetty-closer-1359-thread-1) [    ] o.a.s.m.r.SolrJmxReporter Closing reporter [org.apache.solr.metrics.reporters.SolrJmxReporter@199ae3e: rootName = solr_37709, domain = solr.node, service url = null, agent id = null] for registry solr.node / com.codahale.metrics.MetricRegistry@15fd44f
   [junit4]   2> 1210370 INFO  (jetty-closer-1359-thread-2) [    ] o.a.s.m.r.SolrJmxReporter Closing reporter [org.apache.solr.metrics.reporters.SolrJmxReporter@10cade8: rootName = solr_34129, domain = solr.node, service url = null, agent id = null] for registry solr.node / com.codahale.metrics.MetricRegistry@e1d288
   [junit4]   2> 1210371 INFO  (OverseerThreadFactory-3262-thread-1-processing-n:127.0.0.1:37709_solr) [n:127.0.0.1:37709_solr    ] o.a.s.c.OverseerCollectionMessageHandler Executing Collection Cmd : action=UNLOAD&deleteInstanceDir=true&deleteDataDir=true
   [junit4]   2> 1210376 ERROR (OverseerThreadFactory-3262-thread-1-processing-n:127.0.0.1:37709_solr) [n:127.0.0.1:37709_solr    ] o.a.s.c.OverseerColle

[...truncated too long message...]

ted live nodes from ZooKeeper... (4) -> (3)
   [junit4]   2> 1360439 INFO  (coreCloseExecutor-734-thread-1) [n:127.0.0.1:33115_solr c:currentstate s:shard1 r:core_node2 x:currentstate_shard1_replica_n1] o.a.s.c.SolrCore [currentstate_shard1_replica_n1]  CLOSING SolrCore org.apache.solr.core.SolrCore@15c9ad0
   [junit4]   2> 1360440 INFO  (coreCloseExecutor-734-thread-1) [n:127.0.0.1:33115_solr c:currentstate s:shard1 r:core_node2 x:currentstate_shard1_replica_n1] o.a.s.m.SolrMetricManager Closing metric reporters for registry=solr.core.currentstate.shard1.replica_n1, tag=22846160
   [junit4]   2> 1360440 INFO  (coreCloseExecutor-734-thread-1) [n:127.0.0.1:33115_solr c:currentstate s:shard1 r:core_node2 x:currentstate_shard1_replica_n1] o.a.s.m.r.SolrJmxReporter Closing reporter [org.apache.solr.metrics.reporters.SolrJmxReporter@1fc474b: rootName = solr_33115, domain = solr.core.currentstate.shard1.replica_n1, service url = null, agent id = null] for registry solr.core.currentstate.shard1.replica_n1 / com.codahale.metrics.MetricRegistry@17f84c5
   [junit4]   2> 1360439 INFO  (coreCloseExecutor-734-thread-2) [n:127.0.0.1:33115_solr c:falsepredicate s:shard3 r:core_node7 x:falsepredicate_shard3_replica_n4] o.a.s.c.SolrCore [falsepredicate_shard3_replica_n4]  CLOSING SolrCore org.apache.solr.core.SolrCore@12de0e3
   [junit4]   2> 1360448 INFO  (coreCloseExecutor-730-thread-2) [n:127.0.0.1:41725_solr c:falsepredicate s:shard4 r:core_node8 x:falsepredicate_shard4_replica_n6] o.a.s.m.SolrMetricManager Closing metric reporters for registry=solr.collection.falsepredicate.shard4.leader, tag=17775564
   [junit4]   2> 1360448 INFO  (coreCloseExecutor-730-thread-1) [n:127.0.0.1:41725_solr c:delayed s:shard1 r:core_node2 x:delayed_shard1_replica_n1] o.a.s.m.SolrMetricManager Closing metric reporters for registry=solr.collection.delayed.shard1.leader, tag=11553355
   [junit4]   2> 1360452 WARN  (zkCallback-754-thread-5-processing-n:127.0.0.1:41725_solr) [n:127.0.0.1:41725_solr    ] o.a.s.c.c.ZkStateReader ZooKeeper watch triggered, but Solr cannot talk to ZK: [KeeperErrorCode = Session expired for /live_nodes]
   [junit4]   2> 1360452 INFO  (jetty-closer-735-thread-1) [    ] o.e.j.s.h.ContextHandler Stopped o.e.j.s.ServletContextHandler@16cfbdf{/solr,null,UNAVAILABLE}
   [junit4]   2> 1360452 INFO  (zkCallback-756-thread-4-processing-n:127.0.0.1:33115_solr) [n:127.0.0.1:33115_solr    ] o.a.s.c.c.ZkStateReader Updated live nodes from ZooKeeper... (3) -> (2)
   [junit4]   2> 1360452 INFO  (zkCallback-755-thread-4-processing-n:127.0.0.1:37673_solr) [n:127.0.0.1:37673_solr    ] o.a.s.c.OverseerElectionContext I am going to be the leader 127.0.0.1:37673_solr
   [junit4]   2> 1360453 INFO  (zkCallback-755-thread-5-processing-n:127.0.0.1:37673_solr) [n:127.0.0.1:37673_solr    ] o.a.s.c.c.ZkStateReader Updated live nodes from ZooKeeper... (3) -> (2)
   [junit4]   2> 1360453 INFO  (coreCloseExecutor-732-thread-1) [n:127.0.0.1:37673_solr c:waitforstate s:shard1 r:core_node2 x:waitforstate_shard1_replica_n1] o.a.s.m.SolrMetricManager Closing metric reporters for registry=solr.collection.waitforstate.shard1.leader, tag=7530678
   [junit4]   2> 1360453 INFO  (coreCloseExecutor-732-thread-2) [n:127.0.0.1:37673_solr c:falsepredicate s:shard2 r:core_node5 x:falsepredicate_shard2_replica_n2] o.a.s.m.SolrMetricManager Closing metric reporters for registry=solr.collection.falsepredicate.shard2.leader, tag=28691265
   [junit4]   2> 1360457 INFO  (coreCloseExecutor-734-thread-2) [n:127.0.0.1:33115_solr c:falsepredicate s:shard3 r:core_node7 x:falsepredicate_shard3_replica_n4] o.a.s.m.SolrMetricManager Closing metric reporters for registry=solr.core.falsepredicate.shard3.replica_n4, tag=19783907
   [junit4]   2> 1360457 INFO  (zkCallback-756-thread-4-processing-n:127.0.0.1:33115_solr) [n:127.0.0.1:33115_solr    ] o.a.s.c.OverseerElectionContext I am going to be the leader 127.0.0.1:33115_solr
   [junit4]   2> 1360457 INFO  (zkCallback-756-thread-5-processing-n:127.0.0.1:33115_solr) [n:127.0.0.1:33115_solr    ] o.a.s.c.c.ZkStateReader Updated live nodes from ZooKeeper... (2) -> (1)
   [junit4]   2> 1360457 INFO  (coreCloseExecutor-734-thread-2) [n:127.0.0.1:33115_solr c:falsepredicate s:shard3 r:core_node7 x:falsepredicate_shard3_replica_n4] o.a.s.m.r.SolrJmxReporter Closing reporter [org.apache.solr.metrics.reporters.SolrJmxReporter@1b56f85: rootName = solr_33115, domain = solr.core.falsepredicate.shard3.replica_n4, service url = null, agent id = null] for registry solr.core.falsepredicate.shard3.replica_n4 / com.codahale.metrics.MetricRegistry@15a3d9c
   [junit4]   2> 1360466 INFO  (coreCloseExecutor-734-thread-2) [n:127.0.0.1:33115_solr c:falsepredicate s:shard3 r:core_node7 x:falsepredicate_shard3_replica_n4] o.a.s.m.SolrMetricManager Closing metric reporters for registry=solr.collection.falsepredicate.shard3.leader, tag=19783907
   [junit4]   2> 1360466 INFO  (coreCloseExecutor-734-thread-1) [n:127.0.0.1:33115_solr c:currentstate s:shard1 r:core_node2 x:currentstate_shard1_replica_n1] o.a.s.m.SolrMetricManager Closing metric reporters for registry=solr.collection.currentstate.shard1.leader, tag=22846160
   [junit4]   2> 1360472 WARN  (zkCallback-756-thread-4-processing-n:127.0.0.1:33115_solr) [n:127.0.0.1:33115_solr    ] o.a.s.c.c.ZkStateReader ZooKeeper watch triggered, but Solr cannot talk to ZK: [KeeperErrorCode = Session expired for /live_nodes]
   [junit4]   2> 1360472 INFO  (jetty-closer-735-thread-2) [    ] o.e.j.s.h.ContextHandler Stopped o.e.j.s.ServletContextHandler@bc3665{/solr,null,UNAVAILABLE}
   [junit4]   2> 1361957 WARN  (zkCallback-755-thread-4-processing-n:127.0.0.1:37673_solr) [n:127.0.0.1:37673_solr    ] o.a.s.c.c.ZkStateReader ZooKeeper watch triggered, but Solr cannot talk to ZK: [KeeperErrorCode = Session expired for /live_nodes]
   [junit4]   2> 1361957 INFO  (jetty-closer-735-thread-4) [    ] o.e.j.s.h.ContextHandler Stopped o.e.j.s.ServletContextHandler@1a04a99{/solr,null,UNAVAILABLE}
   [junit4]   2> 1361958 ERROR (SUITE-TestCollectionStateWatchers-seed#[27744BC7E8F3A9A3]-worker) [    ] o.a.z.s.ZooKeeperServer ZKShutdownHandler is not registered, so ZooKeeper server won't take any action on ERROR or SHUTDOWN server state changes
   [junit4]   2> 1361958 INFO  (SUITE-TestCollectionStateWatchers-seed#[27744BC7E8F3A9A3]-worker) [    ] o.a.s.c.ZkTestServer connecting to 127.0.0.1:39221 39221
   [junit4]   2> 1366924 INFO  (Thread-419) [    ] o.a.s.c.ZkTestServer connecting to 127.0.0.1:39221 39221
   [junit4]   2> 1366925 WARN  (Thread-419) [    ] o.a.s.c.ZkTestServer Watch limit violations: 
   [junit4]   2> Maximum concurrent create/delete watches above limit:
   [junit4]   2> 
   [junit4]   2> 	5	/solr/aliases.json
   [junit4]   2> 	5	/solr/clusterprops.json
   [junit4]   2> 	4	/solr/security.json
   [junit4]   2> 	4	/solr/configs/config
   [junit4]   2> 
   [junit4]   2> Maximum concurrent data watches above limit:
   [junit4]   2> 
   [junit4]   2> 	16	/solr/collections/waitforstate/state.json
   [junit4]   2> 	13	/solr/collections/falsepredicate/state.json
   [junit4]   2> 	6	/solr/collections/currentstate/state.json
   [junit4]   2> 	6	/solr/collections/delayed/state.json
   [junit4]   2> 	5	/solr/clusterstate.json
   [junit4]   2> 
   [junit4]   2> Maximum concurrent children watches above limit:
   [junit4]   2> 
   [junit4]   2> 	5	/solr/live_nodes
   [junit4]   2> 	5	/solr/collections
   [junit4]   2> 
   [junit4]   2> NOTE: leaving temporary files on disk at: /home/jenkins/workspace/Lucene-Solr-master-Linux/solr/build/solr-solrj/test/J0/temp/solr.common.cloud.TestCollectionStateWatchers_27744BC7E8F3A9A3-001
   [junit4]   2> NOTE: test params are: codec=Asserting(Lucene70): {}, docValues:{}, maxPointsInLeafNode=378, maxMBSortInHeap=6.527535060251191, sim=RandomSimilarity(queryNorm=false): {}, locale=cs, timezone=America/Jamaica
   [junit4]   2> NOTE: Linux 4.10.0-33-generic i386/Oracle Corporation 1.8.0_144 (32-bit)/cpus=8,threads=1,free=57803696,total=157052928
   [junit4]   2> NOTE: All tests run in this JVM: [TestLBHttpSolrClient, AnlysisResponseBaseTest, ModuloEvaluatorTest, JsonValidatorTest, LengthEvaluatorTest, SubtractEvaluatorTest, OrEvaluatorTest, TestDelegationTokenRequest, SolrZkClientTest, CorrelationEvaluatorTest, CeilingEvaluatorTest, FieldAnalysisResponseTest, JDBCStreamTest, AppendEvaluatorTest, CommonAdminParamsTest, LargeVolumeBinaryJettyTest, TestXMLEscaping, TestV2Request, UniformDistributionEvaluatorTest, HyperbolicCosineEvaluatorTest, NormalDistributionEvaluatorTest, TestDelegationTokenResponse, TestRetryUtil, TermsResponseTest, SolrExampleStreamingTest, SolrExampleJettyTest, TestBatchUpdate, LargeVolumeEmbeddedTest, TestSpellCheckResponse, LargeVolumeJettyTest, TestSolrProperties, MergeIndexesEmbeddedTest, TestEmbeddedSolrServer, QueryResponseTest, TestNamedListCodec, SolrQueryTest, ContentStreamTest, DocumentAnalysisResponseTest, SolrDocumentTest, TestUpdateRequestCodec, ClientUtilsTest, FacetFieldTest, CollectionAdminRequestRequiredParamsTest, GetByIdTest, BasicHttpSolrClientTest, HttpSolrClientBuilderTest, HttpSolrClientConPoolTest, HttpSolrClientSSLAuthConPoolTest, TestCloudSolrClientConnections, JdbcTest, AbsoluteValueEvaluatorTest, AddEvaluatorTest, AndEvaluatorTest, ArcSineEvaluatorTest, ArcTangentEvaluatorTest, CosineEvaluatorTest, CubedRootEvaluatorTest, CumulativeProbabilityEvaluatorTest, DivideEvaluatorTest, EmpiricalDistributionEvaluatorTest, EqualToEvaluatorTest, FloorEvaluatorTest, GreaterThanEqualToEvaluatorTest, HyperbolicTangentEvaluatorTest, LessThanEqualToEvaluatorTest, LessThanEvaluatorTest, NaturalLogEvaluatorTest, NormalizeEvaluatorTest, RecursiveEvaluatorTest, ReverseEvaluatorTest, RoundEvaluatorTest, ConcatOperationTest, SolrPingTest, TestConfigSetAdminRequest, TestV1toV2ApiMapper, NoOpResponseParserTest, TestCollectionStateWatchers]
   [junit4] Completed [145/145 (1!)] on J0 in 1239.20s, 9 tests, 1 failure, 3 errors <<< FAILURES!

[...truncated 42062 lines...]

Mime
View raw message