lucene-dev mailing list archives

Site index · List index
Message view « Date » · « Thread »
Top « Date » · « Thread »
From Policeman Jenkins Server <jenk...@thetaphi.de>
Subject [JENKINS] Lucene-Solr-7.x-Linux (32bit/jdk1.8.0_144) - Build # 559 - Unstable!
Date Sat, 07 Oct 2017 04:55:53 GMT
Build: https://jenkins.thetaphi.de/job/Lucene-Solr-7.x-Linux/559/
Java: 32bit/jdk1.8.0_144 -server -XX:+UseSerialGC

1 tests failed.
FAILED:  junit.framework.TestSuite.org.apache.solr.cloud.TestSolrCloudWithSecureImpersonation

Error Message:
1 thread leaked from SUITE scope at org.apache.solr.cloud.TestSolrCloudWithSecureImpersonation:     1) Thread[id=16492, name=jetty-launcher-3606-thread-1-EventThread, state=TIMED_WAITING, group=TGRP-TestSolrCloudWithSecureImpersonation]         at sun.misc.Unsafe.park(Native Method)         at java.util.concurrent.locks.LockSupport.parkNanos(LockSupport.java:215)         at java.util.concurrent.locks.AbstractQueuedSynchronizer.doAcquireSharedNanos(AbstractQueuedSynchronizer.java:1037)         at java.util.concurrent.locks.AbstractQueuedSynchronizer.tryAcquireSharedNanos(AbstractQueuedSynchronizer.java:1328)         at java.util.concurrent.CountDownLatch.await(CountDownLatch.java:277)         at org.apache.curator.CuratorZookeeperClient.internalBlockUntilConnectedOrTimedOut(CuratorZookeeperClient.java:323)         at org.apache.curator.RetryLoop.callWithRetry(RetryLoop.java:105)         at org.apache.curator.framework.imps.GetDataBuilderImpl.pathInForeground(GetDataBuilderImpl.java:288)         at org.apache.curator.framework.imps.GetDataBuilderImpl.forPath(GetDataBuilderImpl.java:279)         at org.apache.curator.framework.imps.GetDataBuilderImpl.forPath(GetDataBuilderImpl.java:41)         at org.apache.curator.framework.recipes.shared.SharedValue.readValue(SharedValue.java:244)         at org.apache.curator.framework.recipes.shared.SharedValue.access$100(SharedValue.java:44)         at org.apache.curator.framework.recipes.shared.SharedValue$1.process(SharedValue.java:61)         at org.apache.curator.framework.imps.NamespaceWatcher.process(NamespaceWatcher.java:67)         at org.apache.zookeeper.ClientCnxn$EventThread.processEvent(ClientCnxn.java:530)         at org.apache.zookeeper.ClientCnxn$EventThread.run(ClientCnxn.java:505)

Stack Trace:
com.carrotsearch.randomizedtesting.ThreadLeakError: 1 thread leaked from SUITE scope at org.apache.solr.cloud.TestSolrCloudWithSecureImpersonation: 
   1) Thread[id=16492, name=jetty-launcher-3606-thread-1-EventThread, state=TIMED_WAITING, group=TGRP-TestSolrCloudWithSecureImpersonation]
        at sun.misc.Unsafe.park(Native Method)
        at java.util.concurrent.locks.LockSupport.parkNanos(LockSupport.java:215)
        at java.util.concurrent.locks.AbstractQueuedSynchronizer.doAcquireSharedNanos(AbstractQueuedSynchronizer.java:1037)
        at java.util.concurrent.locks.AbstractQueuedSynchronizer.tryAcquireSharedNanos(AbstractQueuedSynchronizer.java:1328)
        at java.util.concurrent.CountDownLatch.await(CountDownLatch.java:277)
        at org.apache.curator.CuratorZookeeperClient.internalBlockUntilConnectedOrTimedOut(CuratorZookeeperClient.java:323)
        at org.apache.curator.RetryLoop.callWithRetry(RetryLoop.java:105)
        at org.apache.curator.framework.imps.GetDataBuilderImpl.pathInForeground(GetDataBuilderImpl.java:288)
        at org.apache.curator.framework.imps.GetDataBuilderImpl.forPath(GetDataBuilderImpl.java:279)
        at org.apache.curator.framework.imps.GetDataBuilderImpl.forPath(GetDataBuilderImpl.java:41)
        at org.apache.curator.framework.recipes.shared.SharedValue.readValue(SharedValue.java:244)
        at org.apache.curator.framework.recipes.shared.SharedValue.access$100(SharedValue.java:44)
        at org.apache.curator.framework.recipes.shared.SharedValue$1.process(SharedValue.java:61)
        at org.apache.curator.framework.imps.NamespaceWatcher.process(NamespaceWatcher.java:67)
        at org.apache.zookeeper.ClientCnxn$EventThread.processEvent(ClientCnxn.java:530)
        at org.apache.zookeeper.ClientCnxn$EventThread.run(ClientCnxn.java:505)
	at __randomizedtesting.SeedInfo.seed([AF3C106B69AC3C5B]:0)




Build Log:
[...truncated 12708 lines...]
   [junit4] Suite: org.apache.solr.cloud.TestSolrCloudWithSecureImpersonation
   [junit4]   2> Creating dataDir: /home/jenkins/workspace/Lucene-Solr-7.x-Linux/solr/build/solr-core/test/J1/temp/solr.cloud.TestSolrCloudWithSecureImpersonation_AF3C106B69AC3C5B-001/init-core-data-001
   [junit4]   2> 958122 WARN  (SUITE-TestSolrCloudWithSecureImpersonation-seed#[AF3C106B69AC3C5B]-worker) [    ] o.a.s.SolrTestCaseJ4 startTrackingSearchers: numOpens=1 numCloses=1
   [junit4]   2> 958122 INFO  (SUITE-TestSolrCloudWithSecureImpersonation-seed#[AF3C106B69AC3C5B]-worker) [    ] o.a.s.SolrTestCaseJ4 Using PointFields (NUMERIC_POINTS_SYSPROP=true) w/NUMERIC_DOCVALUES_SYSPROP=true
   [junit4]   2> 958123 INFO  (SUITE-TestSolrCloudWithSecureImpersonation-seed#[AF3C106B69AC3C5B]-worker) [    ] o.a.s.SolrTestCaseJ4 Randomized ssl (false) and clientAuth (true) via: @org.apache.solr.util.RandomizeSSL(reason=, ssl=NaN, value=NaN, clientAuth=NaN)
   [junit4]   2> 958123 INFO  (SUITE-TestSolrCloudWithSecureImpersonation-seed#[AF3C106B69AC3C5B]-worker) [    ] o.a.s.SolrTestCaseJ4 SecureRandom sanity checks: test.solr.allowed.securerandom=null & java.security.egd=file:/dev/./urandom
   [junit4]   2> 958139 INFO  (SUITE-TestSolrCloudWithSecureImpersonation-seed#[AF3C106B69AC3C5B]-worker) [    ] o.a.s.c.MiniSolrCloudCluster Starting cluster of 2 servers in /home/jenkins/workspace/Lucene-Solr-7.x-Linux/solr/build/solr-core/test/J1/temp/solr.cloud.TestSolrCloudWithSecureImpersonation_AF3C106B69AC3C5B-001/tempDir-001
   [junit4]   2> 958139 INFO  (SUITE-TestSolrCloudWithSecureImpersonation-seed#[AF3C106B69AC3C5B]-worker) [    ] o.a.s.c.ZkTestServer STARTING ZK TEST SERVER
   [junit4]   2> 958139 INFO  (Thread-2237) [    ] o.a.s.c.ZkTestServer client port:0.0.0.0/0.0.0.0:0
   [junit4]   2> 958139 INFO  (Thread-2237) [    ] o.a.s.c.ZkTestServer Starting server
   [junit4]   2> 958140 ERROR (Thread-2237) [    ] o.a.z.s.ZooKeeperServer ZKShutdownHandler is not registered, so ZooKeeper server won't take any action on ERROR or SHUTDOWN server state changes
   [junit4]   2> 958239 INFO  (SUITE-TestSolrCloudWithSecureImpersonation-seed#[AF3C106B69AC3C5B]-worker) [    ] o.a.s.c.ZkTestServer start zk server on port:39679
   [junit4]   2> 958246 INFO  (jetty-launcher-3606-thread-1) [    ] o.e.j.s.Server jetty-9.3.20.v20170531
   [junit4]   2> 958249 INFO  (jetty-launcher-3606-thread-2) [    ] o.e.j.s.Server jetty-9.3.20.v20170531
   [junit4]   2> 958257 INFO  (jetty-launcher-3606-thread-1) [    ] o.e.j.s.h.ContextHandler Started o.e.j.s.ServletContextHandler@1c059e3{/solr,null,AVAILABLE}
   [junit4]   2> 958257 INFO  (jetty-launcher-3606-thread-1) [    ] o.e.j.s.AbstractConnector Started ServerConnector@2407ae{HTTP/1.1,[http/1.1]}{127.0.0.1:42603}
   [junit4]   2> 958258 INFO  (jetty-launcher-3606-thread-1) [    ] o.e.j.s.Server Started @959841ms
   [junit4]   2> 958258 INFO  (jetty-launcher-3606-thread-1) [    ] o.a.s.c.s.e.JettySolrRunner Jetty properties: {hostContext=/solr, hostPort=42603}
   [junit4]   2> 958258 ERROR (jetty-launcher-3606-thread-1) [    ] o.a.s.u.StartupLoggingUtils Missing Java Option solr.log.dir. Logging may be missing or incomplete.
   [junit4]   2> 958258 INFO  (jetty-launcher-3606-thread-1) [    ] o.a.s.s.SolrDispatchFilter  ___      _       Welcome to Apache Solr™ version 7.1.0
   [junit4]   2> 958258 INFO  (jetty-launcher-3606-thread-1) [    ] o.a.s.s.SolrDispatchFilter / __| ___| |_ _   Starting in cloud mode on port null
   [junit4]   2> 958258 INFO  (jetty-launcher-3606-thread-1) [    ] o.a.s.s.SolrDispatchFilter \__ \/ _ \ | '_|  Install dir: null, Default config dir: null
   [junit4]   2> 958258 INFO  (jetty-launcher-3606-thread-1) [    ] o.a.s.s.SolrDispatchFilter |___/\___/_|_|    Start time: 2017-10-07T04:25:18.384Z
   [junit4]   2> 958259 INFO  (jetty-launcher-3606-thread-2) [    ] o.e.j.s.h.ContextHandler Started o.e.j.s.ServletContextHandler@f19442{/solr,null,AVAILABLE}
   [junit4]   2> 958260 INFO  (jetty-launcher-3606-thread-2) [    ] o.e.j.s.AbstractConnector Started ServerConnector@2f845a{HTTP/1.1,[http/1.1]}{127.0.0.1:33559}
   [junit4]   2> 958260 INFO  (jetty-launcher-3606-thread-2) [    ] o.e.j.s.Server Started @959844ms
   [junit4]   2> 958260 INFO  (jetty-launcher-3606-thread-2) [    ] o.a.s.c.s.e.JettySolrRunner Jetty properties: {hostContext=/solr, hostPort=33559}
   [junit4]   2> 958261 ERROR (jetty-launcher-3606-thread-2) [    ] o.a.s.u.StartupLoggingUtils Missing Java Option solr.log.dir. Logging may be missing or incomplete.
   [junit4]   2> 958261 INFO  (jetty-launcher-3606-thread-2) [    ] o.a.s.s.SolrDispatchFilter  ___      _       Welcome to Apache Solr™ version 7.1.0
   [junit4]   2> 958261 INFO  (jetty-launcher-3606-thread-1) [    ] o.a.s.s.SolrDispatchFilter solr.xml found in ZooKeeper. Loading...
   [junit4]   2> 958261 INFO  (jetty-launcher-3606-thread-2) [    ] o.a.s.s.SolrDispatchFilter / __| ___| |_ _   Starting in cloud mode on port null
   [junit4]   2> 958261 INFO  (jetty-launcher-3606-thread-2) [    ] o.a.s.s.SolrDispatchFilter \__ \/ _ \ | '_|  Install dir: null, Default config dir: null
   [junit4]   2> 958261 INFO  (jetty-launcher-3606-thread-2) [    ] o.a.s.s.SolrDispatchFilter |___/\___/_|_|    Start time: 2017-10-07T04:25:18.387Z
   [junit4]   2> 958268 INFO  (jetty-launcher-3606-thread-2) [    ] o.a.s.s.SolrDispatchFilter solr.xml found in ZooKeeper. Loading...
   [junit4]   2> 958276 INFO  (jetty-launcher-3606-thread-1) [    ] o.a.s.c.ZkContainer Zookeeper client=127.0.0.1:39679/solr
   [junit4]   2> 958277 INFO  (jetty-launcher-3606-thread-2) [    ] o.a.s.c.ZkContainer Zookeeper client=127.0.0.1:39679/solr
   [junit4]   2> 958280 WARN  (NIOServerCxn.Factory:0.0.0.0/0.0.0.0:0) [    ] o.a.z.s.NIOServerCnxn caught end of stream exception
   [junit4]   2> EndOfStreamException: Unable to read additional data from client sessionid 0x15ef5148cba0003, likely client has closed socket
   [junit4]   2> 	at org.apache.zookeeper.server.NIOServerCnxn.doIO(NIOServerCnxn.java:239)
   [junit4]   2> 	at org.apache.zookeeper.server.NIOServerCnxnFactory.run(NIOServerCnxnFactory.java:203)
   [junit4]   2> 	at java.lang.Thread.run(Thread.java:748)
   [junit4]   2> 958315 INFO  (jetty-launcher-3606-thread-1) [n:127.0.0.1:42603_solr    ] o.a.s.c.Overseer Overseer (id=null) closing
   [junit4]   2> 958315 INFO  (jetty-launcher-3606-thread-1) [n:127.0.0.1:42603_solr    ] o.a.s.c.OverseerElectionContext I am going to be the leader 127.0.0.1:42603_solr
   [junit4]   2> 958315 INFO  (jetty-launcher-3606-thread-1) [n:127.0.0.1:42603_solr    ] o.a.s.c.Overseer Overseer (id=98785710457880581-127.0.0.1:42603_solr-n_0000000000) starting
   [junit4]   2> 958317 INFO  (jetty-launcher-3606-thread-2) [n:127.0.0.1:33559_solr    ] o.a.s.c.Overseer Overseer (id=null) closing
   [junit4]   2> 958317 INFO  (jetty-launcher-3606-thread-2) [n:127.0.0.1:33559_solr    ] o.a.s.c.ZkController Register node as live in ZooKeeper:/live_nodes/127.0.0.1:33559_solr
   [junit4]   2> 958325 INFO  (zkCallback-3618-thread-1-processing-n:127.0.0.1:33559_solr) [n:127.0.0.1:33559_solr    ] o.a.s.c.c.ZkStateReader Updated live nodes from ZooKeeper... (0) -> (1)
   [junit4]   2> 958325 INFO  (OverseerStateUpdate-98785710457880581-127.0.0.1:42603_solr-n_0000000000) [n:127.0.0.1:42603_solr    ] o.a.s.c.c.ZkStateReader Updated live nodes from ZooKeeper... (0) -> (1)
   [junit4]   2> 958329 INFO  (jetty-launcher-3606-thread-1) [n:127.0.0.1:42603_solr    ] o.a.s.c.ZkController Register node as live in ZooKeeper:/live_nodes/127.0.0.1:42603_solr
   [junit4]   2> 958334 INFO  (zkCallback-3617-thread-1-processing-n:127.0.0.1:42603_solr) [n:127.0.0.1:42603_solr    ] o.a.s.c.c.ZkStateReader Updated live nodes from ZooKeeper... (1) -> (2)
   [junit4]   2> 958334 INFO  (zkCallback-3618-thread-1-processing-n:127.0.0.1:33559_solr) [n:127.0.0.1:33559_solr    ] o.a.s.c.c.ZkStateReader Updated live nodes from ZooKeeper... (1) -> (2)
   [junit4]   2> 958380 INFO  (jetty-launcher-3606-thread-2) [n:127.0.0.1:33559_solr    ] o.a.s.c.CoreContainer Initializing authentication plugin: org.apache.solr.security.HttpParamDelegationTokenPlugin
   [junit4]   2> 958384 WARN  (jetty-launcher-3606-thread-2) [n:127.0.0.1:33559_solr    ] o.a.s.c.s.i.Krb5HttpClientBuilder org.apache.solr.client.solrj.impl.Krb5HttpClientBuilder is configured without specifying system property 'java.security.auth.login.config'
   [junit4]   2> 958385 INFO  (jetty-launcher-3606-thread-2) [n:127.0.0.1:33559_solr    ] o.a.s.s.KerberosPlugin Params: {solr.kerberos.impersonator.user.noGroups.hosts=*, solr.kerberos.impersonator.user.bogusGroup.groups=__some_bogus_group, token.valid=30, cookie.domain=127.0.0.1, solr.kerberos.impersonator.user.anyHostAnyUser.groups=*, solr.kerberos.impersonator.user.bogusGroup.hosts=*, solr.kerberos.impersonator.user.anyHostAnyUser.hosts=*, token.validity=36000, solr.kerberos.impersonator.user.noHosts.groups=*, type=kerberos, solr.kerberos.impersonator.user.localHostAnyGroup.groups=*, delegation-token.token-kind=solr-dt, solr.kerberos.impersonator.user.wrongHost.hosts=1.1.1.1.1.1, cookie.path=/, zk-dt-secret-manager.znodeWorkingPath=solr/security/zkdtsm, solr.kerberos.impersonator.user.localHostAnyGroup.hosts=localhost.localdomain,localhost,127.0.0.1, signer.secret.provider.zookeeper.path=/token, solr.kerberos.impersonator.user.anyHostUsersGroup.groups=jenkins, zk-dt-secret-manager.enable=true, solr.kerberos.impersonator.user.wrongHost.groups=*, kerberos.name.rules=DEFAULT, signer.secret.provider=zookeeper, solr.kerberos.impersonator.user.anyHostUsersGroup.hosts=*}
   [junit4]   2> 958388 INFO  (jetty-launcher-3606-thread-2) [n:127.0.0.1:33559_solr    ] o.a.c.f.i.CuratorFrameworkImpl Starting
   [junit4]   2> 958403 INFO  (jetty-launcher-3606-thread-2-EventThread) [n:127.0.0.1:33559_solr    ] o.a.c.f.s.ConnectionStateManager State change: CONNECTED
   [junit4]   2> 958414 WARN  (jetty-launcher-3606-thread-2) [n:127.0.0.1:33559_solr    ] o.a.s.c.s.i.Krb5HttpClientBuilder org.apache.solr.client.solrj.impl.Krb5HttpClientBuilder is configured without specifying system property 'java.security.auth.login.config'
   [junit4]   2> 958448 INFO  (jetty-launcher-3606-thread-2) [n:127.0.0.1:33559_solr    ] o.a.s.m.r.SolrJmxReporter JMX monitoring for 'solr_33559.solr.node' (registry 'solr.node') enabled at server: com.sun.jmx.mbeanserver.JmxMBeanServer@27c5e7
   [junit4]   2> 958454 INFO  (jetty-launcher-3606-thread-2) [n:127.0.0.1:33559_solr    ] o.a.s.m.r.SolrJmxReporter JMX monitoring for 'solr_33559.solr.jvm' (registry 'solr.jvm') enabled at server: com.sun.jmx.mbeanserver.JmxMBeanServer@27c5e7
   [junit4]   2> 958454 INFO  (jetty-launcher-3606-thread-2) [n:127.0.0.1:33559_solr    ] o.a.s.m.r.SolrJmxReporter JMX monitoring for 'solr_33559.solr.jetty' (registry 'solr.jetty') enabled at server: com.sun.jmx.mbeanserver.JmxMBeanServer@27c5e7
   [junit4]   2> 958455 INFO  (jetty-launcher-3606-thread-2) [n:127.0.0.1:33559_solr    ] o.a.s.c.CorePropertiesLocator Found 0 core definitions underneath /home/jenkins/workspace/Lucene-Solr-7.x-Linux/solr/build/solr-core/test/J1/temp/solr.cloud.TestSolrCloudWithSecureImpersonation_AF3C106B69AC3C5B-001/tempDir-001/node2/.
   [junit4]   2> 958479 INFO  (jetty-launcher-3606-thread-1) [n:127.0.0.1:42603_solr    ] o.a.s.c.CoreContainer Initializing authentication plugin: org.apache.solr.security.HttpParamDelegationTokenPlugin
   [junit4]   2> 958479 WARN  (jetty-launcher-3606-thread-1) [n:127.0.0.1:42603_solr    ] o.a.s.c.s.i.Krb5HttpClientBuilder org.apache.solr.client.solrj.impl.Krb5HttpClientBuilder is configured without specifying system property 'java.security.auth.login.config'
   [junit4]   2> 958479 INFO  (jetty-launcher-3606-thread-1) [n:127.0.0.1:42603_solr    ] o.a.s.s.KerberosPlugin Params: {solr.kerberos.impersonator.user.noGroups.hosts=*, solr.kerberos.impersonator.user.bogusGroup.groups=__some_bogus_group, token.valid=30, cookie.domain=127.0.0.1, solr.kerberos.impersonator.user.anyHostAnyUser.groups=*, solr.kerberos.impersonator.user.bogusGroup.hosts=*, solr.kerberos.impersonator.user.anyHostAnyUser.hosts=*, token.validity=36000, solr.kerberos.impersonator.user.noHosts.groups=*, type=kerberos, solr.kerberos.impersonator.user.localHostAnyGroup.groups=*, delegation-token.token-kind=solr-dt, solr.kerberos.impersonator.user.wrongHost.hosts=1.1.1.1.1.1, cookie.path=/, zk-dt-secret-manager.znodeWorkingPath=solr/security/zkdtsm, solr.kerberos.impersonator.user.localHostAnyGroup.hosts=localhost.localdomain,localhost,127.0.0.1, signer.secret.provider.zookeeper.path=/token, solr.kerberos.impersonator.user.anyHostUsersGroup.groups=jenkins, zk-dt-secret-manager.enable=true, solr.kerberos.impersonator.user.wrongHost.groups=*, kerberos.name.rules=DEFAULT, signer.secret.provider=zookeeper, solr.kerberos.impersonator.user.anyHostUsersGroup.hosts=*}
   [junit4]   2> 958480 INFO  (jetty-launcher-3606-thread-1) [n:127.0.0.1:42603_solr    ] o.a.c.f.i.CuratorFrameworkImpl Starting
   [junit4]   2> 958481 INFO  (jetty-launcher-3606-thread-1-EventThread) [n:127.0.0.1:42603_solr    ] o.a.c.f.s.ConnectionStateManager State change: CONNECTED
   [junit4]   2> 958486 WARN  (jetty-launcher-3606-thread-1) [n:127.0.0.1:42603_solr    ] o.a.s.c.s.i.Krb5HttpClientBuilder org.apache.solr.client.solrj.impl.Krb5HttpClientBuilder is configured without specifying system property 'java.security.auth.login.config'
   [junit4]   2> 958503 INFO  (jetty-launcher-3606-thread-1) [n:127.0.0.1:42603_solr    ] o.a.s.m.r.SolrJmxReporter JMX monitoring for 'solr_42603.solr.node' (registry 'solr.node') enabled at server: com.sun.jmx.mbeanserver.JmxMBeanServer@27c5e7
   [junit4]   2> 958510 INFO  (jetty-launcher-3606-thread-1) [n:127.0.0.1:42603_solr    ] o.a.s.m.r.SolrJmxReporter JMX monitoring for 'solr_42603.solr.jvm' (registry 'solr.jvm') enabled at server: com.sun.jmx.mbeanserver.JmxMBeanServer@27c5e7
   [junit4]   2> 958510 INFO  (jetty-launcher-3606-thread-1) [n:127.0.0.1:42603_solr    ] o.a.s.m.r.SolrJmxReporter JMX monitoring for 'solr_42603.solr.jetty' (registry 'solr.jetty') enabled at server: com.sun.jmx.mbeanserver.JmxMBeanServer@27c5e7
   [junit4]   2> 958511 INFO  (jetty-launcher-3606-thread-1) [n:127.0.0.1:42603_solr    ] o.a.s.c.CorePropertiesLocator Found 0 core definitions underneath /home/jenkins/workspace/Lucene-Solr-7.x-Linux/solr/build/solr-core/test/J1/temp/solr.cloud.TestSolrCloudWithSecureImpersonation_AF3C106B69AC3C5B-001/tempDir-001/node1/.
   [junit4]   2> 958537 INFO  (TEST-TestSolrCloudWithSecureImpersonation.testProxyInvalidGroup-seed#[AF3C106B69AC3C5B]) [    ] o.a.s.SolrTestCaseJ4 ###Starting testProxyInvalidGroup
   [junit4]   2> 958556 WARN  (qtp16565348-16449) [    ] o.a.h.s.ShellBasedUnixGroupsMapping got exception trying to get groups for user bar: id: ‘bar’: no such user
   [junit4]   2> id: ‘bar’: no such user
   [junit4]   2> 
   [junit4]   2> 958566 WARN  (TEST-TestSolrCloudWithSecureImpersonation.testProxyInvalidGroup-seed#[AF3C106B69AC3C5B]) [    ] o.a.h.c.p.ResponseProcessCookies Invalid cookie header: "Set-Cookie: hadoop.auth="u=bogusGroup&p=bogusGroup&t=test&e=1507386318669&s=M+LiBdNFmZnkEPNCufpRvZo1SnA="; Path=/; Domain=127.0.0.1; Expires=sáb, 07-oct-2017 14:25:18 GMT; HttpOnly". Invalid 'expires' attribute: sáb, 07-oct-2017 14:25:18 GMT
   [junit4]   2> 958566 INFO  (TEST-TestSolrCloudWithSecureImpersonation.testProxyInvalidGroup-seed#[AF3C106B69AC3C5B]) [    ] o.a.s.SolrTestCaseJ4 ###Ending testProxyInvalidGroup
   [junit4]   2> 958576 INFO  (TEST-TestSolrCloudWithSecureImpersonation.testProxyValidateHost-seed#[AF3C106B69AC3C5B]) [    ] o.a.s.SolrTestCaseJ4 ###Starting testProxyValidateHost
   [junit4]   2> 958579 INFO  (qtp16565348-16450) [n:127.0.0.1:33559_solr    ] o.a.s.h.a.CollectionsHandler Invoked Collection Action :list with params doAs=bar&action=LIST&wt=javabin&version=2 and sendToOCPQueue=true
   [junit4]   2> 958579 INFO  (qtp16565348-16450) [n:127.0.0.1:33559_solr    ] o.a.s.s.HttpSolrCall [admin] webapp=null path=/admin/collections params={doAs=bar&action=LIST&wt=javabin&version=2} status=0 QTime=0
   [junit4]   2> 958580 WARN  (TEST-TestSolrCloudWithSecureImpersonation.testProxyValidateHost-seed#[AF3C106B69AC3C5B]) [    ] o.a.h.c.p.ResponseProcessCookies Invalid cookie header: "Set-Cookie: hadoop.auth="u=localHostAnyGroup&p=localHostAnyGroup&t=test&e=1507386318702&s=8FsMtwVWybK8yFb4nzN0o4dLzUA="; Path=/; Domain=127.0.0.1; Expires=sáb, 07-oct-2017 14:25:18 GMT; HttpOnly". Invalid 'expires' attribute: sáb, 07-oct-2017 14:25:18 GMT
   [junit4]   2> 958580 INFO  (TEST-TestSolrCloudWithSecureImpersonation.testProxyValidateHost-seed#[AF3C106B69AC3C5B]) [    ] o.a.s.SolrTestCaseJ4 ###Ending testProxyValidateHost
   [junit4]   2> 958591 INFO  (TEST-TestSolrCloudWithSecureImpersonation.testProxyInvalidRemote-seed#[AF3C106B69AC3C5B]) [    ] o.a.s.SolrTestCaseJ4 ###Starting testProxyInvalidRemote
   [junit4]   2> 958597 WARN  (TEST-TestSolrCloudWithSecureImpersonation.testProxyInvalidRemote-seed#[AF3C106B69AC3C5B]) [    ] o.a.h.c.p.ResponseProcessCookies Invalid cookie header: "Set-Cookie: hadoop.auth="u=localHostAnyGroup&p=localHostAnyGroup&t=test&e=1507386318717&s=mUfOo1v2Ho8gDtN4JfTbTbquVf0="; Path=/; Domain=127.0.0.1; Expires=sáb, 07-oct-2017 14:25:18 GMT; HttpOnly". Invalid 'expires' attribute: sáb, 07-oct-2017 14:25:18 GMT
   [junit4]   2> 958597 INFO  (TEST-TestSolrCloudWithSecureImpersonation.testProxyInvalidRemote-seed#[AF3C106B69AC3C5B]) [    ] o.a.s.SolrTestCaseJ4 ###Ending testProxyInvalidRemote
   [junit4]   2> 958607 INFO  (TEST-TestSolrCloudWithSecureImpersonation.testProxyNullProxyUser-seed#[AF3C106B69AC3C5B]) [    ] o.a.s.SolrTestCaseJ4 ###Starting testProxyNullProxyUser
   [junit4]   2> 958608 INFO  (qtp16565348-16440) [    ] o.a.s.s.SolrDispatchFilter Error authenticating
   [junit4]   2> java.lang.IllegalArgumentException: userName is NULL, empty or contains a '&'
   [junit4]   2> 	at org.apache.hadoop.security.authentication.util.AuthToken.checkForIllegalArgument(AuthToken.java:87)
   [junit4]   2> 	at org.apache.hadoop.security.authentication.util.AuthToken.<init>(AuthToken.java:70)
   [junit4]   2> 	at org.apache.hadoop.security.authentication.server.AuthenticationToken.<init>(AuthenticationToken.java:58)
   [junit4]   2> 	at org.apache.solr.security.HttpParamDelegationTokenPlugin$HttpParamDelegationTokenAuthenticationHandler$HttpParamAuthenticationHandler.authenticate(HttpParamDelegationTokenPlugin.java:213)
   [junit4]   2> 	at org.apache.hadoop.security.token.delegation.web.DelegationTokenAuthenticationHandler.authenticate(DelegationTokenAuthenticationHandler.java:348)
   [junit4]   2> 	at org.apache.solr.security.RequestContinuesRecorderAuthenticationHandler.authenticate(RequestContinuesRecorderAuthenticationHandler.java:69)
   [junit4]   2> 	at org.apache.hadoop.security.authentication.server.AuthenticationFilter.doFilter(AuthenticationFilter.java:518)
   [junit4]   2> 	at org.apache.solr.security.DelegationTokenKerberosFilter.doFilter(DelegationTokenKerberosFilter.java:134)
   [junit4]   2> 	at org.apache.solr.security.HttpParamDelegationTokenPlugin$HttpParamToRequestFilter.doFilter(HttpParamDelegationTokenPlugin.java:245)
   [junit4]   2> 	at org.apache.solr.security.KerberosPlugin.doAuthenticate(KerberosPlugin.java:243)
   [junit4]   2> 	at org.apache.solr.servlet.SolrDispatchFilter.authenticateRequest(SolrDispatchFilter.java:451)
   [junit4]   2> 	at org.apache.solr.servlet.SolrDispatchFilter.doFilter(SolrDispatchFilter.java:347)
   [junit4]   2> 	at org.apache.solr.servlet.SolrDispatchFilter.doFilter(SolrDispatchFilter.java:326)
   [junit4]   2> 	at org.eclipse.jetty.servlet.ServletHandler$CachedChain.doFilter(ServletHandler.java:1759)
   [junit4]   2> 	at org.apache.solr.client.solrj.embedded.JettySolrRunner$DebugFilter.doFilter(JettySolrRunner.java:139)
   [junit4]   2> 	at org.eclipse.jetty.servlet.ServletHandler$CachedChain.doFilter(ServletHandler.java:1759)
   [junit4]   2> 	at org.eclipse.jetty.servlet.ServletHandler.doHandle(ServletHandler.java:582)
   [junit4]   2> 	at org.eclipse.jetty.server.session.SessionHandler.doHandle(SessionHandler.java:224)
   [junit4]   2> 	at org.eclipse.jetty.server.handler.ContextHandler.doHandle(ContextHandler.java:1180)
   [junit4]   2> 	at org.eclipse.jetty.servlet.ServletHandler.doScope(ServletHandler.java:512)
   [junit4]   2> 	at org.eclipse.jetty.server.session.SessionHandler.doScope(SessionHandler.java:185)
   [junit4]   2> 	at org.eclipse.jetty.server.handler.ContextHandler.doScope(ContextHandler.java:1112)
   [junit4]   2> 	at org.eclipse.jetty.server.handler.ScopedHandler.handle(ScopedHandler.java:141)
   [junit4]   2> 	at org.eclipse.jetty.server.handler.gzip.GzipHandler.handle(GzipHandler.java:493)
   [junit4]   2> 	at org.eclipse.jetty.server.handler.HandlerWrapper.handle(HandlerWrapper.java:134)
   [junit4]   2> 	at org.eclipse.jetty.server.Server.handle(Server.java:534)
   [junit4]   2> 	at org.eclipse.jetty.server.HttpChannel.handle(HttpChannel.java:320)
   [junit4]   2> 	at org.eclipse.jetty.server.HttpConnection.onFillable(HttpConnection.java:251)
   [junit4]   2> 	at org.eclipse.jetty.io.AbstractConnection$ReadCallback.succeeded(AbstractConnection.java:283)
   [junit4]   2> 	at org.eclipse.jetty.io.FillInterest.fillable(FillInterest.java:108)
   [junit4]   2> 	at org.eclipse.jetty.io.SelectChannelEndPoint$2.run(SelectChannelEndPoint.java:93)
   [junit4]   2> 	at org.eclipse.jetty.util.thread.strategy.ExecuteProduceConsume.executeProduceConsume(ExecuteProduceConsume.java:303)
   [junit4]   2> 	at org.eclipse.jetty.util.thread.strategy.ExecuteProduceConsume.produceConsume(ExecuteProduceConsume.java:148)
   [junit4]   2> 	at org.eclipse.jetty.util.thread.strategy.ExecuteProduceConsume.run(ExecuteProduceConsume.java:136)
   [junit4]   2> 	at org.eclipse.jetty.util.thread.QueuedThreadPool.runJob(QueuedThreadPool.java:671)
   [junit4]   2> 	at org.eclipse.jetty.util.thread.QueuedThreadPool$2.run(QueuedThreadPool.java:589)
   [junit4]   2> 	at java.lang.Thread.run(Thread.java:748)
   [junit4]   2> 958608 WARN  (qtp16565348-16440) [    ] o.e.j.s.ServletHandler /solr/admin/collections
   [junit4]   2> org.apache.solr.common.SolrException: Error during request authentication, 
   [junit4]   2> 	at org.apache.solr.servlet.SolrDispatchFilter.authenticateRequest(SolrDispatchFilter.java:457)
   [junit4]   2> 	at org.apache.solr.servlet.SolrDispatchFilter.doFilter(SolrDispatchFilter.java:347)
   [junit4]   2> 	at org.apache.solr.servlet.SolrDispatchFilter.doFilter(SolrDispatchFilter.java:326)
   [junit4]   2> 	at org.eclipse.jetty.servlet.ServletHandler$CachedChain.doFilter(ServletHandler.java:1759)
   [junit4]   2> 	at org.apache.solr.client.solrj.embedded.JettySolrRunner$DebugFilter.doFilter(JettySolrRunner.java:139)
   [junit4]   2> 	at org.eclipse.jetty.servlet.ServletHandler$CachedChain.doFilter(ServletHandler.java:1759)
   [junit4]   2> 	at org.eclipse.jetty.servlet.ServletHandler.doHandle(ServletHandler.java:582)
   [junit4]   2> 	at org.eclipse.jetty.server.session.SessionHandler.doHandle(SessionHandler.java:224)
   [junit4]   2> 	at org.eclipse.jetty.server.handler.ContextHandler.doHandle(ContextHandler.java:1180)
   [junit4]   2> 	at org.eclipse.jetty.servlet.ServletHandler.doScope(ServletHandler.java:512)
   [junit4]   2> 	at org.eclipse.jetty.server.session.SessionHandler.doScope(SessionHandler.java:185)
   [junit4]   2> 	at org.eclipse.jetty.server.handler.ContextHandler.doScope(ContextHandler.java:1112)
   [junit4]   2> 	at org.eclipse.jetty.server.handler.ScopedHandler.handle(ScopedHandler.java:141)
   [junit4]   2> 	at org.eclipse.jetty.server.handler.gzip.GzipHandler.handle(GzipHandler.java:493)
   [junit4]   2> 	at org.eclipse.jetty.server.handler.HandlerWrapper.handle(HandlerWrapper.java:134)
   [junit4]   2> 	at org.eclipse.jetty.server.Server.handle(Server.java:534)
   [junit4]   2> 	at org.eclipse.jetty.server.HttpChannel.handle(HttpChannel.java:320)
   [junit4]   2> 	at org.eclipse.jetty.server.HttpConnection.onFillable(HttpConnection.java:251)
   [junit4]   2> 	at org.eclipse.jetty.io.AbstractConnection$ReadCallback.succeeded(AbstractConnection.java:283)
   [junit4]   2> 	at org.eclipse.jetty.io.FillInterest.fillable(FillInterest.java:108)
   [junit4]   2> 	at org.eclipse.jetty.io.SelectChannelEndPoint$2.run(SelectChannelEndPoint.java:93)
   [junit4]   2> 	at org.eclipse.jetty.util.thread.strategy.ExecuteProduceConsume.executeProduceConsume(ExecuteProduceConsume.java:303)
   [junit4]   2> 	at org.eclipse.jetty.util.thread.strategy.ExecuteProduceConsume.produceConsume(ExecuteProduceConsume.java:148)
   [junit4]   2> 	at org.eclipse.jetty.util.thread.strategy.ExecuteProduceConsume.run(ExecuteProduceConsume.java:136)
   [junit4]   2> 	at org.eclipse.jetty.util.thread.QueuedThreadPool.runJob(QueuedThreadPool.java:671)
   [junit4]   2> 	at org.eclipse.jetty.util.thread.QueuedThreadPool$2.run(QueuedThreadPool.java:589)
   [junit4]   2> 	at java.lang.Thread.run(Thread.java:748)
   [junit4]   2> Caused by: java.lang.IllegalArgumentException: userName is NULL, empty or contains a '&'
   [junit4]   2> 	at org.apache.hadoop.security.authentication.util.AuthToken.checkForIllegalArgument(AuthToken.java:87)
   [junit4]   2> 	at org.apache.hadoop.security.authentication.util.AuthToken.<init>(AuthToken.java:70)
   [junit4]   2> 	at org.apache.hadoop.security.authentication.server.AuthenticationToken.<init>(AuthenticationToken.java:58)
   [junit4]   2> 	at org.apache.solr.security.HttpParamDelegationTokenPlugin$HttpParamDelegationTokenAuthenticationHandler$HttpParamAuthenticationHandler.authenticate(HttpParamDelegationTokenPlugin.java:213)
   [junit4]   2> 	at org.apache.hadoop.security.token.delegation.web.DelegationTokenAuthenticationHandler.authenticate(DelegationTokenAuthenticationHandler.java:348)
   [junit4]   2> 	at org.apache.solr.security.RequestContinuesRecorderAuthenticationHandler.authenticate(RequestContinuesRecorderAuthenticationHandler.java:69)
   [junit4]   2> 	at org.apache.hadoop.security.authentication.server.AuthenticationFilter.doFilter(AuthenticationFilter.java:518)
   [junit4]   2> 	at org.apache.solr.security.DelegationTokenKerberosFilter.doFilter(DelegationTokenKerberosFilter.java:134)
   [junit4]   2> 	at org.apache.solr.security.HttpParamDelegationTokenPlugin$HttpParamToRequestFilter.doFilter(HttpParamDelegationTokenPlugin.java:245)
   [junit4]   2> 	at org.apache.solr.security.KerberosPlugin.doAuthenticate(KerberosPlugin.java:243)
   [junit4]   2> 	at org.apache.solr.servlet.SolrDispatchFilter.authenticateRequest(SolrDispatchFilter.java:451)
   [junit4]   2> 	... 26 more
   [junit4]   2> 958612 INFO  (TEST-TestSolrCloudWithSecureImpersonation.testProxyNullProxyUser-seed#[AF3C106B69AC3C5B]) [    ] o.a.s.SolrTestCaseJ4 ###Ending testProxyNullProxyUser
   [junit4]   2> 958622 INFO  (TEST-TestSolrCloudWithSecureImpersonation.testProxyValidateAnyHostAnyUser-seed#[AF3C106B69AC3C5B]) [    ] o.a.s.SolrTestCaseJ4 ###Starting testProxyValidateAnyHostAnyUser
   [junit4]   2> 958623 INFO  (qtp16565348-16451) [n:127.0.0.1:33559_solr    ] o.a.s.h.a.CollectionsHandler Invoked Collection Action :list with params doAs=bar&action=LIST&wt=javabin&version=2 and sendToOCPQueue=true
   [junit4]   2> 958623 INFO  (qtp16565348-16451) [n:127.0.0.1:33559_solr    ] o.a.s.s.HttpSolrCall [admin] webapp=null path=/admin/collections params={doAs=bar&action=LIST&wt=javabin&version=2} status=0 QTime=0
   [junit4]   2> 958623 WARN  (TEST-TestSolrCloudWithSecureImpersonation.testProxyValidateAnyHostAnyUser-seed#[AF3C106B69AC3C5B]) [    ] o.a.h.c.p.ResponseProcessCookies Invalid cookie header: "Set-Cookie: hadoop.auth="u=anyHostAnyUser&p=anyHostAnyUser&t=test&e=1507386318749&s=ruMQruv/gKkeRWI4riyCE1QE5YA="; Path=/; Domain=127.0.0.1; Expires=sáb, 07-oct-2017 14:25:18 GMT; HttpOnly". Invalid 'expires' attribute: sáb, 07-oct-2017 14:25:18 GMT
   [junit4]   2> 958623 INFO  (TEST-TestSolrCloudWithSecureImpersonation.testProxyValidateAnyHostAnyUser-seed#[AF3C106B69AC3C5B]) [    ] o.a.s.SolrTestCaseJ4 ###Ending testProxyValidateAnyHostAnyUser
   [junit4]   2> 958633 INFO  (TEST-TestSolrCloudWithSecureImpersonation.testProxyInvalidProxyUser-seed#[AF3C106B69AC3C5B]) [    ] o.a.s.SolrTestCaseJ4 ###Starting testProxyInvalidProxyUser
   [junit4]   2> 958635 WARN  (TEST-TestSolrCloudWithSecureImpersonation.testProxyInvalidProxyUser-seed#[AF3C106B69AC3C5B]) [    ] o.a.h.c.p.ResponseProcessCookies Invalid cookie header: "Set-Cookie: hadoop.auth="u=bar&p=bar&t=test&e=1507386318759&s=E0FDK47NhHhmg1Yh2mXtq5wpNG4="; Path=/; Domain=127.0.0.1; Expires=sáb, 07-oct-2017 14:25:18 GMT; HttpOnly". Invalid 'expires' attribute: sáb, 07-oct-2017 14:25:18 GMT
   [junit4]   2> 958635 INFO  (TEST-TestSolrCloudWithSecureImpersonation.testProxyInvalidProxyUser-seed#[AF3C106B69AC3C5B]) [    ] o.a.s.SolrTestCaseJ4 ###Ending testProxyInvalidProxyUser
   [junit4]   2> 958645 INFO  (TEST-TestSolrCloudWithSecureImpersonation.testProxyNoConfigHosts-seed#[AF3C106B69AC3C5B]) [    ] o.a.s.SolrTestCaseJ4 ###Starting testProxyNoConfigHosts
   [junit4]   2> 958647 WARN  (TEST-TestSolrCloudWithSecureImpersonation.testProxyNoConfigHosts-seed#[AF3C106B69AC3C5B]) [    ] o.a.h.c.p.ResponseProcessCookies Invalid cookie header: "Set-Cookie: hadoop.auth="u=noHosts&p=noHosts&t=test&e=1507386318771&s=tyYDTfjfts73G/xjY51RJoeDU3Q="; Path=/; Domain=127.0.0.1; Expires=sáb, 07-oct-2017 14:25:18 GMT; HttpOnly". Invalid 'expires' attribute: sáb, 07-oct-2017 14:25:18 GMT
   [junit4]   2> 958647 INFO  (TEST-TestSolrCloudWithSecureImpersonation.testProxyNoConfigHosts-seed#[AF3C106B69AC3C5B]) [    ] o.a.s.SolrTestCaseJ4 ###Ending testProxyNoConfigHosts
   [junit4]   2> 958658 INFO  (TEST-TestSolrCloudWithSecureImpersonation.testProxyValidateGroup-seed#[AF3C106B69AC3C5B]) [    ] o.a.s.SolrTestCaseJ4 ###Starting testProxyValidateGroup
   [junit4]   2> 958669 INFO  (qtp16565348-16442) [n:127.0.0.1:33559_solr    ] o.a.s.h.a.CollectionsHandler Invoked Collection Action :list with params doAs=jenkins&action=LIST&wt=javabin&version=2 and sendToOCPQueue=true
   [junit4]   2> 958669 INFO  (qtp16565348-16442) [n:127.0.0.1:33559_solr    ] o.a.s.s.HttpSolrCall [admin] webapp=null path=/admin/collections params={doAs=jenkins&action=LIST&wt=javabin&version=2} status=0 QTime=0
   [junit4]   2> 958670 WARN  (TEST-TestSolrCloudWithSecureImpersonation.testProxyValidateGroup-seed#[AF3C106B69AC3C5B]) [    ] o.a.h.c.p.ResponseProcessCookies Invalid cookie header: "Set-Cookie: hadoop.auth="u=anyHostUsersGroup&p=anyHostUsersGroup&t=test&e=1507386318784&s=kUFybvUs7WzpKmr7fCtGbYNBx3s="; Path=/; Domain=127.0.0.1; Expires=sáb, 07-oct-2017 14:25:18 GMT; HttpOnly". Invalid 'expires' attribute: sáb, 07-oct-2017 14:25:18 GMT
   [junit4]   2> 958670 INFO  (TEST-TestSolrCloudWithSecureImpersonation.testProxyValidateGroup-seed#[AF3C106B69AC3C5B]) [    ] o.a.s.SolrTestCaseJ4 ###Ending testProxyValidateGroup
   [junit4]   2> 958680 INFO  (TEST-TestSolrCloudWithSecureImpersonation.testProxyUnknownRemote-seed#[AF3C106B69AC3C5B]) [    ] o.a.s.SolrTestCaseJ4 ###Starting testProxyUnknownRemote
   [junit4]   2> 964477 WARN  (TEST-TestSolrCloudWithSecureImpersonation.testProxyUnknownRemote-seed#[AF3C106B69AC3C5B]) [    ] o.a.h.c.p.ResponseProcessCookies Invalid cookie header: "Set-Cookie: hadoop.auth="u=localHostAnyGroup&p=localHostAnyGroup&t=test&e=1507386318806&s=gPFarl1fxB5bDS+7/jEXKLXqfhM="; Path=/; Domain=127.0.0.1; Expires=sáb, 07-oct-2017 14:25:18 GMT; HttpOnly". Invalid 'expires' attribute: sáb, 07-oct-2017 14:25:18 GMT
   [junit4]   2> 964477 INFO  (TEST-TestSolrCloudWithSecureImpersonation.testProxyUnknownRemote-seed#[AF3C106B69AC3C5B]) [    ] o.a.s.SolrTestCaseJ4 ###Ending testProxyUnknownRemote
   [junit4]   2> 964487 INFO  (TEST-TestSolrCloudWithSecureImpersonation.testProxyNoConfigGroups-seed#[AF3C106B69AC3C5B]) [    ] o.a.s.SolrTestCaseJ4 ###Starting testProxyNoConfigGroups
   [junit4]   2> 964488 WARN  (TEST-TestSolrCloudWithSecureImpersonation.testProxyNoConfigGroups-seed#[AF3C106B69AC3C5B]) [    ] o.a.h.c.p.ResponseProcessCookies Invalid cookie header: "Set-Cookie: hadoop.auth="u=noGroups&p=noGroups&t=test&e=1507386324613&s=WtqxNxaSU7FNoFkF+RHRuist+P4="; Path=/; Domain=127.0.0.1; Expires=sáb, 07-oct-2017 14:25:24 GMT; HttpOnly". Invalid 'expires' attribute: sáb, 07-oct-2017 14:25:24 GMT
   [junit4]   2> 964488 INFO  (TEST-TestSolrCloudWithSecureImpersonation.testProxyNoConfigGroups-seed#[AF3C106B69AC3C5B]) [    ] o.a.s.SolrTestCaseJ4 ###Ending testProxyNoConfigGroups
   [junit4]   2> 964499 INFO  (TEST-TestSolrCloudWithSecureImpersonation.testProxyWrongHost-seed#[AF3C106B69AC3C5B]) [    ] o.a.s.SolrTestCaseJ4 ###Starting testProxyWrongHost
   [junit4]   2> 974525 WARN  (jetty-launcher-3606-thread-1-SendThread(127.0.0.1:39679)) [n:127.0.0.1:42603_solr    ] o.a.z.ClientCnxn Client session timed out, have not heard from server in 16036ms for sessionid 0x15ef5148cba0008
   [junit4]   2> 974526 WARN  (NIOServerCxn.Factory:0.0.0.0/0.0.0.0:0) [    ] o.a.z.s.NIOServerCnxn caught end of stream exception
   [junit4]   2> EndOfStreamException: Unable to read additional data from client sessionid 0x15ef5148cba0008, likely client has closed socket
   [junit4]   2> 	at org.apache.zookeeper.server.NIOServerCnxn.doIO(NIOServerCnxn.java:239)
   [junit4]   2> 	at org.apache.zookeeper.server.NIOServerCnxnFactory.run(NIOServerCnxnFactory.java:203)
   [junit4]   2> 	at java.lang.Thread.run(Thread.java:748)
   [junit4]   2> 974526 WARN  (jetty-launcher-3606-thread-2-SendThread(127.0.0.1:39679)) [n:127.0.0.1:33559_solr    ] o.a.z.ClientCnxn Client session timed out, have not heard from server in 16037ms for sessionid 0x15ef5148cba0007
   [junit4]   2> 974526 WARN  (jetty-launcher-3606-thread-2-SendThread(127.0.0.1:39679)) [n:127.0.0.1:33559_solr    ] o.a.z.ClientCnxn Client session timed out, have not heard from server in 16071ms for sessionid 0x15ef5148cba0006
   [junit4]   2> 974529 WARN  (NIOServerCxn.Factory:0.0.0.0/0.0.0.0:0) [    ] o.a.z.s.NIOServerCnxn caught end of stream exception
   [junit4]   2> EndOfStreamException: Unable to read additional data from client sessionid 0x15ef5148cba0007, likely client has closed socket
   [junit4]   2> 	at org.apache.zookeeper.server.NIOServerCnxn.doIO(NIOServerCnxn.java:239)
   [junit4]   2> 	at org.apache.zookeeper.server.NIOServerCnxnFactory.run(NIOServerCnxnFactory.java:203)
   [junit4]   2> 	at java.lang.Thread.run(Thread.java:748)
   [junit4]   2> 974530 WARN  (NIOServerCxn.Factory:0.0.0.0/0.0.0.0:0) [    ] o.a.z.s.NIOServerCnxn caught end of stream exception
   [junit4]   2> EndOfStreamException: Unable to read additional data from client sessionid 0x15ef5148cba0006, likely client has closed socket
   [junit4]   2> 	at org.apache.zookeeper.server.NIOServerCnxn.doIO(NIOServerCnxn.java:239)
   [junit4]   2> 	at org.apache.zookeeper.server.NIOServerCnxnFactory.run(NIOServerCnxnFactory.java:203)
   [junit4]   2> 	at java.lang.Thread.run(Thread.java:748)
   [junit4]   2> 974531 WARN  (TEST-TestSolrCloudWithSecureImpersonation.testProxyWrongHost-seed#[AF3C106B69AC3C5B]) [    ] o.a.h.c.p.ResponseProcessCookies Invalid cookie header: "Set-Cookie: hadoop.auth="u=wrongHost&p=wrongHost&t=test&e=1507386324626&s=o5Wu57MIHA2twgw4H0rNhfCoVWM="; Path=/; Domain=127.0.0.1; Expires=sáb, 07-oct-2017 14:25:24 GMT; HttpOnly". Invalid 'expires' attribute: sáb, 07-oct-2017 14:25:24 GMT
   [junit4]   2> 974531 INFO  (TEST-TestSolrCloudWithSecureImpersonation.testProxyWrongHost-seed#[AF3C106B69AC3C5B]) [    ] o.a.s.SolrTestCaseJ4 ###Ending testProxyWrongHost
   [junit4]   2> 974546 INFO  (TEST-TestSolrCloudWithSecureImpersonation.testForwarding-seed#[AF3C106B69AC3C5B]) [    ] o.a.s.SolrTestCaseJ4 ###Starting testForwarding
   [junit4]   2> 974629 INFO  (jetty-launcher-3606-thread-2-EventThread) [n:127.0.0.1:33559_solr    ] o.a.c.f.s.ConnectionStateManager State change: SUSPENDED
   [junit4]   2> 974630 WARN  (zkCallback-3618-thread-1-processing-n:127.0.0.1:33559_solr) [n:127.0.0.1:33559_solr    ] o.a.s.c.c.ConnectionManager Watcher org.apache.solr.common.cloud.ConnectionManager@17082ff name: ZooKeeperConnection Watcher:127.0.0.1:39679/solr got event WatchedEvent state:Disconnected type:None path:null path: null type: None
   [junit4]   2> 974630 WARN  (zkCallback-3618-thread-1-processing-n:127.0.0.1:33559_solr) [n:127.0.0.1:33559_solr    ] o.a.s.c.c.ConnectionManager zkClient has disconnected
   [junit4]   2> 974725 INFO  (TEST-TestSolrCloudWithSecureImpersonation.testForwarding-seed#[AF3C106B69AC3C5B]) [    ] o.a.s.c.c.ZkStateReader Updated live nodes from ZooKeeper... (0) -> (2)
   [junit4]   2> 974725 INFO  (TEST-TestSolrCloudWithSecureImpersonation.testForwarding-seed#[AF3C106B69AC3C5B]) [    ] o.a.s.c.s.i.ZkClientClusterStateProvider Cluster at 127.0.0.1:39679/solr ready
   [junit4]   2> 974726 INFO  (qtp26470690-16441) [n:127.0.0.1:42603_solr    ] o.a.s.h.a.CollectionsHandler Invoked Collection Action :create with params pullReplicas=0&replicationFactor=1&collection.configName=conf1&maxShardsPerNode=1&name=forwardingCollection&nrtReplicas=1&action=CREATE&numShards=1&tlogReplicas=0&wt=javabin&version=2 and sendToOCPQueue=true
   [junit4]   2> 974732 INFO  (OverseerThreadFactory-4208-thread-1-processing-n:127.0.0.1:42603_solr) [n:127.0.0.1:42603_solr    ] o.a.s.c.CreateCollectionCmd Create collection forwardingCollection
   [junit4]   2> 974838 INFO  (OverseerStateUpdate-98785710457880581-127.0.0.1:42603_solr-n_0000000000) [n:127.0.0.1:42603_solr    ] o.a.s.c.o.SliceMutator createReplica() {
   [junit4]   2>   "operation":"ADDREPLICA",
   [junit4]   2>   "collection":"forwardingCollection",
   [junit4]   2>   "shard":"shard1",
   [junit4]   2>   "core":"forwardingCollection_shard1_replica_n1",
   [junit4]   2>   "state":"down",
   [junit4]   2>   "base_url":"http://127.0.0.1:33559/solr",
   [junit4]   2>   "type":"NRT"} 
   [junit4]   2> 975040 INFO  (qtp16565348-16451) [n:127.0.0.1:33559_solr    ] o.a.s.h.a.CoreAdminOperation core create command qt=/admin/cores&coreNodeName=core_node2&collection.configName=conf1&newCollection=true&name=forwardingCollection_shard1_replica_n1&action=CREATE&numShards=1&collection=forwardingCollection&shard=shard1&wt=javabin&version=2&replicaType=NRT
   [junit4]   2> 975041 INFO  (qtp16565348-16451) [n:127.0.0.1:33559_solr    ] o.a.s.c.TransientSolrCoreCacheDefault Allocating transient cache for 2147483647 transient cores
   [junit4]   2> 975982 INFO  (jetty-launcher-3606-thread-1-EventThread) [n:127.0.0.1:42603_solr    ] o.a.c.f.s.ConnectionStateManager State change: SUSPENDED
   [junit4]   2> 976595 INFO  (zkCallback-3618-thread-3-processing-n:127.0.0.1:33559_solr) [n:127.0.0.1:33559_solr    ] o.a.s.c.c.ZkStateReader A cluster state change: [WatchedEvent state:SyncConnected type:NodeDataChanged path:/collections/forwardingCollection/state.json] for collection [forwardingCollection] has occurred - updating... (live nodes size: [2])
   [junit4]   2> 976596 INFO  (zkCallback-3618-thread-5-processing-n:127.0.0.1:33559_solr) [n:127.0.0.1:33559_solr    ] o.a.s.c.c.ZkStateReader A cluster state change: [WatchedEvent state:SyncConnected type:NodeDataChanged path:/collections/forwardingCollection/state.json] for collection [forwardingCollection] has occurred - updating... (live nodes size: [2])
   [junit4]   2> 977504 INFO  (qtp16565348-16451) [n:127.0.0.1:33559_solr c:forwardingCollection s:shard1 r:core_node2 x:forwardingCollection_shard1_replica_n1] o.a.s.c.SolrConfig Using Lucene MatchVersion: 7.1.0
   [junit4]   2> 977519 INFO  (qtp16565348-16451) [n:127.0.0.1:33559_solr c:forwardingCollection s:shard1 r:core_node2 x:forwardingCollection_shard1_replica_n1] o.a.s.s.IndexSchema [forwardingCollection_shard1_replica_n1] Schema name=test
   [junit4]   2> 977615 INFO  (qtp16565348-16451) [n:127.0.0.1:33559_solr c:forwardingCollection s:shard1 r:core_node2 x:forwardingCollection_shard1_replica_n1] o.a.s.s.IndexSchema Loaded schema test/1.0 with uniqueid field id
   [junit4]   2> 977621 INFO  (qtp16565348-16451) [n:127.0.0.1:33559_solr c:forwardingCollection s:shard1 r:core_node2 x:forwardingCollection_shard1_replica_n1] o.a.s.c.CoreContainer Creating SolrCore 'forwardingCollection_shard1_replica_n1' using configuration from collection forwardingCollection, trusted=true
   [junit4]   2> 977622 INFO  (qtp16565348-16451) [n:127.0.0.1:33559_solr c:forwardingCollection s:shard1 r:core_node2 x:forwardingCollection_shard1_replica_n1] o.a.s.m.r.SolrJmxReporter JMX monitoring for 'solr_33559.solr.core.forwardingCollection.shard1.replica_n1' (registry 'solr.core.forwardingCollection.shard1.replica_n1') enabled at server: com.sun.jmx.mbeanserver.JmxMBeanServer@27c5e7
   [junit4]   2> 977622 INFO  (qtp16565348-16451) [n:127.0.0.1:33559_solr c:forwardingCollection s:shard1 r:core_node2 x:forwardingCollection_shard1_replica_n1] o.a.s.c.SolrCore solr.RecoveryStrategy.Builder
   [junit4]   2> 977622 INFO  (qtp16565348-16451) [n:127.0.0.1:33559_solr c:forwardingCollection s:shard1 r:core_node2 x:forwardingCollection_shard1_replica_n1] o.a.s.c.SolrCore [[forwardingCollection_shard1_replica_n1] ] Opening new SolrCore at [/home/jenkins/workspace/Lucene-Solr-7.x-Linux/solr/build/solr-core/test/J1/temp/solr.cloud.TestSolrCloudWithSecureImpersonation_AF3C106B69AC3C5B-001/tempDir-001/node2/forwardingCollection_shard1_replica_n1], dataDir=[/home/jenkins/workspace/Lucene-Solr-7.x-Linux/solr/build/solr-core/test/J1/temp/solr.cloud.TestSolrCloudWithSecureImpersonation_AF3C106B69AC3C5B-001/tempDir-001/node2/./forwardingCollection_shard1_replica_n1/data/]
   [junit4]   2> 977624 INFO  (qtp16565348-16451) [n:127.0.0.1:33559_solr c:forwardingCollection s:shard1 r:core_node2 x:forwardingCollection_shard1_replica_n1] o.a.s.u.RandomMergePolicy RandomMergePolicy wrapping class org.apache.lucene.index.TieredMergePolicy: [TieredMergePolicy: maxMergeAtOnce=36, maxMergeAtOnceExplicit=43, maxMergedSegmentMB=3.1220703125, floorSegmentMB=1.837890625, forceMergeDeletesPctAllowed=25.474994129685502, segmentsPerTier=26.0, maxCFSSegmentSizeMB=8.796093022207999E12, noCFSRatio=1.0
   [junit4]   2> 977665 INFO  (qtp16565348-16451) [n:127.0.0.1:33559_solr c:forwardingCollection s:shard1 r:core_node2 x:forwardingCollection_shard1_replica_n1] o.a.s.u.UpdateHandler Using UpdateLog implementation: org.apache.solr.update.UpdateLog
   [junit4]   2> 977665 INFO  (qtp16565348-16451) [n:127.0.0.1:33559_solr c:forwardingCollection s:shard1 r:core_node2 x:forwardingCollection_shard1_replica_n1] o.a.s.u.UpdateLog Initializing UpdateLog: dataDir= defaultSyncLevel=FLUSH numRecordsToKeep=100 maxNumLogsToKeep=10 numVersionBuckets=65536
   [junit4]   2> 977666 INFO  (qtp16565348-16451) [n:127.0.0.1:33559_solr c:forwardingCollection s:shard1 r:core_node2 x:forwardingCollection_shard1_replica_n1] o.a.s.u.CommitTracker Hard AutoCommit: disabled
   [junit4]   2> 977666 INFO  (qtp16565348-16451) [n:127.0.0.1:33559_solr c:forwardingCollection s:shard1 r:core_node2 x:forwardingCollection_shard1_replica_n1] o.a.s.u.CommitTracker Soft AutoCommit: disabled
   [junit4]   2> 977667 INFO  (qtp16565348-16451) [n:127.0.0.1:33559_solr c:forwardingCollection s:shard1 r:core_node2 x:forwardingCollection_shard1_replica_n1] o.a.s.u.RandomMergePolicy RandomMergePolicy wrapping class org.apache.lucene.index.LogDocMergePolicy: [LogDocMergePolicy: minMergeSize=1000, mergeFactor=27, maxMergeSize=9223372036854775807, maxMergeSizeForForcedMerge=9223372036854775807, calibrateSizeByDeletes=true, maxMergeDocs=2147483647, maxCFSSegmentSizeMB=8.796093022207999E12, noCFSRatio=0.4456344797816404]
   [junit4]   2> 977667 INFO  (qtp16565348-16451) [n:127.0.0.1:33559_solr c:forwardingCollection s:shard1 r:core_node2 x:forwardingCollection_shard1_replica_n1] o.a.s.s.SolrIndexSearcher Opening [Searcher@d6e9cc[forwardingCollection_shard1_replica_n1] main]
   [junit4]   2> 977668 INFO  (qtp16565348-16451) [n:127.0.0.1:33559_solr c:forwardingCollection s:shard1 r:core_node2 x:forwardingCollection_shard1_replica_n1] o.a.s.h.c.SpellCheckComponent Initializing spell checkers
   [junit4]   2> 977686 INFO  (qtp16565348-16451) [n:127.0.0.1:33559_solr c:forwardingCollection s:shard1 r:core_node2 x:forwardingCollection_shard1_replica_n1] o.a.s.s.DirectSolrSpellChecker init: {name=direct,classname=DirectSolrSpellChecker,field=lowerfilt,minQueryLength=3}
   [junit4]   2> 977753 INFO  (qtp16565348-16451) [n:127.0.0.1:33559_solr c:forwardingCollection s:shard1 r:core_node2 x:forwardingCollection_shard1_replica_n1] o.a.s.h.ReplicationHandler Commits will be reserved for 10000ms.
   [junit4]   2> 977753 INFO  (searcherExecutor-4213-thread-1-processing-n:127.0.0.1:33559_solr x:forwardingCollection_shard1_replica_n1 s:shard1 c:forwardingCollection r:core_node2) [n:127.0.0.1:33559_solr c:forwardingCollection s:shard1 r:core_node2 x:forwardingCollection_shard1_replica_n1] o.a.s.h.c.SpellCheckComponent Loading spell index for spellchecker: default
   [junit4]   2> 977753 INFO  (qtp16565348-16451) [n:127.0.0.1:33559_solr c:forwardingCollection s:shard1 r:core_node2 x:forwardingCollection_shard1_replica_n1] o.a.s.u.UpdateLog Could not find max version in index or recent updates, using new clock 1580571387891810304
   [junit4]   2> 977753 INFO  (searcherExecutor-4213-thread-1-processing-n:127.0.0.1:33559_solr x:forwardingCollection_shard1_replica_n1 s:shard1 c:forwardingCollection r:core_node2) [n:127.0.0.1:33559_solr c:forwardingCollection s:shard1 r:core_node2 x:forwardingCollection_shard1_replica_n1] o.a.s.h.c.SpellCheckComponent Loading spell index for spellchecker: direct
   [junit4]   2> 977753 INFO  (searcherExecutor-4213-thread-1-processing-n:127.0.0.1:33559_solr x:forwardingCollection_shard1_replica_n1 s:shard1 c:forwardingCollection r:core_node2) [n:127.0.0.1:33559_solr c:forwardingCollection s:shard1 r:core_node2 x:forwardingCollection_shard1_replica_n1] o.a.s.h.c.SpellCheckComponent Loading spell index for spellchecker: wordbreak
   [junit4]   2> 977753 INFO  (searcherExecutor-4213-thread-1-processing-n:127.0.0.1:33559_solr x:forwardingCollection_shard1_replica_n1 s:shard1 c:forwardingCollection r:core_node2) [n:127.0.0.1:33559_solr c:forwardingCollection s:shard1 r:core_node2 x:forwardingCollection_shard1_replica_n1] o.a.s.h.c.SpellCheckComponent Loading spell index for spellchecker: multipleFields
   [junit4]   2> 977753 INFO  (searcherExecutor-4213-thread-1-processing-n:127.0.0.1:33559_solr x:forwardingCollection_shard1_replica_n1 s:shard1 c:forwardingCollection r:core_node2) [n:127.0.0.1:33559_solr c:forwardingCollection s:shard1 r:core_node2 x:forwardingCollection_shard1_replica_n1] o.a.s.h.c.SpellCheckComponent Loading spell index for spellchecker: jarowinkler
   [junit4]   2> 977754 INFO  (searcherExecutor-4213-thread-1-processing-n:127.0.0.1:33559_solr x:forwardingCollection_shard1_replica_n1 s:shard1 c:forwardingCollection r:core_node2) [n:127.0.0.1:33559_solr c:forwardingCollection s:shard1 r:core_node2 x:forwardingCollection_shard1_replica_n1] o.a.s.h.c.SpellCheckComponent Loading spell index for spellchecker: external
   [junit4]   2> 977754 INFO  (searcherExecutor-4213-thread-1-processing-n:127.0.0.1:33559_solr x:forwardingCollection_shard1_replica_n1 s:shard1 c:forwardingCollection r:core_node2) [n:127.0.0.1:33559_solr c:forwardingCollection s:shard1 r:core_node2 x:forwardingCollection_shard1_replica_n1] o.a.s.h.c.SpellCheckComponent Loading spell index for spellchecker: freq
   [junit4]   2> 977754 INFO  (searcherExecutor-4213-thread-1-processing-n:127.0.0.1:33559_solr x:forwardingCollection_shard1_replica_n1 s:shard1 c:forwardingCollection r:core_node2) [n:127.0.0.1:33559_solr c:forwardingCollection s:shard1 r:core_node2 x:forwardingCollection_shard1_replica_n1] o.a.s.h.c.SpellCheckComponent Loading spell index for spellchecker: fqcn
   [junit4]   2> 977754 INFO  (searcherExecutor-4213-thread-1-processing-n:127.0.0.1:33559_solr x:forwardingCollection_shard1_replica_n1 s:shard1 c:forwardingCollection r:core_node2) [n:127.0.0.1:33559_solr c:forwardingCollection s:shard1 r:core_node2 x:forwardingCollection_shard1_replica_n1] o.a.s.h.c.SpellCheckComponent Loading spell index for spellchecker: perDict
   [junit4]   2> 977755 INFO  (searcherExecutor-4213-thread-1-processing-n:127.0.0.1:33559_solr x:forwardingCollection_shard1_replica_n1 s:shard1 c:forwardingCollection r:core_node2) [n:127.0.0.1:33559_solr c:forwardingCollection s:shard1 r:core_node2 x:forwardingCollection_shard1_replica_n1] o.a.s.c.SolrCore [forwardingCollection_shard1_replica_n1] Registered new searcher Searcher@d6e9cc[forwardingCollection_shard1_replica_n1] main{ExitableDirectoryReader(UninvertingDirectoryReader())}
   [junit4]   2> 977756 INFO  (qtp16565348-16451) [n:127.0.0.1:33559_solr c:forwardingCollection s:shard1 r:core_node2 x:forwardingCollection_shard1_replica_n1] o.a.s.c.ShardLeaderElectionContext Enough replicas found to continue.
   [junit4]   2> 977756 INFO  (qtp16565348-16451) [n:127.0.0.1:33559_solr c:forwardingCollection s:shard1 r:core_node2 x:forwardingCollection_shard1_replica_n1] o.a.s.c.ShardLeaderElectionContext I may be the new leader - try and sync
   [junit4]   2> 977756 INFO  (qtp16565348-16451) [n:127.0.0.1:33559_solr c:forwardingCollection s:shard1 r:core_node2 x:forwardingCollection_shard1_replica_n1] o.a.s.c.SyncStrategy Sync replicas to http://127.0.0.1:33559/solr/forwardingCollection_shard1_replica_n1/
   [junit4]   2> 977756 INFO  (qtp16565348-16451) [n:127.0.0.1:33559_solr c:forwardingCollection s:shard1 r:core_node2 x:forwardingCollection_shard1_replica_n1] o.a.s.c.SyncStrategy Sync Success - now sync replicas to me
   [junit4]   2> 977756 INFO  (qtp16565348-16451) [n:127.0.0.1:33559_solr c:forwardingCollection s:shard1 r:core_node2 x:forwardingCollection_shard1_replica_n1] o.a.s.c.SyncStrategy http://127.0.0.1:33559/solr/forwardingCollection_shard1_replica_n1/ has no replicas
   [junit4]   2> 977756 INFO  (qtp16565348-16451) [n:127.0.0.1:33559_solr c:forwardingCollection s:shard1 r:core_node2 x:forwardingCollection_shard1_replica_n1] o.a.s.c.ShardLeaderElectionContext Found all replicas participating in election, clear LIR
   [junit4]   2> 977757 INFO  (qtp16565348-16451) [n:127.0.0.1:33559_solr c:forwardingCollection s:shard1 r:core_node2 x:forwardingCollection_shard1_replica_n1] o.a.s.c.ShardLeaderElectionContext I am the new leader: http://127.0.0.1:33559/solr/forwardingCollection_shard1_replica_n1/ shard1
   [junit4]   2> 977861 INFO  (zkCallback-3618-thread-3-processing-n:127.0.0.1:33559_solr) [n:127.0.0.1:33559_solr    ] o.a.s.c.c.ZkStateReader A cluster state change: [WatchedEvent state:SyncConnected type:NodeDataChanged path:/collections/forwardingCollection/state.json] for collection [forwardingCollection] has occurred - updating... (live nodes size: [2])
   [junit4]   2> 977861 INFO  (zkCallback-3618-thread-5-processing-n:127.0.0.1:33559_solr) [n:127.0.0.1:33559_solr    ] o.a.s.c.c.ZkStateReader A cluster state change: [WatchedEvent state:SyncConnected type:NodeDataChanged path:/collections/forwardingCollection/state.json] for collection [forwardingCollection] has occurred - updating... (live nodes size: [2])
   [junit4]   2> 977907 INFO  (qtp16565348-16451) [n:127.0.0.1:33559_solr c:forwardingCollection s:shard1 r:core_node2 x:forwardingCollection_shard1_replica_n1] o.a.s.c.ZkController I am the leader, no recovery necessary
   [junit4]   2> 977908 INFO  (qtp16565348-16451) [n:127.0.0.1:33559_solr c:forwardingCollection s:shard1 r:core_node2 x:forwardingCollection_shard1_replica_n1] o.a.s.s.HttpSolrCall [admin] webapp=null path=/admin/cores params={qt=/admin/cores&coreNodeName=core_node2&collection.configName=conf1&newCollection=true&name=forwardingCollection_shard1_replica_n1&action=CREATE&numShards=1&collection=forwardingCollection&shard=shard1&wt=javabin&version=2&replicaType=NRT} status=0 QTime=2867
   [junit4]   2> 977909 WARN  (httpShardExecutor-4202-thread-1-processing-n:127.0.0.1:42603_solr [http:////127.0.0.1:33559//solr] http:////127.0.0.1:33559//solr) [n:127.0.0.1:42603_solr    ] o.a.h.c.p.ResponseProcessCookies Invalid cookie header: "Set-Cookie: hadoop.auth="u=$&p=$&t=test&e=1507386335166&s=z9vp1nH0gc9lTXVMricT5xsfa1c="; Path=/; Domain=127.0.0.1; Expires=sáb, 07-oct-2017 14:25:35 GMT; HttpOnly". Invalid 'expires' attribute: sáb, 07-oct-2017 14:25:35 GMT
   [junit4]   2> 977910 INFO  (qtp26470690-16441) [n:127.0.0.1:42603_solr    ] o.a.s.h.a.CollectionsHandler Wait for new collection to be active for at most 30 seconds. Check all shard replicas
   [junit4]   2> 978010 INFO  (zkCallback-3618-thread-5-processing-n:127.0.0.1:33559_solr) [n:127.0.0.1:33559_solr    ] o.a.s.c.c.ZkStateReader A cluster state change: [WatchedEvent state:SyncConnected type:NodeDataChanged path:/collections/forwardingCollection/state.json] for collection [forwardingCollection] has occurred - updating... (live nodes size: [2])
   [junit4]   2> 978010 INFO  (zkCallback-3618-thread-3-processing-n:127.0.0.1:33559_solr) [n:127.0.0.1:33559_solr    ] o.a.s.c.c.ZkStateReader A cluster state change: [WatchedEvent state:SyncConnected type:NodeDataChanged path:/collections/forwardingCollection/state.json] for collection [forwardingCollection] has occurred - updating... (live nodes size: [2])
   [junit4]   2> 978734 INFO  (OverseerCollectionConfigSetProcessor-98785710457880581-127.0.0.1:42603_solr-n_0000000000) [n:127.0.0.1:42603_solr    ] o.a.s.c.OverseerTaskQueue Response ZK path: /overseer/collection-queue-work/qnr-0000000000 doesn't exist.  Requestor may have disconnected from ZooKeeper
   [junit4]   2> 978917 INFO  (qtp26470690-16441) [n:127.0.0.1:42603_solr    ] o.a.s.s.HttpSolrCall [admin] webapp=null path=/admin/collections params={pullReplicas=0&replicationFactor=1&collection.configName=conf1&maxShardsPerNode=1&name=forwardingCollection&nrtReplicas=1&action=CREATE&numShards=1&tlogReplicas=0&wt=javabin&version=2} status=0 QTime=4190
   [junit4]   2> 978917 WARN  (TEST-TestSolrCloudWithSecureImpersonation.testForwarding-seed#[AF3C106B69AC3C5B]) [    ] o.a.h.c.p.ResponseProcessCookies Invalid cookie header: "Set-Cookie: hadoop.auth="u=user&p=user&t=test&e=1507386334852&s=Kcz9OqRG+7t0WqTyOxJ6hRFF/5I="; Path=/; Domain=127.0.0.1; Expires=sáb, 07-oct-2017 14:25:34 GMT; HttpOnly". Invalid 'expires' attribute: sáb, 07-oct-2017 14:25:34 GMT
   [junit4]   2> 978917 INFO  (TEST-TestSolrCloudWithSecureImpersonation.testForwarding-seed#[AF3C106B69AC3C5B]) [    ] o.a.s.c.AbstractDistribZkTestBase Wait for recoveries to finish - collection: forwardingCollection failOnTimeout:true timeout (sec):100
   [junit4]   2> 978917 INFO  (TEST-TestSolrCloudWithSecureImpersonation.testForwarding-seed#[AF3C106B69AC3C5B]) [    ] o.a.s.c.AbstractDistribZkTestBase Recoveries finished - collection: forwardingCollection
   [junit4]   2> 978930 INFO  (qtp16565348-16446) [n:127.0.0.1:33559_solr c:forwardingCollection s:shard1 r:core_node2 x:forwardingCollection_shard1_replica_n1] o.a.s.c.S.Request [forwardingCollection_shard1_replica_n1]  webapp=/solr path=/select params={q=*:*&wt=javabin&version=2} hits=0 status=0 QTime=0
   [junit4]   2> 978930 WARN  (TEST-TestSolrCloudWithSecureImpersonation.testForwarding-seed#[AF3C106B69AC3C5B]) [    ] o.a.h.c.p.ResponseProcessCookies Invalid cookie header: "Set-Cookie: hadoop.auth="u=user&p=user&t=test&e=1507386339055&s=uLguiE9Mgl+DpVUS3/z5y2mQRN8="; Path=/; Domain=127.0.0.1; Expires=sáb, 07-oct-2017 14:25:39 GMT; HttpOnly". Invalid 'expires' attribute: sáb, 07-oct-2017 14:25:39 GMT
   [junit4]   2> 978939 INFO  (qtp26470690-16436) [n:127.0.0.1:42603_solr    ] o.a.s.c.TransientSolrCoreCacheDefault Allocating transient cache for 2147483647 transient cores
   [junit4]   2> 978941 INFO  (qtp16565348-16451) [n:127.0.0.1:33559_solr c:forwardingCollection s:shard1 r:core_node2 x:forwardingCollection_shard1_replica_n1] o.a.s.c.S.Request [forwardingCollection_shard1_replica_n1]  webapp=/solr path=/select params={q=*:*&wt=javabin&version=2} hits=0 status=0 QTime=0
   [junit4]   2> 978942 WARN  (qtp26470690-16436) [n:127.0.0.1:42603_solr    ] o.a.h.c.p.ResponseProcessCookies Invalid cookie header: "Set-Cookie: hadoop.auth="u=$&p=$&t=test&e=1507386339066&s=hRbPa4wvCnKnuyr8WNJ/nVx0E5A="; Path=/; Domain=127.0.0.1; Expires=sáb, 07-oct-2017 14:25:39 GMT; HttpOnly". Invalid 'expires' attribute: sáb, 07-oct-2017 14:25:39 GMT
   [junit4]   2> 978942 WARN  (TEST-TestSolrCloudWithSecureImpersonation.testForwarding-seed#[AF3C106B69AC3C5B]) [    ] o.a.h.c.p.ResponseProcessCookies Invalid cookie header: "Set-Cookie: hadoop.auth="u=user&p=user&t=test&e=1507386339063&s=kmCi4lYVnw8WDJOA2WWa1OdY1To="; Path=/; Domain=127.0.0.1; Expires=sáb, 07-oct-2017 14:25:39 GMT; HttpOnly". Invalid 'expires' attribute: sáb, 07-oct-2017 14:25:39 GMT
   [junit4]   2> 978942 WARN  (TEST-TestSolrCloudWithSecureImpersonation.testForwarding-seed#[AF3C106B69AC3C5B]) [    ] o.a.h.c.p.ResponseProcessCookies Invalid cookie header: "Set-Cookie: hadoop.auth="u=$&p=$&t=test&e=1507386339066&s=hRbPa4wvCnKnuyr8WNJ/nVx0E5A="; Path=/; Domain=127.0.0.1; Expires=sáb, 07-oct-2017 14:25:39 GMT; HttpOnly". Invalid 'expires' attribute: sáb, 07-oct-2017 14:25:39 GMT
   [junit4]   2> 978942 INFO  (TEST-TestSolrCloudWithSecureImpersonation.testForwarding-seed#[AF3C106B69AC3C5B]) [    ] o.a.s.SolrTestCaseJ4 ###Ending testForwarding
   [junit4]   2> 978972 INFO  (jetty-closer-3607-thread-2) [    ] o.e.j.s.AbstractConnector Stopped ServerConnector@2407ae{HTTP/1.1,[http/1.1]}{127.0.0.1:0}
   [junit4]   2> 978973 INFO  (jetty-closer-3607-thread-2) [    ] o.a.s.c.CoreContainer Shutting down CoreContainer instance=13719332
   [junit4]   2> 978984 INFO  (jetty-closer-3607-thread-2) [    ] o.a.s.m.SolrMetricManager Closing metric reporters for registry=solr.node, tag=null
   [junit4]   2> 978984 INFO  (jetty-closer-3607-thread-2) [    ] o.a.s.m.r.SolrJmxReporter Closing reporter [org.apache.solr.metrics.reporters.SolrJmxReporter@17f57b3: rootName = solr_42603, domain = solr.node, service url = null, agent id = null] for registry solr.node / com.codahale.metrics.MetricRegistry@9e9fb1
   [junit4]   2> 978984 INFO  (jetty-closer-3607-thread-1) [    ] o.e.j.s.AbstractConnector Stopped ServerConnector@2f845a{HTTP/1.1,[http/1.1]}{127.0.0.1:0}
   [junit4]   2> 978985 INFO  (jetty-closer-3607-thread-1) [    ] o.a.s.c.CoreContainer Shutting down CoreContainer instance=30740422
   [junit4]   2> 978985 INFO  (jetty-closer-3607-thread-1) [    ] o.a.s.m.SolrMetricManager Closing metric reporters for registry=solr.node, tag=null
   [junit4]   2> 978985 INFO  (jetty-closer-3607-thread-1) [    ] o.a.s.m.r.SolrJmxReporter Closing reporter [org.apache.solr.metrics.reporters.SolrJmxReporter@13fc78e: rootName = solr_33559, domain = solr.node, service url = null, agent id = null] for registry solr.node / com.codahale.metrics.MetricRegistry@1335f51
   [junit4]   2> 978990 INFO  (jetty-closer-3607-thread-2) [    ] o.a.s.m.SolrMetricManager Closing metric reporters for registry=solr.jvm, tag=null
   [junit4]   2> 978990 INFO  (jetty-closer-3607-thread-2) [    ] o.a.s.m.r.SolrJmxReporter Closing reporter [org.apache.solr.metrics.reporters.SolrJmxReporter@1d0810d: rootName = solr_42603, domain = solr.jvm, service url = null, agent id = null] for registry solr.jvm / com.codahale.metrics.MetricRegistry@1afa6e0
   [junit4]   2> 978990 INFO  (jetty-closer-3607-thread-1) [    ] o.a.s.m.SolrMetricManager Closing metric reporters for registry=solr.jvm, tag=null
   [junit4]   2> 978990 INFO  (jetty-closer-3607-thread-1) [    ] o.a.s.m.r.SolrJmxReporter Closing reporter [org.apache.solr.metrics.reporters.SolrJmxReporter@1784dde: rootName = solr_33559, domain = solr.jvm, service url = null, agent id = null] for registry solr.jvm / com.codahale.metrics.MetricRegistry@1afa6e0
   [junit4]   2> 978994 INFO  (jetty-closer-3607-thread-1) [    ] o.a.s.m.SolrMetricManager Closing metric reporters for registry=solr.jetty, tag=null
   [junit4]   2> 978994 INFO  (jetty-closer-3607-thread-1) [    ] o.a.s.m.r.SolrJmxReporter Closing reporter [org.apache.solr.metrics.reporters.SolrJmxReporter@a587eb: rootName = solr_33559, domain = solr.jetty, service url = null, agent id = null] for registry solr.jetty / com.codahale.metrics.MetricRegistry@cb02d3
   [junit4]   2> 978995 INFO  (jetty-closer-3607-thread-2) [    ] o.a.s.m.SolrMetricManager Closing metric reporters for registry=solr.jetty, tag=null
   [junit4]   2> 978995 INFO  (jetty-closer-3607-thread-2) [    ] o.a.s.m.r.SolrJmxReporter Closing reporter [org.apache.solr.metrics.reporters.SolrJmxReporter@1af7448: rootName = solr_42603, domain = solr.jetty, service url = null, agent id = null] for registry solr.jetty / com.codahale.metrics.MetricRegistry@cb02d3
   [junit4]   2> 978996 INFO  (jetty-closer-3607-thread-2) [    ] o.a.s.m.SolrMetricManager Closing metric reporters for registry=solr.cluster, tag=null
   [junit4]   2> 978997 INFO  (jetty-closer-3607-thread-1) [    ] o.a.s.m.SolrMetricManager Closing metric reporters for registry=solr.cluster, tag=null
   [junit4]   2> 978999 INFO  (jetty-closer-3607-thread-2) [    ] o.a.s.c.Overseer Overseer (id=98785710457880581-127.0.0.1:42603_solr-n_0000000000) closing
   [junit4]   2> 978999 INFO  (OverseerStateUpdate-98785710457880581-127.0.0.1:42603_solr-n_0000000000) [n:127.0.0.1:42603_solr    ] o.a.s.c.Overseer Overseer Loop exiting : 127.0.0.1:42603_solr
   [junit4]   2> 979016 INFO  (coreCloseExecutor-4219-thread-1) [n:127.0.0.1:33559_solr c:forwardingCollection s:shard1 r:core_node2 x:forwardingCollection_shard1_replica_n1] o.a.s.c.SolrCore [forwardingCollection_shard1_replica_n1]  CLOSING SolrCore org.apache.solr.core.SolrCore@173b6e7
   [junit4]   2> 979016 INFO  (coreCloseExecutor-4219-thread-1) [n:127.0.0.1:33559_solr c:forwardingCollection s:shard1 r:core_node2 x:forwardingCollection_shard1_replica_n1] o.a.s.m.SolrMetricManager Closing metric reporters for registry=solr.core.forwardingCollection.shard1.replica_n1, tag=24360679
   [junit4]   2> 979016 INFO  (coreCloseExecutor-4219-thread-1) [n:127.0.0.1:33559_solr c:forwardingCollection s:shard1 r:core_node2 x:forwardingCollection_shard1_replica_n1] o.a.s.m.r.SolrJmxReporter Closing reporter [org.apache.solr.metrics.reporters.SolrJmxReporter@11f87f1: rootName = solr_33559, domain = solr.core.forwardingCollection.shard1.replica_n1, service url = null, agent id = null] for registry solr.core.forwardingCollection.shard1.replica_n1 / com.codahale.metrics.MetricRegistry@2023c4
   [junit4]   2> 979019 INFO  (zkCallback-3618-thread-3-processing-n:127.0.0.1:33559_solr) [n:127.0.0.1:33559_solr    ] o.a.s.c.OverseerElectionContext I am going to be the leader 127.0.0.1:33559_solr
   [junit4]   2> 979019 INFO  (zkCallback-3618-thread-5-processing-n:127.0.0.1:33559_solr) [n:127.0.0.1:33559_solr    ] o.a.s.c.c.ZkStateReader Updated live nodes from ZooKeeper... (2) -> (1)
   [junit4]   2> 979026 INFO  (coreCloseExecutor-4219-thread-1) [n:127.0.0.1:33559_solr c:forwardingCollection s:shard1 r:core_node2 x:forwardingCollection_shard1_replica_n1] o.a.s.m.SolrMetricManager Closing metric reporters for registry=solr.collection.forwardingCollection.shard1.leader, tag=24360679
   [junit4]   2> 980517 WARN  (zkCallback-3617-thread-2-processing-n:127.0.0.1:42603_solr) [n:127.0.0.1:42603_solr    ] o.a.s.c.c.ZkStateReader ZooKeeper watch triggered, but Solr cannot talk to ZK: [KeeperErrorCode = Session expired for /live_nodes]
   [junit4]   2> 980517 ERROR (Thread[Thread-2257,5,TGRP-TestSolrCloudWithSecureImpersonation]) [n:127.0.0.1:42603_solr    ] o.a.h.s.t.d.AbstractDelegationTokenSecretManager ExpiredTokenRemover received java.lang.InterruptedException: sleep interrupted
   [junit4]   2> 980520 INFO  (jetty-closer-3607-thread-2) [    ] o.e.j.s.h.ContextHandler Stopped o.e.j.s.ServletContextHandler@1c059e3{/solr,null,UNAVAILABLE}
   [junit4]   2> 980541 WARN  (zkCallback-3618-thread-3-processing-n:127.0.0.1:33559_solr) [n:127.0.0.1:33559_solr    ] o.a.s.c.c.ZkStateReader ZooKeeper watch triggered, but Solr cannot talk to ZK: [KeeperErrorCode = Session expired for /live_nodes]
   [junit4]   2> 980541 ERROR (Thread[Thread-2254,5,TGRP-TestSolrCloudWithSecureImpersonation]) [n:127.0.0.1:33559_solr    ] o.a.h.s.t.d.AbstractDelegationTokenSecretManager ExpiredTokenRemover received java.lang.InterruptedException: sleep interrupted
   [junit4]   2> 980542 INFO  (jetty-closer-3607-thread-1) [    ] o.e.j.s.h.ContextHandler Stopped o.e.j.s.ServletContextHandler@f19442{/solr,null,UNAVAILABLE}
   [junit4]   2> 980543 ERROR (SUITE-TestSolrCloudWithSecureImpersonation-seed#[AF3C106B69AC3C5B]-worker) [    ] o.a.z.s.ZooKeeperServer ZKShutdownHandler is not registered, so ZooKeeper server won't take any action on ERROR or SHUTDOWN server state changes
   [junit4]   2> 980544 INFO  (SUITE-TestSolrCloudWithSecureImpersonation-seed#[AF3C106B69AC3C5B]-worker) [    ] o.a.s.c.ZkTestServer connecting to 127.0.0.1:39679 39679
   [junit4]   2> 985593 INFO  (Thread-2237) [    ] o.a.s.c.ZkTestServer connecting to 127.0.0.1:39679 39679
   [junit4]   2> 985593 WARN  (Thread-2237) [    ] o.a.s.c.ZkTestServer Watch limit violations: 
   [junit4]   2> Maximum concurrent create/delete watches above limit:
   [junit4]   2> 
   [junit4]   2> 	3	/solr/aliases.json
   [junit4]   2> 	3	/solr/clusterprops.json
   [junit4]   2> 	2	/solr/security.json
   [junit4]   2> 
   [junit4]   2> Maximum concurrent data watches above limit:
   [junit4]   2> 
   [junit4]   2> 	5	/solr/collections/forwardingCollection/state.json
   [junit4]   2> 	3	/solr/security/zkdtsm/ZKDTSMRoot/ZKDTSMKeyIdRoot
   [junit4]   2> 	3	/solr/clusterstate.json
   [junit4]   2> 	3	/solr/security/zkdtsm/ZKDTSMRoot/ZKDTSMSeqNumRoot
   [junit4]   2> 	2	/solr/security/zkdtsm/ZKDTSMRoot/ZKDTSMMasterKeyRoot/DK_1
   [junit4]   2> 	2	/solr/security/zkdtsm/ZKDTSMRoot/ZKDTSMMasterKeyRoot/DK_3
   [junit4]   2> 	2	/solr/security/zkdtsm/ZKDTSMRoot/ZKDTSMMasterKeyRoot/DK_2
   [junit4]   2> 	2	/solr/security/zkdtsm/ZKDTSMRoot/ZKDTSMMasterKeyRoot/DK_4
   [junit4]   2> 
   [junit4]   2> Maximum concurrent children watches above limit:
   [junit4]   2> 
   [junit4]   2> 	4	/solr/security/zkdtsm/ZKDTSMRoot/ZKDTSMMasterKeyRoot
   [junit4]   2> 	3	/solr/live_nodes
   [junit4]   2> 	3	/solr/collections
   [junit4]   2> 	3	/solr/security/zkdtsm/ZKDTSMRoot/ZKDTSMTokensRoot
   [junit4]   2> 
   [junit4]   2> 985604 INFO  (SUITE-TestSolrCloudWithSecureImpersonation-seed#[AF3C106B69AC3C5B]-worker) [    ] o.a.s.SolrTestCaseJ4 ------------------------------------------------------- Done waiting for tracked resources to be released
   [junit4]   2> Oct 07, 2017 4:25:45 AM com.carrotsearch.randomizedtesting.ThreadLeakControl checkThreadLeaks
   [junit4]   2> WARNING: Will linger awaiting termination of 2 leaked thread(s).
   [junit4]   2> 1004638 ERROR (jetty-launcher-3606-thread-2-EventThread) [n:127.0.0.1:33559_solr    ] o.a.c.f.i.CuratorFrameworkImpl Watcher exception
   [junit4]   2> java.lang.IllegalStateException: Client is not started
   [junit4]   2> 	at com.google.common.base.Preconditions.checkState(Preconditions.java:149)
   [junit4]   2> 	at org.apache.curator.CuratorZookeeperClient.getZooKeeper(CuratorZookeeperClient.java:113)
   [junit4]   2> 	at org.apache.curator.framework.imps.CuratorFrameworkImpl.getZooKeeper(CuratorFrameworkImpl.java:477)
   [junit4]   2> 	at org.apache.curator.framework.imps.NamespaceFacade.getZooKeeper(NamespaceFacade.java:112)
   [junit4]   2> 	at org.apache.curator.framework.imps.GetDataBuilderImpl$4.call(GetDataBuilderImpl.java:302)
   [junit4]   2> 	at org.apache.curator.framework.imps.GetDataBuilderImpl$4.call(GetDataBuilderImpl.java:291)
   [junit4]   2> 	at org.apache.curator.RetryLoop.callWithRetry(RetryLoop.java:107)
   [junit4]   2> 	at org.apache.curator.framework.imps.GetDataBuilderImpl.pathInForeground(GetDataBuilderImpl.java:288)
   [junit4]   2> 	at org.apache.curator.framework.imps.GetDataBuilderImpl.forPath(GetDataBuilderImpl.java:279)
   [junit4]   2> 	at org.apache.curator.framework.imps.GetDataBuilderImpl.forPath(GetDataBuilderImpl.java:41)
   [junit4]   2> 	at org.apache.curator.framework.recipes.shared.SharedValue.readValue(SharedValue.java:244)
   [junit4]   2> 	at org.apache.curator.framework.recipes.shared.SharedValue.access$100(SharedValue.java:44)
   [junit4]   2> 	at org.apache.curator.framework.recipes.shared.SharedValue$1.process(SharedValue.java:61)
   [junit4]   2> 	at org.apache.curator.framework.imps.NamespaceWatcher.process(NamespaceWatcher.java:67)
   [junit4]   2> 	at org.apache.zookeeper.ClientCnxn$EventThread.processEvent(ClientCnxn.java:530)
   [junit4]   2> 	at org.apache.zookeeper.ClientCnxn$EventThread.run(ClientCnxn.java:505)
   [junit4]   2> Oct 07, 2017 4:26:05 AM com.carrotsearch.randomizedtesting.ThreadLeakControl checkThreadLeaks
   [junit4]   2> SEVERE: 1 thread leaked from SUITE scope at org.apache.solr.cloud.TestSolrCloudWithSecureImpersonation: 
   [junit4]   2>    1) Thread[id=16492, name=jetty-launcher-3606-thread-1-EventThread, state=TIMED_WAITING, group=TGRP-TestSolrCloudWithSecureImpersonation]
   [junit4]   2>         at sun.misc.Unsafe.park(Native Method)
   [junit4]   2>         at java.util.concurrent.locks.LockSupport.parkNanos(LockSupport.java:215)
   [junit4]   2>         at java.util.concurrent.locks.AbstractQueuedSynchronizer.doAcquireSharedNanos(AbstractQueuedSynchronizer.java:1037)
   [junit4]   2>         at java.util.concurrent.locks.AbstractQueuedSynchronizer.tryAcquireSharedNanos(AbstractQueuedSynchronizer.java:1328)
   [junit4]   2>         at java.util.concurrent.CountDownLatch.await(CountDownLatch.java:277)
   [junit4]   2>         at org.apache.curator.CuratorZookeeperClient.internalBlockUntilConnectedOrTimedOut(CuratorZookeeperClient.java:323)
   [junit4]   2>         at org.apache.curator.RetryLoop.callWithRetry(RetryLoop.java:105)
   [junit4]   2>         at org.apache.curator.framework.imps.GetDataBuilderImpl.pathInForeground(GetDataBuilderImpl.java:288)
   [junit4]   2>         at org.apache.curator.framework.imps.GetDataBuilderImpl.forPath(GetDataBuilderImpl.java:279)
   [junit4]   2>         at org.apache.curator.framework.imps.GetDataBuilderImpl.forPath(GetDataBuilderImpl.java:41)
   [junit4]   2>         at org.apache.curator.framework.recipes.shared.SharedValue.readValue(SharedValue.java:244)
   [junit4]   2>         at org.apache.curator.framework.recipes.shared.SharedValue.access$100(SharedValue.java:44)
   [junit4]   2>         at org.apache.curator.framework.recipes.shared.SharedValue$1.process(SharedValue.java:61)
   [junit4]   2>         at org.apache.curator.framework.imps.NamespaceWatcher.process(NamespaceWatcher.java:67)
   [junit4]   2>         at org.apache.zookeeper.ClientCnxn$EventThread.processEvent(ClientCnxn.java:530)
   [junit4]   2>         at org.apache.zookeeper.ClientCnxn$EventThread.run(ClientCnxn.java:505)
   [junit4]   2> Oct 07, 2017 4:26:05 AM com.carrotsearch.randomizedtesting.ThreadLeakControl tryToInterruptAll
   [junit4]   2> INFO: Starting to interrupt leaked threads:
   [junit4]   2>    1) Thread[id=16492, name=jetty-launcher-3606-thread-1-EventThread, state=TIMED_WAITING, group=TGRP-TestSolrCloudWithSecureImpersonation]
   [junit4]   2> 1005705 ERROR (jetty-launcher-3606-thread-1-EventThread) [n:127.0.0.1:42603_solr    ] o.a.c.f.i.CuratorFrameworkImpl Watcher exception
   [junit4]   2> java.lang.InterruptedException
   [junit4]   2> 	at java.util.concurrent.locks.AbstractQueuedSynchronizer.doAcquireSharedNanos(AbstractQueuedSynchronizer.java:1039)
   [junit4]   2> 	at java.util.concurrent.locks.AbstractQueuedSynchronizer.tryAcquireSharedNanos(AbstractQueuedSynchronizer.java:1328)
   [junit4]   2> 	at java.util.concurrent.CountDownLatch.await(CountDownLatch.java:277)
   [junit4]   2> 	at org.apache.curator.CuratorZookeeperClient.internalBlockUntilConnectedOrTimedOut(CuratorZookeeperClient.java:323)
   [junit4]   2> 	at org.apache.curator.RetryLoop.callWithRetry(RetryLoop.java:105)
   [junit4]   2> 	at org.apache.curator.framework.imps.GetDataBuilderImpl.pathInForeground(GetDataBuilderImpl.java:288)
   [junit4]   2> 	at org.apache.curator.framework.imps.GetDataBuilderImpl.forPath(GetDataBuilderImpl.java:279)
   [junit4]   2> 	at org.apache.curator.framework.imps.GetDataBuilderImpl.forPath(GetDataBuilderImpl.java:41)
   [junit4]   2> 	at org.apache.curator.framework.recipes.shared.SharedValue.readValue(SharedValue.java:244)
   [junit4]   2> 	at org.apache.curator.framework.recipes.shared.SharedValue.access$100(SharedValue.java:44)
   [junit4]   2> 	at org.apache.curator.framework.recipes.shared.SharedValue$1.process(SharedValue.java:61)
   [junit4]   2> 	at org.apache.curator.framework.imps.NamespaceWatcher.process(NamespaceWatcher.java:67)
   [junit4]   2> 	at org.apache.zookeeper.ClientCnxn$EventThread.processEvent(ClientCnxn.java:530)
   [junit4]   2> 	at org.apache.zookeeper.ClientCnxn$EventThread.run(ClientCnxn.java:505)
   [junit4]   2> Oct 07, 2017 4:26:05 AM com.carrotsearch.randomizedtesting.ThreadLeakControl tryToInterruptAll
   [junit4]   2> INFO: All leaked threads terminated.
   [junit4]   2> NOTE: test params are: codec=Lucene70, sim=RandomSimilarity(queryNorm=false): {}, locale=es-UY, timezone=Europe/Jersey
   [junit4]   2> NOTE: Linux 4.10.0-33-generic i386/Oracle Corporation 1.8.0_144 (32-bit)/cpus=8,threads=1,free=65594128,total=355004416
   [junit4]   2> NOTE: All tests run in this JVM: [BasicFunctionalityTest, ConfigSetsAPITest, TestCloudPivotFacet, TestCloudDeleteByQuery, CachingDirectoryFactoryTest, TestManagedSynonymFilterFactory, QueryResultKeyTest, CdcrVersionReplicationTest, DistributedDebugComponentTest, HdfsChaosMonkeyNothingIsSafeTest, ConvertedLegacyTest, TestPartialUpdateDeduplication, TestRTGBase, DistributedIntervalFacetingTest, TestDocTermOrds, CacheHeaderTest, AliasIntegrationTest, PrimUtilsTest, TestEmbeddedSolrServerAdminHandler, DistributedFacetPivotLargeTest, TestPushWriter, TestConfigSetsAPIZkFailure, TestAddFieldRealTimeGet, MoveReplicaTest, TestLegacyTerms, TestFieldTypeCollectionResource, LeaderInitiatedRecoveryOnCommitTest, TestNRTOpen, DOMUtilTest, TestJettySolrRunner, TestHashPartitioner, ResourceLoaderTest, SpatialFilterTest, TestDefaultStatsCache, TestZkAclsWithHadoopAuth, HdfsNNFailoverTest, TestStressLiveNodes, TestSearchPerf, TestSolrCloudSnapshots, SpellCheckComponentTest, TestPivotHelperCode, CdcrReplicationDistributedZkTest, TestPolicyCloud, AddSchemaFieldsUpdateProcessorFactoryTest, StressHdfsTest, StatelessScriptUpdateProcessorFactoryTest, TestLRUCache, TestPostingsSolrHighlighter, ParsingFieldUpdateProcessorsTest, ConjunctionSolrSpellCheckerTest, TestStandardQParsers, HLLUtilTest, TestSweetSpotSimilarityFactory, TestConfigSetImmutable, TestStressRecovery, TestDistribDocBasedVersion, RestartWhileUpdatingTest, TestSchemaResource, TestRestoreCore, InfixSuggestersTest, TestScoreJoinQPScore, MissingSegmentRecoveryTest, LukeRequestHandlerTest, TestSolrConfigHandlerCloud, TestCloudSearcherWarming, TestSortByMinMaxFunction, HdfsTlogReplayBufferedWhileIndexingTest, ChaosMonkeySafeLeaderTest, SolrShardReporterTest, TestComplexPhraseQParserPlugin, TestGeoJSONResponseWriter, TestHighFrequencyDictionaryFactory, SchemaVersionSpecificBehaviorTest, TestCursorMarkWithoutUniqueKey, TestSegmentSorting, TestSubQueryTransformer, ZkStateWriterTest, CSVRequestHandlerTest, PeerSyncWithIndexFingerprintCachingTest, BlockJoinFacetRandomTest, HighlighterTest, TestSolr4Spatial2, ZkSolrClientTest, SolrCmdDistributorTest, DistributedTermsComponentTest, DisMaxRequestHandlerTest, TestSolrIndexConfig, TestFuzzyAnalyzedSuggestions, TestMacros, TestCollectionAPIs, TestCharFilters, TestDistributedGrouping, TestNumericRangeQuery64, SampleTest, SolrMetricManagerTest, ClusterStateUpdateTest, TestOverriddenPrefixQueryForCustomFieldType, CoreAdminRequestStatusTest, TestFieldCacheSort, TestStressVersions, MergeStrategyTest, MetricsHandlerTest, OverseerModifyCollectionTest, TestFiltering, TestInPlaceUpdatesStandalone, TestFieldCacheWithThreads, TestUseDocValuesAsStored, TestSolrJ, TestXIncludeConfig, DocValuesTest, ShardRoutingCustomTest, RemoteQueryErrorTest, DistributedQueryComponentOptimizationTest, UninvertDocValuesMergePolicyTest, VMParamsZkACLAndCredentialsProvidersTest, CollectionsAPIAsyncDistributedZkTest, TestValueSourceCache, SolrGangliaReporterTest, TestSolrCloudWithSecureImpersonation]
   [junit4]   2> NOTE: reproduce with: ant test  -Dtestcase=TestSolrCloudWithSecureImpersonation -Dtests.seed=AF3C106B69AC3C5B -Dtests.multiplier=3 -Dtests.slow=true -Dtests.locale=es-UY -Dtests.timezone=Europe/Jersey -Dtests.asserts=true -Dtests.file.encoding=UTF-8
   [junit4] ERROR   0.00s J1 | TestSolrCloudWithSecureImpersonation (suite) <<<
   [junit4]    > Throwable #1: com.carrotsearch.randomizedtesting.ThreadLeakError: 1 thread leaked from SUITE scope at org.apache.solr.cloud.TestSolrCloudWithSecureImpersonation: 
   [junit4]    >    1) Thread[id=16492, name=jetty-launcher-3606-thread-1-EventThread, state=TIMED_WAITING, group=TGRP-TestSolrCloudWithSecureImpersonation]
   [junit4]    >         at sun.misc.Unsafe.park(Native Method)
   [junit4]    >         at java.util.concurrent.locks.LockSupport.parkNanos(LockSupport.java:215)
   [junit4]    >         at java.util.concurrent.locks.AbstractQueuedSynchronizer.doAcquireSharedNanos(AbstractQueuedSynchronizer.java:1037)
   [junit4]    >         at java.util.concurrent.locks.AbstractQueuedSynchronizer.tryAcquireSharedNanos(AbstractQueuedSynchronizer.java:1328)
   [junit4]    >         at java.util.concurrent.CountDownLatch.await(CountDownLatch.java:277)
   [junit4]    >         at org.apache.curator.CuratorZookeeperClient.internalBlockUntilConnectedOrTimedOut(CuratorZookeeperClient.java:323)
   [junit4]    >         at org.apache.curator.RetryLoop.callWithRetry(RetryLoop.java:105)
   [junit4]    >         at org.apache.curator.framework.imps.GetDataBuilderImpl.pathInForeground(GetDataBuilderImpl.java:288)
   [junit4]    >         at org.apache.curator.framework.imps.GetDataBuilderImpl.forPath(GetDataBuilderImpl.java:279)
   [junit4]    >         at org.apache.curator.framework.imps.GetDataBuilderImpl.forPath(GetDataBuilderImpl.java:41)
   [junit4]    >         at org.apache.curator.framework.recipes.shared.SharedValue.readValue(SharedValue.java:244)
   [junit4]    >         at org.apache.curator.framework.recipes.shared.SharedValue.access$100(SharedValue.java:44)
   [junit4]    >         at org.apache.curator.framework.recipes.shared.SharedValue$1.process(SharedValue.java:61)
   [junit4]    >         at org.apache.curator.framework.imps.NamespaceWatcher.process(NamespaceWatcher.java:67)
   [junit4]    >         at org.apache.zookeeper.ClientCnxn$EventThread.processEvent(ClientCnxn.java:530)
   [junit4]    >         at org.apache.zookeeper.ClientCnxn$EventThread.run(ClientCnxn.java:505)
   [junit4]    > 	at __randomizedtesting.SeedInfo.seed([AF3C106B69AC3C5B]:0)
   [junit4] Completed [338/734 (1!)] on J1 in 47.59s, 12 tests, 1 error <<< FAILURES!

[...truncated 44008 lines...]

Mime
View raw message