lucene-dev mailing list archives

Site index · List index
Message view « Date » · « Thread »
Top « Date » · « Thread »
From Policeman Jenkins Server <jenk...@thetaphi.de>
Subject [JENKINS] Lucene-Solr-master-Solaris (64bit/jdk1.8.0) - Build # 1454 - Still Failing!
Date Wed, 04 Oct 2017 22:25:17 GMT
Build: https://jenkins.thetaphi.de/job/Lucene-Solr-master-Solaris/1454/
Java: 64bit/jdk1.8.0 -XX:-UseCompressedOops -XX:+UseG1GC

6 tests failed.
FAILED:  org.apache.solr.cloud.CdcrBootstrapTest.testConvertClusterToCdcrAndBootstrap

Error Message:
java.util.concurrent.TimeoutException: Could not connect to ZooKeeper 127.0.0.1:42976 within 30000 ms

Stack Trace:
org.apache.solr.common.SolrException: java.util.concurrent.TimeoutException: Could not connect to ZooKeeper 127.0.0.1:42976 within 30000 ms
	at __randomizedtesting.SeedInfo.seed([AE584CE27515D63E:798F6395C14A4E79]:0)
	at org.apache.solr.common.cloud.SolrZkClient.<init>(SolrZkClient.java:183)
	at org.apache.solr.common.cloud.SolrZkClient.<init>(SolrZkClient.java:117)
	at org.apache.solr.common.cloud.SolrZkClient.<init>(SolrZkClient.java:112)
	at org.apache.solr.common.cloud.SolrZkClient.<init>(SolrZkClient.java:99)
	at org.apache.solr.cloud.MiniSolrCloudCluster.<init>(MiniSolrCloudCluster.java:232)
	at org.apache.solr.cloud.MiniSolrCloudCluster.<init>(MiniSolrCloudCluster.java:195)
	at org.apache.solr.cloud.MiniSolrCloudCluster.<init>(MiniSolrCloudCluster.java:122)
	at org.apache.solr.cloud.CdcrBootstrapTest.testConvertClusterToCdcrAndBootstrap(CdcrBootstrapTest.java:61)
	at sun.reflect.NativeMethodAccessorImpl.invoke0(Native Method)
	at sun.reflect.NativeMethodAccessorImpl.invoke(NativeMethodAccessorImpl.java:62)
	at sun.reflect.DelegatingMethodAccessorImpl.invoke(DelegatingMethodAccessorImpl.java:43)
	at java.lang.reflect.Method.invoke(Method.java:498)
	at com.carrotsearch.randomizedtesting.RandomizedRunner.invoke(RandomizedRunner.java:1737)
	at com.carrotsearch.randomizedtesting.RandomizedRunner$8.evaluate(RandomizedRunner.java:934)
	at com.carrotsearch.randomizedtesting.RandomizedRunner$9.evaluate(RandomizedRunner.java:970)
	at com.carrotsearch.randomizedtesting.RandomizedRunner$10.evaluate(RandomizedRunner.java:984)
	at com.carrotsearch.randomizedtesting.rules.SystemPropertiesRestoreRule$1.evaluate(SystemPropertiesRestoreRule.java:57)
	at org.apache.lucene.util.TestRuleSetupTeardownChained$1.evaluate(TestRuleSetupTeardownChained.java:49)
	at org.apache.lucene.util.AbstractBeforeAfterRule$1.evaluate(AbstractBeforeAfterRule.java:45)
	at org.apache.lucene.util.TestRuleThreadAndTestName$1.evaluate(TestRuleThreadAndTestName.java:48)
	at org.apache.lucene.util.TestRuleIgnoreAfterMaxFailures$1.evaluate(TestRuleIgnoreAfterMaxFailures.java:64)
	at org.apache.lucene.util.TestRuleMarkFailure$1.evaluate(TestRuleMarkFailure.java:47)
	at com.carrotsearch.randomizedtesting.rules.StatementAdapter.evaluate(StatementAdapter.java:36)
	at com.carrotsearch.randomizedtesting.ThreadLeakControl$StatementRunner.run(ThreadLeakControl.java:368)
	at com.carrotsearch.randomizedtesting.ThreadLeakControl.forkTimeoutingTask(ThreadLeakControl.java:817)
	at com.carrotsearch.randomizedtesting.ThreadLeakControl$3.evaluate(ThreadLeakControl.java:468)
	at com.carrotsearch.randomizedtesting.RandomizedRunner.runSingleTest(RandomizedRunner.java:943)
	at com.carrotsearch.randomizedtesting.RandomizedRunner$5.evaluate(RandomizedRunner.java:829)
	at com.carrotsearch.randomizedtesting.RandomizedRunner$6.evaluate(RandomizedRunner.java:879)
	at com.carrotsearch.randomizedtesting.RandomizedRunner$7.evaluate(RandomizedRunner.java:890)
	at com.carrotsearch.randomizedtesting.rules.StatementAdapter.evaluate(StatementAdapter.java:36)
	at com.carrotsearch.randomizedtesting.rules.SystemPropertiesRestoreRule$1.evaluate(SystemPropertiesRestoreRule.java:57)
	at org.apache.lucene.util.AbstractBeforeAfterRule$1.evaluate(AbstractBeforeAfterRule.java:45)
	at com.carrotsearch.randomizedtesting.rules.StatementAdapter.evaluate(StatementAdapter.java:36)
	at org.apache.lucene.util.TestRuleStoreClassName$1.evaluate(TestRuleStoreClassName.java:41)
	at com.carrotsearch.randomizedtesting.rules.NoShadowingOrOverridesOnMethodsRule$1.evaluate(NoShadowingOrOverridesOnMethodsRule.java:40)
	at com.carrotsearch.randomizedtesting.rules.NoShadowingOrOverridesOnMethodsRule$1.evaluate(NoShadowingOrOverridesOnMethodsRule.java:40)
	at com.carrotsearch.randomizedtesting.rules.StatementAdapter.evaluate(StatementAdapter.java:36)
	at com.carrotsearch.randomizedtesting.rules.StatementAdapter.evaluate(StatementAdapter.java:36)
	at com.carrotsearch.randomizedtesting.rules.StatementAdapter.evaluate(StatementAdapter.java:36)
	at org.apache.lucene.util.TestRuleAssertionsRequired$1.evaluate(TestRuleAssertionsRequired.java:53)
	at org.apache.lucene.util.TestRuleMarkFailure$1.evaluate(TestRuleMarkFailure.java:47)
	at org.apache.lucene.util.TestRuleIgnoreAfterMaxFailures$1.evaluate(TestRuleIgnoreAfterMaxFailures.java:64)
	at org.apache.lucene.util.TestRuleIgnoreTestSuites$1.evaluate(TestRuleIgnoreTestSuites.java:54)
	at com.carrotsearch.randomizedtesting.rules.StatementAdapter.evaluate(StatementAdapter.java:36)
	at com.carrotsearch.randomizedtesting.ThreadLeakControl$StatementRunner.run(ThreadLeakControl.java:368)
	at java.lang.Thread.run(Thread.java:748)
Caused by: java.util.concurrent.TimeoutException: Could not connect to ZooKeeper 127.0.0.1:42976 within 30000 ms
	at org.apache.solr.common.cloud.ConnectionManager.waitForConnected(ConnectionManager.java:233)
	at org.apache.solr.common.cloud.SolrZkClient.<init>(SolrZkClient.java:175)
	... 46 more


FAILED:  junit.framework.TestSuite.org.apache.solr.cloud.CdcrBootstrapTest

Error Message:
4 threads leaked from SUITE scope at org.apache.solr.cloud.CdcrBootstrapTest:     1) Thread[id=27281, name=Thread-6704, state=WAITING, group=TGRP-CdcrBootstrapTest]         at java.lang.Object.wait(Native Method)         at java.lang.Thread.join(Thread.java:1252)         at java.lang.Thread.join(Thread.java:1326)         at org.apache.zookeeper.server.NIOServerCnxnFactory.join(NIOServerCnxnFactory.java:297)         at org.apache.solr.cloud.ZkTestServer$ZKServerMain.runFromConfig(ZkTestServer.java:309)         at org.apache.solr.cloud.ZkTestServer$2.run(ZkTestServer.java:490)    2) Thread[id=27285, name=ProcessThread(sid:0 cport:42976):, state=WAITING, group=TGRP-CdcrBootstrapTest]         at sun.misc.Unsafe.park(Native Method)         at java.util.concurrent.locks.LockSupport.park(LockSupport.java:175)         at java.util.concurrent.locks.AbstractQueuedSynchronizer$ConditionObject.await(AbstractQueuedSynchronizer.java:2039)         at java.util.concurrent.LinkedBlockingQueue.take(LinkedBlockingQueue.java:442)         at org.apache.zookeeper.server.PrepRequestProcessor.run(PrepRequestProcessor.java:122)    3) Thread[id=27282, name=NIOServerCxn.Factory:0.0.0.0/0.0.0.0:0, state=RUNNABLE, group=TGRP-CdcrBootstrapTest]         at sun.nio.ch.DevPollArrayWrapper.poll0(Native Method)         at sun.nio.ch.DevPollArrayWrapper.poll(DevPollArrayWrapper.java:223)         at sun.nio.ch.DevPollSelectorImpl.doSelect(DevPollSelectorImpl.java:98)         at sun.nio.ch.SelectorImpl.lockAndDoSelect(SelectorImpl.java:86)         at sun.nio.ch.SelectorImpl.select(SelectorImpl.java:97)         at org.apache.zookeeper.server.NIOServerCnxnFactory.run(NIOServerCnxnFactory.java:173)         at java.lang.Thread.run(Thread.java:748)    4) Thread[id=27283, name=SessionTracker, state=TIMED_WAITING, group=TGRP-CdcrBootstrapTest]         at java.lang.Object.wait(Native Method)         at org.apache.zookeeper.server.SessionTrackerImpl.run(SessionTrackerImpl.java:146)

Stack Trace:
com.carrotsearch.randomizedtesting.ThreadLeakError: 4 threads leaked from SUITE scope at org.apache.solr.cloud.CdcrBootstrapTest: 
   1) Thread[id=27281, name=Thread-6704, state=WAITING, group=TGRP-CdcrBootstrapTest]
        at java.lang.Object.wait(Native Method)
        at java.lang.Thread.join(Thread.java:1252)
        at java.lang.Thread.join(Thread.java:1326)
        at org.apache.zookeeper.server.NIOServerCnxnFactory.join(NIOServerCnxnFactory.java:297)
        at org.apache.solr.cloud.ZkTestServer$ZKServerMain.runFromConfig(ZkTestServer.java:309)
        at org.apache.solr.cloud.ZkTestServer$2.run(ZkTestServer.java:490)
   2) Thread[id=27285, name=ProcessThread(sid:0 cport:42976):, state=WAITING, group=TGRP-CdcrBootstrapTest]
        at sun.misc.Unsafe.park(Native Method)
        at java.util.concurrent.locks.LockSupport.park(LockSupport.java:175)
        at java.util.concurrent.locks.AbstractQueuedSynchronizer$ConditionObject.await(AbstractQueuedSynchronizer.java:2039)
        at java.util.concurrent.LinkedBlockingQueue.take(LinkedBlockingQueue.java:442)
        at org.apache.zookeeper.server.PrepRequestProcessor.run(PrepRequestProcessor.java:122)
   3) Thread[id=27282, name=NIOServerCxn.Factory:0.0.0.0/0.0.0.0:0, state=RUNNABLE, group=TGRP-CdcrBootstrapTest]
        at sun.nio.ch.DevPollArrayWrapper.poll0(Native Method)
        at sun.nio.ch.DevPollArrayWrapper.poll(DevPollArrayWrapper.java:223)
        at sun.nio.ch.DevPollSelectorImpl.doSelect(DevPollSelectorImpl.java:98)
        at sun.nio.ch.SelectorImpl.lockAndDoSelect(SelectorImpl.java:86)
        at sun.nio.ch.SelectorImpl.select(SelectorImpl.java:97)
        at org.apache.zookeeper.server.NIOServerCnxnFactory.run(NIOServerCnxnFactory.java:173)
        at java.lang.Thread.run(Thread.java:748)
   4) Thread[id=27283, name=SessionTracker, state=TIMED_WAITING, group=TGRP-CdcrBootstrapTest]
        at java.lang.Object.wait(Native Method)
        at org.apache.zookeeper.server.SessionTrackerImpl.run(SessionTrackerImpl.java:146)
	at __randomizedtesting.SeedInfo.seed([AE584CE27515D63E]:0)


FAILED:  junit.framework.TestSuite.org.apache.solr.cloud.CdcrBootstrapTest

Error Message:
There are still zombie threads that couldn't be terminated:    1) Thread[id=27282, name=NIOServerCxn.Factory:0.0.0.0/0.0.0.0:0, state=RUNNABLE, group=TGRP-CdcrBootstrapTest]         at sun.nio.ch.IOUtil.drain(Native Method)         at sun.nio.ch.DevPollSelectorImpl.doSelect(DevPollSelectorImpl.java:109)         at sun.nio.ch.SelectorImpl.lockAndDoSelect(SelectorImpl.java:86)         at sun.nio.ch.SelectorImpl.select(SelectorImpl.java:97)         at org.apache.zookeeper.server.NIOServerCnxnFactory.run(NIOServerCnxnFactory.java:173)         at java.lang.Thread.run(Thread.java:748)

Stack Trace:
com.carrotsearch.randomizedtesting.ThreadLeakError: There are still zombie threads that couldn't be terminated:
   1) Thread[id=27282, name=NIOServerCxn.Factory:0.0.0.0/0.0.0.0:0, state=RUNNABLE, group=TGRP-CdcrBootstrapTest]
        at sun.nio.ch.IOUtil.drain(Native Method)
        at sun.nio.ch.DevPollSelectorImpl.doSelect(DevPollSelectorImpl.java:109)
        at sun.nio.ch.SelectorImpl.lockAndDoSelect(SelectorImpl.java:86)
        at sun.nio.ch.SelectorImpl.select(SelectorImpl.java:97)
        at org.apache.zookeeper.server.NIOServerCnxnFactory.run(NIOServerCnxnFactory.java:173)
        at java.lang.Thread.run(Thread.java:748)
	at __randomizedtesting.SeedInfo.seed([AE584CE27515D63E]:0)


FAILED:  junit.framework.TestSuite.org.apache.solr.cloud.TestSolrCloudWithSecureImpersonation

Error Message:
2 threads leaked from SUITE scope at org.apache.solr.cloud.TestSolrCloudWithSecureImpersonation:     1) Thread[id=22317, name=jetty-launcher-4213-thread-2-EventThread, state=TIMED_WAITING, group=TGRP-TestSolrCloudWithSecureImpersonation]         at sun.misc.Unsafe.park(Native Method)         at java.util.concurrent.locks.LockSupport.parkNanos(LockSupport.java:215)         at java.util.concurrent.locks.AbstractQueuedSynchronizer.doAcquireSharedNanos(AbstractQueuedSynchronizer.java:1037)         at java.util.concurrent.locks.AbstractQueuedSynchronizer.tryAcquireSharedNanos(AbstractQueuedSynchronizer.java:1328)         at java.util.concurrent.CountDownLatch.await(CountDownLatch.java:277)         at org.apache.curator.CuratorZookeeperClient.internalBlockUntilConnectedOrTimedOut(CuratorZookeeperClient.java:323)         at org.apache.curator.RetryLoop.callWithRetry(RetryLoop.java:105)         at org.apache.curator.framework.imps.GetDataBuilderImpl.pathInForeground(GetDataBuilderImpl.java:288)         at org.apache.curator.framework.imps.GetDataBuilderImpl.forPath(GetDataBuilderImpl.java:279)         at org.apache.curator.framework.imps.GetDataBuilderImpl.forPath(GetDataBuilderImpl.java:41)         at org.apache.curator.framework.recipes.shared.SharedValue.readValue(SharedValue.java:244)         at org.apache.curator.framework.recipes.shared.SharedValue.access$100(SharedValue.java:44)         at org.apache.curator.framework.recipes.shared.SharedValue$1.process(SharedValue.java:61)         at org.apache.curator.framework.imps.NamespaceWatcher.process(NamespaceWatcher.java:67)         at org.apache.zookeeper.ClientCnxn$EventThread.processEvent(ClientCnxn.java:530)         at org.apache.zookeeper.ClientCnxn$EventThread.run(ClientCnxn.java:505)    2) Thread[id=22318, name=jetty-launcher-4213-thread-1-EventThread, state=TIMED_WAITING, group=TGRP-TestSolrCloudWithSecureImpersonation]         at sun.misc.Unsafe.park(Native Method)         at java.util.concurrent.locks.LockSupport.parkNanos(LockSupport.java:215)         at java.util.concurrent.locks.AbstractQueuedSynchronizer.doAcquireSharedNanos(AbstractQueuedSynchronizer.java:1037)         at java.util.concurrent.locks.AbstractQueuedSynchronizer.tryAcquireSharedNanos(AbstractQueuedSynchronizer.java:1328)         at java.util.concurrent.CountDownLatch.await(CountDownLatch.java:277)         at org.apache.curator.CuratorZookeeperClient.internalBlockUntilConnectedOrTimedOut(CuratorZookeeperClient.java:323)         at org.apache.curator.RetryLoop.callWithRetry(RetryLoop.java:105)         at org.apache.curator.framework.imps.GetDataBuilderImpl.pathInForeground(GetDataBuilderImpl.java:288)         at org.apache.curator.framework.imps.GetDataBuilderImpl.forPath(GetDataBuilderImpl.java:279)         at org.apache.curator.framework.imps.GetDataBuilderImpl.forPath(GetDataBuilderImpl.java:41)         at org.apache.curator.framework.recipes.shared.SharedValue.readValue(SharedValue.java:244)         at org.apache.curator.framework.recipes.shared.SharedValue.access$100(SharedValue.java:44)         at org.apache.curator.framework.recipes.shared.SharedValue$1.process(SharedValue.java:61)         at org.apache.curator.framework.imps.NamespaceWatcher.process(NamespaceWatcher.java:67)         at org.apache.zookeeper.ClientCnxn$EventThread.processEvent(ClientCnxn.java:530)         at org.apache.zookeeper.ClientCnxn$EventThread.run(ClientCnxn.java:505)

Stack Trace:
com.carrotsearch.randomizedtesting.ThreadLeakError: 2 threads leaked from SUITE scope at org.apache.solr.cloud.TestSolrCloudWithSecureImpersonation: 
   1) Thread[id=22317, name=jetty-launcher-4213-thread-2-EventThread, state=TIMED_WAITING, group=TGRP-TestSolrCloudWithSecureImpersonation]
        at sun.misc.Unsafe.park(Native Method)
        at java.util.concurrent.locks.LockSupport.parkNanos(LockSupport.java:215)
        at java.util.concurrent.locks.AbstractQueuedSynchronizer.doAcquireSharedNanos(AbstractQueuedSynchronizer.java:1037)
        at java.util.concurrent.locks.AbstractQueuedSynchronizer.tryAcquireSharedNanos(AbstractQueuedSynchronizer.java:1328)
        at java.util.concurrent.CountDownLatch.await(CountDownLatch.java:277)
        at org.apache.curator.CuratorZookeeperClient.internalBlockUntilConnectedOrTimedOut(CuratorZookeeperClient.java:323)
        at org.apache.curator.RetryLoop.callWithRetry(RetryLoop.java:105)
        at org.apache.curator.framework.imps.GetDataBuilderImpl.pathInForeground(GetDataBuilderImpl.java:288)
        at org.apache.curator.framework.imps.GetDataBuilderImpl.forPath(GetDataBuilderImpl.java:279)
        at org.apache.curator.framework.imps.GetDataBuilderImpl.forPath(GetDataBuilderImpl.java:41)
        at org.apache.curator.framework.recipes.shared.SharedValue.readValue(SharedValue.java:244)
        at org.apache.curator.framework.recipes.shared.SharedValue.access$100(SharedValue.java:44)
        at org.apache.curator.framework.recipes.shared.SharedValue$1.process(SharedValue.java:61)
        at org.apache.curator.framework.imps.NamespaceWatcher.process(NamespaceWatcher.java:67)
        at org.apache.zookeeper.ClientCnxn$EventThread.processEvent(ClientCnxn.java:530)
        at org.apache.zookeeper.ClientCnxn$EventThread.run(ClientCnxn.java:505)
   2) Thread[id=22318, name=jetty-launcher-4213-thread-1-EventThread, state=TIMED_WAITING, group=TGRP-TestSolrCloudWithSecureImpersonation]
        at sun.misc.Unsafe.park(Native Method)
        at java.util.concurrent.locks.LockSupport.parkNanos(LockSupport.java:215)
        at java.util.concurrent.locks.AbstractQueuedSynchronizer.doAcquireSharedNanos(AbstractQueuedSynchronizer.java:1037)
        at java.util.concurrent.locks.AbstractQueuedSynchronizer.tryAcquireSharedNanos(AbstractQueuedSynchronizer.java:1328)
        at java.util.concurrent.CountDownLatch.await(CountDownLatch.java:277)
        at org.apache.curator.CuratorZookeeperClient.internalBlockUntilConnectedOrTimedOut(CuratorZookeeperClient.java:323)
        at org.apache.curator.RetryLoop.callWithRetry(RetryLoop.java:105)
        at org.apache.curator.framework.imps.GetDataBuilderImpl.pathInForeground(GetDataBuilderImpl.java:288)
        at org.apache.curator.framework.imps.GetDataBuilderImpl.forPath(GetDataBuilderImpl.java:279)
        at org.apache.curator.framework.imps.GetDataBuilderImpl.forPath(GetDataBuilderImpl.java:41)
        at org.apache.curator.framework.recipes.shared.SharedValue.readValue(SharedValue.java:244)
        at org.apache.curator.framework.recipes.shared.SharedValue.access$100(SharedValue.java:44)
        at org.apache.curator.framework.recipes.shared.SharedValue$1.process(SharedValue.java:61)
        at org.apache.curator.framework.imps.NamespaceWatcher.process(NamespaceWatcher.java:67)
        at org.apache.zookeeper.ClientCnxn$EventThread.processEvent(ClientCnxn.java:530)
        at org.apache.zookeeper.ClientCnxn$EventThread.run(ClientCnxn.java:505)
	at __randomizedtesting.SeedInfo.seed([AE584CE27515D63E]:0)


FAILED:  org.apache.solr.handler.TestReplicationHandler.doTestIndexAndConfigReplication

Error Message:
Index: 0, Size: 0

Stack Trace:
java.lang.IndexOutOfBoundsException: Index: 0, Size: 0
	at __randomizedtesting.SeedInfo.seed([AE584CE27515D63E:BA1017B756126B20]:0)
	at java.util.ArrayList.rangeCheck(ArrayList.java:653)
	at java.util.ArrayList.get(ArrayList.java:429)
	at org.apache.solr.handler.TestReplicationHandler.doTestIndexAndConfigReplication(TestReplicationHandler.java:561)
	at sun.reflect.NativeMethodAccessorImpl.invoke0(Native Method)
	at sun.reflect.NativeMethodAccessorImpl.invoke(NativeMethodAccessorImpl.java:62)
	at sun.reflect.DelegatingMethodAccessorImpl.invoke(DelegatingMethodAccessorImpl.java:43)
	at java.lang.reflect.Method.invoke(Method.java:498)
	at com.carrotsearch.randomizedtesting.RandomizedRunner.invoke(RandomizedRunner.java:1737)
	at com.carrotsearch.randomizedtesting.RandomizedRunner$8.evaluate(RandomizedRunner.java:934)
	at com.carrotsearch.randomizedtesting.RandomizedRunner$9.evaluate(RandomizedRunner.java:970)
	at com.carrotsearch.randomizedtesting.RandomizedRunner$10.evaluate(RandomizedRunner.java:984)
	at com.carrotsearch.randomizedtesting.rules.SystemPropertiesRestoreRule$1.evaluate(SystemPropertiesRestoreRule.java:57)
	at org.apache.lucene.util.TestRuleSetupTeardownChained$1.evaluate(TestRuleSetupTeardownChained.java:49)
	at org.apache.lucene.util.AbstractBeforeAfterRule$1.evaluate(AbstractBeforeAfterRule.java:45)
	at org.apache.lucene.util.TestRuleThreadAndTestName$1.evaluate(TestRuleThreadAndTestName.java:48)
	at org.apache.lucene.util.TestRuleIgnoreAfterMaxFailures$1.evaluate(TestRuleIgnoreAfterMaxFailures.java:64)
	at org.apache.lucene.util.TestRuleMarkFailure$1.evaluate(TestRuleMarkFailure.java:47)
	at com.carrotsearch.randomizedtesting.rules.StatementAdapter.evaluate(StatementAdapter.java:36)
	at com.carrotsearch.randomizedtesting.ThreadLeakControl$StatementRunner.run(ThreadLeakControl.java:368)
	at com.carrotsearch.randomizedtesting.ThreadLeakControl.forkTimeoutingTask(ThreadLeakControl.java:817)
	at com.carrotsearch.randomizedtesting.ThreadLeakControl$3.evaluate(ThreadLeakControl.java:468)
	at com.carrotsearch.randomizedtesting.RandomizedRunner.runSingleTest(RandomizedRunner.java:943)
	at com.carrotsearch.randomizedtesting.RandomizedRunner$5.evaluate(RandomizedRunner.java:829)
	at com.carrotsearch.randomizedtesting.RandomizedRunner$6.evaluate(RandomizedRunner.java:879)
	at com.carrotsearch.randomizedtesting.RandomizedRunner$7.evaluate(RandomizedRunner.java:890)
	at com.carrotsearch.randomizedtesting.rules.StatementAdapter.evaluate(StatementAdapter.java:36)
	at com.carrotsearch.randomizedtesting.rules.SystemPropertiesRestoreRule$1.evaluate(SystemPropertiesRestoreRule.java:57)
	at org.apache.lucene.util.AbstractBeforeAfterRule$1.evaluate(AbstractBeforeAfterRule.java:45)
	at com.carrotsearch.randomizedtesting.rules.StatementAdapter.evaluate(StatementAdapter.java:36)
	at org.apache.lucene.util.TestRuleStoreClassName$1.evaluate(TestRuleStoreClassName.java:41)
	at com.carrotsearch.randomizedtesting.rules.NoShadowingOrOverridesOnMethodsRule$1.evaluate(NoShadowingOrOverridesOnMethodsRule.java:40)
	at com.carrotsearch.randomizedtesting.rules.NoShadowingOrOverridesOnMethodsRule$1.evaluate(NoShadowingOrOverridesOnMethodsRule.java:40)
	at com.carrotsearch.randomizedtesting.rules.StatementAdapter.evaluate(StatementAdapter.java:36)
	at com.carrotsearch.randomizedtesting.rules.StatementAdapter.evaluate(StatementAdapter.java:36)
	at com.carrotsearch.randomizedtesting.rules.StatementAdapter.evaluate(StatementAdapter.java:36)
	at org.apache.lucene.util.TestRuleAssertionsRequired$1.evaluate(TestRuleAssertionsRequired.java:53)
	at org.apache.lucene.util.TestRuleMarkFailure$1.evaluate(TestRuleMarkFailure.java:47)
	at org.apache.lucene.util.TestRuleIgnoreAfterMaxFailures$1.evaluate(TestRuleIgnoreAfterMaxFailures.java:64)
	at org.apache.lucene.util.TestRuleIgnoreTestSuites$1.evaluate(TestRuleIgnoreTestSuites.java:54)
	at com.carrotsearch.randomizedtesting.rules.StatementAdapter.evaluate(StatementAdapter.java:36)
	at com.carrotsearch.randomizedtesting.ThreadLeakControl$StatementRunner.run(ThreadLeakControl.java:368)
	at java.lang.Thread.run(Thread.java:748)


FAILED:  org.apache.solr.cloud.TestLeaderElectionZkExpiry.testLeaderElectionWithZkExpiry

Error Message:
Captured an uncaught exception in thread: Thread[id=18440, name=OverseerAutoScalingTriggerThread-98772829996646402-dummy.host.com:8984_solr-n_0000000000, state=RUNNABLE, group=Overseer autoscaling triggers]

Stack Trace:
com.carrotsearch.randomizedtesting.UncaughtExceptionError: Captured an uncaught exception in thread: Thread[id=18440, name=OverseerAutoScalingTriggerThread-98772829996646402-dummy.host.com:8984_solr-n_0000000000, state=RUNNABLE, group=Overseer autoscaling triggers]
	at __randomizedtesting.SeedInfo.seed([AE584CE27515D63E:78876DB84308C5A6]:0)
Caused by: org.apache.solr.common.SolrException: org.apache.zookeeper.KeeperException$SessionExpiredException: KeeperErrorCode = Session expired for /autoscaling/events/.auto_add_replicas
	at __randomizedtesting.SeedInfo.seed([AE584CE27515D63E]:0)
	at org.apache.solr.cloud.ZkDistributedQueue.<init>(ZkDistributedQueue.java:107)
	at org.apache.solr.cloud.autoscaling.TriggerEventQueue.<init>(TriggerEventQueue.java:44)
	at org.apache.solr.cloud.autoscaling.ScheduledTriggers$ScheduledTrigger.<init>(ScheduledTriggers.java:398)
	at org.apache.solr.cloud.autoscaling.ScheduledTriggers.add(ScheduledTriggers.java:149)
	at org.apache.solr.cloud.autoscaling.OverseerTriggerThread.run(OverseerTriggerThread.java:220)
	at java.lang.Thread.run(Thread.java:748)
Caused by: org.apache.zookeeper.KeeperException$SessionExpiredException: KeeperErrorCode = Session expired for /autoscaling/events/.auto_add_replicas
	at org.apache.zookeeper.KeeperException.create(KeeperException.java:127)
	at org.apache.zookeeper.KeeperException.create(KeeperException.java:51)
	at org.apache.zookeeper.ZooKeeper.exists(ZooKeeper.java:1102)
	at org.apache.solr.common.cloud.SolrZkClient$5.execute(SolrZkClient.java:323)
	at org.apache.solr.common.cloud.SolrZkClient$5.execute(SolrZkClient.java:320)
	at org.apache.solr.common.cloud.ZkCmdExecutor.retryOperation(ZkCmdExecutor.java:60)
	at org.apache.solr.common.cloud.SolrZkClient.exists(SolrZkClient.java:320)
	at org.apache.solr.common.cloud.ZkCmdExecutor.ensureExists(ZkCmdExecutor.java:93)
	at org.apache.solr.common.cloud.ZkCmdExecutor.ensureExists(ZkCmdExecutor.java:78)
	at org.apache.solr.cloud.ZkDistributedQueue.<init>(ZkDistributedQueue.java:105)
	... 5 more




Build Log:
[...truncated 12129 lines...]
   [junit4] Suite: org.apache.solr.handler.TestReplicationHandler
   [junit4]   2> 1500520 INFO  (SUITE-TestReplicationHandler-seed#[AE584CE27515D63E]-worker) [    ] o.a.s.SolrTestCaseJ4 SecureRandom sanity checks: test.solr.allowed.securerandom=null & java.security.egd=file:/dev/./urandom
   [junit4]   2> Creating dataDir: /export/home/jenkins/workspace/Lucene-Solr-master-Solaris/solr/build/solr-core/test/J0/temp/solr.handler.TestReplicationHandler_AE584CE27515D63E-001/init-core-data-001
   [junit4]   2> 1500521 WARN  (SUITE-TestReplicationHandler-seed#[AE584CE27515D63E]-worker) [    ] o.a.s.SolrTestCaseJ4 startTrackingSearchers: numOpens=4 numCloses=4
   [junit4]   2> 1500523 INFO  (SUITE-TestReplicationHandler-seed#[AE584CE27515D63E]-worker) [    ] o.a.s.SolrTestCaseJ4 Using PointFields (NUMERIC_POINTS_SYSPROP=true) w/NUMERIC_DOCVALUES_SYSPROP=false
   [junit4]   2> 1500525 INFO  (SUITE-TestReplicationHandler-seed#[AE584CE27515D63E]-worker) [    ] o.a.s.SolrTestCaseJ4 Randomized ssl (false) and clientAuth (false) via: @org.apache.solr.SolrTestCaseJ4$SuppressSSL(bugUrl=None)
   [junit4]   2> 1500542 INFO  (TEST-TestReplicationHandler.doTestReplicateAfterCoreReload-seed#[AE584CE27515D63E]) [    ] o.a.s.SolrTestCaseJ4 ###Starting doTestReplicateAfterCoreReload
   [junit4]   2> 1500542 INFO  (TEST-TestReplicationHandler.doTestReplicateAfterCoreReload-seed#[AE584CE27515D63E]) [    ] o.a.s.SolrTestCaseJ4 Writing core.properties file to /export/home/jenkins/workspace/Lucene-Solr-master-Solaris/solr/build/solr-core/test/J0/temp/solr.handler.TestReplicationHandler_AE584CE27515D63E-001/solr-instance-001/collection1
   [junit4]   2> 1500546 INFO  (TEST-TestReplicationHandler.doTestReplicateAfterCoreReload-seed#[AE584CE27515D63E]) [    ] o.e.j.s.Server jetty-9.3.20.v20170531
   [junit4]   2> 1500547 INFO  (TEST-TestReplicationHandler.doTestReplicateAfterCoreReload-seed#[AE584CE27515D63E]) [    ] o.e.j.s.h.ContextHandler Started o.e.j.s.ServletContextHandler@a332755{/solr,null,AVAILABLE}
   [junit4]   2> 1500557 INFO  (TEST-TestReplicationHandler.doTestReplicateAfterCoreReload-seed#[AE584CE27515D63E]) [    ] o.e.j.s.AbstractConnector Started ServerConnector@a6274a5{HTTP/1.1,[http/1.1]}{127.0.0.1:57561}
   [junit4]   2> 1500559 INFO  (TEST-TestReplicationHandler.doTestReplicateAfterCoreReload-seed#[AE584CE27515D63E]) [    ] o.e.j.s.Server Started @1502772ms
   [junit4]   2> 1500559 INFO  (TEST-TestReplicationHandler.doTestReplicateAfterCoreReload-seed#[AE584CE27515D63E]) [    ] o.a.s.c.s.e.JettySolrRunner Jetty properties: {solr.data.dir=/export/home/jenkins/workspace/Lucene-Solr-master-Solaris/solr/build/solr-core/test/J0/temp/solr.handler.TestReplicationHandler_AE584CE27515D63E-001/solr-instance-001/collection1/data, hostContext=/solr, hostPort=57561}
   [junit4]   2> 1500559 ERROR (TEST-TestReplicationHandler.doTestReplicateAfterCoreReload-seed#[AE584CE27515D63E]) [    ] o.a.s.u.StartupLoggingUtils Missing Java Option solr.log.dir. Logging may be missing or incomplete.
   [junit4]   2> 1500560 INFO  (TEST-TestReplicationHandler.doTestReplicateAfterCoreReload-seed#[AE584CE27515D63E]) [    ] o.a.s.s.SolrDispatchFilter  ___      _       Welcome to Apache Solr™ version 8.0.0
   [junit4]   2> 1500560 INFO  (TEST-TestReplicationHandler.doTestReplicateAfterCoreReload-seed#[AE584CE27515D63E]) [    ] o.a.s.s.SolrDispatchFilter / __| ___| |_ _   Starting in standalone mode on port null
   [junit4]   2> 1500560 INFO  (TEST-TestReplicationHandler.doTestReplicateAfterCoreReload-seed#[AE584CE27515D63E]) [    ] o.a.s.s.SolrDispatchFilter \__ \/ _ \ | '_|  Install dir: null, Default config dir: null
   [junit4]   2> 1500560 INFO  (TEST-TestReplicationHandler.doTestReplicateAfterCoreReload-seed#[AE584CE27515D63E]) [    ] o.a.s.s.SolrDispatchFilter |___/\___/_|_|    Start time: 2017-10-04T21:48:09.482Z
   [junit4]   2> 1500560 INFO  (TEST-TestReplicationHandler.doTestReplicateAfterCoreReload-seed#[AE584CE27515D63E]) [    ] o.a.s.c.SolrXmlConfig Loading container configuration from /export/home/jenkins/workspace/Lucene-Solr-master-Solaris/solr/build/solr-core/test/J0/temp/solr.handler.TestReplicationHandler_AE584CE27515D63E-001/solr-instance-001/solr.xml
   [junit4]   2> 1500563 INFO  (TEST-TestReplicationHandler.doTestReplicateAfterCoreReload-seed#[AE584CE27515D63E]) [    ] o.a.s.c.SolrXmlConfig Configuration parameter autoReplicaFailoverWorkLoopDelay is ignored
   [junit4]   2> 1500563 INFO  (TEST-TestReplicationHandler.doTestReplicateAfterCoreReload-seed#[AE584CE27515D63E]) [    ] o.a.s.c.SolrXmlConfig Configuration parameter autoReplicaFailoverBadNodeExpiration is ignored
   [junit4]   2> 1500564 INFO  (TEST-TestReplicationHandler.doTestReplicateAfterCoreReload-seed#[AE584CE27515D63E]) [    ] o.a.s.c.SolrXmlConfig MBean server found: com.sun.jmx.mbeanserver.JmxMBeanServer@38ab33cd, but no JMX reporters were configured - adding default JMX reporter.
   [junit4]   2> 1500609 INFO  (TEST-TestReplicationHandler.doTestReplicateAfterCoreReload-seed#[AE584CE27515D63E]) [    ] o.a.s.m.r.SolrJmxReporter JMX monitoring for 'solr.node' (registry 'solr.node') enabled at server: com.sun.jmx.mbeanserver.JmxMBeanServer@38ab33cd
   [junit4]   2> 1500615 INFO  (TEST-TestReplicationHandler.doTestReplicateAfterCoreReload-seed#[AE584CE27515D63E]) [    ] o.a.s.m.r.SolrJmxReporter JMX monitoring for 'solr.jvm' (registry 'solr.jvm') enabled at server: com.sun.jmx.mbeanserver.JmxMBeanServer@38ab33cd
   [junit4]   2> 1500615 INFO  (TEST-TestReplicationHandler.doTestReplicateAfterCoreReload-seed#[AE584CE27515D63E]) [    ] o.a.s.m.r.SolrJmxReporter JMX monitoring for 'solr.jetty' (registry 'solr.jetty') enabled at server: com.sun.jmx.mbeanserver.JmxMBeanServer@38ab33cd
   [junit4]   2> 1500617 INFO  (TEST-TestReplicationHandler.doTestReplicateAfterCoreReload-seed#[AE584CE27515D63E]) [    ] o.a.s.c.CorePropertiesLocator Found 1 core definitions underneath /export/home/jenkins/workspace/Lucene-Solr-master-Solaris/solr/build/solr-core/test/J0/temp/solr.handler.TestReplicationHandler_AE584CE27515D63E-001/solr-instance-001/.
   [junit4]   2> 1500617 INFO  (TEST-TestReplicationHandler.doTestReplicateAfterCoreReload-seed#[AE584CE27515D63E]) [    ] o.a.s.c.CorePropertiesLocator Cores are: [collection1]
   [junit4]   2> 1500617 INFO  (coreLoadExecutor-2937-thread-1) [    ] o.a.s.c.TransientSolrCoreCacheDefault Allocating transient cache for 4 transient cores
   [junit4]   2> 1500633 INFO  (coreLoadExecutor-2937-thread-1) [    x:collection1] o.a.s.c.SolrConfig Using Lucene MatchVersion: 8.0.0
   [junit4]   2> 1500640 INFO  (coreLoadExecutor-2937-thread-1) [    x:collection1] o.a.s.s.IndexSchema [collection1] Schema name=test
   [junit4]   2> 1500642 INFO  (coreLoadExecutor-2937-thread-1) [    x:collection1] o.a.s.s.IndexSchema Loaded schema test/1.2 with uniqueid field id
   [junit4]   2> 1500642 INFO  (coreLoadExecutor-2937-thread-1) [    x:collection1] o.a.s.c.CoreContainer Creating SolrCore 'collection1' using configuration from instancedir /export/home/jenkins/workspace/Lucene-Solr-master-Solaris/solr/build/solr-core/test/J0/temp/solr.handler.TestReplicationHandler_AE584CE27515D63E-001/solr-instance-001/./collection1, trusted=true
   [junit4]   2> 1500642 INFO  (coreLoadExecutor-2937-thread-1) [    x:collection1] o.a.s.m.r.SolrJmxReporter JMX monitoring for 'solr.core.collection1' (registry 'solr.core.collection1') enabled at server: com.sun.jmx.mbeanserver.JmxMBeanServer@38ab33cd
   [junit4]   2> 1500642 INFO  (coreLoadExecutor-2937-thread-1) [    x:collection1] o.a.s.c.SolrCore solr.RecoveryStrategy.Builder
   [junit4]   2> 1500642 INFO  (coreLoadExecutor-2937-thread-1) [    x:collection1] o.a.s.c.SolrCore [[collection1] ] Opening new SolrCore at [/export/home/jenkins/workspace/Lucene-Solr-master-Solaris/solr/build/solr-core/test/J0/temp/solr.handler.TestReplicationHandler_AE584CE27515D63E-001/solr-instance-001/collection1], dataDir=[/export/home/jenkins/workspace/Lucene-Solr-master-Solaris/solr/build/solr-core/test/J0/temp/solr.handler.TestReplicationHandler_AE584CE27515D63E-001/solr-instance-001/./collection1/data/]
   [junit4]   2> 1500643 INFO  (coreLoadExecutor-2937-thread-1) [    x:collection1] o.a.s.u.RandomMergePolicy RandomMergePolicy wrapping class org.apache.lucene.index.TieredMergePolicy: [TieredMergePolicy: maxMergeAtOnce=2, maxMergeAtOnceExplicit=6, maxMergedSegmentMB=77.86328125, floorSegmentMB=0.9970703125, forceMergeDeletesPctAllowed=2.487897048783277, segmentsPerTier=13.0, maxCFSSegmentSizeMB=8.796093022207999E12, noCFSRatio=0.35354646909200416
   [junit4]   2> 1500699 INFO  (coreLoadExecutor-2937-thread-1) [    x:collection1] o.a.s.u.CommitTracker Hard AutoCommit: disabled
   [junit4]   2> 1500699 INFO  (coreLoadExecutor-2937-thread-1) [    x:collection1] o.a.s.u.CommitTracker Soft AutoCommit: disabled
   [junit4]   2> 1500700 INFO  (coreLoadExecutor-2937-thread-1) [    x:collection1] o.a.s.u.RandomMergePolicy RandomMergePolicy wrapping class org.apache.lucene.index.TieredMergePolicy: [TieredMergePolicy: maxMergeAtOnce=44, maxMergeAtOnceExplicit=18, maxMergedSegmentMB=74.1171875, floorSegmentMB=0.7744140625, forceMergeDeletesPctAllowed=4.108848394977814, segmentsPerTier=36.0, maxCFSSegmentSizeMB=8.796093022207999E12, noCFSRatio=0.35848579947479964
   [junit4]   2> 1500700 INFO  (coreLoadExecutor-2937-thread-1) [    x:collection1] o.a.s.s.SolrIndexSearcher Opening [Searcher@52354db4[collection1] main]
   [junit4]   2> 1500700 INFO  (coreLoadExecutor-2937-thread-1) [    x:collection1] o.a.s.r.ManagedResourceStorage File-based storage initialized to use dir: /export/home/jenkins/workspace/Lucene-Solr-master-Solaris/solr/build/solr-core/test/J0/temp/solr.handler.TestReplicationHandler_AE584CE27515D63E-001/solr-instance-001/collection1/conf
   [junit4]   2> 1500701 INFO  (coreLoadExecutor-2937-thread-1) [    x:collection1] o.a.s.h.ReplicationHandler Replication enabled for following config files: schema.xml,xslt/dummy.xsl
   [junit4]   2> 1500701 INFO  (coreLoadExecutor-2937-thread-1) [    x:collection1] o.a.s.h.ReplicationHandler Commits will be reserved for 10000ms.
   [junit4]   2> 1500701 INFO  (searcherExecutor-2938-thread-1-processing-x:collection1) [    x:collection1] o.a.s.c.SolrCore [collection1] Registered new searcher Searcher@52354db4[collection1] main{ExitableDirectoryReader(UninvertingDirectoryReader())}
   [junit4]   2> 1500702 INFO  (TEST-TestReplicationHandler.doTestReplicateAfterCoreReload-seed#[AE584CE27515D63E]) [    ] o.a.s.SolrTestCaseJ4 Writing core.properties file to /export/home/jenkins/workspace/Lucene-Solr-master-Solaris/solr/build/solr-core/test/J0/temp/solr.handler.TestReplicationHandler_AE584CE27515D63E-001/solr-instance-002/collection1
   [junit4]   2> 1500704 INFO  (TEST-TestReplicationHandler.doTestReplicateAfterCoreReload-seed#[AE584CE27515D63E]) [    ] o.e.j.s.Server jetty-9.3.20.v20170531
   [junit4]   2> 1500706 INFO  (TEST-TestReplicationHandler.doTestReplicateAfterCoreReload-seed#[AE584CE27515D63E]) [    ] o.e.j.s.h.ContextHandler Started o.e.j.s.ServletContextHandler@6cd8f708{/solr,null,AVAILABLE}
   [junit4]   2> 1500706 INFO  (TEST-TestReplicationHandler.doTestReplicateAfterCoreReload-seed#[AE584CE27515D63E]) [    ] o.e.j.s.AbstractConnector Started ServerConnector@4d2a2dbd{HTTP/1.1,[http/1.1]}{127.0.0.1:41938}
   [junit4]   2> 1500706 INFO  (TEST-TestReplicationHandler.doTestReplicateAfterCoreReload-seed#[AE584CE27515D63E]) [    ] o.e.j.s.Server Started @1502919ms
   [junit4]   2> 1500706 INFO  (TEST-TestReplicationHandler.doTestReplicateAfterCoreReload-seed#[AE584CE27515D63E]) [    ] o.a.s.c.s.e.JettySolrRunner Jetty properties: {solr.data.dir=/export/home/jenkins/workspace/Lucene-Solr-master-Solaris/solr/build/solr-core/test/J0/temp/solr.handler.TestReplicationHandler_AE584CE27515D63E-001/solr-instance-002/collection1/data, hostContext=/solr, hostPort=41938}
   [junit4]   2> 1500706 ERROR (TEST-TestReplicationHandler.doTestReplicateAfterCoreReload-seed#[AE584CE27515D63E]) [    ] o.a.s.u.StartupLoggingUtils Missing Java Option solr.log.dir. Logging may be missing or incomplete.
   [junit4]   2> 1500709 INFO  (TEST-TestReplicationHandler.doTestReplicateAfterCoreReload-seed#[AE584CE27515D63E]) [    ] o.a.s.s.SolrDispatchFilter  ___      _       Welcome to Apache Solr™ version 8.0.0
   [junit4]   2> 1500709 INFO  (TEST-TestReplicationHandler.doTestReplicateAfterCoreReload-seed#[AE584CE27515D63E]) [    ] o.a.s.s.SolrDispatchFilter / __| ___| |_ _   Starting in standalone mode on port null
   [junit4]   2> 1500709 INFO  (TEST-TestReplicationHandler.doTestReplicateAfterCoreReload-seed#[AE584CE27515D63E]) [    ] o.a.s.s.SolrDispatchFilter \__ \/ _ \ | '_|  Install dir: null, Default config dir: null
   [junit4]   2> 1500709 INFO  (TEST-TestReplicationHandler.doTestReplicateAfterCoreReload-seed#[AE584CE27515D63E]) [    ] o.a.s.s.SolrDispatchFilter |___/\___/_|_|    Start time: 2017-10-04T21:48:09.631Z
   [junit4]   2> 1500709 INFO  (TEST-TestReplicationHandler.doTestReplicateAfterCoreReload-seed#[AE584CE27515D63E]) [    ] o.a.s.c.SolrXmlConfig Loading container configuration from /export/home/jenkins/workspace/Lucene-Solr-master-Solaris/solr/build/solr-core/test/J0/temp/solr.handler.TestReplicationHandler_AE584CE27515D63E-001/solr-instance-002/solr.xml
   [junit4]   2> 1500711 INFO  (TEST-TestReplicationHandler.doTestReplicateAfterCoreReload-seed#[AE584CE27515D63E]) [    ] o.a.s.c.SolrXmlConfig Configuration parameter autoReplicaFailoverWorkLoopDelay is ignored
   [junit4]   2> 1500712 INFO  (TEST-TestReplicationHandler.doTestReplicateAfterCoreReload-seed#[AE584CE27515D63E]) [    ] o.a.s.c.SolrXmlConfig Configuration parameter autoReplicaFailoverBadNodeExpiration is ignored
   [junit4]   2> 1500712 INFO  (TEST-TestReplicationHandler.doTestReplicateAfterCoreReload-seed#[AE584CE27515D63E]) [    ] o.a.s.c.SolrXmlConfig MBean server found: com.sun.jmx.mbeanserver.JmxMBeanServer@38ab33cd, but no JMX reporters were configured - adding default JMX reporter.
   [junit4]   2> 1500743 INFO  (TEST-TestReplicationHandler.doTestReplicateAfterCoreReload-seed#[AE584CE27515D63E]) [    ] o.a.s.m.r.SolrJmxReporter JMX monitoring for 'solr.node' (registry 'solr.node') enabled at server: com.sun.jmx.mbeanserver.JmxMBeanServer@38ab33cd
   [junit4]   2> 1500749 INFO  (TEST-TestReplicationHandler.doTestReplicateAfterCoreReload-seed#[AE584CE27515D63E]) [    ] o.a.s.m.r.SolrJmxReporter JMX monitoring for 'solr.jvm' (registry 'solr.jvm') enabled at server: com.sun.jmx.mbeanserver.JmxMBeanServer@38ab33cd
   [junit4]   2> 1500750 INFO  (TEST-TestReplicationHandler.doTestReplicateAfterCoreReload-seed#[AE584CE27515D63E]) [    ] o.a.s.m.r.SolrJmxReporter JMX monitoring for 'solr.jetty' (registry 'solr.jetty') enabled at server: com.sun.jmx.mbeanserver.JmxMBeanServer@38ab33cd
   [junit4]   2> 1500751 INFO  (TEST-TestReplicationHandler.doTestReplicateAfterCoreReload-seed#[AE584CE27515D63E]) [    ] o.a.s.c.CorePropertiesLocator Found 1 core definitions underneath /export/home/jenkins/workspace/Lucene-Solr-master-Solaris/solr/build/solr-core/test/J0/temp/solr.handler.TestReplicationHandler_AE584CE27515D63E-001/solr-instance-002/.
   [junit4]   2> 1500751 INFO  (TEST-TestReplicationHandler.doTestReplicateAfterCoreReload-seed#[AE584CE27515D63E]) [    ] o.a.s.c.CorePropertiesLocator Cores are: [collection1]
   [junit4]   2> 1500752 INFO  (coreLoadExecutor-2947-thread-1) [    ] o.a.s.c.TransientSolrCoreCacheDefault Allocating transient cache for 4 transient cores
   [junit4]   2> 1500765 INFO  (coreLoadExecutor-2947-thread-1) [    x:collection1] o.a.s.c.SolrConfig Using Lucene MatchVersion: 8.0.0
   [junit4]   2> 1500770 INFO  (coreLoadExecutor-2947-thread-1) [    x:collection1] o.a.s.s.IndexSchema [collection1] Schema name=test
   [junit4]   2> 1500772 INFO  (coreLoadExecutor-2947-thread-1) [    x:collection1] o.a.s.s.IndexSchema Loaded schema test/1.2 with uniqueid field id
   [junit4]   2> 1500772 INFO  (coreLoadExecutor-2947-thread-1) [    x:collection1] o.a.s.c.CoreContainer Creating SolrCore 'collection1' using configuration from instancedir /export/home/jenkins/workspace/Lucene-Solr-master-Solaris/solr/build/solr-core/test/J0/temp/solr.handler.TestReplicationHandler_AE584CE27515D63E-001/solr-instance-002/./collection1, trusted=true
   [junit4]   2> 1500772 INFO  (coreLoadExecutor-2947-thread-1) [    x:collection1] o.a.s.m.r.SolrJmxReporter JMX monitoring for 'solr.core.collection1' (registry 'solr.core.collection1') enabled at server: com.sun.jmx.mbeanserver.JmxMBeanServer@38ab33cd
   [junit4]   2> 1500772 INFO  (coreLoadExecutor-2947-thread-1) [    x:collection1] o.a.s.c.SolrCore solr.RecoveryStrategy.Builder
   [junit4]   2> 1500772 INFO  (coreLoadExecutor-2947-thread-1) [    x:collection1] o.a.s.c.SolrCore [[collection1] ] Opening new SolrCore at [/export/home/jenkins/workspace/Lucene-Solr-master-Solaris/solr/build/solr-core/test/J0/temp/solr.handler.TestReplicationHandler_AE584CE27515D63E-001/solr-instance-002/collection1], dataDir=[/export/home/jenkins/workspace/Lucene-Solr-master-Solaris/solr/build/solr-core/test/J0/temp/solr.handler.TestReplicationHandler_AE584CE27515D63E-001/solr-instance-002/./collection1/data/]
   [junit4]   2> 1500773 INFO  (coreLoadExecutor-2947-thread-1) [    x:collection1] o.a.s.u.RandomMergePolicy RandomMergePolicy wrapping class org.apache.lucene.index.TieredMergePolicy: [TieredMergePolicy: maxMergeAtOnce=2, maxMergeAtOnceExplicit=6, maxMergedSegmentMB=77.86328125, floorSegmentMB=0.9970703125, forceMergeDeletesPctAllowed=2.487897048783277, segmentsPerTier=13.0, maxCFSSegmentSizeMB=8.796093022207999E12, noCFSRatio=0.35354646909200416
   [junit4]   2> 1500808 INFO  (coreLoadExecutor-2947-thread-1) [    x:collection1] o.a.s.u.CommitTracker Hard AutoCommit: disabled
   [junit4]   2> 1500808 INFO  (coreLoadExecutor-2947-thread-1) [    x:collection1] o.a.s.u.CommitTracker Soft AutoCommit: disabled
   [junit4]   2> 1500809 INFO  (coreLoadExecutor-2947-thread-1) [    x:collection1] o.a.s.u.RandomMergePolicy RandomMergePolicy wrapping class org.apache.lucene.index.TieredMergePolicy: [TieredMergePolicy: maxMergeAtOnce=44, maxMergeAtOnceExplicit=18, maxMergedSegmentMB=74.1171875, floorSegmentMB=0.7744140625, forceMergeDeletesPctAllowed=4.108848394977814, segmentsPerTier=36.0, maxCFSSegmentSizeMB=8.796093022207999E12, noCFSRatio=0.35848579947479964
   [junit4]   2> 1500809 INFO  (coreLoadExecutor-2947-thread-1) [    x:collection1] o.a.s.s.SolrIndexSearcher Opening [Searcher@7e3954ec[collection1] main]
   [junit4]   2> 1500809 INFO  (coreLoadExecutor-2947-thread-1) [    x:collection1] o.a.s.r.ManagedResourceStorage File-based storage initialized to use dir: /export/home/jenkins/workspace/Lucene-Solr-master-Solaris/solr/build/solr-core/test/J0/temp/solr.handler.TestReplicationHandler_AE584CE27515D63E-001/solr-instance-002/collection1/conf
   [junit4]   2> 1500810 INFO  (coreLoadExecutor-2947-thread-1) [    x:collection1] o.a.s.h.ReplicationHandler Poll scheduled at an interval of 1000ms
   [junit4]   2> 1500810 INFO  (coreLoadExecutor-2947-thread-1) [    x:collection1] o.a.s.h.ReplicationHandler Commits will be reserved for 10000ms.
   [junit4]   2> 1500822 INFO  (searcherExecutor-2948-thread-1-processing-x:collection1) [    x:collection1] o.a.s.c.SolrCore [collection1] Registered new searcher Searcher@7e3954ec[collection1] main{ExitableDirectoryReader(UninvertingDirectoryReader())}
   [junit4]   2> 1500822 INFO  (qtp353127954-13418) [    x:collection1] o.a.s.c.S.Request [collection1]  webapp=/solr path=/replication params={qt=/replication&wt=javabin&version=2&command=indexversion} status=0 QTime=0
   [junit4]   2> 1500822 INFO  (indexFetcher-2952-thread-1) [    x:collection1] o.a.s.h.IndexFetcher Master's generation: 1
   [junit4]   2> 1500822 INFO  (indexFetcher-2952-thread-1) [    x:collection1] o.a.s.h.IndexFetcher Master's version: 0
   [junit4]   2> 1500822 INFO  (indexFetcher-2952-thread-1) [    x:collection1] o.a.s.h.IndexFetcher Slave's generation: 1
   [junit4]   2> 1500822 INFO  (indexFetcher-2952-thread-1) [    x:collection1] o.a.s.h.IndexFetcher Slave's version: 0
   [junit4]   2> 1500822 INFO  (indexFetcher-2952-thread-1) [    x:collection1] o.a.s.h.IndexFetcher New index in Master. Deleting mine...
   [junit4]   2> 1500822 INFO  (indexFetcher-2952-thread-1) [    x:collection1] o.a.s.u.DirectUpdateHandler2 start commit{,optimize=false,openSearcher=true,waitSearcher=true,expungeDeletes=false,softCommit=false,prepareCommit=false}
   [junit4]   2> 1500822 INFO  (indexFetcher-2952-thread-1) [    x:collection1] o.a.s.u.SolrIndexWriter Calling setCommitData with IW:org.apache.solr.update.SolrIndexWriter@3d13fd3a commitCommandVersion:0
   [junit4]   2> 1500827 INFO  (indexFetcher-2952-thread-1) [    x:collection1] o.a.s.s.SolrIndexSearcher Opening [Searcher@6f409031[collection1] main]
   [junit4]   2> 1500827 INFO  (indexFetcher-2952-thread-1) [    x:collection1] o.a.s.u.DirectUpdateHandler2 end_commit_flush
   [junit4]   2> 1500828 INFO  (TEST-TestReplicationHandler.doTestReplicateAfterCoreReload-seed#[AE584CE27515D63E]) [    ] o.e.j.s.AbstractConnector Stopped ServerConnector@4d2a2dbd{HTTP/1.1,[http/1.1]}{127.0.0.1:0}
   [junit4]   2> 1500828 INFO  (TEST-TestReplicationHandler.doTestReplicateAfterCoreReload-seed#[AE584CE27515D63E]) [    ] o.a.s.c.CoreContainer Shutting down CoreContainer instance=466123618
   [junit4]   2> 1500828 INFO  (searcherExecutor-2948-thread-1-processing-x:collection1) [    x:collection1] o.a.s.c.SolrCore [collection1] Registered new searcher Searcher@6f409031[collection1] main{ExitableDirectoryReader(UninvertingDirectoryReader())}
   [junit4]   2> 1500828 INFO  (TEST-TestReplicationHandler.doTestReplicateAfterCoreReload-seed#[AE584CE27515D63E]) [    ] o.a.s.m.SolrMetricManager Closing metric reporters for registry=solr.node, tag=null
   [junit4]   2> 1500829 INFO  (TEST-TestReplicationHandler.doTestReplicateAfterCoreReload-seed#[AE584CE27515D63E]) [    ] o.a.s.m.r.SolrJmxReporter Closing reporter [org.apache.solr.metrics.reporters.SolrJmxReporter@2263b1e3: rootName = null, domain = solr.node, service url = null, agent id = null] for registry solr.node / com.codahale.metrics.MetricRegistry@7f249039
   [junit4]   2> 1500834 INFO  (TEST-TestReplicationHandler.doTestReplicateAfterCoreReload-seed#[AE584CE27515D63E]) [    ] o.a.s.m.SolrMetricManager Closing metric reporters for registry=solr.jvm, tag=null
   [junit4]   2> 1500834 INFO  (TEST-TestReplicationHandler.doTestReplicateAfterCoreReload-seed#[AE584CE27515D63E]) [    ] o.a.s.m.r.SolrJmxReporter Closing reporter [org.apache.solr.metrics.reporters.SolrJmxReporter@72ddb532: rootName = null, domain = solr.jvm, service url = null, agent id = null] for registry solr.jvm / com.codahale.metrics.MetricRegistry@5dbd2814
   [junit4]   2> 1500837 INFO  (TEST-TestReplicationHandler.doTestReplicateAfterCoreReload-seed#[AE584CE27515D63E]) [    ] o.a.s.m.SolrMetricManager Closing metric reporters for registry=solr.jetty, tag=null
   [junit4]   2> 1500837 INFO  (TEST-TestReplicationHandler.doTestReplicateAfterCoreReload-seed#[AE584CE27515D63E]) [    ] o.a.s.m.r.SolrJmxReporter Closing reporter [org.apache.solr.metrics.reporters.SolrJmxReporter@60882d81: rootName = null, domain = solr.jetty, service url = null, agent id = null] for registry solr.jetty / com.codahale.metrics.MetricRegistry@17a91bcc
   [junit4]   2> 1500841 INFO  (coreCloseExecutor-2953-thread-1) [    x:collection1] o.a.s.c.SolrCore [collection1]  CLOSING SolrCore org.apache.solr.core.SolrCore@28807124
   [junit4]   2> 1500841 INFO  (coreCloseExecutor-2953-thread-1) [    x:collection1] o.a.s.m.SolrMetricManager Closing metric reporters for registry=solr.core.collection1, tag=679506212
   [junit4]   2> 1500841 INFO  (coreCloseExecutor-2953-thread-1) [    x:collection1] o.a.s.m.r.SolrJmxReporter Closing reporter [org.apache.solr.metrics.reporters.SolrJmxReporter@1b05db3d: rootName = null, domain = solr.core.collection1, service url = null, agent id = null] for registry solr.core.collection1 / com.codahale.metrics.MetricRegistry@3a9213b4
   [junit4]   2> 1500857 INFO  (TEST-TestReplicationHandler.doTestReplicateAfterCoreReload-seed#[AE584CE27515D63E]) [    ] o.e.j.s.h.ContextHandler Stopped o.e.j.s.ServletContextHandler@6cd8f708{/solr,null,UNAVAILABLE}
   [junit4]   2> 1500860 INFO  (TEST-TestReplicationHandler.doTestReplicateAfterCoreReload-seed#[AE584CE27515D63E]) [    ] o.e.j.s.AbstractConnector Stopped ServerConnector@a6274a5{HTTP/1.1,[http/1.1]}{127.0.0.1:0}
   [junit4]   2> 1500860 INFO  (TEST-TestReplicationHandler.doTestReplicateAfterCoreReload-seed#[AE584CE27515D63E]) [    ] o.a.s.c.CoreContainer Shutting down CoreContainer instance=1822009639
   [junit4]   2> 1500860 INFO  (TEST-TestReplicationHandler.doTestReplicateAfterCoreReload-seed#[AE584CE27515D63E]) [    ] o.a.s.m.SolrMetricManager Closing metric reporters for registry=solr.node, tag=null
   [junit4]   2> 1500860 INFO  (TEST-TestReplicationHandler.doTestReplicateAfterCoreReload-seed#[AE584CE27515D63E]) [    ] o.a.s.m.r.SolrJmxReporter Closing reporter [org.apache.solr.metrics.reporters.SolrJmxReporter@cc7c730: rootName = null, domain = solr.node, service url = null, agent id = null] for registry solr.node / com.codahale.metrics.MetricRegistry@4818923d
   [junit4]   2> 1500860 INFO  (TEST-TestReplicationHandler.doTestReplicateAfterCoreReload-seed#[AE584CE27515D63E]) [    ] o.a.s.m.SolrMetricManager Closing metric reporters for registry=solr.jvm, tag=null
   [junit4]   2> 1500861 INFO  (TEST-TestReplicationHandler.doTestReplicateAfterCoreReload-seed#[AE584CE27515D63E]) [    ] o.a.s.m.r.SolrJmxReporter Closing reporter [org.apache.solr.metrics.reporters.SolrJmxReporter@661bd96c: rootName = null, domain = solr.jvm, service url = null, agent id = null] for registry solr.jvm / com.codahale.metrics.MetricRegistry@5dbd2814
   [junit4]   2> 1500861 INFO  (TEST-TestReplicationHandler.doTestReplicateAfterCoreReload-seed#[AE584CE27515D63E]) [    ] o.a.s.m.SolrMetricManager Closing metric reporters for registry=solr.jetty, tag=null
   [junit4]   2> 1500861 INFO  (TEST-TestReplicationHandler.doTestReplicateAfterCoreReload-seed#[AE584CE27515D63E]) [    ] o.a.s.m.r.SolrJmxReporter Closing reporter [org.apache.solr.metrics.reporters.SolrJmxReporter@4e89ecd4: rootName = null, domain = solr.jetty, service url = null, agent id = null] for registry solr.jetty / com.codahale.metrics.MetricRegistry@17a91bcc
   [junit4]   2> 1500864 INFO  (coreCloseExecutor-2955-thread-1) [    x:collection1] o.a.s.c.SolrCore [collection1]  CLOSING SolrCore org.apache.solr.core.SolrCore@73905b03
   [junit4]   2> 1500864 INFO  (coreCloseExecutor-2955-thread-1) [    x:collection1] o.a.s.m.SolrMetricManager Closing metric reporters for registry=solr.core.collection1, tag=1938840323
   [junit4]   2> 1500864 INFO  (coreCloseExecutor-2955-thread-1) [    x:collection1] o.a.s.m.r.SolrJmxReporter Closing reporter [org.apache.solr.metrics.reporters.SolrJmxReporter@1ad56924: rootName = null, domain = solr.core.collection1, service url = null, agent id = null] for registry solr.core.collection1 / com.codahale.metrics.MetricRegistry@7b685246
   [junit4]   2> 1500872 INFO  (TEST-TestReplicationHandler.doTestReplicateAfterCoreReload-seed#[AE584CE27515D63E]) [    ] o.e.j.s.h.ContextHandler Stopped o.e.j.s.ServletContextHandler@a332755{/solr,null,UNAVAILABLE}
   [junit4]   2> 1500875 INFO  (TEST-TestReplicationHandler.doTestReplicateAfterCoreReload-seed#[AE584CE27515D63E]) [    ] o.e.j.s.Server jetty-9.3.20.v20170531
   [junit4]   2> 1500876 INFO  (TEST-TestReplicationHandler.doTestReplicateAfterCoreReload-seed#[AE584CE27515D63E]) [    ] o.e.j.s.h.ContextHandler Started o.e.j.s.ServletContextHandler@79931642{/solr,null,AVAILABLE}
   [junit4]   2> 1500876 INFO  (TEST-TestReplicationHandler.doTestReplicateAfterCoreReload-seed#[AE584CE27515D63E]) [    ] o.e.j.s.AbstractConnector Started ServerConnector@3aa7f59b{HTTP/1.1,[http/1.1]}{127.0.0.1:39666}
   [junit4]   2> 1500876 INFO  (TEST-TestReplicationHandler.doTestReplicateAfterCoreReload-seed#[AE584CE27515D63E]) [    ] o.e.j.s.Server Started @1503089ms
   [junit4]   2> 1500876 INFO  (TEST-TestReplicationHandler.doTestReplicateAfterCoreReload-seed#[AE584CE27515D63E]) [    ] o.a.s.c.s.e.JettySolrRunner Jetty properties: {solr.data.dir=/export/home/jenkins/workspace/Lucene-Solr-master-Solaris/solr/build/solr-core/test/J0/temp/solr.handler.TestReplicationHandler_AE584CE27515D63E-001/solr-instance-001/collection1/data, hostContext=/solr, hostPort=39666}
   [junit4]   2> 1500877 ERROR (TEST-TestReplicationHandler.doTestReplicateAfterCoreReload-seed#[AE584CE27515D63E]) [    ] o.a.s.u.StartupLoggingUtils Missing Java Option solr.log.dir. Logging may be missing or incomplete.
   [junit4]   2> 1500879 INFO  (TEST-TestReplicationHandler.doTestReplicateAfterCoreReload-seed#[AE584CE27515D63E]) [    ] o.a.s.s.SolrDispatchFilter  ___      _       Welcome to Apache Solr™ version 8.0.0
   [junit4]   2> 1500879 INFO  (TEST-TestReplicationHandler.doTestReplicateAfterCoreReload-seed#[AE584CE27515D63E]) [    ] o.a.s.s.SolrDispatchFilter / __| ___| |_ _   Starting in standalone mode on port null
   [junit4]   2> 1500879 INFO  (TEST-TestReplicationHandler.doTestReplicateAfterCoreReload-seed#[AE584CE27515D63E]) [    ] o.a.s.s.SolrDispatchFilter \__ \/ _ \ | '_|  Install dir: null, Default config dir: null
   [junit4]   2> 1500879 INFO  (TEST-TestReplicationHandler.doTestReplicateAfterCoreReload-seed#[AE584CE27515D63E]) [    ] o.a.s.s.SolrDispatchFilter |___/\___/_|_|    Start time: 2017-10-04T21:48:09.801Z
   [junit4]   2> 1500880 INFO  (TEST-TestReplicationHandler.doTestReplicateAfterCoreReload-seed#[AE584CE27515D63E]) [    ] o.a.s.c.SolrXmlConfig Loading container configuration from /export/home/jenkins/workspace/Lucene-Solr-master-Solaris/solr/build/solr-core/test/J0/temp/solr.handler.TestReplicationHandler_AE584CE27515D63E-001/solr-instance-001/solr.xml
   [junit4]   2> 1500883 INFO  (TEST-TestReplicationHandler.doTestReplicateAfterCoreReload-seed#[AE584CE27515D63E]) [    ] o.a.s.c.SolrXmlConfig Configuration parameter autoReplicaFailoverWorkLoopDelay is ignored
   [junit4]   2> 1500883 INFO  (TEST-TestReplicationHandler.doTestReplicateAfterCoreReload-seed#[AE584CE27515D63E]) [    ] o.a.s.c.SolrXmlConfig Configuration parameter autoReplicaFailoverBadNodeExpiration is ignored
   [junit4]   2> 1500884 INFO  (TEST-TestReplicationHandler.doTestReplicateAfterCoreReload-seed#[AE584CE27515D63E]) [    ] o.a.s.c.SolrXmlConfig MBean server found: com.sun.jmx.mbeanserver.JmxMBeanServer@38ab33cd, but no JMX reporters were configured - adding default JMX reporter.
   [junit4]   2> 1500918 INFO  (TEST-TestReplicationHandler.doTestReplicateAfterCoreReload-seed#[AE584CE27515D63E]) [    ] o.a.s.m.r.SolrJmxReporter JMX monitoring for 'solr.node' (registry 'solr.node') enabled at server: com.sun.jmx.mbeanserver.JmxMBeanServer@38ab33cd
   [junit4]   2> 1500926 INFO  (TEST-TestReplicationHandler.doTestReplicateAfterCoreReload-seed#[AE584CE27515D63E]) [    ] o.a.s.m.r.SolrJmxReporter JMX monitoring for 'solr.jvm' (registry 'solr.jvm') enabled at server: com.sun.jmx.mbeanserver.JmxMBeanServer@38ab33cd
   [junit4]   2> 1500926 INFO  (TEST-TestReplicationHandler.doTestReplicateAfterCoreReload-seed#[AE584CE27515D63E]) [    ] o.a.s.m.r.SolrJmxReporter JMX monitoring for 'solr.jetty' (registry 'solr.jetty') enabled at server: com.sun.jmx.mbeanserver.JmxMBeanServer@38ab33cd
   [junit4]   2> 1500927 INFO  (TEST-TestReplicationHandler.doTestReplicateAfterCoreReload-seed#[AE584CE27515D63E]) [    ] o.a.s.c.CorePropertiesLocator Found 1 core definitions underneath /export/home/jenkins/workspace/Lucene-Solr-master-Solaris/solr/build/solr-core/test/J0/temp/solr.handler.TestReplicationHandler_AE584CE27515D63E-001/solr-instance-001/.
   [junit4]   2> 1500927 INFO  (TEST-TestReplicationHandler.doTestReplicateAfterCoreReload-seed#[AE584CE27515D63E]) [    ] o.a.s.c.CorePropertiesLocator Cores are: [collection1]
   [junit4]   2> 1500928 INFO  (coreLoadExecutor-2962-thread-1) [    ] o.a.s.c.TransientSolrCoreCacheDefault Allocating transient cache for 4 transient cores
   [junit4]   2> 1500941 INFO  (coreLoadExecutor-2962-thread-1) [    x:collection1] o.a.s.c.SolrConfig Using Lucene MatchVersion: 8.0.0
   [junit4]   2> 1500947 INFO  (coreLoadExecutor-2962-thread-1) [    x:collection1] o.a.s.s.IndexSchema [collection1] Schema name=test
   [junit4]   2> 1500948 INFO  (coreLoadExecutor-2962-thread-1) [    x:collection1] o.a.s.s.IndexSchema Loaded schema test/1.2 with uniqueid field id
   [junit4]   2> 1500948 INFO  (coreLoadExecutor-2962-thread-1) [    x:collection1] o.a.s.c.CoreContainer Creating SolrCore 'collection1' using configuration from instancedir /export/home/jenkins/workspace/Lucene-Solr-master-Solaris/solr/build/solr-core/test/J0/temp/solr.handler.TestReplicationHandler_AE584CE27515D63E-001/solr-instance-001/./collection1, trusted=true
   [junit4]   2> 1500948 INFO  (coreLoadExecutor-2962-thread-1) [    x:collection1] o.a.s.m.r.SolrJmxReporter JMX monitoring for 'solr.core.collection1' (registry 'solr.core.collection1') enabled at server: com.sun.jmx.mbeanserver.JmxMBeanServer@38ab33cd
   [junit4]   2> 1500948 INFO  (coreLoadExecutor-2962-thread-1) [    x:collection1] o.a.s.c.SolrCore solr.RecoveryStrategy.Builder
   [junit4]   2> 1500948 INFO  (coreLoadExecutor-2962-thread-1) [    x:collection1] o.a.s.c.SolrCore [[collection1] ] Opening new SolrCore at [/export/home/jenkins/workspace/Lucene-Solr-master-Solaris/solr/build/solr-core/test/J0/temp/solr.handler.TestReplicationHandler_AE584CE27515D63E-001/solr-instance-001/collection1], dataDir=[/export/home/jenkins/workspace/Lucene-Solr-master-Solaris/solr/build/solr-core/test/J0/temp/solr.handler.TestReplicationHandler_AE584CE27515D63E-001/solr-instance-001/./collection1/data/]
   [junit4]   2> 1500949 INFO  (coreLoadExecutor-2962-thread-1) [    x:collection1] o.a.s.u.RandomMergePolicy RandomMergePolicy wrapping class org.apache.lucene.index.TieredMergePolicy: [TieredMergePolicy: maxMergeAtOnce=2, maxMergeAtOnceExplicit=6, maxMergedSegmentMB=77.86328125, floorSegmentMB=0.9970703125, forceMergeDeletesPctAllowed=2.487897048783277, segmentsPerTier=13.0, maxCFSSegmentSizeMB=8.796093022207999E12, noCFSRatio=0.35354646909200416
   [junit4]   2> 1501005 INFO  (coreLoadExecutor-2962-thread-1) [    x:collection1] o.a.s.u.CommitTracker Hard AutoCommit: disabled
   [junit4]   2> 1501005 INFO  (coreLoadExecutor-2962-thread-1) [    x:collection1] o.a.s.u.CommitTracker Soft AutoCommit: disabled
   [junit4]   2> 1501006 INFO  (coreLoadExecutor-2962-thread-1) [    x:collection1] o.a.s.u.RandomMergePolicy RandomMergePolicy wrapping class org.apache.lucene.index.TieredMergePolicy: [TieredMergePolicy: maxMergeAtOnce=44, maxMergeAtOnceExplicit=18, maxMergedSegmentMB=74.1171875, floorSegmentMB=0.7744140625, forceMergeDeletesPctAllowed=4.108848394977814, segmentsPerTier=36.0, maxCFSSegmentSizeMB=8.796093022207999E12, noCFSRatio=0.35848579947479964
   [junit4]   2> 1501006 INFO  (coreLoadExecutor-2962-thread-1) [    x:collection1] o.a.s.s.SolrIndexSearcher Opening [Searcher@420607b0[collection1] main]
   [junit4]   2> 1501006 INFO  (coreLoadExecutor-2962-thread-1) [    x:collection1] o.a.s.r.ManagedResourceStorage File-based storage initialized to use dir: /export/home/jenkins/workspace/Lucene-Solr-master-Solaris/solr/build/solr-core/test/J0/temp/solr.handler.TestReplicationHandler_AE584CE27515D63E-001/solr-instance-001/collection1/conf
   [junit4]   2> 1501006 INFO  (coreLoadExecutor-2962-thread-1) [    x:collection1] o.a.s.h.ReplicationHandler Replication enabled for following config files: schema.xml
   [junit4]   2> 1501006 INFO  (coreLoadExecutor-2962-thread-1) [    x:collection1] o.a.s.h.ReplicationHandler Commits will be reserved for 10000ms.
   [junit4]   2> 1501006 INFO  (searcherExecutor-2963-thread-1-processing-x:collection1) [    x:collection1] o.a.s.c.SolrCore [collection1] Registered new searcher Searcher@420607b0[collection1] main{ExitableDirectoryReader(UninvertingDirectoryReader())}
   [junit4]   2> 1501017 INFO  (qtp863784252-13459) [    x:collection1] o.a.s.u.DirectUpdateHandler2 [collection1] REMOVING ALL DOCUMENTS FROM INDEX
   [junit4]   2> 1501018 INFO  (qtp863784252-13459) [    x:collection1] o.a.s.u.p.LogUpdateProcessorFactory [collection1]  webapp=/solr path=/update params={wt=javabin&version=2}{deleteByQuery=*:*} 0 0
   [junit4]   2> 1501018 INFO  (qtp863784252-13460) [    x:collection1] o.a.s.u.DirectUpdateHandler2 start commit{,optimize=false,openSearcher=true,waitSearcher=true,expungeDeletes=false,softCommit=false,prepareCommit=false}
   [junit4]   2> 1501018 INFO  (qtp863784252-13460) [    x:collection1] o.a.s.u.SolrIndexWriter Calling setCommitData with IW:org.apache.solr.update.SolrIndexWriter@214a24f6 commitCommandVersion:0
   [junit4]   2> 1501023 INFO  (qtp863784252-13460) [    x:collection1] o.a.s.s.SolrIndexSearcher Opening [Searcher@6eb0d494[collection1] main]
   [junit4]   2> 1501024 INFO  (qtp863784252-13460) [    x:collection1] o.a.s.u.DirectUpdateHandler2 end_commit_flush
   [junit4]   2> 1501025 INFO  (searcherExecutor-2963-thread-1-processing-x:collection1) [    x:collection1] o.a.s.c.SolrCore [collection1] Registered new searcher Searcher@6eb0d494[collection1] main{ExitableDirectoryReader(UninvertingDirectoryReader())}
   [junit4]   2> 1501025 INFO  (qtp863784252-13460) [    x:collection1] o.a.s.u.p.LogUpdateProcessorFactory [collection1]  webapp=/solr path=/update params={waitSearcher=true&commit=true&softCommit=false&wt=javabin&version=2}{commit=} 0 6
   [junit4]   2> 1501026 INFO  (qtp863784252-13461) [    x:collection1] o.a.s.c.S.Request [collection1]  webapp=/solr path=/select params={q=*:*&sort=id+desc&wt=javabin&version=2} hits=0 status=0 QTime=0
   [junit4]   2> 1501026 INFO  (TEST-TestReplicationHandler.doTestReplicateAfterCoreReload-seed#[AE584CE27515D63E]) [    ] o.a.s.h.TestReplicationHandler Waited for 0ms and found 0 docs
   [junit4]   2> 1501030 INFO  (TEST-TestReplicationHandler.doTestReplicateAfterCoreReload-seed#[AE584CE27515D63E]) [    ] o.e.j.s.Server jetty-9.3.20.v20170531
   [junit4]   2> 1501031 INFO  (TEST-TestReplicationHandler.doTestReplicateAfterCoreReload-seed#[AE584CE27515D63E]) [    ] o.e.j.s.h.ContextHandler Started o.e.j.s.ServletContextHandler@78a375e2{/solr,null,AVAILABLE}
   [junit4]   2> 1501031 INFO  (TEST-TestReplicationHandler.doTestReplicateAfterCoreReload-seed#[AE584CE27515D63E]) [    ] o.e.j.s.AbstractConnector Started ServerConnector@9d32c0d{HTTP/1.1,[http/1.1]}{127.0.0.1:49567}
   [junit4]   2> 1501031 INFO  (TEST-TestReplicationHandler.doTestReplicateAfterCoreReload-seed#[AE584CE27515D63E]) [    ] o.e.j.s.Server Started @1503244ms
   [junit4]   2> 1501032 INFO  (TEST-TestReplicationHandler.doTestReplicateAfterCoreReload-seed#[AE584CE27515D63E]) [    ] o.a.s.c.s.e.JettySolrRunner Jetty properties: {solr.data.dir=/export/home/jenkins/workspace/Lucene-Solr-master-Solaris/solr/build/solr-core/test/J0/temp/solr.handler.TestReplicationHandler_AE584CE27515D63E-001/solr-instance-002/collection1/data, hostContext=/solr, hostPort=49567}
   [junit4]   2> 1501032 ERROR (TEST-TestReplicationHandler.doTestReplicateAfterCoreReload-seed#[AE584CE27515D63E]) [    ] o.a.s.u.StartupLoggingUtils Missing Java Option solr.log.dir. Logging may be missing or incomplete.
   [junit4]   2> 1501032 INFO  (TEST-TestReplicationHandler.doTestReplicateAfterCoreReload-seed#[AE584CE27515D63E]) [    ] o.a.s.s.SolrDispatchFilter  ___      _       Welcome to Apache Solr™ version 8.0.0
   [junit4]   2> 1501032 INFO  (TEST-TestReplicationHandler.doTestReplicateAfterCoreReload-seed#[AE584CE27515D63E]) [    ] o.a.s.s.SolrDispatchFilter / __| ___| |_ _   Starting in standalone mode on port null
   [junit4]   2> 1501032 INFO  (TEST-TestReplicationHandler.doTestReplicateAfterCoreReload-seed#[AE584CE27515D63E]) [    ] o.a.s.s.SolrDispatchFilter \__ \/ _ \ | '_|  Install dir: null, Default config dir: null
   [junit4]   2> 1501032 INFO  (TEST-TestReplicationHandler.doTestReplicateAfterCoreReload-seed#[AE584CE27515D63E]) [    ] o.a.s.s.SolrDispatchFilter |___/\___/_|_|    Start time: 2017-10-04T21:48:09.954Z
   [junit4]   2> 1501035 INFO  (TEST-TestReplicationHandler.doTestReplicateAfterCoreReload-seed#[AE584CE27515D63E]) [    ] o.a.s.c.SolrXmlConfig Loading container configuration from /export/home/jenkins/workspace/Lucene-Solr-master-Solaris/solr/build/solr-core/test/J0/temp/solr.handler.TestReplicationHandler_AE584CE27515D63E-001/solr-instance-002/solr.xml
   [junit4]   2> 1501038 INFO  (TEST-TestReplicationHandler.doTestReplicateAfterCoreReload-seed#[AE584CE27515D63E]) [    ] o.a.s.c.SolrXmlConfig Configuration parameter autoReplicaFailoverWorkLoopDelay is ignored
   [junit4]   2> 1501038 INFO  (TEST-TestReplicationHandler.doTestReplicateAfterCoreReload-seed#[AE584CE27515D63E]) [    ] o.a.s.c.SolrXmlConfig Configuration parameter autoReplicaFailoverBadNodeExpiration is ignored
   [junit4]   2> 1501039 INFO  (TEST-TestReplicationHandler.doTestReplicateAfterCoreReload-seed#[AE584CE27515D63E]) [    ] o.a.s.c.SolrXmlConfig MBean server found: com.sun.jmx.mbeanserver.JmxMBeanServer@38ab33cd, but no JMX reporters were configured - adding default JMX reporter.
   [junit4]   2> 1501081 INFO  (TEST-TestReplicationHandler.doTestReplicateAfterCoreReload-seed#[AE584CE27515D63E]) [    ] o.a.s.m.r.SolrJmxReporter JMX monitoring for 'solr.node' (registry 'solr.node') enabled at server: com.sun.jmx.mbeanserver.JmxMBeanServer@38ab33cd
   [junit4]   2> 1501090 INFO  (TEST-TestReplicationHandler.doTestReplicateAfterCoreReload-seed#[AE584CE27515D63E]) [    ] o.a.s.m.r.SolrJmxReporter JMX monitoring for 'solr.jvm' (registry 'solr.jvm') enabled at server: com.sun.jmx.mbeanserver.JmxMBeanServer@38ab33cd
   [junit4]   2> 1501090 INFO  (TEST-TestReplicationHandler.doTestReplicateAfterCoreReload-seed#[AE584CE27515D63E]) [    ] o.a.s.m.r.SolrJmxReporter JMX monitoring for 'solr.jetty' (registry 'solr.jetty') enabled at server: com.sun.jmx.mbeanserver.JmxMBeanServer@38ab33cd
   [junit4]   2> 1501091 INFO  (TEST-TestReplicationHandler.doTestReplicateAfterCoreReload-seed#[AE584CE27515D63E]) [    ] o.a.s.c.CorePropertiesLocator Found 1 core definitions underneath /export/home/jenkins/workspace/Lucene-Solr-master-Solaris/solr/build/solr-core/test/J0/temp/solr.handler.TestReplicationHandler_AE584CE27515D63E-001/solr-instance-002/.
   [junit4]   2> 1501091 INFO  (TEST-TestReplicationHandler.doTestReplicateAfterCoreReload-seed#[AE584CE27515D63E]) [    ] o.a.s.c.CorePropertiesLocator Cores are: [collection1]
   [junit4]   2> 1501093 INFO  (coreLoadExecutor-2972-thread-1) [    ] o.a.s.c.TransientSolrCoreCacheDefault Allocating transient cache for 4 transient cores
   [junit4]   2> 1501108 INFO  (coreLoadExecutor-2972-thread-1) [    x:collection1] o.a.s.c.SolrConfig Using Lucene MatchVersion: 8.0.0
   [junit4]   2> 1501114 INFO  (coreLoadExecutor-2972-thread-1) [    x:collection1] o.a.s.s.IndexSchema [collection1] Schema name=test
   [junit4]   2> 1501115 INFO  (coreLoadExecutor-2972-thread-1) [    x:collection1] o.a.s.s.IndexSchema Loaded schema test/1.2 with uniqueid field id
   [junit4]   2> 1501115 INFO  (coreLoadExecutor-2972-thread-1) [    x:collection1] o.a.s.c.CoreContainer Creating SolrCore 'collection1' using configuration from instancedir /export/home/jenkins/workspace/Lucene-Solr-master-Solaris/solr/build/solr-core/test/J0/temp/solr.handler.TestReplicationHandler_AE584CE27515D63E-001/solr-instance-002/./collection1, trusted=true
   [junit4]   2> 1501116 INFO  (coreLoadExecutor-2972-thread-1) [    x:collection1] o.a.s.m.r.SolrJmxReporter JMX monitoring for 'solr.core.collection1' (registry 'solr.core.collection1') enabled at server: com.sun.jmx.mbeanserver.JmxMBeanServer@38ab33cd
   [junit4]   2> 1501116 INFO  (coreLoadExecutor-2972-thread-1) [    x:collection1] o.a.s.c.SolrCore solr.RecoveryStrategy.Builder
   [junit4]   2> 1501116 INFO  (coreLoadExecutor-2972-thread-1) [    x:collection1] o.a.s.c.SolrCore [[collection1] ] Opening new SolrCore at [/export/home/jenkins/workspace/Lucene-Solr-master-Solaris/solr/build/solr-core/test/J0/temp/solr.handler.TestReplicationHandler_AE584CE27515D63E-001/solr-instance-002/collection1], dataDir=[/export/home/jenkins/workspace/Lucene-Solr-master-Solaris/solr/build/solr-core/test/J0/temp/solr.handler.TestReplicationHandler_AE584CE27515D63E-001/solr-instance-002/./collection1/data/]
   [junit4]   2> 1501117 INFO  (coreLoadExecutor-2972-thread-1) [    x:collection1] o.a.s.u.RandomMergePolicy RandomMergePolicy wrapping class org.apache.lucene.index.TieredMergePolicy: [TieredMergePolicy: maxMergeAtOnce=2, maxMergeAtOnceExplicit=6, maxMergedSegmentMB=77.86328125, floorSegmentMB=0.9970703125, forceMergeDeletesPctAllowed=2.487897048783277, segmentsPerTier=13.0, maxCFSSegmentSizeMB=8.796093022207999E12, noCFSRatio=0.35354646909200416
   [junit4]   2> 1501156 INFO  (coreLoadExecutor-2972-thread-1) [    x:collection1] o.a.s.u.CommitTracker Hard AutoCommit: disabled
   [junit4]   2> 1501156 INFO  (coreLoadExecutor-2972-thread-1) [    x:collection1] o.a.s.u.CommitTracker Soft AutoCommit: disabled
   [junit4]   2> 1501157 INFO  (coreLoadExecutor-2972-thread-1) [    x:collection1] o.a.s.u.RandomMergePolicy RandomMergePolicy wrapping class org.apache.lucene.index.TieredMergePolicy: [TieredMergePolicy: maxMergeAtOnce=44, maxMergeAtOnceExplicit=18, maxMergedSegmentMB=74.1171875, floorSegmentMB=0.7744140625, forceMergeDeletesPctAllowed=4.108848394977814, segmentsPerTier=36.0, maxCFSSegmentSizeMB=8.796093022207999E12, noCFSRatio=0.35848579947479964
   [junit4]   2> 1501157 INFO  (coreLoadExecutor-2972-thread-1) [    x:collection1] o.a.s.s.SolrIndexSearcher Opening [Searcher@111292d9[collection1] main]
   [junit4]   2> 1501157 INFO  (coreLoadExecutor-2972-thread-1) [    x:collection1] o.a.s.r.ManagedResourceStorage File-based storage initialized to use dir: /export/home/jenkins/workspace/Lucene-Solr-master-Solaris/solr/build/solr-core/test/J0/temp/solr.handler.TestReplicationHandler_AE584CE27515D63E-001/solr-instance-002/collection1/conf
   [junit4]   2> 1501158 INFO  (coreLoadExecutor-2972-thread-1) [    x:collection1] o.a.s.h.ReplicationHandler Poll scheduled at an interval of 1000ms
   [junit4]   2> 1501158 INFO  (coreLoadExecutor-2972-thread-1) [    x:collection1] o.a.s.h.ReplicationHandler Commits will be reserved for 10000ms.
   [junit4]   2> 1501159 INFO  (searcherExecutor-2973-thread-1-processing-x:collection1) [    x:collection1] o.a.s.c.SolrCore [collection1] Registered new searcher Searcher@111292d9[collection1] main{ExitableDirectoryReader(UninvertingDirectoryReader())}
   [junit4]   2> 1501173 INFO  (qtp1265301787-13477) [    x:collection1] o.a.s.c.S.Request [collection1]  webapp=/solr path=/select params={q=*:*&sort=id+desc&wt=javabin&version=2} hits=0 status=0 QTime=0
   [junit4]   2> 1501173 INFO  (TEST-TestReplicationHandler.doTestReplicateAfterCoreReload-seed#[AE584CE27515D63E]) [    ] o.a.s.h.TestReplicationHandler Waited for 0ms and found 0 docs
   [junit4]   2> 1501174 INFO  (qtp863784252-13462) [    x:collection1] o.a.s.c.S.Request [collection1]  webapp=/solr path=/replication params={_trace=getIndexVersion&qt=/replication&wt=javabin&version=2&command=indexversion} status=0 QTime=0
   [junit4]   2> 1501174 INFO  (qtp863784252-13463) [    x:collection1] o.a.s.c.S.Request [collection1]  webapp=/solr path=/replication params={_trace=getCommits&qt=/replication&wt=javabin&version=2&command=commits} status=0 QTime=0
   [junit4]   2> 1501187 INFO  (qtp863784252-13457) [    ] o.a.s.c.SolrConfig Using Lucene MatchVersion: 8.0.0
   [junit4]   2> 1501192 INFO  (qtp863784252-13457) [    ] o.a.s.s.IndexSchema [collection1] Schema name=test
   [junit4]   2> 1501194 INFO  (qtp863784252-13457) [    ] o.a.s.s.IndexSchema Loaded schema test/1.2 with uniqueid field id
   [junit4]   2> 1501194 INFO  (qtp863784252-13457) [    ] o.a.s.c.CoreContainer Reloading SolrCore 'collection1' using configuration from instancedir /export/home/jenkins/workspace/Lucene-Solr-master-Solaris/solr/build/solr-core/test/J0/temp/solr.handler.TestReplicationHandler_AE584CE27515D63E-001/solr-instance-001/./collection1
   [junit4]   2> 1501212 INFO  (qtp863784252-13457) [    x:collection1] o.a.s.m.r.SolrJmxReporter JMX monitoring for 'solr.core.collection1' (registry 'solr.core.collection1') enabled at server: com.sun.jmx.mbeanserver.JmxMBeanServer@38ab33cd
   [junit4]   2> 1501212 INFO  (qtp863784252-13457) [    x:collection1] o.a.s.c.SolrCore [[collection1] ] Opening new SolrCore at [/export/home/jenkins/workspace/Lucene-Solr-master-Solaris/solr/build/solr-core/test/J0/temp/solr.handler.TestReplicationHandler_AE584CE27515D63E-001/solr-instance-001/collection1], dataDir=[/export/home/jenkins/workspace/Lucene-Solr-master-Solaris/solr/build/solr-core/test/J0/temp/solr.handler.TestReplicationHandler_AE584CE27515D63E-001/solr-instance-001/./collection1/data/]
   [junit4]   2> 1501254 INFO  (qtp863784252-13457) [    x:collection1] o.a.s.u.CommitTracker Hard AutoCommit: disabled
   [junit4]   2> 1501254 INFO  (qtp863784252-13457) [    x:collection1] o.a.s.u.CommitTracker Soft AutoCommit: disabled
   [junit4]   2> 1501255 INFO  (qtp863784252-13457) [    x:collection1] o.a.s.s.SolrIndexSearcher Opening [Searcher@2685b25e[collection1] main]
   [junit4]   2> 1501255 INFO  (qtp863784252-13457) [    x:collection1] o.a.s.r.ManagedResourceStorage File-based storage initialized to use dir: /export/home/jenkins/workspace/Lucene-Solr-master-Solaris/solr/build/solr-core/test/J0/temp/solr.handler.TestReplicationHandler_AE584CE27515D63E-001/solr-instance-001/collection1/conf
   [junit4]   2> 1501256 INFO  (qtp863784252-13457) [    x:collection1] o.a.s.h.ReplicationHandler Replication enabled for following config files: schema.xml
   [junit4]   2> 1501256 INFO  (qtp863784252-13457) [    x:collection1] o.a.s.h.ReplicationHandler Commits will be reserved for 10000ms.
   [junit4]   2> 1501259 INFO  (qtp863784252-13457) [    x:collection1] o.a.s.u.RandomMergePolicy RandomMergePolicy wrapping class org.apache.lucene.index.TieredMergePolicy: [TieredMergePolicy: maxMergeAtOnce=27, maxMergeAtOnceExplicit=49, maxMergedSegmentMB=69.4169921875, floorSegmentMB=1.2412109375, forceMergeDeletesPctAllowed=8.19040782526387, segmentsPerTier=24.0, maxCFSSegmentSizeMB=8.796093022207999E12, noCFSRatio=0.3784452969658093
   [junit4]   2> 1501259 INFO  (qtp863784252-13457) [    x:collection1] o.a.s.u.DefaultSolrCoreState New IndexWriter is ready to be used.
   [junit4]   2> 1501260 INFO  (searcherExecutor-2978-thread-1-processing-x:collection1) [    x:collection1] o.a.s.c.SolrCore [collection1] Registered new searcher Searcher@2685b25e[collection1] main{ExitableDirectoryReader(UninvertingDirectoryReader())}
   [junit4]   2> 1501260 INFO  (qtp863784252-13457) [    x:collection1] o.a.s.s.SolrIndexSearcher Opening [Searcher@100af24[collection1] main]
   [junit4]   2> 1501260 INFO  (qtp863784252-13457) [    x:collection1] o.a.s.c.SolrCore [collection1]  CLOSING SolrCore org.apache.solr.core.SolrCore@7332e061
   [junit4]   2> 1501260 INFO  (qtp863784252-13457) [    x:collection1] o.a.s.m.SolrMetricManager Closing metric reporters for registry=solr.core.collection1, tag=1932714081
   [junit4]   2> 1501260 INFO  (qtp863784252-13457) [    x:collection1] o.a.s.m.r.SolrJmxReporter Closing reporter [org.apache.solr.metrics.reporters.SolrJmxReporter@f1ba02f: rootName = null, domain = solr.core.collection1, service url = null, agent id = null] for registry solr.core.collection1 / com.codahale.metrics.MetricRegistry@689ace5a
   [junit4]   2> 1501261 INFO  (searcherExecutor-2978-thread-1-processing-x:collection1) [    x:collection1] o.a.s.c.SolrCore [collection1] Registered new searcher Searcher@100af24[collection1] main{ExitableDirectoryReader(UninvertingDirectoryReader())}
   [junit4]   2> 1501265 INFO  (qtp863784252-13457) [    x:collection1] o.a.s.s.HttpSolrCall [admin] webapp=null path=/admin/cores params={core=collection1&qt=/admin/cores&action=reload&wt=javabin&version=2} status=0 QTime=89
   [junit4]   2> 1501266 INFO  (qtp863784252-13460) [    x:collection1] o.a.s.c.S.Request [collection1]  webapp=/solr path=/replication params={_trace=getIndexVersion&qt=/replication&wt=javabin&version=2&command=indexversion} status=0 QTime=0
   [junit4]   2> 1501266 INFO  (qtp863784252-13462) [    x:collection1] o.a.s.c.S.Request [collection1]  webapp=/solr path=/replication params={_trace=getCommits&qt=/replication&wt=javabin&version=2&command=commits} status=0 QTime=0
   [junit4]   2> 1501267 INFO  (qtp863784252-13463) [    x:collection1] o.a.s.u.p.LogUpdateProcessorFactory [collection1]  webapp=/solr path=/update params={wt=javabin&version=2}{add=[10]} 0 0
   [junit4]   2> 1501270 INFO  (qtp863784252-13464) [    x:collection1] o.a.s.u.p.LogUpdateProcessorFactory [collection1]  webapp=/solr path=/update params={wt=javabin&version=2}{add=[20]} 0 2
   [junit4]   2> 1501271 INFO  (qtp863784252-13457) [    x:collection1] o.a.s.u.DirectUpdateHandler2 start commit{,optimize=false,openSearcher=true,waitSearcher=true,expungeDeletes=false,softCommit=false,prepareCommit=false}
   [junit4]   2> 1501271 INFO  (qtp863784252-13457) [    x:collection1] o.a.s.u.SolrIndexWriter Calling setCommitData with IW:org.apache.solr.update.SolrIndexWriter@7c7e962c commitCommandVersion:0
   [junit4]   2> 1501272 INFO  (qtp863784252-13457) [    x:collection1] o.a.s.s.SolrIndexSearcher Opening [Searcher@cd5125f[collection1] main]
   [junit4]   2> 1501272 INFO  (qtp863784252-13457) [    x:collection1] o.a.s.u.DirectUpdateHandler2 end_commit_flush
   [junit4]   2> 1501273 INFO  (searcherExecutor-2978-thread-1-processing-x:collection1) [    x:collection1] o.a.s.c.SolrCore [collection1] Registered new searcher Searcher@cd5125f[collection1] main{ExitableDirectoryReader(UninvertingDirectoryReader(Uninverting(_0(8.0.0):C2)))}
   [junit4]   2> 1501273 INFO  (qtp863784252-13457) [    x:collection1] o.a.s.u.p.LogUpdateProcessorFactory [collection1]  webapp=/solr path=/update params={waitSearcher=true&commit=true&softCommit=false&wt=javabin&version=2}{commit=} 0 1
   [junit4]   2> 1501273 INFO  (qtp863784252-13459) [    x:collection1] o.a.s.c.S.Request [collection1]  webapp=/solr path=/select params={q=*:*&sort=id+desc&wt=javabin&version=2} hits=2 status=0 QTime=0
   [junit4]   2> 1501274 INFO  (TEST-TestReplicationHandler.doTestReplicateAfterCoreReload-seed#[AE584CE27515D63E]) [    ] o.a.s.h.TestReplicationHandler Waited for 0ms and found 2 docs
   [junit4]   2> 1501274 INFO  (qtp1265301787-13478) [    x:collection1] o.a.s.c.S.Request [collection1]  webapp=/solr path=/select params={q=*:*&sort=id+desc&wt=javabin&version=2} hits=0 status=0 QTime=0
   [junit4]   2> 1501274 INFO  (TEST-TestReplicationHandler.doTestReplicateAfterCoreReload-seed#[AE584CE27515D63E]) [    ] o.a.s.h.TestReplicationHandler Waiting for 2 docs
   [junit4]   2> 1501376 INFO  (qtp1265301787-13479) [    x:collection1] o.a.s.c.S.Request [collection1]  webapp=/solr path=/select params={q=*:*&sort=id+desc&wt=javabin&version=2} hits=0 status=0 QTime=0
   [junit4]   2> 1501376 INFO  (TEST-TestReplicationHandler.doTestReplicateAfterCoreReload-seed#[AE584CE27515D63E]) [    ] o.a.s.h.TestReplicationHandler Waiting for 2 docs
   [junit4]   2> 1501477 INFO  (qtp1265301787-13480) [    x:collection1] o.a.s.c.S.Request [collection1]  webapp=/solr path=/select params={q=*:*&sort=id+desc&wt=javabin&version=2} hits=0 status=0 QTime=0
   [junit4]   2> 1501477 INFO  (TEST-TestReplicationHandler.doTestReplicateAfterCoreReload-seed#[AE584CE27515D63E]) [    ] o.a.s.h.TestReplicationHandler Waiting for 2 docs
   [junit4]   2> 1501578 INFO  (qtp1265301787-13481) [    x:collection1] o.a.s.c.S.Request [collection1]  webapp=/solr path=/select params={q=*:*&sort=id+desc&wt=javabin&version=2} hits=0 status=0 QTime=0
   [junit4]   2> 1501578 INFO  (TEST-TestReplicationHandler.doTestReplicateAfterCoreReload-seed#[AE584CE27515D63E]) [    ] o.a.s.h.TestReplicationHandler Waiting for 2 docs
   [junit4]   2> 1501624 INFO  (qtp863784252-13461) [    x:collection1] o.a.s.c.S.Request [collection1]  webapp=/solr path=/replication params={qt=/replication&wt=javabin&version=2&command=indexversion} status=0 QTime=0
   [junit4]   2> 1501624 INFO  (indexFetcher-2977-thread-1) [    x:collection1] o.a.s.h.IndexFetcher Master's generation: 3
   [junit4]   2> 1501625 INFO  (indexFetcher-2977-thread-1) [    x:collection1] o.a.s.h.IndexFetcher Master's version: 1507153690193
   [junit4]   2> 1501625 INFO  (indexFetcher-2977-thread-1) [    x:collection1] o.a.s.h.IndexFetcher Slave's generation: 1
   [junit4]   2> 1501625 INFO  (indexFetcher-2977-thread-1) [    x:collection1] o.a.s.h.IndexFetcher Slave's version: 0
   [junit4]   2> 1501625 INFO  (indexFetcher-2977-thread-1) [    x:collection1] o.a.s.h.IndexFetcher Starting replication process
   [junit4]   2> 1501627 INFO  (qtp863784252-13461) [    x:collection1] o.a.s.c.S.Request [collection1]  webapp=/solr path=/replication params={generation=3&qt=/replication&wt=javabin&version=2&command=filelist} status=0 QTime=1
   [junit4]   2> 1501627 INFO  (indexFetcher-2977-thread-1) [    x:collection1] o.a.s.h.IndexFetcher Number of files in latest index in master: 10
   [junit4]   2> 1501630 INFO  (indexFetcher-2977-thread-1) [    x:collection1] o.a.s.u.RandomMergePolicy RandomMergePolicy wrapping class org.apache.lucene.index.AlcoholicMergePolicy: [AlcoholicMergePolicy: minMergeSize=0, mergeFactor=10, maxMergeSize=229680935, maxMergeSizeForForcedMerge=9223372036854775807, calibrateSizeByDeletes=true, maxMergeDocs=2147483647, maxCFSSegmentSizeMB=8.796093022207999E12, noCFSRatio=0.1]
   [junit4]   2> 1501633 INFO  (indexFetcher-2977-thread-1) [    x:collection1] o.a.s.u.DefaultSolrCoreState New IndexWriter is ready to be used.
   [junit4]   2> 1501633 INFO  (indexFetcher-2977-thread-1) [    x:collection1] o.a.s.h.IndexFetcher Starting download (fullCopy=false) to MockDirectoryWrapper(RAMDirectory@5ad19eb2 lockFactory=org.apache.lucene.store.SingleInstanceLockFactory@79043286)
   [junit4]   2> 1501633 INFO  (qtp863784252-13462) [    x:collection1] o.a.s.c.S.Request [collection1]  webapp=/solr path=/replication params={generation=3&qt=/replication&file=_0.si&checksum=true&wt=filestream&command=filecontent} status=0 QTime=0
   [junit4]   2> 1501634 INFO  (qtp863784252-13463) [    x:collection1] o.a.s.c.S.Request [collection1]  webapp=/solr path=/replication params={generation=3&qt=/replication&file=_0.nvd&checksum=true&wt=filestream&command=filecontent} status=0 QTime=0
   [junit4]   2> 1501637 INFO  (qtp863784252-13464) [    x:collection1] o.a.s.c.S.Request [collection1]  webapp=/solr path=/replication params={generation=3&qt=/replication&file=_0.tip&checksum=true&wt=filestream&command=filecontent} status=0 QTime=0
   [junit4]   2> 1501638 INFO  (qtp863784252-13457) [    x:collection1] o.a.s.c.S.Request [collection1]  webapp=/solr path=/replication params={generation=3&qt=/replication&file=_0.fdx&checksum=true&wt=filestream&command=filecontent} status=0 QTime=0
   [junit4]   2> 1501639 INFO  (qtp863784252-13459) [    x:collection1] o.a.s.c.S.Request [collection1]  webapp=/solr path=/replication params={generation=3&qt=/replication&file=_0.doc&checksum=true&wt=filestream&command=filecontent} status=0 QTime=0
   [junit4]   2> 1501640 INFO  (qtp863784252-13460) [    x:collection1] o.a.s.c.S.Request [collection1]  webapp=/solr path=/replication params={generation=3&qt=/replication&file=_0.tim&checksum=true&wt=filestream&command=filecontent} status=0 QTime=0
   [junit4]   2> 1501640 INFO  (qtp863784252-13461) [    x:collection1] o.a.s.c.S.Request [collection1]  webapp=/solr path=/replication params={generation=3&qt=/replication&file=_0.fdt&checksum=true&wt=filestream&command=filecontent} status=0 QTime=0
   [junit4]   2> 1501641 INFO  (qtp863784252-13462) [    x:collection1] o.a.s.c.S.Request [collection1]  webapp=/solr path=/replication params={generation=3&qt=/replication&file=_0.fnm&checksum=true&wt=filestream&command=filecontent} status=0 QTime=0
   [junit4]   2> 1501642 INFO  (qtp863784252-13463) [    x:collection1] o.a.s.c.S.Request [collection1]  webapp=/solr path=/replication params={generation=3&qt=/replication&file=_0.nvm&checksum=true&wt=filestream&command=filecontent} status=0 QTime=0
   [junit4]   2> 1501642 INFO  (qtp863784252-13464) [    x:collection1] o.a.s.c.S.Request [collection1]  webapp=/solr path=/replication params={generation=3&qt=/replication&file=segments_3&checksum=true&wt=filestream&command=filecontent} status=0 QTime=0
   [junit4]   2> 1501643 INFO  (indexFetcher-2977-thread-1) [    x:collection1] o.a.s.h.IndexFetcher Total time taken for download (fullCopy=false,bytesDownloaded=1503) : 0 secs (null bytes/sec) to MockDirectoryWrapper(RAMDirectory@5ad19eb2 lockFactory=org.apache.lucene.store.SingleInstanceLockFactory@79043286)
   [junit4]   2> 1501644 INFO  (indexFetcher-2977-thread-1) [    x:collection1] o.a.s.u.RandomMergePolicy RandomMergePolicy wrapping class org.apache.lucene.index.TieredMergePolicy: [TieredMergePolicy: maxMergeAtOnce=10, maxMergeAtOnceExplicit=23, maxMergedSegmentMB=54.041015625, floorSegmentMB=0.8642578125, forceMergeDeletesPctAllowed=11.80472124987806, segmentsPerTier=38.0, maxCFSSegmentSizeMB=8.796093022207999E12, noCFSRatio=0.1663439213008874
   [junit4]   2> 1501647 INFO  (indexFetcher-2977-thread-1) [    x:collection1] o.a.s.u.DefaultSolrCoreState New IndexWriter is ready to be used.
   [junit4]   2> 1501647 INFO  (indexFetcher-2977-thread-1) [    x:collection1] o.a.s.s.SolrIndexSearcher Opening [Searcher@9b5a984[collection1] main]
   [junit4]   2> 1501648 INFO  (searcherExecutor-2973-thread-1-processing-x:collection1) [    x:collection1] o.a.s.c.SolrCore [collection1] Registered new searcher Searcher@9b5a984[collection1] main{ExitableDirectoryReader(UninvertingDirectoryReader(Uninverting(_0(8.0.0):C2)))}
   [junit4]   2> 1501679 INFO  (qtp1265301787-13482) [    x:collection1] o.a.s.c.S.Request [collection1]  webapp=/solr path=/select params={q=*:*&sort=id+desc&wt=javabin&version=2} hits=2 status=0 QTime=0
   [junit4]   2> 1501679 INFO  (TEST-TestReplicationHandler.doTestReplicateAfterCoreReload-seed#[AE584CE27515D63E]) [    ] o.a.s.h.TestReplicationHandler Waited for 400ms and found 2 docs
   [junit4]   2> 1501679 INFO  (TEST-TestReplicationHandler.doTestReplicateAfterCoreReload-seed#[AE584CE27515D63E]) [    ] o.a.s.SolrTestCaseJ4 ###Ending doTestReplicateAfterCoreReload
   [junit4]   2> 1501680 INFO  (TEST-TestReplicationHandler.doTestReplicateAfterCoreReload-seed#[AE584CE27515D63E]) [    ] o.e.j.s.AbstractConnector Stopped ServerConnector@3aa7f59b{HTTP/1.1,[http/1.1]}{127.0.0.1:0}
   [junit4]   2> 1501680 INFO  (TEST-TestReplicationHandler.doTestReplicateAfterCoreReload-seed#[AE584CE27515D63E]) [    ] o.a.s.c.CoreContainer Shutting down CoreContainer instance=980837206
   [junit4]   2> 1501680 INFO  (TEST-TestReplicationHandler.doTestReplicateAfterCoreReload-seed#[AE584CE27515D63E]) [    ] o.a.s.m.SolrMetricManager Closing metric reporters for registry=solr.node, tag=null
   [junit4]   2> 1501680 INFO  (TEST-TestReplicationHandler.doTestReplicateAfterCoreReload-seed#[AE584CE27515D63E]) [    ] o.a.s.m.r.SolrJmxReporter Closing reporter [org.apache.solr.metrics.reporters.SolrJmxReporter@4db30fc6: rootName = null, domain = solr.node, service url = null, agent id = null] for registry solr.node / com.codahale.metrics.MetricRegistry@1e91ac1a
   [junit4]   2> 1501684 INFO  (TEST-TestReplicationHandler.doTestReplicateAfterCoreReload-seed#[AE584CE27515D63E]) [    ] o.a.s.m.SolrMetricManager Closing metric reporters for registry=solr.jvm, tag=null
   [junit4]   2> 1501684 INFO  (TEST-TestReplicationHandler.doTestReplicateAfterCoreReload-seed#[AE584CE27515D63E]) [    ] o.a.s.m.r.SolrJmxReporter Closing reporter [org.apache.solr.metrics.reporters.SolrJmxReporter@220e3046: rootName = null, domain = solr.jvm, service url = null, agent id = null] for registry solr.jvm / com.codahale.metrics.MetricRegistry@5dbd2814
   [junit4]   2> 1501686 INFO  (TEST-TestReplicationHandler.doTestReplicateAfterCoreReload-seed#[AE584CE27515D63E]) [    ] o.a.s.m.SolrMetricManager Closing metric reporters for registry=solr.jetty, tag=null
   [junit4]   2> 1501686 INFO  (TEST-TestReplicationHandler.doTestReplicateAfterCoreReload-seed#[AE584CE27515D63E]) [    ] o.a.s.m.r.SolrJmxReporter Closing reporter [org.apache.solr.metrics.reporters.SolrJmxReporter@446e2522: rootName = null, domain = solr.jetty, service url = null, agent id = null] for registry solr.jetty / com.codahale.metrics.MetricRegistry@17a91bcc
   [junit4]   2> 1501688 INFO  (coreCloseExecutor-2983-thread-1) [    x:collection1] o.a.s.c.SolrCore [collection1]  CLOSING SolrCore org.apache.solr.core.SolrCore@4056a276
   [junit4]   2> 1501688 INFO  (coreCloseExecutor-2983-thread-1) [    x:collection1] o.a.s.m.SolrMetricManager Closing metric reporters for registry=solr.core.collection1, tag=1079419510
   [junit4]   2> 1501688 INFO  (coreCloseExecutor-2983-thread-1) [    x:collection1] o.a.s.m.r.SolrJmxReporter Closing reporter [org.apache.solr.metrics.reporters.SolrJmxReporter@601bf468: rootName = null, domain

[...truncated too long message...]

sUnloadDistributedZkTest, CollectionsAPIAsyncDistributedZkTest, AutoScalingHandlerTest, ZkCLITest, DistribDocExpirationUpdateProcessorTest, TestScoreJoinQPScore, TestSolrCoreSnapshots, SimplePostToolTest, TestXIncludeConfig, TestRecoveryHdfs, PrimitiveFieldTypeTest, TestConfigSetImmutable, RecoveryAfterSoftCommitTest, FastVectorHighlighterTest, TimeZoneUtilsTest, BlockJoinFacetRandomTest, OverseerTest, TestSlowCompositeReaderWrapper, TestQueryWrapperFilter, SolrInfoBeanTest, BufferStoreTest, SearchHandlerTest, RAMDirectoryFactoryTest, TestLFUCache, UniqFieldsUpdateProcessorFactoryTest, DistributedDebugComponentTest, TestFunctionQuery, TestRTimerTree, TestXmlQParserPlugin, SSLMigrationTest, TestManagedResourceStorage, AssignTest, TestCursorMarkWithoutUniqueKey, RecoveryZkTest, TestSha256AuthenticationProvider, ClusterStateUpdateTest, RestartWhileUpdatingTest, TestCloudRecovery, TestTestInjection, TestBinaryResponseWriter, CloudExitableDirectoryReaderTest, UUIDUpdateProcessorFallbackTest, CSVRequestHandlerTest, TestHalfAndHalfDocValues, TestPseudoReturnFields, BJQParserTest, CustomCollectionTest, InfixSuggestersTest, AnalysisAfterCoreReloadTest, ShardRoutingTest, ReplaceNodeTest, OutOfBoxZkACLAndCredentialsProvidersTest, TestClassicSimilarityFactory, CoreAdminRequestStatusTest, DirectUpdateHandlerOptimizeTest, HdfsBasicDistributedZk2Test, TestLegacyFieldCache, TestUseDocValuesAsStored2, ExecutePlanActionTest, AtomicUpdateProcessorFactoryTest, TestSolrConfigHandlerConcurrent, TestTolerantSearch, SegmentsInfoRequestHandlerTest, SolrIndexSplitterTest, SyncSliceTest, ScriptEngineTest, SuggestComponentContextFilterQueryTest, AddBlockUpdateTest, MoveReplicaHDFSTest, DateFieldTest, TestRawTransformer, TestReplicationHandler, DistributedQueueTest, DistributedSuggestComponentTest, NodeLostTriggerTest, DocValuesTest, TestHashQParserPlugin, TestBinaryField, TestSweetSpotSimilarityFactory, TestWriterPerf, HdfsLockFactoryTest, TestLegacyNumericUtils, ParsingFieldUpdateProcessorsTest, SuggesterWFSTTest, UUIDFieldTest, TestSubQueryTransformerDistrib, TestCoreContainer, TestSolrCoreProperties, TestCloudPivotFacet, SolrCloudExampleTest, TestDFRSimilarityFactory, XmlUpdateRequestHandlerTest, SolrGraphiteReporterTest, SolrCoreTest, TestNoOpRegenerator, TestReversedWildcardFilterFactory, CurrencyFieldTypeTest, TestRestoreCore, GraphQueryTest, ClusterStateTest, DefaultValueUpdateProcessorTest, TestSchemaSimilarityResource, RequestHandlersTest, TestPolicyCloud, TestSolrDeletionPolicy2, TestSerializedLuceneMatchVersion, MultiThreadedOCPTest, HighlighterTest, TestDocBasedVersionConstraints, RulesTest, TestJmxIntegration, HighlighterConfigTest, TestRequestForwarding, SolrTestCaseJ4Test, TestOnReconnectListenerSupport, DistributedSpellCheckComponentTest, TestManagedStopFilterFactory, TestCodecSupport, TestRandomDVFaceting, TestStressRecovery, NotRequiredUniqueKeyTest, ResponseLogComponentTest, TestManagedSchemaAPI, TestSQLHandlerNonCloud, TestIntervalFaceting, TestStressCloudBlindAtomicUpdates, HealthCheckHandlerTest, DistributedFacetPivotLongTailTest, TestCustomSort, TestConfigSetsAPIExclusivity, TestDistributedStatsComponentCardinality, BasicAuthIntegrationTest, TestQuerySenderListener, TestMultiValuedNumericRangeQuery, MissingSegmentRecoveryTest, TestPhraseSuggestions, TestAuthenticationFramework, TestCloudInspectUtil, TestStressVersions, ChaosMonkeyNothingIsSafeTest, TestGraphMLResponseWriter, TestOrdValues, TestLockTree, QueryParsingTest, TestExportWriter, TestExclusionRuleCollectionAccess, DistributedFacetExistsSmallTest, TestBulkSchemaAPI, TestUpdate, TestSubQueryTransformer, OverseerTaskQueueTest, TestFreeTextSuggestions, TestSearcherReuse, DisMaxRequestHandlerTest, CollectionStateFormat2Test, MetricsConfigTest, SuggesterTest, TestReloadAndDeleteDocs, TestSolrCloudWithKerberosAlt, TestStressLiveNodes, TestIBSimilarityFactory, TestConfigsApi, OpenCloseCoreStressTest, FullSolrCloudDistribCmdsTest, TestRandomFaceting, LeaderElectionTest, TestZkChroot, ShardRoutingCustomTest, TestDistributedGrouping, TestFaceting, TestRecovery, TestHashPartitioner, TestRealTimeGet, TestJoin, HardAutoCommitTest, TestRangeQuery, ConvertedLegacyTest, TestSort, TestFiltering, TestLazyCores, ShowFileRequestHandlerTest, TestCoreDiscovery, TestExtendedDismaxParser, SpellCheckCollatorTest, SuggesterFSTTest, CoreAdminHandlerTest, TestFoldingMultitermQuery, TestStressLucene, TestTrie, SpatialFilterTest, PolyFieldTest, NoCacheHeaderTest, WordBreakSolrSpellCheckerTest, SchemaVersionSpecificBehaviorTest, SortByFunctionTest, TestRemoteStreaming, DocValuesMultiTest, DistanceFunctionTest, TestSolrDeletionPolicy1, XsltUpdateRequestHandlerTest, DebugComponentTest, CacheHeaderTest, IndexBasedSpellCheckerTest, TestSurroundQueryParser, LukeRequestHandlerTest, DirectSolrSpellCheckerTest, TestOmitPositions, TermsComponentTest, PathHierarchyTokenizerFactoryTest, TestIndexingPerformance, MoreLikeThisHandlerTest, RequiredFieldsTest, FieldAnalysisRequestHandlerTest, IndexSchemaRuntimeFieldTest, SolrPluginUtilsTest, IndexSchemaTest, TestCollationField, ReturnFieldsTest, UpdateRequestProcessorFactoryTest, TestCSVResponseWriter, BinaryUpdateRequestHandlerTest, TestPartialUpdateDeduplication, TestPHPSerializedResponseWriter, TestComponentsName, SearchHandlerTest, TestDistributedMissingSort, ActionThrottleTest, AliasIntegrationTest, AsyncCallRequestStatusResponseTest, BaseCdcrDistributedZkTest, CdcrBootstrapTest]
   [junit4]   2> NOTE: reproduce with: ant test  -Dtestcase=CdcrBootstrapTest -Dtests.seed=AE584CE27515D63E -Dtests.slow=true -Dtests.locale=es-CU -Dtests.timezone=Africa/Sao_Tome -Dtests.asserts=true -Dtests.file.encoding=UTF-8
   [junit4] ERROR   0.00s J0 | CdcrBootstrapTest (suite) <<<
   [junit4]    > Throwable #1: com.carrotsearch.randomizedtesting.ThreadLeakError: 4 threads leaked from SUITE scope at org.apache.solr.cloud.CdcrBootstrapTest: 
   [junit4]    >    1) Thread[id=27281, name=Thread-6704, state=WAITING, group=TGRP-CdcrBootstrapTest]
   [junit4]    >         at java.lang.Object.wait(Native Method)
   [junit4]    >         at java.lang.Thread.join(Thread.java:1252)
   [junit4]    >         at java.lang.Thread.join(Thread.java:1326)
   [junit4]    >         at org.apache.zookeeper.server.NIOServerCnxnFactory.join(NIOServerCnxnFactory.java:297)
   [junit4]    >         at org.apache.solr.cloud.ZkTestServer$ZKServerMain.runFromConfig(ZkTestServer.java:309)
   [junit4]    >         at org.apache.solr.cloud.ZkTestServer$2.run(ZkTestServer.java:490)
   [junit4]    >    2) Thread[id=27285, name=ProcessThread(sid:0 cport:42976):, state=WAITING, group=TGRP-CdcrBootstrapTest]
   [junit4]    >         at sun.misc.Unsafe.park(Native Method)
   [junit4]    >         at java.util.concurrent.locks.LockSupport.park(LockSupport.java:175)
   [junit4]    >         at java.util.concurrent.locks.AbstractQueuedSynchronizer$ConditionObject.await(AbstractQueuedSynchronizer.java:2039)
   [junit4]    >         at java.util.concurrent.LinkedBlockingQueue.take(LinkedBlockingQueue.java:442)
   [junit4]    >         at org.apache.zookeeper.server.PrepRequestProcessor.run(PrepRequestProcessor.java:122)
   [junit4]    >    3) Thread[id=27282, name=NIOServerCxn.Factory:0.0.0.0/0.0.0.0:0, state=RUNNABLE, group=TGRP-CdcrBootstrapTest]
   [junit4]    >         at sun.nio.ch.DevPollArrayWrapper.poll0(Native Method)
   [junit4]    >         at sun.nio.ch.DevPollArrayWrapper.poll(DevPollArrayWrapper.java:223)
   [junit4]    >         at sun.nio.ch.DevPollSelectorImpl.doSelect(DevPollSelectorImpl.java:98)
   [junit4]    >         at sun.nio.ch.SelectorImpl.lockAndDoSelect(SelectorImpl.java:86)
   [junit4]    >         at sun.nio.ch.SelectorImpl.select(SelectorImpl.java:97)
   [junit4]    >         at org.apache.zookeeper.server.NIOServerCnxnFactory.run(NIOServerCnxnFactory.java:173)
   [junit4]    >         at java.lang.Thread.run(Thread.java:748)
   [junit4]    >    4) Thread[id=27283, name=SessionTracker, state=TIMED_WAITING, group=TGRP-CdcrBootstrapTest]
   [junit4]    >         at java.lang.Object.wait(Native Method)
   [junit4]    >         at org.apache.zookeeper.server.SessionTrackerImpl.run(SessionTrackerImpl.java:146)
   [junit4]    > 	at __randomizedtesting.SeedInfo.seed([AE584CE27515D63E]:0)Throwable #2: com.carrotsearch.randomizedtesting.ThreadLeakError: There are still zombie threads that couldn't be terminated:
   [junit4]    >    1) Thread[id=27282, name=NIOServerCxn.Factory:0.0.0.0/0.0.0.0:0, state=RUNNABLE, group=TGRP-CdcrBootstrapTest]
   [junit4]    >         at sun.nio.ch.IOUtil.drain(Native Method)
   [junit4]    >         at sun.nio.ch.DevPollSelectorImpl.doSelect(DevPollSelectorImpl.java:109)
   [junit4]    >         at sun.nio.ch.SelectorImpl.lockAndDoSelect(SelectorImpl.java:86)
   [junit4]    >         at sun.nio.ch.SelectorImpl.select(SelectorImpl.java:97)
   [junit4]    >         at org.apache.zookeeper.server.NIOServerCnxnFactory.run(NIOServerCnxnFactory.java:173)
   [junit4]    >         at java.lang.Thread.run(Thread.java:748)
   [junit4]    > 	at __randomizedtesting.SeedInfo.seed([AE584CE27515D63E]:0)
   [junit4] Completed [512/745 (4!)] on J0 in 122.33s, 3 tests, 3 errors <<< FAILURES!

[...truncated 47641 lines...]
BUILD FAILED
/export/home/jenkins/workspace/Lucene-Solr-master-Solaris/build.xml:826: The following error occurred while executing this line:
/export/home/jenkins/workspace/Lucene-Solr-master-Solaris/build.xml:706: The following error occurred while executing this line:
/export/home/jenkins/workspace/Lucene-Solr-master-Solaris/build.xml:693: Source checkout is dirty (unversioned/missing files) after running tests!!! Offending files:
* lucene/licenses/morfologik-ukrainian-search-3.7.5.jar.sha1

Total time: 77 minutes 50 seconds
Build step 'Invoke Ant' marked build as failure
Archiving artifacts
[WARNINGS] Skipping publisher since build result is FAILURE
Recording test results
Email was triggered for: Failure - Any
Sending email for trigger: Failure - Any

Mime
View raw message