lucene-dev mailing list archives

Site index · List index
Message view « Date » · « Thread »
Top « Date » · « Thread »
From Policeman Jenkins Server <jenk...@thetaphi.de>
Subject [JENKINS] Lucene-Solr-7.x-MacOSX (64bit/jdk-9) - Build # 238 - Unstable!
Date Wed, 11 Oct 2017 01:40:17 GMT
Build: https://jenkins.thetaphi.de/job/Lucene-Solr-7.x-MacOSX/238/
Java: 64bit/jdk-9 -XX:+UseCompressedOops -XX:+UseParallelGC --illegal-access=deny

3 tests failed.
FAILED:  org.apache.solr.cloud.FullSolrCloudDistribCmdsTest.test

Error Message:
Could not find collection:collection2

Stack Trace:
java.lang.AssertionError: Could not find collection:collection2
	at __randomizedtesting.SeedInfo.seed([5960603EC3CF7CD1:D1345FE46D331129]:0)
	at org.junit.Assert.fail(Assert.java:93)
	at org.junit.Assert.assertTrue(Assert.java:43)
	at org.junit.Assert.assertNotNull(Assert.java:526)
	at org.apache.solr.cloud.AbstractDistribZkTestBase.waitForRecoveriesToFinish(AbstractDistribZkTestBase.java:155)
	at org.apache.solr.cloud.AbstractDistribZkTestBase.waitForRecoveriesToFinish(AbstractDistribZkTestBase.java:140)
	at org.apache.solr.cloud.AbstractDistribZkTestBase.waitForRecoveriesToFinish(AbstractDistribZkTestBase.java:135)
	at org.apache.solr.cloud.AbstractFullDistribZkTestBase.waitForRecoveriesToFinish(AbstractFullDistribZkTestBase.java:908)
	at org.apache.solr.cloud.FullSolrCloudDistribCmdsTest.testIndexingBatchPerRequestWithHttpSolrClient(FullSolrCloudDistribCmdsTest.java:612)
	at org.apache.solr.cloud.FullSolrCloudDistribCmdsTest.test(FullSolrCloudDistribCmdsTest.java:152)
	at java.base/jdk.internal.reflect.NativeMethodAccessorImpl.invoke0(Native Method)
	at java.base/jdk.internal.reflect.NativeMethodAccessorImpl.invoke(NativeMethodAccessorImpl.java:62)
	at java.base/jdk.internal.reflect.DelegatingMethodAccessorImpl.invoke(DelegatingMethodAccessorImpl.java:43)
	at java.base/java.lang.reflect.Method.invoke(Method.java:564)
	at com.carrotsearch.randomizedtesting.RandomizedRunner.invoke(RandomizedRunner.java:1737)
	at com.carrotsearch.randomizedtesting.RandomizedRunner$8.evaluate(RandomizedRunner.java:934)
	at com.carrotsearch.randomizedtesting.RandomizedRunner$9.evaluate(RandomizedRunner.java:970)
	at com.carrotsearch.randomizedtesting.RandomizedRunner$10.evaluate(RandomizedRunner.java:984)
	at org.apache.solr.BaseDistributedSearchTestCase$ShardsRepeatRule$ShardsFixedStatement.callStatement(BaseDistributedSearchTestCase.java:993)
	at org.apache.solr.BaseDistributedSearchTestCase$ShardsRepeatRule$ShardsStatement.evaluate(BaseDistributedSearchTestCase.java:968)
	at com.carrotsearch.randomizedtesting.rules.SystemPropertiesRestoreRule$1.evaluate(SystemPropertiesRestoreRule.java:57)
	at org.apache.lucene.util.TestRuleSetupTeardownChained$1.evaluate(TestRuleSetupTeardownChained.java:49)
	at org.apache.lucene.util.AbstractBeforeAfterRule$1.evaluate(AbstractBeforeAfterRule.java:45)
	at org.apache.lucene.util.TestRuleThreadAndTestName$1.evaluate(TestRuleThreadAndTestName.java:48)
	at org.apache.lucene.util.TestRuleIgnoreAfterMaxFailures$1.evaluate(TestRuleIgnoreAfterMaxFailures.java:64)
	at org.apache.lucene.util.TestRuleMarkFailure$1.evaluate(TestRuleMarkFailure.java:47)
	at com.carrotsearch.randomizedtesting.rules.StatementAdapter.evaluate(StatementAdapter.java:36)
	at com.carrotsearch.randomizedtesting.ThreadLeakControl$StatementRunner.run(ThreadLeakControl.java:368)
	at com.carrotsearch.randomizedtesting.ThreadLeakControl.forkTimeoutingTask(ThreadLeakControl.java:817)
	at com.carrotsearch.randomizedtesting.ThreadLeakControl$3.evaluate(ThreadLeakControl.java:468)
	at com.carrotsearch.randomizedtesting.RandomizedRunner.runSingleTest(RandomizedRunner.java:943)
	at com.carrotsearch.randomizedtesting.RandomizedRunner$5.evaluate(RandomizedRunner.java:829)
	at com.carrotsearch.randomizedtesting.RandomizedRunner$6.evaluate(RandomizedRunner.java:879)
	at com.carrotsearch.randomizedtesting.RandomizedRunner$7.evaluate(RandomizedRunner.java:890)
	at com.carrotsearch.randomizedtesting.rules.StatementAdapter.evaluate(StatementAdapter.java:36)
	at com.carrotsearch.randomizedtesting.rules.SystemPropertiesRestoreRule$1.evaluate(SystemPropertiesRestoreRule.java:57)
	at org.apache.lucene.util.AbstractBeforeAfterRule$1.evaluate(AbstractBeforeAfterRule.java:45)
	at com.carrotsearch.randomizedtesting.rules.StatementAdapter.evaluate(StatementAdapter.java:36)
	at org.apache.lucene.util.TestRuleStoreClassName$1.evaluate(TestRuleStoreClassName.java:41)
	at com.carrotsearch.randomizedtesting.rules.NoShadowingOrOverridesOnMethodsRule$1.evaluate(NoShadowingOrOverridesOnMethodsRule.java:40)
	at com.carrotsearch.randomizedtesting.rules.NoShadowingOrOverridesOnMethodsRule$1.evaluate(NoShadowingOrOverridesOnMethodsRule.java:40)
	at com.carrotsearch.randomizedtesting.rules.StatementAdapter.evaluate(StatementAdapter.java:36)
	at com.carrotsearch.randomizedtesting.rules.StatementAdapter.evaluate(StatementAdapter.java:36)
	at org.apache.lucene.util.TestRuleAssertionsRequired$1.evaluate(TestRuleAssertionsRequired.java:53)
	at org.apache.lucene.util.TestRuleMarkFailure$1.evaluate(TestRuleMarkFailure.java:47)
	at org.apache.lucene.util.TestRuleIgnoreAfterMaxFailures$1.evaluate(TestRuleIgnoreAfterMaxFailures.java:64)
	at org.apache.lucene.util.TestRuleIgnoreTestSuites$1.evaluate(TestRuleIgnoreTestSuites.java:54)
	at com.carrotsearch.randomizedtesting.rules.StatementAdapter.evaluate(StatementAdapter.java:36)
	at com.carrotsearch.randomizedtesting.ThreadLeakControl$StatementRunner.run(ThreadLeakControl.java:368)
	at java.base/java.lang.Thread.run(Thread.java:844)


FAILED:  org.apache.solr.cloud.TestTlogReplica.testOutOfOrderDBQWithInPlaceUpdates

Error Message:
Can not find doc 1 in http://127.0.0.1:53910/solr

Stack Trace:
java.lang.AssertionError: Can not find doc 1 in http://127.0.0.1:53910/solr
	at __randomizedtesting.SeedInfo.seed([5960603EC3CF7CD1:DFA198D39C9EAA31]:0)
	at org.junit.Assert.fail(Assert.java:93)
	at org.junit.Assert.assertTrue(Assert.java:43)
	at org.junit.Assert.assertNotNull(Assert.java:526)
	at org.apache.solr.cloud.TestTlogReplica.checkRTG(TestTlogReplica.java:861)
	at org.apache.solr.cloud.TestTlogReplica.testOutOfOrderDBQWithInPlaceUpdates(TestTlogReplica.java:664)
	at java.base/jdk.internal.reflect.NativeMethodAccessorImpl.invoke0(Native Method)
	at java.base/jdk.internal.reflect.NativeMethodAccessorImpl.invoke(NativeMethodAccessorImpl.java:62)
	at java.base/jdk.internal.reflect.DelegatingMethodAccessorImpl.invoke(DelegatingMethodAccessorImpl.java:43)
	at java.base/java.lang.reflect.Method.invoke(Method.java:564)
	at com.carrotsearch.randomizedtesting.RandomizedRunner.invoke(RandomizedRunner.java:1737)
	at com.carrotsearch.randomizedtesting.RandomizedRunner$8.evaluate(RandomizedRunner.java:934)
	at com.carrotsearch.randomizedtesting.RandomizedRunner$9.evaluate(RandomizedRunner.java:970)
	at com.carrotsearch.randomizedtesting.RandomizedRunner$10.evaluate(RandomizedRunner.java:984)
	at com.carrotsearch.randomizedtesting.rules.SystemPropertiesRestoreRule$1.evaluate(SystemPropertiesRestoreRule.java:57)
	at org.apache.lucene.util.TestRuleSetupTeardownChained$1.evaluate(TestRuleSetupTeardownChained.java:49)
	at org.apache.lucene.util.AbstractBeforeAfterRule$1.evaluate(AbstractBeforeAfterRule.java:45)
	at org.apache.lucene.util.TestRuleThreadAndTestName$1.evaluate(TestRuleThreadAndTestName.java:48)
	at org.apache.lucene.util.TestRuleIgnoreAfterMaxFailures$1.evaluate(TestRuleIgnoreAfterMaxFailures.java:64)
	at org.apache.lucene.util.TestRuleMarkFailure$1.evaluate(TestRuleMarkFailure.java:47)
	at com.carrotsearch.randomizedtesting.rules.StatementAdapter.evaluate(StatementAdapter.java:36)
	at com.carrotsearch.randomizedtesting.ThreadLeakControl$StatementRunner.run(ThreadLeakControl.java:368)
	at com.carrotsearch.randomizedtesting.ThreadLeakControl.forkTimeoutingTask(ThreadLeakControl.java:817)
	at com.carrotsearch.randomizedtesting.ThreadLeakControl$3.evaluate(ThreadLeakControl.java:468)
	at com.carrotsearch.randomizedtesting.RandomizedRunner.runSingleTest(RandomizedRunner.java:943)
	at com.carrotsearch.randomizedtesting.RandomizedRunner$5.evaluate(RandomizedRunner.java:829)
	at com.carrotsearch.randomizedtesting.RandomizedRunner$6.evaluate(RandomizedRunner.java:879)
	at com.carrotsearch.randomizedtesting.RandomizedRunner$7.evaluate(RandomizedRunner.java:890)
	at com.carrotsearch.randomizedtesting.rules.StatementAdapter.evaluate(StatementAdapter.java:36)
	at com.carrotsearch.randomizedtesting.rules.SystemPropertiesRestoreRule$1.evaluate(SystemPropertiesRestoreRule.java:57)
	at org.apache.lucene.util.AbstractBeforeAfterRule$1.evaluate(AbstractBeforeAfterRule.java:45)
	at com.carrotsearch.randomizedtesting.rules.StatementAdapter.evaluate(StatementAdapter.java:36)
	at org.apache.lucene.util.TestRuleStoreClassName$1.evaluate(TestRuleStoreClassName.java:41)
	at com.carrotsearch.randomizedtesting.rules.NoShadowingOrOverridesOnMethodsRule$1.evaluate(NoShadowingOrOverridesOnMethodsRule.java:40)
	at com.carrotsearch.randomizedtesting.rules.NoShadowingOrOverridesOnMethodsRule$1.evaluate(NoShadowingOrOverridesOnMethodsRule.java:40)
	at com.carrotsearch.randomizedtesting.rules.StatementAdapter.evaluate(StatementAdapter.java:36)
	at com.carrotsearch.randomizedtesting.rules.StatementAdapter.evaluate(StatementAdapter.java:36)
	at org.apache.lucene.util.TestRuleAssertionsRequired$1.evaluate(TestRuleAssertionsRequired.java:53)
	at org.apache.lucene.util.TestRuleMarkFailure$1.evaluate(TestRuleMarkFailure.java:47)
	at org.apache.lucene.util.TestRuleIgnoreAfterMaxFailures$1.evaluate(TestRuleIgnoreAfterMaxFailures.java:64)
	at org.apache.lucene.util.TestRuleIgnoreTestSuites$1.evaluate(TestRuleIgnoreTestSuites.java:54)
	at com.carrotsearch.randomizedtesting.rules.StatementAdapter.evaluate(StatementAdapter.java:36)
	at com.carrotsearch.randomizedtesting.ThreadLeakControl$StatementRunner.run(ThreadLeakControl.java:368)
	at java.base/java.lang.Thread.run(Thread.java:844)


FAILED:  org.apache.solr.cloud.TestTlogReplica.testOnlyLeaderIndexes

Error Message:
Can not find doc 2 in http://127.0.0.1:53910/solr

Stack Trace:
java.lang.AssertionError: Can not find doc 2 in http://127.0.0.1:53910/solr
	at __randomizedtesting.SeedInfo.seed([5960603EC3CF7CD1:45611DB3B66A0242]:0)
	at org.junit.Assert.fail(Assert.java:93)
	at org.junit.Assert.assertTrue(Assert.java:43)
	at org.junit.Assert.assertNotNull(Assert.java:526)
	at org.apache.solr.cloud.TestTlogReplica.checkRTG(TestTlogReplica.java:861)
	at org.apache.solr.cloud.TestTlogReplica.testOnlyLeaderIndexes(TestTlogReplica.java:483)
	at java.base/jdk.internal.reflect.NativeMethodAccessorImpl.invoke0(Native Method)
	at java.base/jdk.internal.reflect.NativeMethodAccessorImpl.invoke(NativeMethodAccessorImpl.java:62)
	at java.base/jdk.internal.reflect.DelegatingMethodAccessorImpl.invoke(DelegatingMethodAccessorImpl.java:43)
	at java.base/java.lang.reflect.Method.invoke(Method.java:564)
	at com.carrotsearch.randomizedtesting.RandomizedRunner.invoke(RandomizedRunner.java:1737)
	at com.carrotsearch.randomizedtesting.RandomizedRunner$8.evaluate(RandomizedRunner.java:934)
	at com.carrotsearch.randomizedtesting.RandomizedRunner$9.evaluate(RandomizedRunner.java:970)
	at com.carrotsearch.randomizedtesting.RandomizedRunner$10.evaluate(RandomizedRunner.java:984)
	at com.carrotsearch.randomizedtesting.rules.SystemPropertiesRestoreRule$1.evaluate(SystemPropertiesRestoreRule.java:57)
	at org.apache.lucene.util.TestRuleSetupTeardownChained$1.evaluate(TestRuleSetupTeardownChained.java:49)
	at org.apache.lucene.util.AbstractBeforeAfterRule$1.evaluate(AbstractBeforeAfterRule.java:45)
	at org.apache.lucene.util.TestRuleThreadAndTestName$1.evaluate(TestRuleThreadAndTestName.java:48)
	at org.apache.lucene.util.TestRuleIgnoreAfterMaxFailures$1.evaluate(TestRuleIgnoreAfterMaxFailures.java:64)
	at org.apache.lucene.util.TestRuleMarkFailure$1.evaluate(TestRuleMarkFailure.java:47)
	at com.carrotsearch.randomizedtesting.rules.StatementAdapter.evaluate(StatementAdapter.java:36)
	at com.carrotsearch.randomizedtesting.ThreadLeakControl$StatementRunner.run(ThreadLeakControl.java:368)
	at com.carrotsearch.randomizedtesting.ThreadLeakControl.forkTimeoutingTask(ThreadLeakControl.java:817)
	at com.carrotsearch.randomizedtesting.ThreadLeakControl$3.evaluate(ThreadLeakControl.java:468)
	at com.carrotsearch.randomizedtesting.RandomizedRunner.runSingleTest(RandomizedRunner.java:943)
	at com.carrotsearch.randomizedtesting.RandomizedRunner$5.evaluate(RandomizedRunner.java:829)
	at com.carrotsearch.randomizedtesting.RandomizedRunner$6.evaluate(RandomizedRunner.java:879)
	at com.carrotsearch.randomizedtesting.RandomizedRunner$7.evaluate(RandomizedRunner.java:890)
	at com.carrotsearch.randomizedtesting.rules.StatementAdapter.evaluate(StatementAdapter.java:36)
	at com.carrotsearch.randomizedtesting.rules.SystemPropertiesRestoreRule$1.evaluate(SystemPropertiesRestoreRule.java:57)
	at org.apache.lucene.util.AbstractBeforeAfterRule$1.evaluate(AbstractBeforeAfterRule.java:45)
	at com.carrotsearch.randomizedtesting.rules.StatementAdapter.evaluate(StatementAdapter.java:36)
	at org.apache.lucene.util.TestRuleStoreClassName$1.evaluate(TestRuleStoreClassName.java:41)
	at com.carrotsearch.randomizedtesting.rules.NoShadowingOrOverridesOnMethodsRule$1.evaluate(NoShadowingOrOverridesOnMethodsRule.java:40)
	at com.carrotsearch.randomizedtesting.rules.NoShadowingOrOverridesOnMethodsRule$1.evaluate(NoShadowingOrOverridesOnMethodsRule.java:40)
	at com.carrotsearch.randomizedtesting.rules.StatementAdapter.evaluate(StatementAdapter.java:36)
	at com.carrotsearch.randomizedtesting.rules.StatementAdapter.evaluate(StatementAdapter.java:36)
	at org.apache.lucene.util.TestRuleAssertionsRequired$1.evaluate(TestRuleAssertionsRequired.java:53)
	at org.apache.lucene.util.TestRuleMarkFailure$1.evaluate(TestRuleMarkFailure.java:47)
	at org.apache.lucene.util.TestRuleIgnoreAfterMaxFailures$1.evaluate(TestRuleIgnoreAfterMaxFailures.java:64)
	at org.apache.lucene.util.TestRuleIgnoreTestSuites$1.evaluate(TestRuleIgnoreTestSuites.java:54)
	at com.carrotsearch.randomizedtesting.rules.StatementAdapter.evaluate(StatementAdapter.java:36)
	at com.carrotsearch.randomizedtesting.ThreadLeakControl$StatementRunner.run(ThreadLeakControl.java:368)
	at java.base/java.lang.Thread.run(Thread.java:844)




Build Log:
[...truncated 12733 lines...]
   [junit4] Suite: org.apache.solr.cloud.FullSolrCloudDistribCmdsTest
   [junit4]   2> 2078374 INFO  (SUITE-FullSolrCloudDistribCmdsTest-seed#[5960603EC3CF7CD1]-worker) [    ] o.a.s.SolrTestCaseJ4 SecureRandom sanity checks: test.solr.allowed.securerandom=null & java.security.egd=file:/dev/./urandom
   [junit4]   2> Creating dataDir: /Users/jenkins/workspace/Lucene-Solr-7.x-MacOSX/solr/build/solr-core/test/J0/temp/solr.cloud.FullSolrCloudDistribCmdsTest_5960603EC3CF7CD1-001/init-core-data-001
   [junit4]   2> 2078374 WARN  (SUITE-FullSolrCloudDistribCmdsTest-seed#[5960603EC3CF7CD1]-worker) [    ] o.a.s.SolrTestCaseJ4 startTrackingSearchers: numOpens=11 numCloses=11
   [junit4]   2> 2078374 INFO  (SUITE-FullSolrCloudDistribCmdsTest-seed#[5960603EC3CF7CD1]-worker) [    ] o.a.s.SolrTestCaseJ4 Using PointFields (NUMERIC_POINTS_SYSPROP=true) w/NUMERIC_DOCVALUES_SYSPROP=true
   [junit4]   2> 2078375 INFO  (SUITE-FullSolrCloudDistribCmdsTest-seed#[5960603EC3CF7CD1]-worker) [    ] o.a.s.SolrTestCaseJ4 Randomized ssl (false) and clientAuth (false) via: @org.apache.solr.SolrTestCaseJ4$SuppressSSL(bugUrl="https://issues.apache.org/jira/browse/SOLR-5776") w/ MAC_OS_X supressed clientAuth
   [junit4]   2> 2078375 INFO  (SUITE-FullSolrCloudDistribCmdsTest-seed#[5960603EC3CF7CD1]-worker) [    ] o.a.s.BaseDistributedSearchTestCase Setting hostContext system property: /no_/g
   [junit4]   2> 2078376 INFO  (TEST-FullSolrCloudDistribCmdsTest.test-seed#[5960603EC3CF7CD1]) [    ] o.a.s.c.ZkTestServer STARTING ZK TEST SERVER
   [junit4]   2> 2078376 INFO  (Thread-3389) [    ] o.a.s.c.ZkTestServer client port:0.0.0.0/0.0.0.0:0
   [junit4]   2> 2078376 INFO  (Thread-3389) [    ] o.a.s.c.ZkTestServer Starting server
   [junit4]   2> 2078378 ERROR (Thread-3389) [    ] o.a.z.s.ZooKeeperServer ZKShutdownHandler is not registered, so ZooKeeper server won't take any action on ERROR or SHUTDOWN server state changes
   [junit4]   2> 2078486 INFO  (TEST-FullSolrCloudDistribCmdsTest.test-seed#[5960603EC3CF7CD1]) [    ] o.a.s.c.ZkTestServer start zk server on port:49169
   [junit4]   2> 2078563 INFO  (TEST-FullSolrCloudDistribCmdsTest.test-seed#[5960603EC3CF7CD1]) [    ] o.a.s.c.AbstractZkTestCase put /Users/jenkins/workspace/Lucene-Solr-7.x-MacOSX/solr/core/src/test-files/solr/collection1/conf/solrconfig-tlog.xml to /configs/conf1/solrconfig.xml
   [junit4]   2> 2078570 INFO  (TEST-FullSolrCloudDistribCmdsTest.test-seed#[5960603EC3CF7CD1]) [    ] o.a.s.c.AbstractZkTestCase put /Users/jenkins/workspace/Lucene-Solr-7.x-MacOSX/solr/core/src/test-files/solr/collection1/conf/schema15.xml to /configs/conf1/schema.xml
   [junit4]   2> 2078577 INFO  (TEST-FullSolrCloudDistribCmdsTest.test-seed#[5960603EC3CF7CD1]) [    ] o.a.s.c.AbstractZkTestCase put /Users/jenkins/workspace/Lucene-Solr-7.x-MacOSX/solr/core/src/test-files/solr/collection1/conf/solrconfig.snippet.randomindexconfig.xml to /configs/conf1/solrconfig.snippet.randomindexconfig.xml
   [junit4]   2> 2078582 INFO  (TEST-FullSolrCloudDistribCmdsTest.test-seed#[5960603EC3CF7CD1]) [    ] o.a.s.c.AbstractZkTestCase put /Users/jenkins/workspace/Lucene-Solr-7.x-MacOSX/solr/core/src/test-files/solr/collection1/conf/stopwords.txt to /configs/conf1/stopwords.txt
   [junit4]   2> 2078587 INFO  (TEST-FullSolrCloudDistribCmdsTest.test-seed#[5960603EC3CF7CD1]) [    ] o.a.s.c.AbstractZkTestCase put /Users/jenkins/workspace/Lucene-Solr-7.x-MacOSX/solr/core/src/test-files/solr/collection1/conf/protwords.txt to /configs/conf1/protwords.txt
   [junit4]   2> 2078592 INFO  (TEST-FullSolrCloudDistribCmdsTest.test-seed#[5960603EC3CF7CD1]) [    ] o.a.s.c.AbstractZkTestCase put /Users/jenkins/workspace/Lucene-Solr-7.x-MacOSX/solr/core/src/test-files/solr/collection1/conf/currency.xml to /configs/conf1/currency.xml
   [junit4]   2> 2078597 INFO  (TEST-FullSolrCloudDistribCmdsTest.test-seed#[5960603EC3CF7CD1]) [    ] o.a.s.c.AbstractZkTestCase put /Users/jenkins/workspace/Lucene-Solr-7.x-MacOSX/solr/core/src/test-files/solr/collection1/conf/enumsConfig.xml to /configs/conf1/enumsConfig.xml
   [junit4]   2> 2078601 INFO  (TEST-FullSolrCloudDistribCmdsTest.test-seed#[5960603EC3CF7CD1]) [    ] o.a.s.c.AbstractZkTestCase put /Users/jenkins/workspace/Lucene-Solr-7.x-MacOSX/solr/core/src/test-files/solr/collection1/conf/open-exchange-rates.json to /configs/conf1/open-exchange-rates.json
   [junit4]   2> 2078606 INFO  (TEST-FullSolrCloudDistribCmdsTest.test-seed#[5960603EC3CF7CD1]) [    ] o.a.s.c.AbstractZkTestCase put /Users/jenkins/workspace/Lucene-Solr-7.x-MacOSX/solr/core/src/test-files/solr/collection1/conf/mapping-ISOLatin1Accent.txt to /configs/conf1/mapping-ISOLatin1Accent.txt
   [junit4]   2> 2078610 INFO  (TEST-FullSolrCloudDistribCmdsTest.test-seed#[5960603EC3CF7CD1]) [    ] o.a.s.c.AbstractZkTestCase put /Users/jenkins/workspace/Lucene-Solr-7.x-MacOSX/solr/core/src/test-files/solr/collection1/conf/old_synonyms.txt to /configs/conf1/old_synonyms.txt
   [junit4]   2> 2078613 INFO  (TEST-FullSolrCloudDistribCmdsTest.test-seed#[5960603EC3CF7CD1]) [    ] o.a.s.c.AbstractZkTestCase put /Users/jenkins/workspace/Lucene-Solr-7.x-MacOSX/solr/core/src/test-files/solr/collection1/conf/synonyms.txt to /configs/conf1/synonyms.txt
   [junit4]   2> 2078617 INFO  (TEST-FullSolrCloudDistribCmdsTest.test-seed#[5960603EC3CF7CD1]) [    ] o.a.s.c.AbstractFullDistribZkTestBase Will use NRT replicas unless explicitly asked otherwise
   [junit4]   2> 2078967 INFO  (TEST-FullSolrCloudDistribCmdsTest.test-seed#[5960603EC3CF7CD1]) [    ] o.e.j.s.Server jetty-9.3.20.v20170531
   [junit4]   2> 2078968 INFO  (TEST-FullSolrCloudDistribCmdsTest.test-seed#[5960603EC3CF7CD1]) [    ] o.e.j.s.h.ContextHandler Started o.e.j.s.ServletContextHandler@5f357ad9{/no_/g,null,AVAILABLE}
   [junit4]   2> 2078969 INFO  (TEST-FullSolrCloudDistribCmdsTest.test-seed#[5960603EC3CF7CD1]) [    ] o.e.j.s.AbstractConnector Started ServerConnector@5aba0073{HTTP/1.1,[http/1.1]}{127.0.0.1:49173}
   [junit4]   2> 2078969 INFO  (TEST-FullSolrCloudDistribCmdsTest.test-seed#[5960603EC3CF7CD1]) [    ] o.e.j.s.Server Started @2080718ms
   [junit4]   2> 2078969 INFO  (TEST-FullSolrCloudDistribCmdsTest.test-seed#[5960603EC3CF7CD1]) [    ] o.a.s.c.s.e.JettySolrRunner Jetty properties: {hostContext=/no_/g, solr.data.dir=/Users/jenkins/workspace/Lucene-Solr-7.x-MacOSX/solr/build/solr-core/test/J0/temp/solr.cloud.FullSolrCloudDistribCmdsTest_5960603EC3CF7CD1-001/tempDir-001/control/data, hostPort=49173, coreRootDirectory=/Users/jenkins/workspace/Lucene-Solr-7.x-MacOSX/solr/build/solr-core/test/J0/../../../../../../../../../Users/jenkins/workspace/Lucene-Solr-7.x-MacOSX/solr/build/solr-core/test/J0/temp/solr.cloud.FullSolrCloudDistribCmdsTest_5960603EC3CF7CD1-001/control-001/cores, replicaType=NRT}
   [junit4]   2> 2078969 ERROR (TEST-FullSolrCloudDistribCmdsTest.test-seed#[5960603EC3CF7CD1]) [    ] o.a.s.u.StartupLoggingUtils Missing Java Option solr.log.dir. Logging may be missing or incomplete.
   [junit4]   2> 2078969 INFO  (TEST-FullSolrCloudDistribCmdsTest.test-seed#[5960603EC3CF7CD1]) [    ] o.a.s.s.SolrDispatchFilter  ___      _       Welcome to Apache Solr™ version 7.2.0
   [junit4]   2> 2078969 INFO  (TEST-FullSolrCloudDistribCmdsTest.test-seed#[5960603EC3CF7CD1]) [    ] o.a.s.s.SolrDispatchFilter / __| ___| |_ _   Starting in cloud mode on port null
   [junit4]   2> 2078969 INFO  (TEST-FullSolrCloudDistribCmdsTest.test-seed#[5960603EC3CF7CD1]) [    ] o.a.s.s.SolrDispatchFilter \__ \/ _ \ | '_|  Install dir: null, Default config dir: null
   [junit4]   2> 2078969 INFO  (TEST-FullSolrCloudDistribCmdsTest.test-seed#[5960603EC3CF7CD1]) [    ] o.a.s.s.SolrDispatchFilter |___/\___/_|_|    Start time: 2017-10-11T01:04:39.972841Z
   [junit4]   2> 2078972 INFO  (TEST-FullSolrCloudDistribCmdsTest.test-seed#[5960603EC3CF7CD1]) [    ] o.a.s.s.SolrDispatchFilter Loading solr.xml from SolrHome (not found in ZooKeeper)
   [junit4]   2> 2078972 INFO  (TEST-FullSolrCloudDistribCmdsTest.test-seed#[5960603EC3CF7CD1]) [    ] o.a.s.c.SolrXmlConfig Loading container configuration from /Users/jenkins/workspace/Lucene-Solr-7.x-MacOSX/solr/build/solr-core/test/J0/temp/solr.cloud.FullSolrCloudDistribCmdsTest_5960603EC3CF7CD1-001/control-001/solr.xml
   [junit4]   2> 2078973 INFO  (TEST-FullSolrCloudDistribCmdsTest.test-seed#[5960603EC3CF7CD1]) [    ] o.a.s.c.SolrXmlConfig Configuration parameter autoReplicaFailoverWorkLoopDelay is ignored
   [junit4]   2> 2078973 INFO  (TEST-FullSolrCloudDistribCmdsTest.test-seed#[5960603EC3CF7CD1]) [    ] o.a.s.c.SolrXmlConfig Configuration parameter autoReplicaFailoverBadNodeExpiration is ignored
   [junit4]   2> 2078974 INFO  (TEST-FullSolrCloudDistribCmdsTest.test-seed#[5960603EC3CF7CD1]) [    ] o.a.s.c.SolrXmlConfig MBean server found: com.sun.jmx.mbeanserver.JmxMBeanServer@c10bc99, but no JMX reporters were configured - adding default JMX reporter.
   [junit4]   2> 2078976 INFO  (TEST-FullSolrCloudDistribCmdsTest.test-seed#[5960603EC3CF7CD1]) [    ] o.a.s.c.ZkContainer Zookeeper client=127.0.0.1:49169/solr
   [junit4]   2> 2079129 INFO  (TEST-FullSolrCloudDistribCmdsTest.test-seed#[5960603EC3CF7CD1]) [    ] o.a.s.c.Overseer Overseer (id=null) closing
   [junit4]   2> 2079130 INFO  (TEST-FullSolrCloudDistribCmdsTest.test-seed#[5960603EC3CF7CD1]) [    ] o.a.s.c.OverseerElectionContext I am going to be the leader 127.0.0.1:49173_no_%2Fg
   [junit4]   2> 2079132 INFO  (TEST-FullSolrCloudDistribCmdsTest.test-seed#[5960603EC3CF7CD1]) [    ] o.a.s.c.Overseer Overseer (id=98807570719113220-127.0.0.1:49173_no_%2Fg-n_0000000000) starting
   [junit4]   2> 2079144 INFO  (TEST-FullSolrCloudDistribCmdsTest.test-seed#[5960603EC3CF7CD1]) [    ] o.a.s.c.ZkController Register node as live in ZooKeeper:/live_nodes/127.0.0.1:49173_no_%2Fg
   [junit4]   2> 2079146 INFO  (OverseerStateUpdate-98807570719113220-127.0.0.1:49173_no_%2Fg-n_0000000000) [    ] o.a.s.c.c.ZkStateReader Updated live nodes from ZooKeeper... (0) -> (1)
   [junit4]   2> 2079199 INFO  (TEST-FullSolrCloudDistribCmdsTest.test-seed#[5960603EC3CF7CD1]) [    ] o.a.s.m.r.SolrJmxReporter JMX monitoring for 'solr.node' (registry 'solr.node') enabled at server: com.sun.jmx.mbeanserver.JmxMBeanServer@c10bc99
   [junit4]   2> 2079214 INFO  (TEST-FullSolrCloudDistribCmdsTest.test-seed#[5960603EC3CF7CD1]) [    ] o.a.s.m.r.SolrJmxReporter JMX monitoring for 'solr.jvm' (registry 'solr.jvm') enabled at server: com.sun.jmx.mbeanserver.JmxMBeanServer@c10bc99
   [junit4]   2> 2079214 INFO  (TEST-FullSolrCloudDistribCmdsTest.test-seed#[5960603EC3CF7CD1]) [    ] o.a.s.m.r.SolrJmxReporter JMX monitoring for 'solr.jetty' (registry 'solr.jetty') enabled at server: com.sun.jmx.mbeanserver.JmxMBeanServer@c10bc99
   [junit4]   2> 2079216 INFO  (TEST-FullSolrCloudDistribCmdsTest.test-seed#[5960603EC3CF7CD1]) [    ] o.a.s.c.CorePropertiesLocator Found 0 core definitions underneath /Users/jenkins/workspace/Lucene-Solr-7.x-MacOSX/solr/build/solr-core/test/J0/../../../../../../../../../Users/jenkins/workspace/Lucene-Solr-7.x-MacOSX/solr/build/solr-core/test/J0/temp/solr.cloud.FullSolrCloudDistribCmdsTest_5960603EC3CF7CD1-001/control-001/cores
   [junit4]   2> 2079232 INFO  (TEST-FullSolrCloudDistribCmdsTest.test-seed#[5960603EC3CF7CD1]) [    ] o.a.s.c.c.ZkStateReader Updated live nodes from ZooKeeper... (0) -> (1)
   [junit4]   2> 2079233 INFO  (TEST-FullSolrCloudDistribCmdsTest.test-seed#[5960603EC3CF7CD1]) [    ] o.a.s.c.s.i.ZkClientClusterStateProvider Cluster at 127.0.0.1:49169/solr ready
   [junit4]   2> 2079235 INFO  (qtp335375371-18333) [    ] o.a.s.h.a.CollectionsHandler Invoked Collection Action :create with params replicationFactor=1&collection.configName=conf1&name=control_collection&nrtReplicas=1&action=CREATE&numShards=1&createNodeSet=127.0.0.1:49173_no_%252Fg&wt=javabin&version=2 and sendToOCPQueue=true
   [junit4]   2> 2079239 INFO  (OverseerThreadFactory-7451-thread-1) [    ] o.a.s.c.CreateCollectionCmd Create collection control_collection
   [junit4]   2> 2079358 INFO  (qtp335375371-18335) [    ] o.a.s.h.a.CoreAdminOperation core create command qt=/admin/cores&collection.configName=conf1&newCollection=true&name=control_collection_shard1_replica_n1&action=CREATE&numShards=1&collection=control_collection&shard=shard1&wt=javabin&version=2&replicaType=NRT
   [junit4]   2> 2079358 INFO  (qtp335375371-18335) [    ] o.a.s.c.TransientSolrCoreCacheDefault Allocating transient cache for 4 transient cores
   [junit4]   2> 2079476 INFO  (zkCallback-3061-thread-1) [    ] o.a.s.c.c.ZkStateReader A cluster state change: [WatchedEvent state:SyncConnected type:NodeDataChanged path:/collections/control_collection/state.json] for collection [control_collection] has occurred - updating... (live nodes size: [1])
   [junit4]   2> 2080392 INFO  (qtp335375371-18335) [    ] o.a.s.c.SolrConfig Using Lucene MatchVersion: 7.2.0
   [junit4]   2> 2080406 INFO  (qtp335375371-18335) [    ] o.a.s.s.IndexSchema [control_collection_shard1_replica_n1] Schema name=test
   [junit4]   2> 2080464 INFO  (qtp335375371-18335) [    ] o.a.s.s.IndexSchema Loaded schema test/1.6 with uniqueid field id
   [junit4]   2> 2080485 INFO  (qtp335375371-18335) [    ] o.a.s.c.CoreContainer Creating SolrCore 'control_collection_shard1_replica_n1' using configuration from collection control_collection, trusted=true
   [junit4]   2> 2080486 INFO  (qtp335375371-18335) [    ] o.a.s.m.r.SolrJmxReporter JMX monitoring for 'solr.core.control_collection.shard1.replica_n1' (registry 'solr.core.control_collection.shard1.replica_n1') enabled at server: com.sun.jmx.mbeanserver.JmxMBeanServer@c10bc99
   [junit4]   2> 2080486 INFO  (qtp335375371-18335) [    ] o.a.s.c.SolrCore solr.RecoveryStrategy.Builder
   [junit4]   2> 2080486 INFO  (qtp335375371-18335) [    ] o.a.s.c.SolrCore [[control_collection_shard1_replica_n1] ] Opening new SolrCore at [/Users/jenkins/workspace/Lucene-Solr-7.x-MacOSX/solr/build/solr-core/test/J0/temp/solr.cloud.FullSolrCloudDistribCmdsTest_5960603EC3CF7CD1-001/control-001/cores/control_collection_shard1_replica_n1], dataDir=[/Users/jenkins/workspace/Lucene-Solr-7.x-MacOSX/solr/build/solr-core/test/J0/../../../../../../../../../Users/jenkins/workspace/Lucene-Solr-7.x-MacOSX/solr/build/solr-core/test/J0/temp/solr.cloud.FullSolrCloudDistribCmdsTest_5960603EC3CF7CD1-001/control-001/cores/control_collection_shard1_replica_n1/data/]
   [junit4]   2> 2080488 INFO  (qtp335375371-18335) [    ] o.a.s.u.RandomMergePolicy RandomMergePolicy wrapping class org.apache.lucene.index.LogByteSizeMergePolicy: [LogByteSizeMergePolicy: minMergeSize=1677721, mergeFactor=13, maxMergeSize=2147483648, maxMergeSizeForForcedMerge=9223372036854775807, calibrateSizeByDeletes=true, maxMergeDocs=2147483647, maxCFSSegmentSizeMB=8.796093022207999E12, noCFSRatio=0.0]
   [junit4]   2> 2080491 WARN  (qtp335375371-18335) [    ] o.a.s.c.RequestHandlers INVALID paramSet a in requestHandler {type = requestHandler,name = /dump,class = DumpRequestHandler,attributes = {initParams=a, name=/dump, class=DumpRequestHandler},args = {defaults={a=A,b=B}}}
   [junit4]   2> 2080522 INFO  (qtp335375371-18335) [    ] o.a.s.u.UpdateHandler Using UpdateLog implementation: org.apache.solr.update.UpdateLog
   [junit4]   2> 2080522 INFO  (qtp335375371-18335) [    ] o.a.s.u.UpdateLog Initializing UpdateLog: dataDir= defaultSyncLevel=FLUSH numRecordsToKeep=100 maxNumLogsToKeep=10 numVersionBuckets=65536
   [junit4]   2> 2080523 INFO  (qtp335375371-18335) [    ] o.a.s.u.CommitTracker Hard AutoCommit: disabled
   [junit4]   2> 2080523 INFO  (qtp335375371-18335) [    ] o.a.s.u.CommitTracker Soft AutoCommit: disabled
   [junit4]   2> 2080524 INFO  (qtp335375371-18335) [    ] o.a.s.u.RandomMergePolicy RandomMergePolicy wrapping class org.apache.lucene.index.TieredMergePolicy: [TieredMergePolicy: maxMergeAtOnce=17, maxMergeAtOnceExplicit=18, maxMergedSegmentMB=56.994140625, floorSegmentMB=2.1728515625, forceMergeDeletesPctAllowed=15.396008698404852, segmentsPerTier=42.0, maxCFSSegmentSizeMB=8.796093022207999E12, noCFSRatio=0.0
   [junit4]   2> 2080524 INFO  (qtp335375371-18335) [    ] o.a.s.s.SolrIndexSearcher Opening [Searcher@51e247a[control_collection_shard1_replica_n1] main]
   [junit4]   2> 2080526 INFO  (qtp335375371-18335) [    ] o.a.s.r.ManagedResourceStorage Configured ZooKeeperStorageIO with znodeBase: /configs/conf1
   [junit4]   2> 2080526 INFO  (qtp335375371-18335) [    ] o.a.s.r.ManagedResourceStorage Loaded null at path _rest_managed.json using ZooKeeperStorageIO:path=/configs/conf1
   [junit4]   2> 2080526 INFO  (qtp335375371-18335) [    ] o.a.s.h.ReplicationHandler Commits will be reserved for 10000ms.
   [junit4]   2> 2080527 INFO  (qtp335375371-18335) [    ] o.a.s.u.UpdateLog Could not find max version in index or recent updates, using new clock 1580921133759201280
   [junit4]   2> 2080527 INFO  (searcherExecutor-7454-thread-1) [    ] o.a.s.c.SolrCore [control_collection_shard1_replica_n1] Registered new searcher Searcher@51e247a[control_collection_shard1_replica_n1] main{ExitableDirectoryReader(UninvertingDirectoryReader())}
   [junit4]   2> 2080532 INFO  (qtp335375371-18335) [    ] o.a.s.c.ShardLeaderElectionContext Enough replicas found to continue.
   [junit4]   2> 2080532 INFO  (qtp335375371-18335) [    ] o.a.s.c.ShardLeaderElectionContext I may be the new leader - try and sync
   [junit4]   2> 2080532 INFO  (qtp335375371-18335) [    ] o.a.s.c.SyncStrategy Sync replicas to http://127.0.0.1:49173/no_/g/control_collection_shard1_replica_n1/
   [junit4]   2> 2080532 INFO  (qtp335375371-18335) [    ] o.a.s.c.SyncStrategy Sync Success - now sync replicas to me
   [junit4]   2> 2080532 INFO  (qtp335375371-18335) [    ] o.a.s.c.SyncStrategy http://127.0.0.1:49173/no_/g/control_collection_shard1_replica_n1/ has no replicas
   [junit4]   2> 2080532 INFO  (qtp335375371-18335) [    ] o.a.s.c.ShardLeaderElectionContext Found all replicas participating in election, clear LIR
   [junit4]   2> 2080537 INFO  (qtp335375371-18335) [    ] o.a.s.c.ShardLeaderElectionContext I am the new leader: http://127.0.0.1:49173/no_/g/control_collection_shard1_replica_n1/ shard1
   [junit4]   2> 2080647 INFO  (zkCallback-3061-thread-1) [    ] o.a.s.c.c.ZkStateReader A cluster state change: [WatchedEvent state:SyncConnected type:NodeDataChanged path:/collections/control_collection/state.json] for collection [control_collection] has occurred - updating... (live nodes size: [1])
   [junit4]   2> 2080701 INFO  (qtp335375371-18335) [    ] o.a.s.c.ZkController I am the leader, no recovery necessary
   [junit4]   2> 2080705 INFO  (qtp335375371-18335) [    ] o.a.s.s.HttpSolrCall [admin] webapp=null path=/admin/cores params={qt=/admin/cores&collection.configName=conf1&newCollection=true&name=control_collection_shard1_replica_n1&action=CREATE&numShards=1&collection=control_collection&shard=shard1&wt=javabin&version=2&replicaType=NRT} status=0 QTime=1347
   [junit4]   2> 2080712 INFO  (qtp335375371-18333) [    ] o.a.s.h.a.CollectionsHandler Wait for new collection to be active for at most 30 seconds. Check all shard replicas
   [junit4]   2> 2080818 INFO  (zkCallback-3061-thread-1) [    ] o.a.s.c.c.ZkStateReader A cluster state change: [WatchedEvent state:SyncConnected type:NodeDataChanged path:/collections/control_collection/state.json] for collection [control_collection] has occurred - updating... (live nodes size: [1])
   [junit4]   2> 2081249 INFO  (OverseerCollectionConfigSetProcessor-98807570719113220-127.0.0.1:49173_no_%2Fg-n_0000000000) [    ] o.a.s.c.OverseerTaskQueue Response ZK path: /overseer/collection-queue-work/qnr-0000000000 doesn't exist.  Requestor may have disconnected from ZooKeeper
   [junit4]   2> 2081713 INFO  (qtp335375371-18333) [    ] o.a.s.s.HttpSolrCall [admin] webapp=null path=/admin/collections params={replicationFactor=1&collection.configName=conf1&name=control_collection&nrtReplicas=1&action=CREATE&numShards=1&createNodeSet=127.0.0.1:49173_no_%252Fg&wt=javabin&version=2} status=0 QTime=2478
   [junit4]   2> 2081723 INFO  (TEST-FullSolrCloudDistribCmdsTest.test-seed#[5960603EC3CF7CD1]) [    ] o.a.s.c.c.ZkStateReader Updated live nodes from ZooKeeper... (0) -> (1)
   [junit4]   2> 2081727 INFO  (TEST-FullSolrCloudDistribCmdsTest.test-seed#[5960603EC3CF7CD1]) [    ] o.a.s.c.s.i.ZkClientClusterStateProvider Cluster at 127.0.0.1:49169/solr ready
   [junit4]   2> 2081727 INFO  (TEST-FullSolrCloudDistribCmdsTest.test-seed#[5960603EC3CF7CD1]) [    ] o.a.s.c.ChaosMonkey monkey: init - expire sessions:false cause connection loss:false
   [junit4]   2> 2081728 INFO  (qtp335375371-18331) [    ] o.a.s.h.a.CollectionsHandler Invoked Collection Action :create with params replicationFactor=1&collection.configName=conf1&name=collection1&nrtReplicas=1&action=CREATE&numShards=3&createNodeSet=&stateFormat=2&wt=javabin&version=2 and sendToOCPQueue=true
   [junit4]   2> 2081734 INFO  (OverseerThreadFactory-7451-thread-2) [    ] o.a.s.c.CreateCollectionCmd Create collection collection1
   [junit4]   2> 2081736 WARN  (OverseerThreadFactory-7451-thread-2) [    ] o.a.s.c.CreateCollectionCmd It is unusual to create a collection (collection1) without cores.
   [junit4]   2> 2081950 INFO  (qtp335375371-18331) [    ] o.a.s.h.a.CollectionsHandler Wait for new collection to be active for at most 30 seconds. Check all shard replicas
   [junit4]   2> 2081951 INFO  (qtp335375371-18331) [    ] o.a.s.s.HttpSolrCall [admin] webapp=null path=/admin/collections params={replicationFactor=1&collection.configName=conf1&name=collection1&nrtReplicas=1&action=CREATE&numShards=3&createNodeSet=&stateFormat=2&wt=javabin&version=2} status=0 QTime=222
   [junit4]   2> 2082193 INFO  (TEST-FullSolrCloudDistribCmdsTest.test-seed#[5960603EC3CF7CD1]) [    ] o.a.s.c.AbstractFullDistribZkTestBase create jetty 1 in directory /Users/jenkins/workspace/Lucene-Solr-7.x-MacOSX/solr/build/solr-core/test/J0/temp/solr.cloud.FullSolrCloudDistribCmdsTest_5960603EC3CF7CD1-001/shard-1-001 of type NRT
   [junit4]   2> 2082193 INFO  (TEST-FullSolrCloudDistribCmdsTest.test-seed#[5960603EC3CF7CD1]) [    ] o.e.j.s.Server jetty-9.3.20.v20170531
   [junit4]   2> 2082194 INFO  (TEST-FullSolrCloudDistribCmdsTest.test-seed#[5960603EC3CF7CD1]) [    ] o.e.j.s.h.ContextHandler Started o.e.j.s.ServletContextHandler@4aee70c6{/no_/g,null,AVAILABLE}
   [junit4]   2> 2082195 INFO  (TEST-FullSolrCloudDistribCmdsTest.test-seed#[5960603EC3CF7CD1]) [    ] o.e.j.s.AbstractConnector Started ServerConnector@29a570fa{HTTP/1.1,[http/1.1]}{127.0.0.1:49194}
   [junit4]   2> 2082195 INFO  (TEST-FullSolrCloudDistribCmdsTest.test-seed#[5960603EC3CF7CD1]) [    ] o.e.j.s.Server Started @2083943ms
   [junit4]   2> 2082195 INFO  (TEST-FullSolrCloudDistribCmdsTest.test-seed#[5960603EC3CF7CD1]) [    ] o.a.s.c.s.e.JettySolrRunner Jetty properties: {hostContext=/no_/g, solrconfig=solrconfig.xml, solr.data.dir=/Users/jenkins/workspace/Lucene-Solr-7.x-MacOSX/solr/build/solr-core/test/J0/temp/solr.cloud.FullSolrCloudDistribCmdsTest_5960603EC3CF7CD1-001/tempDir-001/jetty1, hostPort=49194, coreRootDirectory=/Users/jenkins/workspace/Lucene-Solr-7.x-MacOSX/solr/build/solr-core/test/J0/temp/solr.cloud.FullSolrCloudDistribCmdsTest_5960603EC3CF7CD1-001/shard-1-001/cores, replicaType=NRT}
   [junit4]   2> 2082195 ERROR (TEST-FullSolrCloudDistribCmdsTest.test-seed#[5960603EC3CF7CD1]) [    ] o.a.s.u.StartupLoggingUtils Missing Java Option solr.log.dir. Logging may be missing or incomplete.
   [junit4]   2> 2082195 INFO  (TEST-FullSolrCloudDistribCmdsTest.test-seed#[5960603EC3CF7CD1]) [    ] o.a.s.s.SolrDispatchFilter  ___      _       Welcome to Apache Solr™ version 7.2.0
   [junit4]   2> 2082195 INFO  (TEST-FullSolrCloudDistribCmdsTest.test-seed#[5960603EC3CF7CD1]) [    ] o.a.s.s.SolrDispatchFilter / __| ___| |_ _   Starting in cloud mode on port null
   [junit4]   2> 2082195 INFO  (TEST-FullSolrCloudDistribCmdsTest.test-seed#[5960603EC3CF7CD1]) [    ] o.a.s.s.SolrDispatchFilter \__ \/ _ \ | '_|  Install dir: null, Default config dir: null
   [junit4]   2> 2082195 INFO  (TEST-FullSolrCloudDistribCmdsTest.test-seed#[5960603EC3CF7CD1]) [    ] o.a.s.s.SolrDispatchFilter |___/\___/_|_|    Start time: 2017-10-11T01:04:43.198629Z
   [junit4]   2> 2082198 INFO  (TEST-FullSolrCloudDistribCmdsTest.test-seed#[5960603EC3CF7CD1]) [    ] o.a.s.s.SolrDispatchFilter Loading solr.xml from SolrHome (not found in ZooKeeper)
   [junit4]   2> 2082198 INFO  (TEST-FullSolrCloudDistribCmdsTest.test-seed#[5960603EC3CF7CD1]) [    ] o.a.s.c.SolrXmlConfig Loading container configuration from /Users/jenkins/workspace/Lucene-Solr-7.x-MacOSX/solr/build/solr-core/test/J0/temp/solr.cloud.FullSolrCloudDistribCmdsTest_5960603EC3CF7CD1-001/shard-1-001/solr.xml
   [junit4]   2> 2082199 INFO  (TEST-FullSolrCloudDistribCmdsTest.test-seed#[5960603EC3CF7CD1]) [    ] o.a.s.c.SolrXmlConfig Configuration parameter autoReplicaFailoverWorkLoopDelay is ignored
   [junit4]   2> 2082199 INFO  (TEST-FullSolrCloudDistribCmdsTest.test-seed#[5960603EC3CF7CD1]) [    ] o.a.s.c.SolrXmlConfig Configuration parameter autoReplicaFailoverBadNodeExpiration is ignored
   [junit4]   2> 2082200 INFO  (TEST-FullSolrCloudDistribCmdsTest.test-seed#[5960603EC3CF7CD1]) [    ] o.a.s.c.SolrXmlConfig MBean server found: com.sun.jmx.mbeanserver.JmxMBeanServer@c10bc99, but no JMX reporters were configured - adding default JMX reporter.
   [junit4]   2> 2082202 INFO  (TEST-FullSolrCloudDistribCmdsTest.test-seed#[5960603EC3CF7CD1]) [    ] o.a.s.c.ZkContainer Zookeeper client=127.0.0.1:49169/solr
   [junit4]   2> 2082214 INFO  (TEST-FullSolrCloudDistribCmdsTest.test-seed#[5960603EC3CF7CD1]) [    ] o.a.s.c.c.ZkStateReader Updated live nodes from ZooKeeper... (0) -> (1)
   [junit4]   2> 2082218 INFO  (TEST-FullSolrCloudDistribCmdsTest.test-seed#[5960603EC3CF7CD1]) [    ] o.a.s.c.Overseer Overseer (id=null) closing
   [junit4]   2> 2082221 INFO  (TEST-FullSolrCloudDistribCmdsTest.test-seed#[5960603EC3CF7CD1]) [    ] o.a.s.c.ZkController Register node as live in ZooKeeper:/live_nodes/127.0.0.1:49194_no_%2Fg
   [junit4]   2> 2082222 INFO  (zkCallback-3061-thread-1) [    ] o.a.s.c.c.ZkStateReader Updated live nodes from ZooKeeper... (1) -> (2)
   [junit4]   2> 2082222 INFO  (zkCallback-3068-thread-1) [    ] o.a.s.c.c.ZkStateReader Updated live nodes from ZooKeeper... (1) -> (2)
   [junit4]   2> 2082222 INFO  (zkCallback-3073-thread-1) [    ] o.a.s.c.c.ZkStateReader Updated live nodes from ZooKeeper... (1) -> (2)
   [junit4]   2> 2082257 INFO  (TEST-FullSolrCloudDistribCmdsTest.test-seed#[5960603EC3CF7CD1]) [    ] o.a.s.m.r.SolrJmxReporter JMX monitoring for 'solr.node' (registry 'solr.node') enabled at server: com.sun.jmx.mbeanserver.JmxMBeanServer@c10bc99
   [junit4]   2> 2082267 INFO  (TEST-FullSolrCloudDistribCmdsTest.test-seed#[5960603EC3CF7CD1]) [    ] o.a.s.m.r.SolrJmxReporter JMX monitoring for 'solr.jvm' (registry 'solr.jvm') enabled at server: com.sun.jmx.mbeanserver.JmxMBeanServer@c10bc99
   [junit4]   2> 2082268 INFO  (TEST-FullSolrCloudDistribCmdsTest.test-seed#[5960603EC3CF7CD1]) [    ] o.a.s.m.r.SolrJmxReporter JMX monitoring for 'solr.jetty' (registry 'solr.jetty') enabled at server: com.sun.jmx.mbeanserver.JmxMBeanServer@c10bc99
   [junit4]   2> 2082269 INFO  (TEST-FullSolrCloudDistribCmdsTest.test-seed#[5960603EC3CF7CD1]) [    ] o.a.s.c.CorePropertiesLocator Found 0 core definitions underneath /Users/jenkins/workspace/Lucene-Solr-7.x-MacOSX/solr/build/solr-core/test/J0/temp/solr.cloud.FullSolrCloudDistribCmdsTest_5960603EC3CF7CD1-001/shard-1-001/cores
   [junit4]   2> 2082292 INFO  (qtp335375371-18334) [    ] o.a.s.h.a.CollectionsHandler Invoked Collection Action :addreplica with params node=127.0.0.1:49194_no_%252Fg&action=ADDREPLICA&collection=collection1&shard=shard2&type=NRT&wt=javabin&version=2 and sendToOCPQueue=true
   [junit4]   2> 2082295 INFO  (OverseerCollectionConfigSetProcessor-98807570719113220-127.0.0.1:49173_no_%2Fg-n_0000000000) [    ] o.a.s.c.OverseerTaskQueue Response ZK path: /overseer/collection-queue-work/qnr-0000000002 doesn't exist.  Requestor may have disconnected from ZooKeeper
   [junit4]   2> 2082296 INFO  (OverseerThreadFactory-7451-thread-3) [    ] o.a.s.c.AddReplicaCmd Node Identified 127.0.0.1:49194_no_%2Fg for creating new replica
   [junit4]   2> 2082300 INFO  (qtp1766832821-18378) [    ] o.a.s.h.a.CoreAdminOperation core create command qt=/admin/cores&collection.configName=conf1&name=collection1_shard2_replica_n61&action=CREATE&collection=collection1&shard=shard2&wt=javabin&version=2&replicaType=NRT
   [junit4]   2> 2082300 INFO  (qtp1766832821-18378) [    ] o.a.s.c.TransientSolrCoreCacheDefault Allocating transient cache for 4 transient cores
   [junit4]   2> 2082414 INFO  (zkCallback-3073-thread-1) [    ] o.a.s.c.c.ZkStateReader A cluster state change: [WatchedEvent state:SyncConnected type:NodeDataChanged path:/collections/collection1/state.json] for collection [collection1] has occurred - updating... (live nodes size: [2])
   [junit4]   2> 2083315 INFO  (qtp1766832821-18378) [    ] o.a.s.c.SolrConfig Using Lucene MatchVersion: 7.2.0
   [junit4]   2> 2083327 INFO  (qtp1766832821-18378) [    ] o.a.s.s.IndexSchema [collection1_shard2_replica_n61] Schema name=test
   [junit4]   2> 2083402 INFO  (qtp1766832821-18378) [    ] o.a.s.s.IndexSchema Loaded schema test/1.6 with uniqueid field id
   [junit4]   2> 2083429 INFO  (qtp1766832821-18378) [    ] o.a.s.c.CoreContainer Creating SolrCore 'collection1_shard2_replica_n61' using configuration from collection collection1, trusted=true
   [junit4]   2> 2083430 INFO  (qtp1766832821-18378) [    ] o.a.s.m.r.SolrJmxReporter JMX monitoring for 'solr.core.collection1.shard2.replica_n61' (registry 'solr.core.collection1.shard2.replica_n61') enabled at server: com.sun.jmx.mbeanserver.JmxMBeanServer@c10bc99
   [junit4]   2> 2083430 INFO  (qtp1766832821-18378) [    ] o.a.s.c.SolrCore solr.RecoveryStrategy.Builder
   [junit4]   2> 2083430 INFO  (qtp1766832821-18378) [    ] o.a.s.c.SolrCore [[collection1_shard2_replica_n61] ] Opening new SolrCore at [/Users/jenkins/workspace/Lucene-Solr-7.x-MacOSX/solr/build/solr-core/test/J0/temp/solr.cloud.FullSolrCloudDistribCmdsTest_5960603EC3CF7CD1-001/shard-1-001/cores/collection1_shard2_replica_n61], dataDir=[/Users/jenkins/workspace/Lucene-Solr-7.x-MacOSX/solr/build/solr-core/test/J0/temp/solr.cloud.FullSolrCloudDistribCmdsTest_5960603EC3CF7CD1-001/shard-1-001/cores/collection1_shard2_replica_n61/data/]
   [junit4]   2> 2083433 INFO  (qtp1766832821-18378) [    ] o.a.s.u.RandomMergePolicy RandomMergePolicy wrapping class org.apache.lucene.index.LogByteSizeMergePolicy: [LogByteSizeMergePolicy: minMergeSize=1677721, mergeFactor=13, maxMergeSize=2147483648, maxMergeSizeForForcedMerge=9223372036854775807, calibrateSizeByDeletes=true, maxMergeDocs=2147483647, maxCFSSegmentSizeMB=8.796093022207999E12, noCFSRatio=0.0]
   [junit4]   2> 2083436 WARN  (qtp1766832821-18378) [    ] o.a.s.c.RequestHandlers INVALID paramSet a in requestHandler {type = requestHandler,name = /dump,class = DumpRequestHandler,attributes = {initParams=a, name=/dump, class=DumpRequestHandler},args = {defaults={a=A,b=B}}}
   [junit4]   2> 2083490 INFO  (qtp1766832821-18378) [    ] o.a.s.u.UpdateHandler Using UpdateLog implementation: org.apache.solr.update.UpdateLog
   [junit4]   2> 2083490 INFO  (qtp1766832821-18378) [    ] o.a.s.u.UpdateLog Initializing UpdateLog: dataDir= defaultSyncLevel=FLUSH numRecordsToKeep=100 maxNumLogsToKeep=10 numVersionBuckets=65536
   [junit4]   2> 2083492 INFO  (qtp1766832821-18378) [    ] o.a.s.u.CommitTracker Hard AutoCommit: disabled
   [junit4]   2> 2083492 INFO  (qtp1766832821-18378) [    ] o.a.s.u.CommitTracker Soft AutoCommit: disabled
   [junit4]   2> 2083494 INFO  (qtp1766832821-18378) [    ] o.a.s.u.RandomMergePolicy RandomMergePolicy wrapping class org.apache.lucene.index.TieredMergePolicy: [TieredMergePolicy: maxMergeAtOnce=17, maxMergeAtOnceExplicit=18, maxMergedSegmentMB=56.994140625, floorSegmentMB=2.1728515625, forceMergeDeletesPctAllowed=15.396008698404852, segmentsPerTier=42.0, maxCFSSegmentSizeMB=8.796093022207999E12, noCFSRatio=0.0
   [junit4]   2> 2083494 INFO  (qtp1766832821-18378) [    ] o.a.s.s.SolrIndexSearcher Opening [Searcher@9d5f941[collection1_shard2_replica_n61] main]
   [junit4]   2> 2083496 INFO  (qtp1766832821-18378) [    ] o.a.s.r.ManagedResourceStorage Configured ZooKeeperStorageIO with znodeBase: /configs/conf1
   [junit4]   2> 2083496 INFO  (qtp1766832821-18378) [    ] o.a.s.r.ManagedResourceStorage Loaded null at path _rest_managed.json using ZooKeeperStorageIO:path=/configs/conf1
   [junit4]   2> 2083497 INFO  (qtp1766832821-18378) [    ] o.a.s.h.ReplicationHandler Commits will be reserved for 10000ms.
   [junit4]   2> 2083498 INFO  (qtp1766832821-18378) [    ] o.a.s.u.UpdateLog Could not find max version in index or recent updates, using new clock 1580921136874520576
   [junit4]   2> 2083499 INFO  (searcherExecutor-7465-thread-1) [    ] o.a.s.c.SolrCore [collection1_shard2_replica_n61] Registered new searcher Searcher@9d5f941[collection1_shard2_replica_n61] main{ExitableDirectoryReader(UninvertingDirectoryReader())}
   [junit4]   2> 2083505 INFO  (qtp1766832821-18378) [    ] o.a.s.c.ShardLeaderElectionContext Enough replicas found to continue.
   [junit4]   2> 2083505 INFO  (qtp1766832821-18378) [    ] o.a.s.c.ShardLeaderElectionContext I may be the new leader - try and sync
   [junit4]   2> 2083505 INFO  (qtp1766832821-18378) [    ] o.a.s.c.SyncStrategy Sync replicas to http://127.0.0.1:49194/no_/g/collection1_shard2_replica_n61/
   [junit4]   2> 2083505 INFO  (qtp1766832821-18378) [    ] o.a.s.c.SyncStrategy Sync Success - now sync replicas to me
   [junit4]   2> 2083505 INFO  (qtp1766832821-18378) [    ] o.a.s.c.SyncStrategy http://127.0.0.1:49194/no_/g/collection1_shard2_replica_n61/ has no replicas
   [junit4]   2> 2083506 INFO  (qtp1766832821-18378) [    ] o.a.s.c.ShardLeaderElectionContext Found all replicas participating in election, clear LIR
   [junit4]   2> 2083514 INFO  (qtp1766832821-18378) [    ] o.a.s.c.ShardLeaderElectionContext I am the new leader: http://127.0.0.1:49194/no_/g/collection1_shard2_replica_n61/ shard2
   [junit4]   2> 2083626 INFO  (zkCallback-3073-thread-1) [    ] o.a.s.c.c.ZkStateReader A cluster state change: [WatchedEvent state:SyncConnected type:NodeDataChanged path:/collections/collection1/state.json] for collection [collection1] has occurred - updating... (live nodes size: [2])
   [junit4]   2> 2083675 INFO  (qtp1766832821-18378) [    ] o.a.s.c.ZkController I am the leader, no recovery necessary
   [junit4]   2> 2083678 INFO  (qtp1766832821-18378) [    ] o.a.s.s.HttpSolrCall [admin] webapp=null path=/admin/cores params={qt=/admin/cores&collection.configName=conf1&name=collection1_shard2_replica_n61&action=CREATE&collection=collection1&shard=shard2&wt=javabin&version=2&replicaType=NRT} status=0 QTime=1377
   [junit4]   2> 2083681 INFO  (qtp335375371-18334) [    ] o.a.s.s.HttpSolrCall [admin] webapp=null path=/admin/collections params={node=127.0.0.1:49194_no_%252Fg&action=ADDREPLICA&collection=collection1&shard=shard2&type=NRT&wt=javabin&version=2} status=0 QTime=1389
   [junit4]   2> 2083783 INFO  (zkCallback-3073-thread-1) [    ] o.a.s.c.c.ZkStateReader A cluster state change: [WatchedEvent state:SyncConnected type:NodeDataChanged path:/collections/collection1/state.json] for collection [collection1] has occurred - updating... (live nodes size: [2])
   [junit4]   2> 2084099 INFO  (TEST-FullSolrCloudDistribCmdsTest.test-seed#[5960603EC3CF7CD1]) [    ] o.a.s.c.AbstractFullDistribZkTestBase create jetty 2 in directory /Users/jenkins/workspace/Lucene-Solr-7.x-MacOSX/solr/build/solr-core/test/J0/temp/solr.cloud.FullSolrCloudDistribCmdsTest_5960603EC3CF7CD1-001/shard-2-001 of type NRT
   [junit4]   2> 2084099 INFO  (TEST-FullSolrCloudDistribCmdsTest.test-seed#[5960603EC3CF7CD1]) [    ] o.e.j.s.Server jetty-9.3.20.v20170531
   [junit4]   2> 2084102 INFO  (TEST-FullSolrCloudDistribCmdsTest.test-seed#[5960603EC3CF7CD1]) [    ] o.e.j.s.h.ContextHandler Started o.e.j.s.ServletContextHandler@1b449509{/no_/g,null,AVAILABLE}
   [junit4]   2> 2084102 INFO  (TEST-FullSolrCloudDistribCmdsTest.test-seed#[5960603EC3CF7CD1]) [    ] o.e.j.s.AbstractConnector Started ServerConnector@1dec8311{HTTP/1.1,[http/1.1]}{127.0.0.1:49208}
   [junit4]   2> 2084102 INFO  (TEST-FullSolrCloudDistribCmdsTest.test-seed#[5960603EC3CF7CD1]) [    ] o.e.j.s.Server Started @2085851ms
   [junit4]   2> 2084102 INFO  (TEST-FullSolrCloudDistribCmdsTest.test-seed#[5960603EC3CF7CD1]) [    ] o.a.s.c.s.e.JettySolrRunner Jetty properties: {hostContext=/no_/g, solrconfig=solrconfig.xml, solr.data.dir=/Users/jenkins/workspace/Lucene-Solr-7.x-MacOSX/solr/build/solr-core/test/J0/temp/solr.cloud.FullSolrCloudDistribCmdsTest_5960603EC3CF7CD1-001/tempDir-001/jetty2, hostPort=49208, coreRootDirectory=/Users/jenkins/workspace/Lucene-Solr-7.x-MacOSX/solr/build/solr-core/test/J0/../../../../../../../../../Users/jenkins/workspace/Lucene-Solr-7.x-MacOSX/solr/build/solr-core/test/J0/temp/solr.cloud.FullSolrCloudDistribCmdsTest_5960603EC3CF7CD1-001/shard-2-001/cores}
   [junit4]   2> 2084102 ERROR (TEST-FullSolrCloudDistribCmdsTest.test-seed#[5960603EC3CF7CD1]) [    ] o.a.s.u.StartupLoggingUtils Missing Java Option solr.log.dir. Logging may be missing or incomplete.
   [junit4]   2> 2084103 INFO  (TEST-FullSolrCloudDistribCmdsTest.test-seed#[5960603EC3CF7CD1]) [    ] o.a.s.s.SolrDispatchFilter  ___      _       Welcome to Apache Solr™ version 7.2.0
   [junit4]   2> 2084103 INFO  (TEST-FullSolrCloudDistribCmdsTest.test-seed#[5960603EC3CF7CD1]) [    ] o.a.s.s.SolrDispatchFilter / __| ___| |_ _   Starting in cloud mode on port null
   [junit4]   2> 2084103 INFO  (TEST-FullSolrCloudDistribCmdsTest.test-seed#[5960603EC3CF7CD1]) [    ] o.a.s.s.SolrDispatchFilter \__ \/ _ \ | '_|  Install dir: null, Default config dir: null
   [junit4]   2> 2084103 INFO  (TEST-FullSolrCloudDistribCmdsTest.test-seed#[5960603EC3CF7CD1]) [    ] o.a.s.s.SolrDispatchFilter |___/\___/_|_|    Start time: 2017-10-11T01:04:45.106512Z
   [junit4]   2> 2084108 INFO  (TEST-FullSolrCloudDistribCmdsTest.test-seed#[5960603EC3CF7CD1]) [    ] o.a.s.s.SolrDispatchFilter Loading solr.xml from SolrHome (not found in ZooKeeper)
   [junit4]   2> 2084108 INFO  (TEST-FullSolrCloudDistribCmdsTest.test-seed#[5960603EC3CF7CD1]) [    ] o.a.s.c.SolrXmlConfig Loading container configuration from /Users/jenkins/workspace/Lucene-Solr-7.x-MacOSX/solr/build/solr-core/test/J0/temp/solr.cloud.FullSolrCloudDistribCmdsTest_5960603EC3CF7CD1-001/shard-2-001/solr.xml
   [junit4]   2> 2084111 INFO  (TEST-FullSolrCloudDistribCmdsTest.test-seed#[5960603EC3CF7CD1]) [    ] o.a.s.c.SolrXmlConfig Configuration parameter autoReplicaFailoverWorkLoopDelay is ignored
   [junit4]   2> 2084111 INFO  (TEST-FullSolrCloudDistribCmdsTest.test-seed#[5960603EC3CF7CD1]) [    ] o.a.s.c.SolrXmlConfig Configuration parameter autoReplicaFailoverBadNodeExpiration is ignored
   [junit4]   2> 2084112 INFO  (TEST-FullSolrCloudDistribCmdsTest.test-seed#[5960603EC3CF7CD1]) [    ] o.a.s.c.SolrXmlConfig MBean server found: com.sun.jmx.mbeanserver.JmxMBeanServer@c10bc99, but no JMX reporters were configured - adding default JMX reporter.
   [junit4]   2> 2084115 INFO  (TEST-FullSolrCloudDistribCmdsTest.test-seed#[5960603EC3CF7CD1]) [    ] o.a.s.c.ZkContainer Zookeeper client=127.0.0.1:49169/solr
   [junit4]   2> 2084133 INFO  (TEST-FullSolrCloudDistribCmdsTest.test-seed#[5960603EC3CF7CD1]) [    ] o.a.s.c.c.ZkStateReader Updated live nodes from ZooKeeper... (0) -> (2)
   [junit4]   2> 2084137 INFO  (TEST-FullSolrCloudDistribCmdsTest.test-seed#[5960603EC3CF7CD1]) [    ] o.a.s.c.Overseer Overseer (id=null) closing
   [junit4]   2> 2084141 INFO  (TEST-FullSolrCloudDistribCmdsTest.test-seed#[5960603EC3CF7CD1]) [    ] o.a.s.c.ZkController Register node as live in ZooKeeper:/live_nodes/127.0.0.1:49208_no_%2Fg
   [junit4]   2> 2084144 INFO  (zkCallback-3061-thread-1) [    ] o.a.s.c.c.ZkStateReader Updated live nodes from ZooKeeper... (2) -> (3)
   [junit4]   2> 2084144 INFO  (zkCallback-3073-thread-1) [    ] o.a.s.c.c.ZkStateReader Updated live nodes from ZooKeeper... (2) -> (3)
   [junit4]   2> 2084144 INFO  (zkCallback-3068-thread-1) [    ] o.a.s.c.c.ZkStateReader Updated live nodes from ZooKeeper... (2) -> (3)
   [junit4]   2> 2084145 INFO  (zkCallback-3079-thread-1) [    ] o.a.s.c.c.ZkStateReader Updated live nodes from ZooKeeper... (2) -> (3)
   [junit4]   2> 2084191 INFO  (TEST-FullSolrCloudDistribCmdsTest.test-seed#[5960603EC3CF7CD1]) [    ] o.a.s.m.r.SolrJmxReporter JMX monitoring for 'solr.node' (registry 'solr.node') enabled at server: com.sun.jmx.mbeanserver.JmxMBeanServer@c10bc99
   [junit4]   2> 2084208 INFO  (TEST-FullSolrCloudDistribCmdsTest.test-seed#[5960603EC3CF7CD1]) [    ] o.a.s.m.r.SolrJmxReporter JMX monitoring for 'solr.jvm' (registry 'solr.jvm') enabled at server: com.sun.jmx.mbeanserver.JmxMBeanServer@c10bc99
   [junit4]   2> 2084208 INFO  (TEST-FullSolrCloudDistribCmdsTest.test-seed#[5960603EC3CF7CD1]) [    ] o.a.s.m.r.SolrJmxReporter JMX monitoring for 'solr.jetty' (registry 'solr.jetty') enabled at server: com.sun.jmx.mbeanserver.JmxMBeanServer@c10bc99
   [junit4]   2> 2084210 INFO  (TEST-FullSolrCloudDistribCmdsTest.test-seed#[5960603EC3CF7CD1]) [    ] o.a.s.c.CorePropertiesLocator Found 0 core definitions underneath /Users/jenkins/workspace/Lucene-Solr-7.x-MacOSX/solr/build/solr-core/test/J0/../../../../../../../../../Users/jenkins/workspace/Lucene-Solr-7.x-MacOSX/solr/build/solr-core/test/J0/temp/solr.cloud.FullSolrCloudDistribCmdsTest_5960603EC3CF7CD1-001/shard-2-001/cores
   [junit4]   2> 2084244 INFO  (qtp335375371-18335) [    ] o.a.s.h.a.CollectionsHandler Invoked Collection Action :addreplica with params node=127.0.0.1:49208_no_%252Fg&action=ADDREPLICA&collection=collection1&shard=shard3&type=NRT&wt=javabin&version=2 and sendToOCPQueue=true
   [junit4]   2> 2084248 INFO  (OverseerCollectionConfigSetProcessor-98807570719113220-127.0.0.1:49173_no_%2Fg-n_0000000000) [    ] o.a.s.c.OverseerTaskQueue Response ZK path: /overseer/collection-queue-work/qnr-0000000004 doesn't exist.  Requestor may have disconnected from ZooKeeper
   [junit4]   2> 2084249 INFO  (OverseerThreadFactory-7451-thread-4) [    ] o.a.s.c.AddReplicaCmd Node Identified 127.0.0.1:49208_no_%2Fg for creating new replica
   [junit4]   2> 2084253 INFO  (qtp1419356168-18407) [    ] o.a.s.h.a.CoreAdminOperation core create command qt=/admin/cores&collection.configName=conf1&name=collection1_shard3_replica_n63&action=CREATE&collection=collection1&shard=shard3&wt=javabin&version=2&replicaType=NRT
   [junit4]   2> 2084253 INFO  (qtp1419356168-18407) [    ] o.a.s.c.TransientSolrCoreCacheDefault Allocating transient cache for 4 transient cores
   [junit4]   2> 2084371 INFO  (zkCallback-3079-thread-1) [    ] o.a.s.c.c.ZkStateReader A cluster state change: [WatchedEvent state:SyncConnected type:NodeDataChanged path:/collections/collection1/state.json] for collection [collection1] has occurred - updating... (live nodes size: [3])
   [junit4]   2> 2084371 INFO  (zkCallback-3073-thread-1) [    ] o.a.s.c.c.ZkStateReader A cluster state change: [WatchedEvent state:SyncConnected type:NodeDataChanged path:/collections/collection1/state.json] for collection [collection1] has occurred - updating... (live nodes size: [3])
   [junit4]   2> 2085270 INFO  (qtp1419356168-18407) [    ] o.a.s.c.SolrConfig Using Lucene MatchVersion: 7.2.0
   [junit4]   2> 2085279 INFO  (qtp1419356168-18407) [    ] o.a.s.s.IndexSchema [collection1_shard3_replica_n63] Schema name=test
   [junit4]   2> 2085330 INFO  (qtp1419356168-18407) [    ] o.a.s.s.IndexSchema Loaded schema test/1.6 with uniqueid field id
   [junit4]   2> 2085350 INFO  (qtp1419356168-18407) [    ] o.a.s.c.CoreContainer Creating SolrCore 'collection1_shard3_replica_n63' using configuration from collection collection1, trusted=true
   [junit4]   2> 2085350 INFO  (qtp1419356168-18407) [    ] o.a.s.m.r.SolrJmxReporter JMX monitoring for 'solr.core.collection1.shard3.replica_n63' (registry 'solr.core.collection1.shard3.replica_n63') enabled at server: com.sun.jmx.mbeanserver.JmxMBeanServer@c10bc99
   [junit4]   2> 2085350 INFO  (qtp1419356168-18407) [    ] o.a.s.c.SolrCore solr.RecoveryStrategy.Builder
   [junit4]   2> 2085351 INFO  (qtp1419356168-18407) [    ] o.a.s.c.SolrCore [[collection1_shard3_replica_n63] ] Opening new SolrCore at [/Users/jenkins/workspace/Lucene-Solr-7.x-MacOSX/solr/build/solr-core/test/J0/temp/solr.cloud.FullSolrCloudDistribCmdsTest_5960603EC3CF7CD1-001/shard-2-001/cores/collection1_shard3_replica_n63], dataDir=[/Users/jenkins/workspace/Lucene-Solr-7.x-MacOSX/solr/build/solr-core/test/J0/../../../../../../../../../Users/jenkins/workspace/Lucene-Solr-7.x-MacOSX/solr/build/solr-core/test/J0/temp/solr.cloud.FullSolrCloudDistribCmdsTest_5960603EC3CF7CD1-001/shard-2-001/cores/collection1_shard3_replica_n63/data/]
   [junit4]   2> 2085353 INFO  (qtp1419356168-18407) [    ] o.a.s.u.RandomMergePolicy RandomMergePolicy wrapping class org.apache.lucene.index.LogByteSizeMergePolicy: [LogByteSizeMergePolicy: minMergeSize=1677721, mergeFactor=13, maxMergeSize=2147483648, maxMergeSizeForForcedMerge=9223372036854775807, calibrateSizeByDeletes=true, maxMergeDocs=2147483647, maxCFSSegmentSizeMB=8.796093022207999E12, noCFSRatio=0.0]
   [junit4]   2> 2085355 WARN  (qtp1419356168-18407) [    ] o.a.s.c.RequestHandlers INVALID paramSet a in requestHandler {type = requestHandler,name = /dump,class = DumpRequestHandler,attributes = {initParams=a, name=/dump, class=DumpRequestHandler},args = {defaults={a=A,b=B}}}
   [junit4]   2> 2085416 INFO  (qtp1419356168-18407) [    ] o.a.s.u.UpdateHandler Using UpdateLog implementation: org.apache.solr.update.UpdateLog
   [junit4]   2> 2085416 INFO  (qtp1419356168-18407) [    ] o.a.s.u.UpdateLog Initializing UpdateLog: dataDir= defaultSyncLevel=FLUSH numRecordsToKeep=100 maxNumLogsToKeep=10 numVersionBuckets=65536
   [junit4]   2> 2085418 INFO  (qtp1419356168-18407) [    ] o.a.s.u.CommitTracker Hard AutoCommit: disabled
   [junit4]   2> 2085418 INFO  (qtp1419356168-18407) [    ] o.a.s.u.CommitTracker Soft AutoCommit: disabled
   [junit4]   2> 2085420 INFO  (qtp1419356168-18407) [    ] o.a.s.u.RandomMergePolicy RandomMergePolicy wrapping class org.apache.lucene.index.TieredMergePolicy: [TieredMergePolicy: maxMergeAtOnce=17, maxMergeAtOnceExplicit=18, maxMergedSegmentMB=56.994140625, floorSegmentMB=2.1728515625, forceMergeDeletesPctAllowed=15.396008698404852, segmentsPerTier=42.0, maxCFSSegmentSizeMB=8.796093022207999E12, noCFSRatio=0.0
   [junit4]   2> 2085423 INFO  (qtp1419356168-18407) [    ] o.a.s.s.SolrIndexSearcher Opening [Searcher@5bcf7658[collection1_shard3_replica_n63] main]
   [junit4]   2> 2085425 INFO  (qtp1419356168-18407) [    ] o.a.s.r.ManagedResourceStorage Configured ZooKeeperStorageIO with znodeBase: /configs/conf1
   [junit4]   2> 2085426 INFO  (qtp1419356168-18407) [    ] o.a.s.r.ManagedResourceStorage Loaded null at path _rest_managed.json using ZooKeeperStorageIO:path=/configs/conf1
   [junit4]   2> 2085426 INFO  (qtp1419356168-18407) [    ] o.a.s.h.ReplicationHandler Commits will be reserved for 10000ms.
   [junit4]   2> 2085428 INFO  (searcherExecutor-7476-thread-1) [    ] o.a.s.c.SolrCore [collection1_shard3_replica_n63] Registered new searcher Searcher@5bcf7658[collection1_shard3_replica_n63] main{ExitableDirectoryReader(UninvertingDirectoryReader())}
   [junit4]   2> 2085428 INFO  (qtp1419356168-18407) [    ] o.a.s.u.UpdateLog Could not find max version in index or recent updates, using new clock 1580921138898272256
   [junit4]   2> 2085438 INFO  (qtp1419356168-18407) [    ] o.a.s.c.ShardLeaderElectionContext Enough replicas found to continue.
   [junit4]   2> 2085438 INFO  (qtp1419356168-18407) [    ] o.a.s.c.ShardLeaderElectionContext I may be the new leader - try and sync
   [junit4]   2> 2085438 INFO  (qtp1419356168-18407) [    ] o.a.s.c.SyncStrategy Sync replicas to http://127.0.0.1:49208/no_/g/collection1_shard3_replica_n63/
   [junit4]   2> 2085438 INFO  (qtp1419356168-18407) [    ] o.a.s.c.SyncStrategy Sync Success - now sync replicas to me
   [junit4]   2> 2085439 INFO  (qtp1419356168-18407) [    ] o.a.s.c.SyncStrategy http://127.0.0.1:49208/no_/g/collection1_shard3_replica_n63/ has no replicas
   [junit4]   2> 2085439 INFO  (qtp1419356168-18407) [    ] o.a.s.c.ShardLeaderElectionContext Found all replicas participating in election, clear LIR
   [junit4]   2> 2085449 INFO  (qtp1419356168-18407) [    ] o.a.s.c.ShardLeaderElectionContext I am the new leader: http://127.0.0.1:49208/no_/g/collection1_shard3_replica_n63/ shard3
   [junit4]   2> 2085552 INFO  (zkCallback-3073-thread-1) [    ] o.a.s.c.c.ZkStateReader A cluster state change: [WatchedEvent state:SyncConnected type:NodeDataChanged path:/collections/collection1/state.json] for collection [collection1] has occurred - updating... (live nodes size: [3])
   [junit4]   2> 2085552 INFO  (zkCallback-3079-thread-1) [    ] o.a.s.c.c.ZkStateReader A cluster state change: [WatchedEvent state:SyncConnected type:NodeDataChanged path:/collections/collection1/state.json] for collection [collection1] has occurred - updating... (live nodes size: [3])
   [junit4]   2> 2085563 INFO  (qtp1419356168-18407) [    ] o.a.s.c.ZkController I am the leader, no recovery necessary
   [junit4]   2> 2085566 INFO  (qtp1419356168-18407) [    ] o.a.s.s.HttpSolrCall [admin] webapp=null path=/admin/cores params={qt=/admin/cores&collection.configName=conf1&name=collection1_shard3_replica_n63&action=CREATE&collection=collection1&shard=shard3&wt=javabin&version=2&replicaType=NRT} status=0 QTime=1312
   [junit4]   2> 2085569 INFO  (qtp335375371-18335) [    ] o.a.s.s.HttpSolrCall [admin] webapp=null path=/admin/collections params={node=127.0.0.1:49208_no_%252Fg&action=ADDREPLICA&collection=collection1&shard=shard3&type=NRT&wt=javabin&version=2} status=0 QTime=1325
   [junit4]   2> 2085672 INFO  (zkCallback-3073-thread-1) [    ] o.a.s.c.c.ZkStateReader A cluster state change: [WatchedEvent state:SyncConnected type:NodeDataChanged path:/collections/collection1/state.json] for collection [collection1] has occurred - updating... (live nodes size: [3])
   [junit4]   2> 2085672 INFO  (zkCallback-3079-thread-1) [    ] o.a.s.c.c.ZkStateReader A cluster state change: [WatchedEvent state:SyncConnected type:NodeDataChanged path:/collections/collection1/state.json] for collection [collection1] has occurred - updating... (live nodes size: [3])
   [junit4]   2> 2085900 INFO  (TEST-FullSolrCloudDistribCmdsTest.test-seed#[5960603EC3CF7CD1]) [    ] o.a.s.c.AbstractFullDistribZkTestBase create jetty 3 in directory /Users/jenkins/workspace/Lucene-Solr-7.x-MacOSX/solr/build/solr-core/test/J0/temp/solr.cloud.FullSolrCloudDistribCmdsTest_5960603EC3CF7CD1-001/shard-3-001 of type NRT
   [junit4]   2> 2085900 INFO  (TEST-FullSolrCloudDistribCmdsTest.test-seed#[5960603EC3CF7CD1]) [    ] o.e.j.s.Server jetty-9.3.20.v20170531
   [junit4]   2> 2085902 INFO  (TEST-FullSolrCloudDistribCmdsTest.test-seed#[5960603EC3CF7CD1]) [    ] o.e.j.s.h.ContextHandler Started o.e.j.s.ServletContextHandler@66bb10b4{/no_/g,null,AVAILABLE}
   [junit4]   2> 2085903 INFO  (TEST-FullSolrCloudDistribCmdsTest.test-seed#[5960603EC3CF7CD1]) [    ] o.e.j.s.AbstractConnector Started ServerConnector@4592a473{HTTP/1.1,[http/1.1]}{127.0.0.1:49219}
   [junit4]   2> 2085903 INFO  (TEST-FullSolrCloudDistribCmdsTest.test-seed#[5960603EC3CF7CD1]) [    ] o.e.j.s.Server Started @2087651ms
   [junit4]   2> 2085903 INFO  (TEST-FullSolrCloudDistribCmdsTest.test-seed#[5960603EC3CF7CD1]) [    ] o.a.s.c.s.e.JettySolrRunner Jetty properties: {hostContext=/no_/g, solrconfig=solrconfig.xml, solr.data.dir=/Users/jenkins/workspace/Lucene-Solr-7.x-MacOSX/solr/build/solr-core/test/J0/temp/solr.cloud.FullSolrCloudDistribCmdsTest_5960603EC3CF7CD1-001/tempDir-001/jetty3, hostPort=49219, coreRootDirectory=/Users/jenkins/workspace/Lucene-Solr-7.x-MacOSX/solr/build/solr-core/test/J0/../../../../../../../../../Users/jenkins/workspace/Lucene-Solr-7.x-MacOSX/solr/build/solr-core/test/J0/temp/solr.cloud.FullSolrCloudDistribCmdsTest_5960603EC3CF7CD1-001/shard-3-001/cores, replicaType=NRT}
   [junit4]   2> 2085903 ERROR (TEST-FullSolrCloudDistribCmdsTest.test-seed#[5960603EC3CF7CD1]) [    ] o.a.s.u.StartupLoggingUtils Missing Java Option solr.log.dir. Logging may be missing or incomplete.
   [junit4]   2> 2085903 INFO  (TEST-FullSolrCloudDistribCmdsTest.test-seed#[5960603EC3CF7CD1]) [    ] o.a.s.s.SolrDispatchFilter  ___      _       Welcome to Apache Solr™ version 7.2.0
   [junit4]   2> 2085903 INFO  (TEST-FullSolrCloudDistribCmdsTest.test-seed#[5960603EC3CF7CD1]) [    ] o.a.s.s.SolrDispatchFilter / __| ___| |_ _   Starting in cloud mode on port null
   [junit4]   2> 2085903 INFO  (TEST-FullSolrCloudDistribCmdsTest.test-seed#[5960603EC3CF7CD1]) [    ] o.a.s.s.SolrDispatchFilter \__ \/ _ \ | '_|  Install dir: null, Default config dir: null
   [junit4]   2> 2085903 INFO  (TEST-FullSolrCloudDistribCmdsTest.test-seed#[5960603EC3CF7CD1]) [    ] o.a.s.s.SolrDispatchFilter |___/\___/_|_|    Start time: 2017-10-11T01:04:46.906880Z
   [junit4]   2> 2085907 INFO  (TEST-FullSolrCloudDistribCmdsTest.test-seed#[5960603EC3CF7CD1]) [    ] o.a.s.s.SolrDispatchFilter Loading solr.xml from SolrHome (not found in ZooKeeper)
   [junit4]   2> 2085908 INFO  (TEST-FullSolrCloudDistribCmdsTest.test-seed#[5960603EC3CF7CD1]) [    ] o.a.s.c.SolrXmlConfig Loading container configuration from /Users/jenkins/workspace/Lucene-Solr-7.x-MacOSX/solr/build/solr-core/test/J0/temp/solr.cloud.FullSolrCloudDistribCmdsTest_5960603EC3CF7CD1-001/shard-3-001/solr.xml
   [junit4]   2> 2085923 INFO  (TEST-FullSolrCloudDistribCmdsTest.test-seed#[5960603EC3CF7CD1]) [    ] o.a.s.c.SolrXmlConfig Configuration parameter autoReplicaFailoverWorkLoopDelay is ignored
   [junit4]   2> 2085923 INFO  (TEST-FullSolrCloudDistribCmdsTest.test-seed#[5960603EC3CF7CD1]) [    ] o.a.s.c.SolrXmlConfig Configuration parameter autoReplicaFailoverBadNodeExpiration is ignored
   [junit4]   2> 2085923 INFO  (TEST-FullSolrCloudDistribCmdsTest.test-seed#[5960603EC3CF7CD1]) [    ] o.a.s.c.SolrXmlConfig MBean server found: com.sun.jmx.mbeanserver.JmxMBeanServer@c10bc99, but no JMX reporters were configured - adding default JMX reporter.
   [junit4]   2> 2085926 INFO  (TEST-FullSolrCloudDistribCmdsTest.test-seed#[5960603EC3CF7CD1]) [    ] o.a.s.c.ZkContainer Zookeeper client=127.0.0.1:49169/solr
   [junit4]   2> 2085946 INFO  (TEST-FullSolrCloudDistribCmdsTest.test-seed#[5960603EC3CF7CD1]) [    ] o.a.s.c.c.ZkStateReader Updated live nodes from ZooKeeper... (0) -> (3)
   [junit4]   2> 2085950 INFO  (TEST-FullSolrCloudDistribCmdsTest.test-seed#[5960603EC3CF7CD1]) [    ] o.a.s.c.Overseer Overseer (id=null) closing
   [junit4]   2> 2085960 INFO  (TEST-FullSolrCloudDistribCmdsTest.test-seed#[5960603EC3CF7CD1]) [    ] o.a.s.c.ZkController Register node as live in ZooKeeper:/live_nodes/127.0.0.1:49219_no_%2Fg
   [junit4]   2> 2085962 INFO  (zkCallback-3061-thread-1) [    ] o.a.s.c.c.ZkStateReader Updated live nodes from ZooKeeper... (3) -> (4)
   [junit4]   2> 2085962 INFO  (zkCallback-3073-thread-1) [    ] o.a.s.c.c.ZkStateReader Updated live nodes from ZooKeeper... (3) -> (4)
   [junit4]   2> 2085962 INFO  (zkCallback-3068-thread-1) [    ] o.a.s.c.c.ZkStateReader Updated live nodes from ZooKeeper... (3) -> (4)
   [junit4]   2> 2085962 INFO  (zkCallback-3079-thread-1) [    ] o.a.s.c.c.ZkStateReader Updated live nodes from ZooKeeper... (3) -> (4)
   [junit4]   2> 2085962 INFO  (zkCallback-3085-thread-1) [    ] o.a.s.c.c.ZkStateReader Updated live nodes from ZooKeeper... (3) -> (4)
   [junit4]   2> 2085997 INFO  (TEST-FullSolrCloudDistribCmdsTest.test-seed#[5960603EC3CF7CD1]) [    ] o.a.s.m.r.SolrJmxReporter JMX monitoring for 'solr.node' (registry 'solr.node') enabled at server: com.sun.jmx.mbeanserver.JmxMBeanServer@c10bc99
   [junit4]   2> 2086007 INFO  (TEST-FullSolrCloudDistribCmdsTest.test-seed#[5960603EC3CF7CD1]) [    ] o.a.s.m.r.SolrJmxReporter JMX monitoring for 'solr.jvm' (registry 'solr.jvm') enabled at server: com.sun.jmx.mbeanserver.JmxMBeanServer@c10bc99
   [junit4]   2> 2086007 INFO  (TEST-FullSolrCloudDistribCmdsTest.test-seed#[5960603EC3CF7CD1]) [    ] o.a.s.m.r.SolrJmxReporter JMX monitoring for 'solr.jetty' (registry 'solr.jetty') enabled at server: com.sun.jmx.mbeanserver.JmxMBeanServer@c10bc99
   [junit4]   2> 2086009 INFO  (TEST-FullSolrCloudDistribCmdsTest.test-seed#[5960603EC3CF7CD1]) [    ] o.a.s.c.CorePropertiesLocator Found 0 core definitions underneath /Users/jenkins/workspace/Lucene-Solr-7.x-MacOSX/solr/build/solr-core/test/J0/../../../../../../../../../Users/jenkins/workspace/Lucene-Solr-7.x-MacOSX/solr/build/solr-core/test/J0/temp/solr.cloud.FullSolrCloudDistribCmdsTest_5960603EC3CF7CD1-001/shard-3-001/cores
   [junit4]   2> 2086048 INFO  (qtp335375371-18333) [    ] o.a.s.h.a.CollectionsHandler Invoked Collection Action :addreplica with params node=127.0.0.1:49219_no_%252Fg&action=ADDREPLICA&collection=collection1&shard=shard1&type=NRT&wt=javabin&version=2 and sendToOCPQueue=true
   [junit4]   2> 2086052 INFO  (OverseerCollectionConfigSetProcessor-98807570719113220-127.0.0.1:49173_no_%2Fg-n_0000000000) [    ] o.a.s.c.OverseerTaskQueue Response ZK path: /overseer/collection-queue-work/qnr-0000000006 doesn't exist.  Requestor may have disconnected from ZooKeeper
   [junit4]   2> 2086053 INFO  (OverseerThreadFactory-7451-thread-5) [    ] o.a.s.c.AddReplicaCmd Node Identified 127.0.0.1:49219_no_%2Fg for creating new replica
   [junit4]   2> 2086056 INFO  (qtp2037953181-18436) [    ] o.a.s.h.a.CoreAdminOperation core create command qt=/admin/cores&collection.configName=conf1&name=collection1_shard1_replica_n65&action=CREATE&collection=collection1&shard=shard1&wt=javabin&version=2&replicaType=NRT
   [junit4]   2> 2086057 INFO  (qtp2037953181-18436) [    ] o.a.s.c.TransientSolrCoreCacheDefault Allocating transient cache for 4 transient cores
   [junit4]   2> 2086169 INFO  (zkCallback-3085-thread-1) [    ] o.a.s.c.c.ZkStateReader A cluster state change: [WatchedEvent state:SyncConnected type:NodeDataChanged path:/collections/collection1/state.json] for collection [collection1] has occurred - updating... (live nodes size: [4])
   [junit4]   2> 2086169 INFO  (zkCallback-3073-thread-1) [    ] o.a.s.c.c.ZkStateReader A cluster state change: [WatchedEvent state:SyncConnected type:NodeDataChanged path:/collections/collection1/state.json] for collection [collection1] has occurred - updating... (live nodes size: [4])
   [junit4]   2> 2086169 INFO  (zkCallback-3079-thread-1) [    ] o.a.s.c.c.ZkStateReader A cluster state change: [WatchedEvent state:SyncConnected type:NodeDataChanged path:/collections/collection1/state.json] for collection [collection1] has occurred - updating... (live nodes size: [4])
   [junit4]   2> 2087078 INFO  (qtp2037953181-18436) [    ] o.a.s.c.SolrConfig Using Lucene MatchVersion: 7.2.0
   [junit4]   2> 2087094 INFO  (qtp2037953181-18436) [    ] o.a.s.s.IndexSchema [collection1_shard1_replica_n65] Schema name=test
   [junit4]   2> 2087175 INFO  (qtp2037953181-18436) [    ] o.a.s.s.IndexSchema Loaded schema test/1.6 with uniqueid field id
   [junit4]   2> 2087207 INFO  (qtp2037953181-18436) [    ] o.a.s.c.CoreContainer Creating SolrCore 'collection1_shard1_replica_n65' using configuration from collection collection1, trusted=true
   [junit4]   2> 2087208 INFO  (qtp2037953181-18436) [    ] o.a.s.m.r.SolrJmxReporter JMX monitoring for 'solr.core.collection1.shard1.replica_n65' (registry 'solr.core.collection1.shard1.replica_n65') enabled at server: com.sun.jmx.mbeanserver.JmxMBeanServer@c10bc99
   [junit4]   2> 2087208 INFO  (qtp2037953181-18436) [    ] o.a.s.c.SolrCore solr.RecoveryStrategy.Builder
   [junit4]   2> 2087208 INFO  (qtp2037953181-18436) [    ] o.a.s.c.SolrCore [[collection1_shard1_replica_n65] ] Opening new SolrCore at [/Users/jenkins/workspace/Lucene-Solr-7.x-MacOSX/solr/build/solr-core/test/J0/temp/solr.cloud.FullSolrCloudDistribCmdsTest_5960603EC3CF7CD1-001/shard-3-001/cores/collection1_shard1_replica_n65], dataDir=[/Users/jenkins/workspace/Lucene-Solr-7.x-MacOSX/solr/build/solr-core/test/J0/../../../../../../../../../Users/jenkins/workspace/Lucene-Solr-7.x-MacOSX/solr/build/solr-core/test/J0/temp/solr.cloud.FullSolrCloudDistribCmdsTest_5960603EC3CF7CD1-001/shard-3-001/cores/collection1_shard1_replica_n65/data/]
   [junit4]   2> 2087211 INFO  (qtp2037953181-18436) [    ] o.a.s.u.RandomMergePolicy RandomMergePolicy wrapping class org.apache.lucene.index.LogByteSizeMergePolicy: [LogByteSizeMergePolicy: minMergeSize=1677721, mergeFactor=13, maxMergeSize=2147483648, maxMergeSizeForForcedMerge=9223372036854775807, calibrateSizeByDeletes=true, maxMergeDocs=2147483647, maxCFSSegmentSizeMB=8.796093022207999E12, noCFSRatio=0.0]
   [junit4]   2> 2087214 WARN  (qtp2037953181-18436) [    ] o.a.s.c.RequestHandlers INVALID paramSet a in requestHandler {type = requestHandler,name = /dump,class = DumpRequestHandler,attributes = {initParams=a, name=/dump, class=DumpRequestHandler},args = {defaults={a=A,b=B}}}
   [junit4]   2> 2087271 INFO  (qtp2037953181-18436) [    ] o.a.s.u.UpdateHandler Using UpdateLog implementation: org.apache.solr.update.UpdateLog
   [junit4]   2> 2087271 INFO  (qtp2037953181-18436) [    ] o.a.s.u.UpdateLog Initializing UpdateLog: dataDir= defaultSyncLevel=FLUSH numRecordsToKeep=100 maxNumLogsToKeep=10 numVersionBuckets=65536
   [junit4]   2> 2087272 INFO  (qtp2037953181-18436) [    ] o.a.s.u.CommitTracker Hard AutoCommit: disabled
   [junit4]   2> 2087272 INFO  (qtp2037953181-18436) [    ] o.a.s.u.CommitTracker Soft AutoCommit: disabled
   [junit4]   2> 2087273 INFO  (qtp2037953181-18436) [    ] o.a.s.u.RandomMergePolicy RandomMergePolicy wrapping class org.apache.lucene.index.TieredMergePolicy: [TieredMergePolicy: maxMergeAtOnce=17, maxMergeAtOnceExplicit=18, maxMergedSegmentMB=56.994140625, floorSegmentMB=2.1728515625, forceMergeDeletesPctAllowed=15.396008698404852, segmentsPerTier=42.0, maxCFSSegmentSizeMB=8.796093022207999E12, noCFSRatio=0.0
   [junit4]   2> 2087273 INFO  (qtp2037953181-18436) [    ] o.a.s.s.SolrIndexSearcher Opening [Searcher@5349dec4[collection1_shard1_replica_n65] main]
   [junit4]   2> 2087275 INFO  (qtp2037953181-18436) [    ] o.a.s.r.ManagedResourceStorage Configured ZooKeeperStorageIO with znodeBase: /configs/conf1
   [junit4]   2> 2087276 INFO  (qtp2037953181-18436) [    ] o.a.s.r.ManagedResourceStorage Loaded null at path _rest_managed.json using ZooKeeperStorageIO:path=/configs/conf1
   [junit4]   2> 2087276 INFO  (qtp2037953181-18436) [    ] o.a.s.h.ReplicationHandler Commits will be reserved for 10000ms.
   [junit4]   2> 2087276 INFO  (qtp2037953181-18436) [    ] o.a.s.u.UpdateLog Could not find max version in index or recent updates, using new clock 1580921140836040704
   [junit4]   2> 2087277 INFO  (searcherExecutor-7487-thread-1) [    ] o.a.s.c.SolrCore [collection1_shard1_replica_n65] Registered new searcher Searcher@5349dec4[collection1_shard1_replica_n65] main{ExitableDirectoryReader(UninvertingDirectoryReader())}
   [junit4]   2> 2087286 INFO  (qtp2037953181-18436) [    ] o.a.s.c.ShardLeaderElectionContext Enough replicas found to continue.
   [junit4]   2> 2087286 INFO  (qtp2037953181-18436) [    ] o.a.s.c.ShardLeaderElectionContext I may be the new leader - try and sync
   [junit4]   2> 2087286 INFO  (qtp2037953181-18436) [    ] o.a.s.c.SyncStrategy Sync replicas to http://127.0.0.1:49219/no_/g/collection1_shard1_replica_n65/
   [junit4]   2> 2087286 INFO  (qtp2037953181-18436) [    ] o.a.s.c.SyncStrategy Sync Success - now sync replicas to me
   [junit4]   2> 2087287 INFO  (qtp2037953181-18436) [    ] o.a.s.c.SyncStrategy http://127.0.0.1:49219/no_/g/collection1_shard1_replica_n65/ has no replicas
   [junit4]   2> 2087287 INFO  (qtp2037953181-18436) [    ] o.a.s.c.ShardLeaderElectionContext Found all replicas participating in election, clear LIR
   [junit4]   2> 2087292 INFO  (qtp2037953181-18436) [    ] o.a.s.c.ShardLeaderElectionContext I am the new leader: http://127.0.0.1:49219/no_/g/collection1_shard1_replica_n65/ shard1
   [junit4]   2> 2087397 INFO  (zkCallback-3085-thread-1) [    ] o.a.s.c.c.ZkStateReader A cluster state change: [WatchedEvent state:SyncConnected type:NodeDataChanged path:/collections/collection1/state.json] for collection [collection1] has occurred - updating... (live nodes size: [4])
   [junit4]   2> 2087397 INFO  (zkCallback-3079-thread-1) [    ] o.a.s.c.c.ZkStateReader A cluster state change: [WatchedEvent state:SyncConnected type:NodeDataChanged path:/collections/collection1/state.json] for collection [collection1] has occurred - updating... (live nodes size: [4])
   [junit4]   2> 2087397 INFO  (zkCallback-3073-thread-1) [    ] o.a.s.c.c.ZkStateReader A cluster state change: [WatchedEvent state:SyncConnected type:NodeDataChanged path:/collections/collection1/state.json] for collection [collection1] has occurred - updating... (live nodes size: [4])
   [junit4]   2> 2087404 INFO  (qtp2037953181-18436) [    ] o.a.s.c.ZkController I am the leader, no recovery necessary
   [junit4]   2> 2087406 INFO  (qtp2037953181-18436) [    ] o.a.s.s.HttpSolrCall [admin] webapp=null path=/admin/cores params={qt=/admin/cores&collection.configName=conf1&name=collection1_shard1_replica_n65&action=CREATE&collection=collection1&shard=shard1&wt=javabin&version=2&replicaType=NRT} status=0 QTime=1349
   [junit4]   2> 2087410 INFO  (qtp335375371-18333) [    ] o.a.s.s.HttpSolrCall [admin] webapp=null path=/admin/collections params={node=127.0.0.1:49219_no_%252Fg&action=ADDREPLICA&collection=collection1&shard=shard1&type=NRT&wt=javabin&version=2} status=0 QTime=1361
   [junit4]   2> 2087519 INFO  (zkCallback-3085-thread-1) [    ] o.a.s.c.c.ZkStateReader A cluster state change: [WatchedEvent state:SyncConnected type:NodeDataChanged path:/collections/collection1/state.json] for collection [collection1] has occurred - updating... (live nodes size: [4])
   [junit4]   2> 2087520 INFO  (zkCallback-3079-thread-1) [    ] o.a.s.c.c.ZkStateReader A cluster state change: [WatchedEvent state:SyncConnected type:NodeDataChanged path:/collections/collection1/state.json] for collection [collection1] has occurred - updating... (live nodes size: [4])
   [junit4]   2> 2087520 INFO  (zkCallback-3073-thread-1) [    ] o.a.s.c.c.ZkStateReader A cluster state change: [WatchedEvent state:SyncConnected type:NodeDataChanged path:/collections/collection1/state.json] for collection [collection1] has occurred - updating... (live nodes size: [4])
   [junit4]   2> 2087763 INFO  (TEST-FullSolrCloudDistribCmdsTest.test-seed#[5960603EC3CF7CD1]) [    ] o.a.s.c.AbstractFullDistribZkTestBase create jetty 4 in directory /Users/jenkins/workspace/Lucene-Solr-7.x-MacOSX/solr/build/solr-core/test/J0/temp/solr.cloud.FullSolrCloudDistribCmdsTest_5960603EC3CF7CD1-001/shard-4-001 of type NRT
   [junit4]   2> 2087763 INFO  (TEST-FullSolrCloudDistribCmdsTest.test-seed#[5960603EC3CF7CD1]) [    ] o.e.j.s.Server jetty-9.3.20.v20170531
   [junit4]   2> 2087765 INFO  (TEST-FullSolrCloudDistribCmdsTest.test-seed#[5960603EC3CF7CD1]) [    ] o.e.j.s.h.ContextHandler Started o.e.j.s.ServletContextHandler@d655ab6{/no_/g,null,AVAILABLE}
   [junit4]   2> 2087766 INFO  (TEST-FullSolrCloudDistribCmdsTest.test-seed#[5960603EC3CF7CD1]) [    ] o.e.j.s.AbstractConnector Started ServerConnector@28933b8f{HTTP/1.1,[http/1.1]}{127.0.0.1:49232}
   [junit4]   2> 2087766 INFO  (TEST-FullSolrCloudDistribCmdsTest.test-seed#[5960603EC3CF7CD1]) [    ] o.e.j.s.Server Started @2089515ms
   [junit4]   2> 2087766 INFO  (TEST-FullSolrCloudDistribCmdsTest.test-seed#[5960603EC3CF7CD1]) [    ] o.a.s.c.s.e.JettySolrRunner Jetty properties: {hostContext=/no_/g, solrconfig=solrconfig.xml, solr.data.dir=/Users/jenkins/workspace/Lucene-Solr-7.x-MacOSX/solr/build/solr-core/test/J0/temp/solr.cloud.FullSolrCloudDistribCmdsTest_5960603EC3CF7CD1-001/tempDir-001/jetty4, hostPort=49232, coreRootDirectory=/Users/jenkins/workspace/Lucene-Solr-7.x-MacOSX/solr/build/solr-core/test/J0/temp/solr.cloud.FullSolrCloudDistribCmdsTest_5960603EC3CF7CD1-001/shard-4-001/cores}
   [junit4]   2> 2087766 ERROR (TEST-FullSolrCloudDistribCmdsTest.test-seed#[5960603EC3CF7CD1]) [    ] o.a.s.u.StartupLoggingUtils Missing Java Option solr.log.dir. Logging may be missing or incomplete.
   [junit4]   2> 2087766 INFO  (TEST-FullSolrCloudDistribCmdsTest.test-seed#[5960603EC3CF7CD1]) [    ] o.a.s.s.SolrDispatchFilter  ___      _       Welcome to Apache Solr™ version 7.2.0
   [junit4]   2> 2087766 INFO  (TEST-FullSolrCloudDistribCmdsTest.test-seed#[5960603EC3CF7CD1]) [    ] o.a.s.s.SolrDispatchFilter / __| ___| |_ _   Starting in cloud mode on port null
   [junit4]   2> 2087766 INFO  (TEST-FullSolrCloudDistribCmdsTest.test-seed#[5960603EC3CF7CD1]) [    ] o.a.s.s.SolrDispatchFilter \__ \/ _ \ | '_|  Install dir: null, Default config dir: null
   [junit4]   2> 2087767 INFO  (TEST-FullSolrCloudDistribCmdsTest.test-seed#[5960603EC3CF7CD1]) [    ] o.a.s.s.SolrDispatchFilter |___/\___/_|_|    Start time: 2017-10-11T01:04:48.770037Z
   [junit4]   2> 2087772 INFO  (TEST-FullSolrCloudDistribCmdsTest.test-seed#[5960603EC3CF7CD1]) [    ] o.a.s.s.SolrDispatchFilter Loading solr.xml from SolrHome (not found in ZooKeeper)
   [junit4]   2> 2087772 INFO  (TEST-FullSolrCloudDistribCmdsTest.test-seed#[5960603EC3CF7CD1]) [    ] o.a.s.c.SolrXmlConfig Loading container configuration from /Users/jenkins/workspace/Lucene-Solr-7.x-MacOSX/solr/build/solr-core/test/J0/temp/solr.cloud.FullSolrCloudDistribCmdsTest_5960603EC3CF7CD1-001/shard-4-001/solr.xml
   [junit4]   2> 2087774 INFO  (TEST-FullSolrCloudDistribCmdsTest.test-seed#[5960603EC3CF7CD1]) [    ] o.a.s.c.SolrXmlConfig Configuration parameter autoReplicaFailoverWorkLoopDelay is ignored
   [junit4]   2> 2087774 INFO  (TEST-FullSolrCloudDistribCmdsTest.test-seed#[5960603EC3CF7CD1]) [    ] o.a.s.c.SolrXmlConfig Configuration parameter autoReplicaFailoverBadNodeExpiration is ignored
   [junit4]   2> 2087774 INFO  (TEST-FullSolrCloudDistribCmdsTest.test-seed#[5960603EC3CF7CD1]) [    ] o.a.s.c.SolrXmlConfig MBean server found: com.sun.jmx.mbeanserver.JmxMBeanServer@c10bc99, but no JMX reporters were configured - adding default JMX reporter.
   [junit4]   2> 2087784 INFO  (TEST-FullSolrCloudDistribCmdsTest.test-seed#[5960603EC3CF7CD1]) [    ] o.a.s.c.ZkContainer Zookeeper client=127.0.0.1:49169/solr
   [junit4]   2> 2087798 INFO  (TEST-FullSolrCloudDistribCmdsTest.test-seed#[5960603EC3CF7CD1]) [    ] o.a.s.c.c.ZkStateReader Updated live nodes from ZooKeeper... (0) -> (4)
   [junit4]   2> 2087803 INFO  (TEST-FullSolrCloudDistribCmdsTest.test-seed#[5960603EC3CF7CD1]) [    ] o.a.s.c.Overseer Overseer (id=null) closing
   [junit4]   2> 2087807 INFO  (TEST-FullSolrCloudDistribCmdsTest.test-seed#[5960603EC3CF7CD1]) [    ] o.a.s.c.ZkController Register node as live in ZooKeeper:/live_nodes/127.0.0.1:49232_no_%2Fg
   [junit4]   2> 2087810 INFO  (zkCallback-3061-thread-1) [    ] o.a.s.c.c.ZkStateReader Updated live nodes from ZooKeeper... (4) -> (5)
   [junit4]   2> 2087810 INFO  (zkCallback-3085-thread-1) [    ] o.a.s.c.c.ZkStateReader Updated live nodes from ZooKeeper... (4) -> (5)
   [junit4]   2> 2087814 INFO  (zkCallback-3068-thread-1) [    ] o.a.s.c.c.ZkStateReader Updated live nodes from ZooKeeper... (4) -> (5)
   [junit4]   2> 2087814 INFO  (zkCallback-3079-thread-1) [    ] o.a.s.c.c.ZkStateReader Updated live nodes from ZooKeeper... (4) -> (5)
   [junit4]   2> 2087814 INFO  (zkCallback-3073-thread-1) [    ] o.a.s.c.c.ZkStateReader Updated live nodes from ZooKeeper... (4) -> (5)
   [junit4]   2> 2087817 INFO  (zkCallback-3091-thread-1) [    ] o.a.s.c.c.ZkStateReader Updated live nodes from ZooKeeper... (4) -> (5)
   [junit4]   2> 2087860 INFO  (TEST-FullSolrCloudDistribCmdsTest.test-seed#[5960603EC3CF7CD1]) [    ] o.a.s.m.r.SolrJmxReporter JMX monitoring for 'solr.node' (registry 'solr.node') enabled at server: com.sun.jmx.mbeanserver.JmxMBeanServer@c10bc99
   [junit4]   2> 2087878 INFO  (TEST-FullSolrCloudDistribCmdsTest.test-seed#[5960603EC3CF7CD1]) [    ] o.a.s.m.r.SolrJmxReporter JMX monitoring for 'solr.jvm' (registry 'solr.jvm') enabled at server: com.sun.jmx.mbeanserver.JmxMBeanServer@c10bc99
   [junit4]   2> 2087878 INFO  (TEST-FullSolrCloudDistribCmdsTest.test-seed#[5960603EC3CF7CD1]) [    ] o.a.s.m.r.SolrJmxReporter JMX monitoring for 'solr.jetty' (registry 'solr.jetty') enabled at server: com.sun.jmx.mbeanserver.JmxMBeanServer@c10bc99
   [junit4]   2> 2087880 INFO  (TEST-FullSolrCloudDistribCmdsTest.test-seed#[5960603EC3CF7CD1]) [    ] o.a.s.c.CorePropertiesLocator Found 0 core definitions underneath /Users/jenkins/workspace/Lucene-Solr-7.x-MacOSX/solr/build/solr-core/test/J0/temp/solr.cloud.FullSolrCloudDistribCmdsTest_5960603EC3CF7CD1-001/shard-4-001/cores
   [junit4]   2> 2087966 INFO  (qtp335375371-18336) [    ] o.a.s.h.a.CollectionsHandler Invoked Collection Action :addreplica with params node=127.0.0.1:49232_no_%252Fg&action=ADDREPLICA&collection=collection1&shard=shard2&type=NRT&wt=javabin&version=2 and sendToOCPQueue=true
   [junit4]   2> 2087981 INFO  (OverseerCollectionConfigSetProcessor-98807570719113220-127.0.0.1:49173_no_%2Fg-n_0000000000) [    ] o.a.s.c.OverseerTaskQueue Response ZK path: /overseer/collection-queue-work/qnr-0000000008 doesn't exist.  Requestor may have disconnected from ZooKeeper
   [junit4]   2> 2087983 INFO  (OverseerThreadFactory-7451-thread-5) [    ] o.a.s.c.AddReplicaCmd Node Identified 127.0.0.1:49232_no_%2Fg for creating new replica
   [junit4]   2> 2087987 INFO  (qtp69442707-18465) [    ] o.a.s.h.a.CoreAdminOperation core create command qt=/admin/cores&collection.configName=conf1&name=collection1_shard2_replica_n67&action=CREATE&collection=collection1&shard=shard2&wt=javabin&version=2&replicaType=NRT
   [junit4]   2> 2087987 INFO  (qtp69442707-18465) [    ] o.a.s.c.TransientSolrCoreCacheDefault Allocating transient cache for 4 transient cores
   [junit4]   2> 2088096 INFO  (zkCallback-3091-thread-1) [    ] o.a.s.c.c.ZkStateReader A cluster state change: [WatchedEvent state:SyncConnected type:NodeDataChanged path:/collections/collection1/state.json] for collection [collection1] has occurred - updating... (live nodes size: [5])
   [junit4]   2> 2088096 INFO  (zkCallback-3085-thread-1) [    ] o.a.s.c.c.ZkStateReader A cluster state change: [WatchedEvent state:SyncConnected type:NodeDataChanged path:/collections/collection1/state.json] for collection [collection1] has occurred - updating... (live nodes size: [5])
   [junit4]   2> 2088096 INFO  (zkCallback-3073-thread-1) [    ] o.a.s.c.c.ZkStateReader A cluster state change: [WatchedEvent state:SyncConnected type:NodeDataChanged path:/collections/collection1/state.json] for collection [collection1] has occurred - updating... (live nodes size: [5])
   [junit4]   2> 2088096 INFO  (zkCallback-3079-thread-1) [    ] o.a.s.c.c.ZkStateReader A cluster state change: [WatchedEvent state:SyncConnected type:NodeDataChanged path:/collections/collection1/state.json] for collection [collection1] has occurred - updating... (live nodes size: [5])
   [junit4]   2> 2089001 INFO  (qtp69442707-18465) [    ] o.a.s.c.SolrConfig Using Lucene MatchVersion: 7.2.0
   [junit4]   2> 2089009 INFO  (qtp69442707-18465) [    ] o.a.s.s.IndexSchema [collection1_shard2_replica_n67] Schema name=test
   [junit4]   2> 2089071 INFO  (qtp69442707-18465) [    ] o.a.s.s.IndexSchema Loaded schema test/1.6 with uniqueid field id
   [junit4]   2> 2089092 INFO  (qtp69442707-18465) [    ] o.a.s.c.CoreContainer Creating SolrCore 'collection1_shard2_replica_n67' using configuration from collection collection1, trusted=true
   [junit4]   2> 2089092 INFO  (qtp69442707-18465) [    ] o.a.s.m.r.SolrJmxReporter JMX monitoring for 'solr.

[...truncated too long message...]

onnecting to 127.0.0.1:53907 53907
   [junit4]   2> 3108932 WARN  (Thread-4415) [    ] o.a.s.c.ZkTestServer Watch limit violations: 
   [junit4]   2> Maximum concurrent create/delete watches above limit:
   [junit4]   2> 
   [junit4]   2> 	28	/solr/configs/conf
   [junit4]   2> 	10	/solr/aliases.json
   [junit4]   2> 	9	/solr/security.json
   [junit4]   2> 	3	/solr/collections/tlog_replica_test_out_of_order_db_qwith_in_place_updates/state.json
   [junit4]   2> 	3	/solr/clusterprops.json
   [junit4]   2> 
   [junit4]   2> Maximum concurrent data watches above limit:
   [junit4]   2> 
   [junit4]   2> 	40	/solr/collections/tlog_replica_test_recovery/state.json
   [junit4]   2> 	28	/solr/collections/tlog_replica_test_create_delete/state.json
   [junit4]   2> 	27	/solr/collections/tlog_replica_test_kill_leader/state.json
   [junit4]   2> 	27	/solr/collections/tlog_replica_test_kill_tlog_replica/state.json
   [junit4]   2> 	25	/solr/collections/tlog_replica_test_basic_leader_election/state.json
   [junit4]   2> 	24	/solr/collections/tlog_replica_test_remove_leader/state.json
   [junit4]   2> 	23	/solr/collections/tlog_replica_test_add_remove_tlog_replica/state.json
   [junit4]   2> 	21	/solr/collections/tlog_replica_test_out_of_order_db_qwith_in_place_updates/state.json
   [junit4]   2> 	15	/solr/collections/tlog_replica_test_add_docs/state.json
   [junit4]   2> 	15	/solr/collections/tlog_replica_test_only_leader_indexes/state.json
   [junit4]   2> 	13	/solr/collections/tlog_replica_test_delete_by_id/state.json
   [junit4]   2> 	10	/solr/clusterprops.json
   [junit4]   2> 	10	/solr/clusterstate.json
   [junit4]   2> 	6	/solr/collections/tlog_replica_test_real_time_get/state.json
   [junit4]   2> 	4	/solr/overseer_elect/election/98807631004762118-127.0.0.1:53909_solr-n_0000000000
   [junit4]   2> 	3	/solr/overseer_elect/election/98807631004762132-127.0.0.1:53909_solr-n_0000000005
   [junit4]   2> 	3	/solr/collections/tlog_replica_test_create_delete/leader_elect/shard1/election/98807631004762117-core_node9-n_0000000000
   [junit4]   2> 	3	/solr/autoscaling.json
   [junit4]   2> 	3	/solr/collections/tlog_replica_test_recovery/leader_elect/shard1/election/98807631004762132-core_node4-n_0000000001
   [junit4]   2> 	2	/solr/collections/tlog_replica_test_add_docs/leader_elect/shard1/election/98807631004762118-core_node6-n_0000000000
   [junit4]   2> 	2	/solr/collections/tlog_replica_test_create_delete/leader_elect/shard1/election/98807631004762118-core_node7-n_0000000001
   [junit4]   2> 
   [junit4]   2> Maximum concurrent children watches above limit:
   [junit4]   2> 
   [junit4]   2> 	10	/solr/collections
   [junit4]   2> 	3	/solr/overseer/queue
   [junit4]   2> 	3	/solr/live_nodes
   [junit4]   2> 	3	/solr/autoscaling/events/.auto_add_replicas
   [junit4]   2> 	3	/solr/overseer/collection-queue-work
   [junit4]   2> 	2	/solr/overseer/queue-work
   [junit4]   2> 
   [junit4]   2> NOTE: leaving temporary files on disk at: /Users/jenkins/workspace/Lucene-Solr-7.x-MacOSX/solr/build/solr-core/test/J1/temp/solr.cloud.TestTlogReplica_5960603EC3CF7CD1-001
   [junit4]   2> NOTE: test params are: codec=Asserting(Lucene70): {foo=PostingsFormat(name=LuceneVarGapFixedInterval), id=BlockTreeOrds(blocksize=128), foo_s=PostingsFormat(name=LuceneVarGapFixedInterval)}, docValues:{_version_=DocValuesFormat(name=Lucene70), id=DocValuesFormat(name=Direct)}, maxPointsInLeafNode=848, maxMBSortInHeap=5.634864522268311, sim=RandomSimilarity(queryNorm=false): {}, locale=so, timezone=America/Winnipeg
   [junit4]   2> NOTE: Mac OS X 10.11.6 x86_64/Oracle Corporation 9 (64-bit)/cpus=3,threads=1,free=133114120,total=522715136
   [junit4]   2> NOTE: All tests run in this JVM: [TestManagedResourceStorage, SolrJmxReporterTest, TestSmileRequest, TestMergePolicyConfig, DirectSolrSpellCheckerTest, TestSubQueryTransformer, DebugComponentTest, OpenExchangeRatesOrgProviderTest, EchoParamsTest, TestHalfAndHalfDocValues, TestConfigSetsAPIExclusivity, TestConfigReload, TestPostingsSolrHighlighter, MoveReplicaHDFSTest, RulesTest, TestLuceneIndexBackCompat, TestBulkSchemaAPI, HighlighterMaxOffsetTest, AnalyticsQueryTest, TestImplicitCoreProperties, TestMacroExpander, OverseerTaskQueueTest, TestLuceneMatchVersion, TestCloudSchemaless, TestSearcherReuse, TestLegacyNumericUtils, ManagedSchemaRoundRobinCloudTest, TestCloudPivotFacet, TestIntervalFaceting, TestManagedSynonymGraphFilterFactory, TestCollectionsAPIViaSolrCloudCluster, TestConfig, TestBlendedInfixSuggestions, PreAnalyzedFieldTest, AutoscalingHistoryHandlerTest, SolrMetricManagerTest, TestComponentsName, TestReloadAndDeleteDocs, SpellPossibilityIteratorTest, HdfsChaosMonkeyNothingIsSafeTest, TestTrackingShardHandlerFactory, LukeRequestHandlerTest, AsyncCallRequestStatusResponseTest, AddBlockUpdateTest, TestSystemIdResolver, TestLegacyNumericRangeQueryBuilder, BlockCacheTest, WrapperMergePolicyFactoryTest, UpdateRequestProcessorFactoryTest, TestPKIAuthenticationPlugin, DistributedFacetPivotLongTailTest, SearchHandlerTest, OverseerCollectionConfigSetProcessorTest, TestValueSourceCache, TestDistribDocBasedVersion, ChaosMonkeySafeLeaderTest, TestDistributedGrouping, HdfsUnloadDistributedZkTest, TermVectorComponentDistributedTest, TestSearchPerf, TestShortCircuitedRequests, TestExportWriter, BigEndianAscendingWordSerializerTest, CreateCollectionCleanupTest, TestBadConfig, TestBinaryResponseWriter, TestOnReconnectListenerSupport, OverseerRolesTest, TestInitParams, DistributedIntervalFacetingTest, MissingSegmentRecoveryTest, SolrPluginUtilsTest, TestCustomStream, SpellingQueryConverterTest, ShardSplitTest, TestFastLRUCache, AutoScalingHandlerTest, TestSolrQueryParser, TestSkipOverseerOperations, DistributedFacetExistsSmallTest, RestartWhileUpdatingTest, TermVectorComponentTest, ExplicitHLLTest, TestStressLucene, TestCustomSort, TestDocumentBuilder, TestSolr4Spatial, TestDocSet, ActionThrottleTest, TermsComponentTest, IndexSchemaRuntimeFieldTest, ShowFileRequestHandlerTest, StatelessScriptUpdateProcessorFactoryTest, TestFieldCacheVsDocValues, TestHdfsUpdateLog, UpdateParamsTest, SimpleCollectionCreateDeleteTest, TestCloudRecovery, TestTrie, SparseHLLTest, TestElisionMultitermQuery, HdfsRecoverLeaseTest, SolrCoreCheckLockOnStartupTest, TestRandomFaceting, TestRestoreCore, TestSchemaNameResource, TestSolrDeletionPolicy1, CloudMLTQParserTest, SubstringBytesRefFilterTest, TestRecoveryHdfs, TestTolerantUpdateProcessorCloud, TestSchemaSimilarityResource, AutoAddReplicasIntegrationTest, DistributedQueryElevationComponentTest, TestBM25SimilarityFactory, TestFieldCollectionResource, FileBasedSpellCheckerTest, TestSolrCloudWithKerberosAlt, CopyFieldTest, TestSerializedLuceneMatchVersion, TestManagedStopFilterFactory, TestExactStatsCache, TestAnalyzedSuggestions, TestMaxTokenLenTokenizer, TestRTimerTree, TestNumericRangeQuery64, TestPointFields, TestNamedUpdateProcessors, TestUseDocValuesAsStored2, TestClusterProperties, TestPolicyCloud, TestPullReplica, DeleteInactiveReplicaTest, SearchHandlerTest, TestDistributedMissingSort, SuggesterTSTTest, TestConfigSets, TestCrossCoreJoin, TestAddFieldRealTimeGet, SSLMigrationTest, PropertiesRequestHandlerTest, TestRTGBase, ZkSolrClientTest, TestTrieFacet, TestComplexPhraseLeadingWildcard, HLLSerializationTest, TestGraphMLResponseWriter, LeaderElectionContextKeyTest, ConfigureRecoveryStrategyTest, AssignBackwardCompatibilityTest, CollectionReloadTest, TestQueryWrapperFilter, CdcrUpdateLogTest, MultiThreadedOCPTest, TestSha256AuthenticationProvider, TestLeaderElectionWithEmptyReplica, TestCoreDiscovery, TestFieldCacheSort, TestPayloadCheckQParserPlugin, InfixSuggestersTest, CacheHeaderTest, TestDistribIDF, SpellCheckCollatorTest, TestNestedDocsSort, TestXmlQParserPlugin, TestDocBasedVersionConstraints, ClassificationUpdateProcessorFactoryTest, HdfsThreadLeakTest, TestZkChroot, SolrRequestParserTest, SynonymTokenizerTest, TestRemoteStreaming, CdcrVersionReplicationTest, SuggesterFSTTest, SolrCloudReportersTest, BlockJoinFacetRandomTest, HdfsCollectionsAPIDistributedZkTest, ResponseHeaderTest, TestExclusionRuleCollectionAccess, BasicDistributedZkTest, TestRandomDVFaceting, AutoCommitTest, TestHashPartitioner, TestRealTimeGet, TestReload, TestRangeQuery, TestGroupingSearch, SolrCmdDistributorTest, PeerSyncTest, DirectUpdateHandlerTest, TestIndexSearcher, SimplePostToolTest, AnalysisAfterCoreReloadTest, CoreAdminHandlerTest, SchemaVersionSpecificBehaviorTest, TestAtomicUpdateErrorCases, QueryEqualityTest, DocValuesMultiTest, XsltUpdateRequestHandlerTest, TestWriterPerf, TestQueryTypes, MoreLikeThisHandlerTest, LoggingHandlerTest, TestCollationField, UniqFieldsUpdateProcessorFactoryTest, JsonLoaderTest, TestPartialUpdateDeduplication, PingRequestHandlerTest, CSVRequestHandlerTest, TestLFUCache, MultiTermTest, TestBinaryField, NumericFieldsTest, ExternalFileFieldSortTest, TestCharFilters, TestPerFieldSimilarity, TestLMDirichletSimilarityFactory, ResourceLoaderTest, ScriptEngineTest, PluginInfoTest, ChaosMonkeyNothingIsSafeTest, CdcrReplicationHandlerTest, ChaosMonkeySafeLeaderWithPullReplicasTest, CollectionsAPIAsyncDistributedZkTest, ConcurrentDeleteAndCreateCollectionTest, ConfigSetsAPITest, ConnectionManagerTest, DeleteNodeTest, DeleteReplicaTest, DeleteStatusTest, DistribDocExpirationUpdateProcessorTest, DocValuesNotIndexedTest, ForceLeaderTest, LeaderFailureAfterFreshStartTest, LeaderInitiatedRecoveryOnShardRestartTest, MigrateRouteKeyTest, OutOfBoxZkACLAndCredentialsProvidersTest, OverseerModifyCollectionTest, RemoteQueryErrorTest, ReplaceNodeTest, SaslZkACLProviderTest, SolrCLIZkUtilsTest, SolrCloudExampleTest, TestCloudInspectUtil, TestCollectionAPI, TestDownShardTolerantSearch, TestLeaderInitiatedRecoveryThread, TestPrepRecovery, TestRequestForwarding, TestSSLRandomization, TestSegmentSorting, TestSizeLimitedDistributedMap, TestStressLiveNodes, TestTlogReplica]
   [junit4] Completed [564/744 (2!)] on J1 in 110.67s, 13 tests, 2 failures <<< FAILURES!

[...truncated 40393 lines...]

Mime
View raw message