lucene-dev mailing list archives

Site index · List index
Message view « Date » · « Thread »
Top « Date » · « Thread »
From Policeman Jenkins Server <jenk...@thetaphi.de>
Subject [JENKINS] Lucene-Solr-master-Solaris (64bit/jdk1.8.0) - Build # 1492 - Failure!
Date Wed, 25 Oct 2017 03:44:05 GMT
Build: https://jenkins.thetaphi.de/job/Lucene-Solr-master-Solaris/1492/
Java: 64bit/jdk1.8.0 -XX:-UseCompressedOops -XX:+UseParallelGC

1 tests failed.
FAILED:  junit.framework.TestSuite.org.apache.solr.security.hadoop.TestImpersonationWithHadoopAuth

Error Message:
2 threads leaked from SUITE scope at org.apache.solr.security.hadoop.TestImpersonationWithHadoopAuth:     1) Thread[id=41174, name=jetty-launcher-8209-thread-2-EventThread, state=TIMED_WAITING, group=TGRP-TestImpersonationWithHadoopAuth]         at sun.misc.Unsafe.park(Native Method)         at java.util.concurrent.locks.LockSupport.parkNanos(LockSupport.java:215)         at java.util.concurrent.locks.AbstractQueuedSynchronizer.doAcquireSharedNanos(AbstractQueuedSynchronizer.java:1037)         at java.util.concurrent.locks.AbstractQueuedSynchronizer.tryAcquireSharedNanos(AbstractQueuedSynchronizer.java:1328)         at java.util.concurrent.CountDownLatch.await(CountDownLatch.java:277)         at org.apache.curator.CuratorZookeeperClient.internalBlockUntilConnectedOrTimedOut(CuratorZookeeperClient.java:323)         at org.apache.curator.RetryLoop.callWithRetry(RetryLoop.java:105)         at org.apache.curator.framework.imps.GetDataBuilderImpl.pathInForeground(GetDataBuilderImpl.java:288)         at org.apache.curator.framework.imps.GetDataBuilderImpl.forPath(GetDataBuilderImpl.java:279)         at org.apache.curator.framework.imps.GetDataBuilderImpl.forPath(GetDataBuilderImpl.java:41)         at org.apache.curator.framework.recipes.shared.SharedValue.readValue(SharedValue.java:244)         at org.apache.curator.framework.recipes.shared.SharedValue.access$100(SharedValue.java:44)         at org.apache.curator.framework.recipes.shared.SharedValue$1.process(SharedValue.java:61)         at org.apache.curator.framework.imps.NamespaceWatcher.process(NamespaceWatcher.java:67)         at org.apache.zookeeper.ClientCnxn$EventThread.processEvent(ClientCnxn.java:530)         at org.apache.zookeeper.ClientCnxn$EventThread.run(ClientCnxn.java:505)    2) Thread[id=41184, name=jetty-launcher-8209-thread-1-EventThread, state=TIMED_WAITING, group=TGRP-TestImpersonationWithHadoopAuth]         at sun.misc.Unsafe.park(Native Method)         at java.util.concurrent.locks.LockSupport.parkNanos(LockSupport.java:215)         at java.util.concurrent.locks.AbstractQueuedSynchronizer.doAcquireSharedNanos(AbstractQueuedSynchronizer.java:1037)         at java.util.concurrent.locks.AbstractQueuedSynchronizer.tryAcquireSharedNanos(AbstractQueuedSynchronizer.java:1328)         at java.util.concurrent.CountDownLatch.await(CountDownLatch.java:277)         at org.apache.curator.CuratorZookeeperClient.internalBlockUntilConnectedOrTimedOut(CuratorZookeeperClient.java:323)         at org.apache.curator.RetryLoop.callWithRetry(RetryLoop.java:105)         at org.apache.curator.framework.imps.GetDataBuilderImpl.pathInForeground(GetDataBuilderImpl.java:288)         at org.apache.curator.framework.imps.GetDataBuilderImpl.forPath(GetDataBuilderImpl.java:279)         at org.apache.curator.framework.imps.GetDataBuilderImpl.forPath(GetDataBuilderImpl.java:41)         at org.apache.curator.framework.recipes.shared.SharedValue.readValue(SharedValue.java:244)         at org.apache.curator.framework.recipes.shared.SharedValue.access$100(SharedValue.java:44)         at org.apache.curator.framework.recipes.shared.SharedValue$1.process(SharedValue.java:61)         at org.apache.curator.framework.imps.NamespaceWatcher.process(NamespaceWatcher.java:67)         at org.apache.zookeeper.ClientCnxn$EventThread.processEvent(ClientCnxn.java:530)         at org.apache.zookeeper.ClientCnxn$EventThread.run(ClientCnxn.java:505)

Stack Trace:
com.carrotsearch.randomizedtesting.ThreadLeakError: 2 threads leaked from SUITE scope at org.apache.solr.security.hadoop.TestImpersonationWithHadoopAuth: 
   1) Thread[id=41174, name=jetty-launcher-8209-thread-2-EventThread, state=TIMED_WAITING, group=TGRP-TestImpersonationWithHadoopAuth]
        at sun.misc.Unsafe.park(Native Method)
        at java.util.concurrent.locks.LockSupport.parkNanos(LockSupport.java:215)
        at java.util.concurrent.locks.AbstractQueuedSynchronizer.doAcquireSharedNanos(AbstractQueuedSynchronizer.java:1037)
        at java.util.concurrent.locks.AbstractQueuedSynchronizer.tryAcquireSharedNanos(AbstractQueuedSynchronizer.java:1328)
        at java.util.concurrent.CountDownLatch.await(CountDownLatch.java:277)
        at org.apache.curator.CuratorZookeeperClient.internalBlockUntilConnectedOrTimedOut(CuratorZookeeperClient.java:323)
        at org.apache.curator.RetryLoop.callWithRetry(RetryLoop.java:105)
        at org.apache.curator.framework.imps.GetDataBuilderImpl.pathInForeground(GetDataBuilderImpl.java:288)
        at org.apache.curator.framework.imps.GetDataBuilderImpl.forPath(GetDataBuilderImpl.java:279)
        at org.apache.curator.framework.imps.GetDataBuilderImpl.forPath(GetDataBuilderImpl.java:41)
        at org.apache.curator.framework.recipes.shared.SharedValue.readValue(SharedValue.java:244)
        at org.apache.curator.framework.recipes.shared.SharedValue.access$100(SharedValue.java:44)
        at org.apache.curator.framework.recipes.shared.SharedValue$1.process(SharedValue.java:61)
        at org.apache.curator.framework.imps.NamespaceWatcher.process(NamespaceWatcher.java:67)
        at org.apache.zookeeper.ClientCnxn$EventThread.processEvent(ClientCnxn.java:530)
        at org.apache.zookeeper.ClientCnxn$EventThread.run(ClientCnxn.java:505)
   2) Thread[id=41184, name=jetty-launcher-8209-thread-1-EventThread, state=TIMED_WAITING, group=TGRP-TestImpersonationWithHadoopAuth]
        at sun.misc.Unsafe.park(Native Method)
        at java.util.concurrent.locks.LockSupport.parkNanos(LockSupport.java:215)
        at java.util.concurrent.locks.AbstractQueuedSynchronizer.doAcquireSharedNanos(AbstractQueuedSynchronizer.java:1037)
        at java.util.concurrent.locks.AbstractQueuedSynchronizer.tryAcquireSharedNanos(AbstractQueuedSynchronizer.java:1328)
        at java.util.concurrent.CountDownLatch.await(CountDownLatch.java:277)
        at org.apache.curator.CuratorZookeeperClient.internalBlockUntilConnectedOrTimedOut(CuratorZookeeperClient.java:323)
        at org.apache.curator.RetryLoop.callWithRetry(RetryLoop.java:105)
        at org.apache.curator.framework.imps.GetDataBuilderImpl.pathInForeground(GetDataBuilderImpl.java:288)
        at org.apache.curator.framework.imps.GetDataBuilderImpl.forPath(GetDataBuilderImpl.java:279)
        at org.apache.curator.framework.imps.GetDataBuilderImpl.forPath(GetDataBuilderImpl.java:41)
        at org.apache.curator.framework.recipes.shared.SharedValue.readValue(SharedValue.java:244)
        at org.apache.curator.framework.recipes.shared.SharedValue.access$100(SharedValue.java:44)
        at org.apache.curator.framework.recipes.shared.SharedValue$1.process(SharedValue.java:61)
        at org.apache.curator.framework.imps.NamespaceWatcher.process(NamespaceWatcher.java:67)
        at org.apache.zookeeper.ClientCnxn$EventThread.processEvent(ClientCnxn.java:530)
        at org.apache.zookeeper.ClientCnxn$EventThread.run(ClientCnxn.java:505)
	at __randomizedtesting.SeedInfo.seed([A494B1E20F13937]:0)




Build Log:
[...truncated 13784 lines...]
   [junit4] Suite: org.apache.solr.security.hadoop.TestImpersonationWithHadoopAuth
   [junit4]   2> Creating dataDir: /export/home/jenkins/workspace/Lucene-Solr-master-Solaris/solr/build/solr-core/test/J1/temp/solr.security.hadoop.TestImpersonationWithHadoopAuth_A494B1E20F13937-001/init-core-data-001
   [junit4]   2> 3859371 INFO  (SUITE-TestImpersonationWithHadoopAuth-seed#[A494B1E20F13937]-worker) [    ] o.a.s.SolrTestCaseJ4 Using PointFields (NUMERIC_POINTS_SYSPROP=true) w/NUMERIC_DOCVALUES_SYSPROP=false
   [junit4]   2> 3859372 INFO  (SUITE-TestImpersonationWithHadoopAuth-seed#[A494B1E20F13937]-worker) [    ] o.a.s.SolrTestCaseJ4 Randomized ssl (false) and clientAuth (true) via: @org.apache.solr.util.RandomizeSSL(reason=, value=NaN, ssl=NaN, clientAuth=NaN)
   [junit4]   2> 3859372 INFO  (SUITE-TestImpersonationWithHadoopAuth-seed#[A494B1E20F13937]-worker) [    ] o.a.s.SolrTestCaseJ4 SecureRandom sanity checks: test.solr.allowed.securerandom=null & java.security.egd=file:/dev/./urandom
   [junit4]   2> 3859409 INFO  (SUITE-TestImpersonationWithHadoopAuth-seed#[A494B1E20F13937]-worker) [    ] o.a.s.c.MiniSolrCloudCluster Starting cluster of 2 servers in /export/home/jenkins/workspace/Lucene-Solr-master-Solaris/solr/build/solr-core/test/J1/temp/solr.security.hadoop.TestImpersonationWithHadoopAuth_A494B1E20F13937-001/tempDir-001
   [junit4]   2> 3859410 INFO  (SUITE-TestImpersonationWithHadoopAuth-seed#[A494B1E20F13937]-worker) [    ] o.a.s.c.ZkTestServer STARTING ZK TEST SERVER
   [junit4]   2> 3859410 INFO  (Thread-9168) [    ] o.a.s.c.ZkTestServer client port:0.0.0.0/0.0.0.0:0
   [junit4]   2> 3859410 INFO  (Thread-9168) [    ] o.a.s.c.ZkTestServer Starting server
   [junit4]   2> 3859411 ERROR (Thread-9168) [    ] o.a.z.s.ZooKeeperServer ZKShutdownHandler is not registered, so ZooKeeper server won't take any action on ERROR or SHUTDOWN server state changes
   [junit4]   2> 3859510 INFO  (SUITE-TestImpersonationWithHadoopAuth-seed#[A494B1E20F13937]-worker) [    ] o.a.s.c.ZkTestServer start zk server on port:47686
   [junit4]   2> 3859526 INFO  (jetty-launcher-8209-thread-1) [    ] o.e.j.s.Server jetty-9.3.20.v20170531
   [junit4]   2> 3859526 INFO  (jetty-launcher-8209-thread-2) [    ] o.e.j.s.Server jetty-9.3.20.v20170531
   [junit4]   2> 3859528 INFO  (jetty-launcher-8209-thread-1) [    ] o.e.j.s.h.ContextHandler Started o.e.j.s.ServletContextHandler@699104f6{/solr,null,AVAILABLE}
   [junit4]   2> 3859528 INFO  (jetty-launcher-8209-thread-2) [    ] o.e.j.s.h.ContextHandler Started o.e.j.s.ServletContextHandler@493911f4{/solr,null,AVAILABLE}
   [junit4]   2> 3859529 INFO  (jetty-launcher-8209-thread-2) [    ] o.e.j.s.AbstractConnector Started ServerConnector@9ba2588{HTTP/1.1,[http/1.1]}{127.0.0.1:๕๔๕๙๙}
   [junit4]   2> 3859531 INFO  (jetty-launcher-8209-thread-2) [    ] o.e.j.s.Server Started @๓๘๖๓๔๐๖ms
   [junit4]   2> 3859531 INFO  (jetty-launcher-8209-thread-1) [    ] o.e.j.s.AbstractConnector Started ServerConnector@56d3e320{HTTP/1.1,[http/1.1]}{127.0.0.1:๓๘๑๒๕}
   [junit4]   2> 3859531 INFO  (jetty-launcher-8209-thread-2) [    ] o.a.s.c.s.e.JettySolrRunner Jetty properties: {hostContext=/solr, hostPort=54599}
   [junit4]   2> 3859531 INFO  (jetty-launcher-8209-thread-1) [    ] o.e.j.s.Server Started @๓๘๖๓๔๐๗ms
   [junit4]   2> 3859532 ERROR (jetty-launcher-8209-thread-2) [    ] o.a.s.u.StartupLoggingUtils Missing Java Option solr.log.dir. Logging may be missing or incomplete.
   [junit4]   2> 3859532 INFO  (jetty-launcher-8209-thread-2) [    ] o.a.s.s.SolrDispatchFilter  ___      _       Welcome to Apache Solr™ version 8.0.0
   [junit4]   2> 3859532 INFO  (jetty-launcher-8209-thread-2) [    ] o.a.s.s.SolrDispatchFilter / __| ___| |_ _   Starting in cloud mode on port null
   [junit4]   2> 3859532 INFO  (jetty-launcher-8209-thread-2) [    ] o.a.s.s.SolrDispatchFilter \__ \/ _ \ | '_|  Install dir: null, Default config dir: null
   [junit4]   2> 3859532 INFO  (jetty-launcher-8209-thread-1) [    ] o.a.s.c.s.e.JettySolrRunner Jetty properties: {hostContext=/solr, hostPort=38125}
   [junit4]   2> 3859532 INFO  (jetty-launcher-8209-thread-2) [    ] o.a.s.s.SolrDispatchFilter |___/\___/_|_|    Start time: 2017-10-25T03:34:07.949Z
   [junit4]   2> 3859532 ERROR (jetty-launcher-8209-thread-1) [    ] o.a.s.u.StartupLoggingUtils Missing Java Option solr.log.dir. Logging may be missing or incomplete.
   [junit4]   2> 3859532 INFO  (jetty-launcher-8209-thread-1) [    ] o.a.s.s.SolrDispatchFilter  ___      _       Welcome to Apache Solr™ version 8.0.0
   [junit4]   2> 3859532 INFO  (jetty-launcher-8209-thread-1) [    ] o.a.s.s.SolrDispatchFilter / __| ___| |_ _   Starting in cloud mode on port null
   [junit4]   2> 3859532 INFO  (jetty-launcher-8209-thread-1) [    ] o.a.s.s.SolrDispatchFilter \__ \/ _ \ | '_|  Install dir: null, Default config dir: null
   [junit4]   2> 3859532 INFO  (jetty-launcher-8209-thread-1) [    ] o.a.s.s.SolrDispatchFilter |___/\___/_|_|    Start time: 2017-10-25T03:34:07.949Z
   [junit4]   2> 3859534 INFO  (jetty-launcher-8209-thread-2) [    ] o.a.s.s.SolrDispatchFilter solr.xml found in ZooKeeper. Loading...
   [junit4]   2> 3859534 INFO  (jetty-launcher-8209-thread-1) [    ] o.a.s.s.SolrDispatchFilter solr.xml found in ZooKeeper. Loading...
   [junit4]   2> 3859541 INFO  (jetty-launcher-8209-thread-2) [    ] o.a.s.c.ZkContainer Zookeeper client=127.0.0.1:47686/solr
   [junit4]   2> 3859541 INFO  (jetty-launcher-8209-thread-1) [    ] o.a.s.c.ZkContainer Zookeeper client=127.0.0.1:47686/solr
   [junit4]   2> 3859673 INFO  (jetty-launcher-8209-thread-2) [n:127.0.0.1:54599_solr    ] o.a.s.c.Overseer Overseer (id=null) closing
   [junit4]   2> 3859674 INFO  (jetty-launcher-8209-thread-1) [n:127.0.0.1:38125_solr    ] o.a.s.c.Overseer Overseer (id=null) closing
   [junit4]   2> 3859674 INFO  (jetty-launcher-8209-thread-2) [n:127.0.0.1:54599_solr    ] o.a.s.c.OverseerElectionContext I am going to be the leader 127.0.0.1:54599_solr
   [junit4]   2> 3859675 INFO  (jetty-launcher-8209-thread-2) [n:127.0.0.1:54599_solr    ] o.a.s.c.Overseer Overseer (id=98887430820855813-127.0.0.1:54599_solr-n_0000000000) starting
   [junit4]   2> 3859675 INFO  (jetty-launcher-8209-thread-1) [n:127.0.0.1:38125_solr    ] o.a.s.c.ZkController Register node as live in ZooKeeper:/live_nodes/127.0.0.1:38125_solr
   [junit4]   2> 3859678 INFO  (zkCallback-8220-thread-1-processing-n:127.0.0.1:38125_solr) [n:127.0.0.1:38125_solr    ] o.a.s.c.c.ZkStateReader Updated live nodes from ZooKeeper... (0) -> (1)
   [junit4]   2> 3859680 INFO  (zkCallback-8221-thread-1-processing-n:127.0.0.1:54599_solr) [n:127.0.0.1:54599_solr    ] o.a.s.c.c.ZkStateReader Updated live nodes from ZooKeeper... (0) -> (1)
   [junit4]   2> 3859690 INFO  (jetty-launcher-8209-thread-2) [n:127.0.0.1:54599_solr    ] o.a.s.c.ZkController Register node as live in ZooKeeper:/live_nodes/127.0.0.1:54599_solr
   [junit4]   2> 3859691 INFO  (zkCallback-8220-thread-1-processing-n:127.0.0.1:38125_solr) [n:127.0.0.1:38125_solr    ] o.a.s.c.c.ZkStateReader Updated live nodes from ZooKeeper... (1) -> (2)
   [junit4]   2> 3859692 INFO  (zkCallback-8221-thread-1-processing-n:127.0.0.1:54599_solr) [n:127.0.0.1:54599_solr    ] o.a.s.c.c.ZkStateReader Updated live nodes from ZooKeeper... (1) -> (2)
   [junit4]   2> 3859716 INFO  (jetty-launcher-8209-thread-2) [n:127.0.0.1:54599_solr    ] o.a.s.c.CoreContainer Initializing authentication plugin: org.apache.solr.security.HadoopAuthPlugin
   [junit4]   2> 3859716 INFO  (jetty-launcher-8209-thread-2) [n:127.0.0.1:54599_solr    ] o.a.s.s.HadoopAuthPlugin Params: {proxyuser.anyHostUsersGroup.hosts=*, proxyuser.wrongHost.hosts=1.1.1.1.1.1, proxyuser.bogusGroup.groups=__some_bogus_group, proxyuser.localHostAnyGroup.groups=*, cookie.domain=127.0.0.1, proxyuser.wrongHost.groups=*, type=simple, proxyuser.noHosts.groups=*, proxyuser.anyHostUsersGroup.groups=staff, proxyuser.noGroups.hosts=*, proxyuser.anyHostAnyUser.groups=*, delegation-token.token-kind=solr-dt, proxyuser.bogusGroup.hosts=*, zk-dt-secret-manager.znodeWorkingPath=solr/security/zkdtsm, signer.secret.provider.zookeeper.path=/token, zk-dt-secret-manager.enable=true, proxyuser.localHostAnyGroup.hosts=serv1-vm3,localhost,127.0.0.1, proxyuser.anyHostAnyUser.hosts=*, signer.secret.provider=zookeeper}
   [junit4]   2> 3859718 INFO  (jetty-launcher-8209-thread-2) [n:127.0.0.1:54599_solr    ] o.a.c.f.i.CuratorFrameworkImpl Starting
   [junit4]   2> 3859720 INFO  (jetty-launcher-8209-thread-2-EventThread) [n:127.0.0.1:54599_solr    ] o.a.c.f.s.ConnectionStateManager State change: CONNECTED
   [junit4]   2> 3859736 INFO  (jetty-launcher-8209-thread-2) [n:127.0.0.1:54599_solr    ] o.a.s.c.CoreContainer PKIAuthenticationPlugin is managing internode requests
   [junit4]   2> 3859736 INFO  (jetty-launcher-8209-thread-1) [n:127.0.0.1:38125_solr    ] o.a.s.c.CoreContainer Initializing authentication plugin: org.apache.solr.security.HadoopAuthPlugin
   [junit4]   2> 3859736 INFO  (jetty-launcher-8209-thread-1) [n:127.0.0.1:38125_solr    ] o.a.s.s.HadoopAuthPlugin Params: {proxyuser.anyHostUsersGroup.hosts=*, proxyuser.wrongHost.hosts=1.1.1.1.1.1, proxyuser.bogusGroup.groups=__some_bogus_group, proxyuser.localHostAnyGroup.groups=*, cookie.domain=127.0.0.1, proxyuser.wrongHost.groups=*, type=simple, proxyuser.noHosts.groups=*, proxyuser.anyHostUsersGroup.groups=staff, proxyuser.noGroups.hosts=*, proxyuser.anyHostAnyUser.groups=*, delegation-token.token-kind=solr-dt, proxyuser.bogusGroup.hosts=*, zk-dt-secret-manager.znodeWorkingPath=solr/security/zkdtsm, signer.secret.provider.zookeeper.path=/token, zk-dt-secret-manager.enable=true, proxyuser.localHostAnyGroup.hosts=serv1-vm3,localhost,127.0.0.1, proxyuser.anyHostAnyUser.hosts=*, signer.secret.provider=zookeeper}
   [junit4]   2> 3859737 INFO  (jetty-launcher-8209-thread-1) [n:127.0.0.1:38125_solr    ] o.a.c.f.i.CuratorFrameworkImpl Starting
   [junit4]   2> 3859742 INFO  (jetty-launcher-8209-thread-1-EventThread) [n:127.0.0.1:38125_solr    ] o.a.c.f.s.ConnectionStateManager State change: CONNECTED
   [junit4]   2> 3859772 INFO  (jetty-launcher-8209-thread-1) [n:127.0.0.1:38125_solr    ] o.a.s.c.CoreContainer PKIAuthenticationPlugin is managing internode requests
   [junit4]   2> 3859789 INFO  (jetty-launcher-8209-thread-2) [n:127.0.0.1:54599_solr    ] o.a.s.m.r.SolrJmxReporter JMX monitoring for 'solr_54599.solr.node' (registry 'solr.node') enabled at server: com.sun.jmx.mbeanserver.JmxMBeanServer@720a9ded
   [junit4]   2> 3859806 INFO  (jetty-launcher-8209-thread-2) [n:127.0.0.1:54599_solr    ] o.a.s.m.r.SolrJmxReporter JMX monitoring for 'solr_54599.solr.jvm' (registry 'solr.jvm') enabled at server: com.sun.jmx.mbeanserver.JmxMBeanServer@720a9ded
   [junit4]   2> 3859806 INFO  (jetty-launcher-8209-thread-2) [n:127.0.0.1:54599_solr    ] o.a.s.m.r.SolrJmxReporter JMX monitoring for 'solr_54599.solr.jetty' (registry 'solr.jetty') enabled at server: com.sun.jmx.mbeanserver.JmxMBeanServer@720a9ded
   [junit4]   2> 3859807 INFO  (jetty-launcher-8209-thread-2) [n:127.0.0.1:54599_solr    ] o.a.s.c.CorePropertiesLocator Found 0 core definitions underneath /export/home/jenkins/workspace/Lucene-Solr-master-Solaris/solr/build/solr-core/test/J1/temp/solr.security.hadoop.TestImpersonationWithHadoopAuth_A494B1E20F13937-001/tempDir-001/node2/.
   [junit4]   2> 3859819 INFO  (jetty-launcher-8209-thread-1) [n:127.0.0.1:38125_solr    ] o.a.s.m.r.SolrJmxReporter JMX monitoring for 'solr_38125.solr.node' (registry 'solr.node') enabled at server: com.sun.jmx.mbeanserver.JmxMBeanServer@720a9ded
   [junit4]   2> 3859824 INFO  (jetty-launcher-8209-thread-1) [n:127.0.0.1:38125_solr    ] o.a.s.m.r.SolrJmxReporter JMX monitoring for 'solr_38125.solr.jvm' (registry 'solr.jvm') enabled at server: com.sun.jmx.mbeanserver.JmxMBeanServer@720a9ded
   [junit4]   2> 3859824 INFO  (jetty-launcher-8209-thread-1) [n:127.0.0.1:38125_solr    ] o.a.s.m.r.SolrJmxReporter JMX monitoring for 'solr_38125.solr.jetty' (registry 'solr.jetty') enabled at server: com.sun.jmx.mbeanserver.JmxMBeanServer@720a9ded
   [junit4]   2> 3859825 INFO  (jetty-launcher-8209-thread-1) [n:127.0.0.1:38125_solr    ] o.a.s.c.CorePropertiesLocator Found 0 core definitions underneath /export/home/jenkins/workspace/Lucene-Solr-master-Solaris/solr/build/solr-core/test/J1/temp/solr.security.hadoop.TestImpersonationWithHadoopAuth_A494B1E20F13937-001/tempDir-001/node1/.
   [junit4]   2> 3859844 INFO  (SUITE-TestImpersonationWithHadoopAuth-seed#[A494B1E20F13937]-worker) [    ] o.a.s.c.c.ZkStateReader Updated live nodes from ZooKeeper... (0) -> (2)
   [junit4]   2> 3859845 INFO  (SUITE-TestImpersonationWithHadoopAuth-seed#[A494B1E20F13937]-worker) [    ] o.a.s.c.s.i.ZkClientClusterStateProvider Cluster at 127.0.0.1:47686/solr ready
   [junit4]   2> 3860015 INFO  (TEST-TestImpersonationWithHadoopAuth.testProxyValidateHost-seed#[A494B1E20F13937]) [    ] o.a.s.SolrTestCaseJ4 ###Starting testProxyValidateHost
   [junit4]   2> 3860029 INFO  (qtp1110115401-41136) [n:127.0.0.1:54599_solr    ] o.a.s.h.a.CollectionsHandler Invoked Collection Action :list with params doAs=bar&action=LIST&user.name=localHostAnyGroup&wt=javabin&version=2 and sendToOCPQueue=true
   [junit4]   2> 3860029 INFO  (qtp1110115401-41136) [n:127.0.0.1:54599_solr    ] o.a.s.s.HttpSolrCall [admin] webapp=null path=/admin/collections params={doAs=bar&action=LIST&user.name=localHostAnyGroup&wt=javabin&version=2} status=0 QTime=0
   [junit4]   2> 3860030 INFO  (TEST-TestImpersonationWithHadoopAuth.testProxyValidateHost-seed#[A494B1E20F13937]) [    ] o.a.s.SolrTestCaseJ4 ###Ending testProxyValidateHost
   [junit4]   2> 3860175 INFO  (TEST-TestImpersonationWithHadoopAuth.testProxyValidateAnyHostAnyUser-seed#[A494B1E20F13937]) [    ] o.a.s.SolrTestCaseJ4 ###Starting testProxyValidateAnyHostAnyUser
   [junit4]   2> 3860180 INFO  (qtp1110115401-41138) [n:127.0.0.1:54599_solr    ] o.a.s.h.a.CollectionsHandler Invoked Collection Action :list with params doAs=bar&action=LIST&user.name=anyHostAnyUser&wt=javabin&version=2 and sendToOCPQueue=true
   [junit4]   2> 3860180 INFO  (qtp1110115401-41138) [n:127.0.0.1:54599_solr    ] o.a.s.s.HttpSolrCall [admin] webapp=null path=/admin/collections params={doAs=bar&action=LIST&user.name=anyHostAnyUser&wt=javabin&version=2} status=0 QTime=0
   [junit4]   2> 3860180 INFO  (TEST-TestImpersonationWithHadoopAuth.testProxyValidateAnyHostAnyUser-seed#[A494B1E20F13937]) [    ] o.a.s.SolrTestCaseJ4 ###Ending testProxyValidateAnyHostAnyUser
   [junit4]   2> 3860331 INFO  (TEST-TestImpersonationWithHadoopAuth.testProxyNoConfigHosts-seed#[A494B1E20F13937]) [    ] o.a.s.SolrTestCaseJ4 ###Starting testProxyNoConfigHosts
   [junit4]   2> 3860335 INFO  (TEST-TestImpersonationWithHadoopAuth.testProxyNoConfigHosts-seed#[A494B1E20F13937]) [    ] o.a.s.SolrTestCaseJ4 ###Ending testProxyNoConfigHosts
   [junit4]   2> 3860498 INFO  (TEST-TestImpersonationWithHadoopAuth.testProxyWrongHost-seed#[A494B1E20F13937]) [    ] o.a.s.SolrTestCaseJ4 ###Starting testProxyWrongHost
   [junit4]   2> 3875516 WARN  (jetty-launcher-8209-thread-1-SendThread(127.0.0.1:47686)) [n:127.0.0.1:38125_solr    ] o.a.z.ClientCnxn Client session timed out, have not heard from server in 15690ms for sessionid 0x15f51982ad40006
   [junit4]   2> 3875516 WARN  (jetty-launcher-8209-thread-2-SendThread(127.0.0.1:47686)) [n:127.0.0.1:54599_solr    ] o.a.z.ClientCnxn Client session timed out, have not heard from server in 15729ms for sessionid 0x15f51982ad40007
   [junit4]   2> 3875517 WARN  (jetty-launcher-8209-thread-1-SendThread(127.0.0.1:47686)) [n:127.0.0.1:38125_solr    ] o.a.z.ClientCnxn Client session timed out, have not heard from server in 15730ms for sessionid 0x15f51982ad40008
   [junit4]   2> 3875517 WARN  (jetty-launcher-8209-thread-2-SendThread(127.0.0.1:47686)) [n:127.0.0.1:54599_solr    ] o.a.z.ClientCnxn Client session timed out, have not heard from server in 15709ms for sessionid 0x15f51982ad40005
   [junit4]   2> 3875517 WARN  (NIOServerCxn.Factory:0.0.0.0/0.0.0.0:0) [    ] o.a.z.s.NIOServerCnxn caught end of stream exception
   [junit4]   2> EndOfStreamException: Unable to read additional data from client sessionid 0x15f51982ad40006, likely client has closed socket
   [junit4]   2> 	at org.apache.zookeeper.server.NIOServerCnxn.doIO(NIOServerCnxn.java:239)
   [junit4]   2> 	at org.apache.zookeeper.server.NIOServerCnxnFactory.run(NIOServerCnxnFactory.java:203)
   [junit4]   2> 	at java.lang.Thread.run(Thread.java:748)
   [junit4]   2> 3875517 WARN  (NIOServerCxn.Factory:0.0.0.0/0.0.0.0:0) [    ] o.a.z.s.NIOServerCnxn caught end of stream exception
   [junit4]   2> EndOfStreamException: Unable to read additional data from client sessionid 0x15f51982ad40007, likely client has closed socket
   [junit4]   2> 	at org.apache.zookeeper.server.NIOServerCnxn.doIO(NIOServerCnxn.java:239)
   [junit4]   2> 	at org.apache.zookeeper.server.NIOServerCnxnFactory.run(NIOServerCnxnFactory.java:203)
   [junit4]   2> 	at java.lang.Thread.run(Thread.java:748)
   [junit4]   2> 3875517 WARN  (NIOServerCxn.Factory:0.0.0.0/0.0.0.0:0) [    ] o.a.z.s.NIOServerCnxn caught end of stream exception
   [junit4]   2> EndOfStreamException: Unable to read additional data from client sessionid 0x15f51982ad40008, likely client has closed socket
   [junit4]   2> 	at org.apache.zookeeper.server.NIOServerCnxn.doIO(NIOServerCnxn.java:239)
   [junit4]   2> 	at org.apache.zookeeper.server.NIOServerCnxnFactory.run(NIOServerCnxnFactory.java:203)
   [junit4]   2> 	at java.lang.Thread.run(Thread.java:748)
   [junit4]   2> 3875518 WARN  (NIOServerCxn.Factory:0.0.0.0/0.0.0.0:0) [    ] o.a.z.s.NIOServerCnxn caught end of stream exception
   [junit4]   2> EndOfStreamException: Unable to read additional data from client sessionid 0x15f51982ad40005, likely client has closed socket
   [junit4]   2> 	at org.apache.zookeeper.server.NIOServerCnxn.doIO(NIOServerCnxn.java:239)
   [junit4]   2> 	at org.apache.zookeeper.server.NIOServerCnxnFactory.run(NIOServerCnxnFactory.java:203)
   [junit4]   2> 	at java.lang.Thread.run(Thread.java:748)
   [junit4]   2> 3875518 INFO  (TEST-TestImpersonationWithHadoopAuth.testProxyWrongHost-seed#[A494B1E20F13937]) [    ] o.a.s.SolrTestCaseJ4 ###Ending testProxyWrongHost
   [junit4] IGNOR/A 0.00s J1 | TestImpersonationWithHadoopAuth.testForwarding
   [junit4]    > Assumption #1: 'awaitsfix' test group is disabled (@AwaitsFix(bugUrl=https://issues.apache.org/jira/browse/HADOOP-9893))
   [junit4]   2> 3875638 INFO  (jetty-launcher-8209-thread-2-EventThread) [n:127.0.0.1:54599_solr    ] o.a.c.f.s.ConnectionStateManager State change: SUSPENDED
   [junit4]   2> 3875647 INFO  (jetty-launcher-8209-thread-1-EventThread) [n:127.0.0.1:38125_solr    ] o.a.c.f.s.ConnectionStateManager State change: SUSPENDED
   [junit4]   2> 3875647 WARN  (zkCallback-8220-thread-1-processing-n:127.0.0.1:38125_solr) [n:127.0.0.1:38125_solr    ] o.a.s.c.c.ConnectionManager Watcher org.apache.solr.common.cloud.ConnectionManager@63deb247 name: ZooKeeperConnection Watcher:127.0.0.1:47686/solr got event WatchedEvent state:Disconnected type:None path:null path: null type: None
   [junit4]   2> 3875648 WARN  (zkCallback-8220-thread-1-processing-n:127.0.0.1:38125_solr) [n:127.0.0.1:38125_solr    ] o.a.s.c.c.ConnectionManager zkClient has disconnected
   [junit4]   2> 3875676 WARN  (zkCallback-8228-thread-4) [    ] o.a.s.c.c.ConnectionManager Watcher org.apache.solr.common.cloud.ConnectionManager@3cc6677d name: ZooKeeperConnection Watcher:127.0.0.1:47686/solr got event WatchedEvent state:Disconnected type:None path:null path: null type: None
   [junit4]   2> 3875682 WARN  (zkCallback-8228-thread-4) [    ] o.a.s.c.c.ConnectionManager zkClient has disconnected
   [junit4]   2> 3875680 WARN  (zkCallback-8221-thread-2-processing-n:127.0.0.1:54599_solr) [n:127.0.0.1:54599_solr    ] o.a.s.c.c.ConnectionManager Watcher org.apache.solr.common.cloud.ConnectionManager@6f7580b5 name: ZooKeeperConnection Watcher:127.0.0.1:47686/solr got event WatchedEvent state:Disconnected type:None path:null path: null type: None
   [junit4]   2> 3875686 WARN  (zkCallback-8221-thread-2-processing-n:127.0.0.1:54599_solr) [n:127.0.0.1:54599_solr    ] o.a.s.c.c.ConnectionManager zkClient has disconnected
   [junit4]   2> 3875679 INFO  (TEST-TestImpersonationWithHadoopAuth.testProxyInvalidProxyUser-seed#[A494B1E20F13937]) [    ] o.a.s.SolrTestCaseJ4 ###Starting testProxyInvalidProxyUser
   [junit4]   2> 3875692 INFO  (TEST-TestImpersonationWithHadoopAuth.testProxyInvalidProxyUser-seed#[A494B1E20F13937]) [    ] o.a.s.SolrTestCaseJ4 ###Ending testProxyInvalidProxyUser
   [junit4]   2> 3875927 INFO  (TEST-TestImpersonationWithHadoopAuth.testProxyNoConfigGroups-seed#[A494B1E20F13937]) [    ] o.a.s.SolrTestCaseJ4 ###Starting testProxyNoConfigGroups
   [junit4]   2> 3875930 INFO  (TEST-TestImpersonationWithHadoopAuth.testProxyNoConfigGroups-seed#[A494B1E20F13937]) [    ] o.a.s.SolrTestCaseJ4 ###Ending testProxyNoConfigGroups
   [junit4]   2> 3876137 INFO  (TEST-TestImpersonationWithHadoopAuth.testProxyNullProxyUser-seed#[A494B1E20F13937]) [    ] o.a.s.SolrTestCaseJ4 ###Starting testProxyNullProxyUser
   [junit4]   2> 3876139 INFO  (qtp1110115401-41135) [    ] o.a.s.s.SolrDispatchFilter Error authenticating
   [junit4]   2> java.lang.IllegalArgumentException: userName is NULL, empty or contains a '&'
   [junit4]   2> 	at org.apache.hadoop.security.authentication.util.AuthToken.checkForIllegalArgument(AuthToken.java:87)
   [junit4]   2> 	at org.apache.hadoop.security.authentication.util.AuthToken.<init>(AuthToken.java:70)
   [junit4]   2> 	at org.apache.hadoop.security.authentication.server.AuthenticationToken.<init>(AuthenticationToken.java:58)
   [junit4]   2> 	at org.apache.hadoop.security.authentication.server.PseudoAuthenticationHandler.authenticate(PseudoAuthenticationHandler.java:195)
   [junit4]   2> 	at org.apache.hadoop.security.token.delegation.web.DelegationTokenAuthenticationHandler.authenticate(DelegationTokenAuthenticationHandler.java:348)
   [junit4]   2> 	at org.apache.solr.security.RequestContinuesRecorderAuthenticationHandler.authenticate(RequestContinuesRecorderAuthenticationHandler.java:69)
   [junit4]   2> 	at org.apache.hadoop.security.authentication.server.AuthenticationFilter.doFilter(AuthenticationFilter.java:518)
   [junit4]   2> 	at org.apache.solr.security.HadoopAuthFilter.doFilter(HadoopAuthFilter.java:110)
   [junit4]   2> 	at org.apache.solr.security.HadoopAuthPlugin.doAuthenticate(HadoopAuthPlugin.java:245)
   [junit4]   2> 	at org.apache.solr.servlet.SolrDispatchFilter.authenticateRequest(SolrDispatchFilter.java:451)
   [junit4]   2> 	at org.apache.solr.servlet.SolrDispatchFilter.doFilter(SolrDispatchFilter.java:347)
   [junit4]   2> 	at org.apache.solr.servlet.SolrDispatchFilter.doFilter(SolrDispatchFilter.java:326)
   [junit4]   2> 	at org.eclipse.jetty.servlet.ServletHandler$CachedChain.doFilter(ServletHandler.java:1759)
   [junit4]   2> 	at org.apache.solr.client.solrj.embedded.JettySolrRunner$DebugFilter.doFilter(JettySolrRunner.java:139)
   [junit4]   2> 	at org.eclipse.jetty.servlet.ServletHandler$CachedChain.doFilter(ServletHandler.java:1759)
   [junit4]   2> 	at org.eclipse.jetty.servlet.ServletHandler.doHandle(ServletHandler.java:582)
   [junit4]   2> 	at org.eclipse.jetty.server.session.SessionHandler.doHandle(SessionHandler.java:224)
   [junit4]   2> 	at org.eclipse.jetty.server.handler.ContextHandler.doHandle(ContextHandler.java:1180)
   [junit4]   2> 	at org.eclipse.jetty.servlet.ServletHandler.doScope(ServletHandler.java:512)
   [junit4]   2> 	at org.eclipse.jetty.server.session.SessionHandler.doScope(SessionHandler.java:185)
   [junit4]   2> 	at org.eclipse.jetty.server.handler.ContextHandler.doScope(ContextHandler.java:1112)
   [junit4]   2> 	at org.eclipse.jetty.server.handler.ScopedHandler.handle(ScopedHandler.java:141)
   [junit4]   2> 	at org.eclipse.jetty.server.handler.gzip.GzipHandler.handle(GzipHandler.java:493)
   [junit4]   2> 	at org.eclipse.jetty.server.handler.HandlerWrapper.handle(HandlerWrapper.java:134)
   [junit4]   2> 	at org.eclipse.jetty.server.Server.handle(Server.java:534)
   [junit4]   2> 	at org.eclipse.jetty.server.HttpChannel.handle(HttpChannel.java:320)
   [junit4]   2> 	at org.eclipse.jetty.server.HttpConnection.onFillable(HttpConnection.java:251)
   [junit4]   2> 	at org.eclipse.jetty.io.AbstractConnection$ReadCallback.succeeded(AbstractConnection.java:283)
   [junit4]   2> 	at org.eclipse.jetty.io.FillInterest.fillable(FillInterest.java:108)
   [junit4]   2> 	at org.eclipse.jetty.io.SelectChannelEndPoint$2.run(SelectChannelEndPoint.java:93)
   [junit4]   2> 	at org.eclipse.jetty.util.thread.strategy.ExecuteProduceConsume.executeProduceConsume(ExecuteProduceConsume.java:303)
   [junit4]   2> 	at org.eclipse.jetty.util.thread.strategy.ExecuteProduceConsume.produceConsume(ExecuteProduceConsume.java:148)
   [junit4]   2> 	at org.eclipse.jetty.util.thread.strategy.ExecuteProduceConsume.run(ExecuteProduceConsume.java:136)
   [junit4]   2> 	at org.eclipse.jetty.util.thread.QueuedThreadPool.runJob(QueuedThreadPool.java:671)
   [junit4]   2> 	at org.eclipse.jetty.util.thread.QueuedThreadPool$2.run(QueuedThreadPool.java:589)
   [junit4]   2> 	at java.lang.Thread.run(Thread.java:748)
   [junit4]   2> 3876139 WARN  (qtp1110115401-41135) [    ] o.e.j.s.ServletHandler /solr/admin/collections
   [junit4]   2> org.apache.solr.common.SolrException: Error during request authentication, 
   [junit4]   2> 	at org.apache.solr.servlet.SolrDispatchFilter.authenticateRequest(SolrDispatchFilter.java:457)
   [junit4]   2> 	at org.apache.solr.servlet.SolrDispatchFilter.doFilter(SolrDispatchFilter.java:347)
   [junit4]   2> 	at org.apache.solr.servlet.SolrDispatchFilter.doFilter(SolrDispatchFilter.java:326)
   [junit4]   2> 	at org.eclipse.jetty.servlet.ServletHandler$CachedChain.doFilter(ServletHandler.java:1759)
   [junit4]   2> 	at org.apache.solr.client.solrj.embedded.JettySolrRunner$DebugFilter.doFilter(JettySolrRunner.java:139)
   [junit4]   2> 	at org.eclipse.jetty.servlet.ServletHandler$CachedChain.doFilter(ServletHandler.java:1759)
   [junit4]   2> 	at org.eclipse.jetty.servlet.ServletHandler.doHandle(ServletHandler.java:582)
   [junit4]   2> 	at org.eclipse.jetty.server.session.SessionHandler.doHandle(SessionHandler.java:224)
   [junit4]   2> 	at org.eclipse.jetty.server.handler.ContextHandler.doHandle(ContextHandler.java:1180)
   [junit4]   2> 	at org.eclipse.jetty.servlet.ServletHandler.doScope(ServletHandler.java:512)
   [junit4]   2> 	at org.eclipse.jetty.server.session.SessionHandler.doScope(SessionHandler.java:185)
   [junit4]   2> 	at org.eclipse.jetty.server.handler.ContextHandler.doScope(ContextHandler.java:1112)
   [junit4]   2> 	at org.eclipse.jetty.server.handler.ScopedHandler.handle(ScopedHandler.java:141)
   [junit4]   2> 	at org.eclipse.jetty.server.handler.gzip.GzipHandler.handle(GzipHandler.java:493)
   [junit4]   2> 	at org.eclipse.jetty.server.handler.HandlerWrapper.handle(HandlerWrapper.java:134)
   [junit4]   2> 	at org.eclipse.jetty.server.Server.handle(Server.java:534)
   [junit4]   2> 	at org.eclipse.jetty.server.HttpChannel.handle(HttpChannel.java:320)
   [junit4]   2> 	at org.eclipse.jetty.server.HttpConnection.onFillable(HttpConnection.java:251)
   [junit4]   2> 	at org.eclipse.jetty.io.AbstractConnection$ReadCallback.succeeded(AbstractConnection.java:283)
   [junit4]   2> 	at org.eclipse.jetty.io.FillInterest.fillable(FillInterest.java:108)
   [junit4]   2> 	at org.eclipse.jetty.io.SelectChannelEndPoint$2.run(SelectChannelEndPoint.java:93)
   [junit4]   2> 	at org.eclipse.jetty.util.thread.strategy.ExecuteProduceConsume.executeProduceConsume(ExecuteProduceConsume.java:303)
   [junit4]   2> 	at org.eclipse.jetty.util.thread.strategy.ExecuteProduceConsume.produceConsume(ExecuteProduceConsume.java:148)
   [junit4]   2> 	at org.eclipse.jetty.util.thread.strategy.ExecuteProduceConsume.run(ExecuteProduceConsume.java:136)
   [junit4]   2> 	at org.eclipse.jetty.util.thread.QueuedThreadPool.runJob(QueuedThreadPool.java:671)
   [junit4]   2> 	at org.eclipse.jetty.util.thread.QueuedThreadPool$2.run(QueuedThreadPool.java:589)
   [junit4]   2> 	at java.lang.Thread.run(Thread.java:748)
   [junit4]   2> Caused by: java.lang.IllegalArgumentException: userName is NULL, empty or contains a '&'
   [junit4]   2> 	at org.apache.hadoop.security.authentication.util.AuthToken.checkForIllegalArgument(AuthToken.java:87)
   [junit4]   2> 	at org.apache.hadoop.security.authentication.util.AuthToken.<init>(AuthToken.java:70)
   [junit4]   2> 	at org.apache.hadoop.security.authentication.server.AuthenticationToken.<init>(AuthenticationToken.java:58)
   [junit4]   2> 	at org.apache.hadoop.security.authentication.server.PseudoAuthenticationHandler.authenticate(PseudoAuthenticationHandler.java:195)
   [junit4]   2> 	at org.apache.hadoop.security.token.delegation.web.DelegationTokenAuthenticationHandler.authenticate(DelegationTokenAuthenticationHandler.java:348)
   [junit4]   2> 	at org.apache.solr.security.RequestContinuesRecorderAuthenticationHandler.authenticate(RequestContinuesRecorderAuthenticationHandler.java:69)
   [junit4]   2> 	at org.apache.hadoop.security.authentication.server.AuthenticationFilter.doFilter(AuthenticationFilter.java:518)
   [junit4]   2> 	at org.apache.solr.security.HadoopAuthFilter.doFilter(HadoopAuthFilter.java:110)
   [junit4]   2> 	at org.apache.solr.security.HadoopAuthPlugin.doAuthenticate(HadoopAuthPlugin.java:245)
   [junit4]   2> 	at org.apache.solr.servlet.SolrDispatchFilter.authenticateRequest(SolrDispatchFilter.java:451)
   [junit4]   2> 	... 26 more
   [junit4]   2> 3876140 INFO  (TEST-TestImpersonationWithHadoopAuth.testProxyNullProxyUser-seed#[A494B1E20F13937]) [    ] o.a.s.SolrTestCaseJ4 ###Ending testProxyNullProxyUser
   [junit4]   2> 3876342 INFO  (TEST-TestImpersonationWithHadoopAuth.testProxyInvalidGroup-seed#[A494B1E20F13937]) [    ] o.a.s.SolrTestCaseJ4 ###Starting testProxyInvalidGroup
   [junit4]   2> 3876372 WARN  (qtp1110115401-41140) [    ] o.a.h.s.ShellBasedUnixGroupsMapping got exception trying to get groups for user bar: id: invalid user name: "bar"
   [junit4]   2> id: invalid user name: "bar"
   [junit4]   2> 
   [junit4]   2> 3876374 INFO  (TEST-TestImpersonationWithHadoopAuth.testProxyInvalidGroup-seed#[A494B1E20F13937]) [    ] o.a.s.SolrTestCaseJ4 ###Ending testProxyInvalidGroup
   [junit4]   2> 3876586 INFO  (TEST-TestImpersonationWithHadoopAuth.testProxyValidateGroup-seed#[A494B1E20F13937]) [    ] o.a.s.SolrTestCaseJ4 ###Starting testProxyValidateGroup
   [junit4]   2> 3876588 INFO  (qtp1110115401-41136) [n:127.0.0.1:54599_solr    ] o.a.s.h.a.CollectionsHandler Invoked Collection Action :list with params doAs=jenkins&action=LIST&user.name=anyHostUsersGroup&wt=javabin&version=2 and sendToOCPQueue=true
   [junit4]   2> 3876589 INFO  (qtp1110115401-41136) [n:127.0.0.1:54599_solr    ] o.a.s.s.HttpSolrCall [admin] webapp=null path=/admin/collections params={doAs=jenkins&action=LIST&user.name=anyHostUsersGroup&wt=javabin&version=2} status=0 QTime=0
   [junit4]   2> 3876589 INFO  (TEST-TestImpersonationWithHadoopAuth.testProxyValidateGroup-seed#[A494B1E20F13937]) [    ] o.a.s.SolrTestCaseJ4 ###Ending testProxyValidateGroup
   [junit4]   2> 3876796 WARN  (SUITE-TestImpersonationWithHadoopAuth-seed#[A494B1E20F13937]-worker-SendThread(127.0.0.1:47686)) [    ] o.a.z.ClientCnxn Unable to reconnect to ZooKeeper service, session 0x15f51982ad4000a has expired
   [junit4]   2> 3876798 WARN  (zkCallback-8228-thread-2) [    ] o.a.s.c.c.ConnectionManager Watcher org.apache.solr.common.cloud.ConnectionManager@3cc6677d name: ZooKeeperConnection Watcher:127.0.0.1:47686/solr got event WatchedEvent state:Expired type:None path:null path: null type: None
   [junit4]   2> 3876799 WARN  (zkCallback-8228-thread-2) [    ] o.a.s.c.c.ConnectionManager Our previous ZooKeeper session was expired. Attempting to reconnect to recover relationship with ZooKeeper...
   [junit4]   2> 3876799 WARN  (zkCallback-8228-thread-2) [    ] o.a.s.c.c.DefaultConnectionStrategy Connection expired - starting a new one...
   [junit4]   2> 3876801 INFO  (zkCallback-8228-thread-2) [    ] o.a.s.c.c.ConnectionManager Connection with ZooKeeper reestablished.
   [junit4]   2> 3876902 ERROR (zkCallback-8228-thread-2) [    ] o.a.s.c.c.ZkStateReader A ZK error has occurred
   [junit4]   2> org.apache.zookeeper.KeeperException$SessionExpiredException: KeeperErrorCode = Session expired for /clusterstate.json
   [junit4]   2> 	at org.apache.zookeeper.KeeperException.create(KeeperException.java:127)
   [junit4]   2> 	at org.apache.zookeeper.KeeperException.create(KeeperException.java:51)
   [junit4]   2> 	at org.apache.zookeeper.ZooKeeper.exists(ZooKeeper.java:1102)
   [junit4]   2> 	at org.apache.solr.common.cloud.SolrZkClient$5.execute(SolrZkClient.java:323)
   [junit4]   2> 	at org.apache.solr.common.cloud.SolrZkClient$5.execute(SolrZkClient.java:320)
   [junit4]   2> 	at org.apache.solr.common.cloud.ZkCmdExecutor.retryOperation(ZkCmdExecutor.java:60)
   [junit4]   2> 	at org.apache.solr.common.cloud.SolrZkClient.exists(SolrZkClient.java:320)
   [junit4]   2> 	at org.apache.solr.common.cloud.ZkStateReader.createClusterStateWatchersAndUpdate(ZkStateReader.java:428)
   [junit4]   2> 	at org.apache.solr.common.cloud.ZkStateReader$1.command(ZkStateReader.java:283)
   [junit4]   2> 	at org.apache.solr.common.cloud.ConnectionManager$1.update(ConnectionManager.java:168)
   [junit4]   2> 	at org.apache.solr.common.cloud.DefaultConnectionStrategy.reconnect(DefaultConnectionStrategy.java:57)
   [junit4]   2> 	at org.apache.solr.common.cloud.ConnectionManager.process(ConnectionManager.java:142)
   [junit4]   2> 	at org.apache.solr.common.cloud.SolrZkClient$3.lambda$process$0(SolrZkClient.java:269)
   [junit4]   2> 	at java.util.concurrent.Executors$RunnableAdapter.call(Executors.java:511)
   [junit4]   2> 	at java.util.concurrent.FutureTask.run(FutureTask.java:266)
   [junit4]   2> 	at org.apache.solr.common.util.ExecutorUtil$MDCAwareThreadPoolExecutor.lambda$execute$0(ExecutorUtil.java:188)
   [junit4]   2> 	at java.util.concurrent.ThreadPoolExecutor.runWorker(ThreadPoolExecutor.java:1149)
   [junit4]   2> 	at java.util.concurrent.ThreadPoolExecutor$Worker.run(ThreadPoolExecutor.java:624)
   [junit4]   2> 	at java.lang.Thread.run(Thread.java:748)
   [junit4]   2> 3876903 ERROR (zkCallback-8228-thread-2) [    ] o.a.s.c.c.DefaultConnectionStrategy Reconnect to ZooKeeper failed:org.apache.solr.common.cloud.ZooKeeperException: A ZK error has occurred
   [junit4]   2> 	at org.apache.solr.common.cloud.ZkStateReader$1.command(ZkStateReader.java:286)
   [junit4]   2> 	at org.apache.solr.common.cloud.ConnectionManager$1.update(ConnectionManager.java:168)
   [junit4]   2> 	at org.apache.solr.common.cloud.DefaultConnectionStrategy.reconnect(DefaultConnectionStrategy.java:57)
   [junit4]   2> 	at org.apache.solr.common.cloud.ConnectionManager.process(ConnectionManager.java:142)
   [junit4]   2> 	at org.apache.solr.common.cloud.SolrZkClient$3.lambda$process$0(SolrZkClient.java:269)
   [junit4]   2> 	at java.util.concurrent.Executors$RunnableAdapter.call(Executors.java:511)
   [junit4]   2> 	at java.util.concurrent.FutureTask.run(FutureTask.java:266)
   [junit4]   2> 	at org.apache.solr.common.util.ExecutorUtil$MDCAwareThreadPoolExecutor.lambda$execute$0(ExecutorUtil.java:188)
   [junit4]   2> 	at java.util.concurrent.ThreadPoolExecutor.runWorker(ThreadPoolExecutor.java:1149)
   [junit4]   2> 	at java.util.concurrent.ThreadPoolExecutor$Worker.run(ThreadPoolExecutor.java:624)
   [junit4]   2> 	at java.lang.Thread.run(Thread.java:748)
   [junit4]   2> Caused by: org.apache.zookeeper.KeeperException$SessionExpiredException: KeeperErrorCode = Session expired for /clusterstate.json
   [junit4]   2> 	at org.apache.zookeeper.KeeperException.create(KeeperException.java:127)
   [junit4]   2> 	at org.apache.zookeeper.KeeperException.create(KeeperException.java:51)
   [junit4]   2> 	at org.apache.zookeeper.ZooKeeper.exists(ZooKeeper.java:1102)
   [junit4]   2> 	at org.apache.solr.common.cloud.SolrZkClient$5.execute(SolrZkClient.java:323)
   [junit4]   2> 	at org.apache.solr.common.cloud.SolrZkClient$5.execute(SolrZkClient.java:320)
   [junit4]   2> 	at org.apache.solr.common.cloud.ZkCmdExecutor.retryOperation(ZkCmdExecutor.java:60)
   [junit4]   2> 	at org.apache.solr.common.cloud.SolrZkClient.exists(SolrZkClient.java:320)
   [junit4]   2> 	at org.apache.solr.common.cloud.ZkStateReader.createClusterStateWatchersAndUpdate(ZkStateReader.java:428)
   [junit4]   2> 	at org.apache.solr.common.cloud.ZkStateReader$1.command(ZkStateReader.java:283)
   [junit4]   2> 	... 10 more
   [junit4]   2> 
   [junit4]   2> 3876903 WARN  (zkCallback-8228-thread-2) [    ] o.a.s.c.c.DefaultConnectionStrategy Reconnect to ZooKeeper failed
   [junit4]   2> 3876903 INFO  (zkCallback-8228-thread-2) [    ] o.a.s.c.c.ConnectionManager Connected:true
   [junit4]   2> 3876905 INFO  (jetty-closer-8210-thread-2) [    ] o.e.j.s.AbstractConnector Stopped ServerConnector@56d3e320{HTTP/1.1,[http/1.1]}{127.0.0.1:๐}
   [junit4]   2> 3876908 INFO  (jetty-closer-8210-thread-2) [    ] o.a.s.c.CoreContainer Shutting down CoreContainer instance=1740217671
   [junit4]   2> 3876908 INFO  (jetty-closer-8210-thread-1) [    ] o.e.j.s.AbstractConnector Stopped ServerConnector@9ba2588{HTTP/1.1,[http/1.1]}{127.0.0.1:๐}
   [junit4]   2> 3876912 INFO  (jetty-closer-8210-thread-1) [    ] o.a.s.c.CoreContainer Shutting down CoreContainer instance=1730876514
   [junit4]   2> 3876912 INFO  (jetty-closer-8210-thread-2) [    ] o.a.s.m.SolrMetricManager Closing metric reporters for registry=solr.node, tag=null
   [junit4]   2> 3876912 INFO  (jetty-closer-8210-thread-1) [    ] o.a.s.m.SolrMetricManager Closing metric reporters for registry=solr.node, tag=null
   [junit4]   2> 3876912 INFO  (jetty-closer-8210-thread-2) [    ] o.a.s.m.r.SolrJmxReporter Closing reporter [org.apache.solr.metrics.reporters.SolrJmxReporter@7121e5db: rootName = solr_38125, domain = solr.node, service url = null, agent id = null] for registry solr.node / com.codahale.metrics.MetricRegistry@264af853
   [junit4]   2> 3876912 INFO  (jetty-closer-8210-thread-1) [    ] o.a.s.m.r.SolrJmxReporter Closing reporter [org.apache.solr.metrics.reporters.SolrJmxReporter@6973a5f4: rootName = solr_54599, domain = solr.node, service url = null, agent id = null] for registry solr.node / com.codahale.metrics.MetricRegistry@7f04203f
   [junit4]   2> 3876927 INFO  (jetty-closer-8210-thread-1) [    ] o.a.s.m.SolrMetricManager Closing metric reporters for registry=solr.jvm, tag=null
   [junit4]   2> 3876927 INFO  (jetty-closer-8210-thread-2) [    ] o.a.s.m.SolrMetricManager Closing metric reporters for registry=solr.jvm, tag=null
   [junit4]   2> 3876927 INFO  (jetty-closer-8210-thread-2) [    ] o.a.s.m.r.SolrJmxReporter Closing reporter [org.apache.solr.metrics.reporters.SolrJmxReporter@45f1c94f: rootName = solr_38125, domain = solr.jvm, service url = null, agent id = null] for registry solr.jvm / com.codahale.metrics.MetricRegistry@6a5b7c6c
   [junit4]   2> 3876927 INFO  (jetty-closer-8210-thread-1) [    ] o.a.s.m.r.SolrJmxReporter Closing reporter [org.apache.solr.metrics.reporters.SolrJmxReporter@33e0f501: rootName = solr_54599, domain = solr.jvm, service url = null, agent id = null] for registry solr.jvm / com.codahale.metrics.MetricRegistry@6a5b7c6c
   [junit4]   2> 3876932 INFO  (jetty-closer-8210-thread-1) [    ] o.a.s.m.SolrMetricManager Closing metric reporters for registry=solr.jetty, tag=null
   [junit4]   2> 3876932 INFO  (jetty-closer-8210-thread-1) [    ] o.a.s.m.r.SolrJmxReporter Closing reporter [org.apache.solr.metrics.reporters.SolrJmxReporter@9ca0735: rootName = solr_54599, domain = solr.jetty, service url = null, agent id = null] for registry solr.jetty / com.codahale.metrics.MetricRegistry@3761bba0
   [junit4]   2> 3876932 INFO  (jetty-closer-8210-thread-2) [    ] o.a.s.m.SolrMetricManager Closing metric reporters for registry=solr.jetty, tag=null
   [junit4]   2> 3876932 INFO  (jetty-closer-8210-thread-2) [    ] o.a.s.m.r.SolrJmxReporter Closing reporter [org.apache.solr.metrics.reporters.SolrJmxReporter@77036a08: rootName = solr_38125, domain = solr.jetty, service url = null, agent id = null] for registry solr.jetty / com.codahale.metrics.MetricRegistry@3761bba0
   [junit4]   2> 3877095 INFO  (jetty-closer-8210-thread-2) [    ] o.a.s.c.ZkController Remove node as live in ZooKeeper:/live_nodes/127.0.0.1:38125_solr
   [junit4]   2> 3877097 INFO  (jetty-closer-8210-thread-2) [    ] o.a.s.m.SolrMetricManager Closing metric reporters for registry=solr.cluster, tag=null
   [junit4]   2> 3877097 INFO  (zkCallback-8220-thread-3-processing-n:127.0.0.1:38125_solr) [n:127.0.0.1:38125_solr    ] o.a.s.c.c.ZkStateReader Updated live nodes from ZooKeeper... (2) -> (1)
   [junit4]   2> 3877098 INFO  (jetty-closer-8210-thread-2) [    ] o.a.s.c.TransientSolrCoreCacheDefault Allocating transient cache for 2147483647 transient cores
   [junit4]   2> 3877104 ERROR (Thread[Thread-9187,5,TGRP-TestImpersonationWithHadoopAuth]) [n:127.0.0.1:38125_solr    ] o.a.h.s.t.d.AbstractDelegationTokenSecretManager ExpiredTokenRemover received java.lang.InterruptedException: sleep interrupted
   [junit4]   2> 3877204 INFO  (zkCallback-8221-thread-6-processing-n:127.0.0.1:54599_solr) [n:127.0.0.1:54599_solr    ] o.a.s.c.c.ZkStateReader Updated live nodes from ZooKeeper... (2) -> (1)
   [junit4]   2> 3877206 INFO  (jetty-closer-8210-thread-1) [    ] o.a.s.c.ZkController Remove node as live in ZooKeeper:/live_nodes/127.0.0.1:54599_solr
   [junit4]   2> 3877208 INFO  (jetty-closer-8210-thread-1) [    ] o.a.s.m.SolrMetricManager Closing metric reporters for registry=solr.cluster, tag=null
   [junit4]   2> 3877209 INFO  (jetty-closer-8210-thread-1) [    ] o.a.s.c.TransientSolrCoreCacheDefault Allocating transient cache for 2147483647 transient cores
   [junit4]   2> 3877209 INFO  (zkCallback-8221-thread-6-processing-n:127.0.0.1:54599_solr) [n:127.0.0.1:54599_solr    ] o.a.s.c.c.ZkStateReader Updated live nodes from ZooKeeper... (1) -> (0)
   [junit4]   2> 3877209 INFO  (jetty-closer-8210-thread-1) [    ] o.a.s.c.Overseer Overseer (id=98887430820855813-127.0.0.1:54599_solr-n_0000000000) closing
   [junit4]   2> 3877210 INFO  (OverseerStateUpdate-98887430820855813-127.0.0.1:54599_solr-n_0000000000) [n:127.0.0.1:54599_solr    ] o.a.s.c.Overseer Overseer Loop exiting : 127.0.0.1:54599_solr
   [junit4]   2> 3877210 WARN  (OverseerAutoScalingTriggerThread-98887430820855813-127.0.0.1:54599_solr-n_0000000000) [n:127.0.0.1:54599_solr    ] o.a.s.c.a.OverseerTriggerThread OverseerTriggerThread woken up but we are closed, exiting.
   [junit4]   2> 3877225 ERROR (Thread[Thread-9185,5,TGRP-TestImpersonationWithHadoopAuth]) [n:127.0.0.1:54599_solr    ] o.a.h.s.t.d.AbstractDelegationTokenSecretManager ExpiredTokenRemover received java.lang.InterruptedException: sleep interrupted
   [junit4]   2> 3877339 INFO  (jetty-closer-8210-thread-1) [    ] o.e.j.s.h.ContextHandler Stopped o.e.j.s.ServletContextHandler@493911f4{/solr,null,UNAVAILABLE}
   [junit4]   2> 3877560 INFO  (jetty-closer-8210-thread-2) [    ] o.e.j.s.h.ContextHandler Stopped o.e.j.s.ServletContextHandler@699104f6{/solr,null,UNAVAILABLE}
   [junit4]   2> 3877563 ERROR (SUITE-TestImpersonationWithHadoopAuth-seed#[A494B1E20F13937]-worker) [    ] o.a.z.s.ZooKeeperServer ZKShutdownHandler is not registered, so ZooKeeper server won't take any action on ERROR or SHUTDOWN server state changes
   [junit4]   2> 3877564 INFO  (SUITE-TestImpersonationWithHadoopAuth-seed#[A494B1E20F13937]-worker) [    ] o.a.s.c.ZkTestServer connecting to 127.0.0.1:47686 47686
   [junit4]   2> 3882836 INFO  (Thread-9168) [    ] o.a.s.c.ZkTestServer connecting to 127.0.0.1:47686 47686
   [junit4]   2> 3882843 WARN  (Thread-9168) [    ] o.a.s.c.ZkTestServer Watch limit violations: 
   [junit4]   2> Maximum concurrent create/delete watches above limit:
   [junit4]   2> 
   [junit4]   2> 	3	/solr/aliases.json
   [junit4]   2> 	3	/solr/clusterprops.json
   [junit4]   2> 	2	/solr/security.json
   [junit4]   2> 
   [junit4]   2> Maximum concurrent data watches above limit:
   [junit4]   2> 
   [junit4]   2> 	3	/solr/clusterstate.json
   [junit4]   2> 	2	/solr/security/zkdtsm/ZKDTSMRoot/ZKDTSMKeyIdRoot
   [junit4]   2> 	2	/solr/security/zkdtsm/ZKDTSMRoot/ZKDTSMMasterKeyRoot/DK_1
   [junit4]   2> 	2	/solr/security/zkdtsm/ZKDTSMRoot/ZKDTSMMasterKeyRoot/DK_3
   [junit4]   2> 	2	/solr/security/zkdtsm/ZKDTSMRoot/ZKDTSMMasterKeyRoot/DK_2
   [junit4]   2> 	2	/solr/security/zkdtsm/ZKDTSMRoot/ZKDTSMMasterKeyRoot/DK_4
   [junit4]   2> 	2	/solr/security/zkdtsm/ZKDTSMRoot/ZKDTSMSeqNumRoot
   [junit4]   2> 
   [junit4]   2> Maximum concurrent children watches above limit:
   [junit4]   2> 
   [junit4]   2> 	4	/solr/security/zkdtsm/ZKDTSMRoot/ZKDTSMTokensRoot
   [junit4]   2> 	3	/solr/live_nodes
   [junit4]   2> 	3	/solr/collections
   [junit4]   2> 	3	/solr/security/zkdtsm/ZKDTSMRoot/ZKDTSMMasterKeyRoot
   [junit4]   2> 
   [junit4]   2> 3882844 INFO  (SUITE-TestImpersonationWithHadoopAuth-seed#[A494B1E20F13937]-worker) [    ] o.a.s.SolrTestCaseJ4 ------------------------------------------------------- Done waiting for tracked resources to be released
   [junit4]   2> Oct 25, 2017 3:34:31 AM com.carrotsearch.randomizedtesting.ThreadLeakControl checkThreadLeaks
   [junit4]   2> WARNING: Will linger awaiting termination of 2 leaked thread(s).
   [junit4]   2> Oct 25, 2017 3:34:51 AM com.carrotsearch.randomizedtesting.ThreadLeakControl checkThreadLeaks
   [junit4]   2> SEVERE: 2 threads leaked from SUITE scope at org.apache.solr.security.hadoop.TestImpersonationWithHadoopAuth: 
   [junit4]   2>    1) Thread[id=41174, name=jetty-launcher-8209-thread-2-EventThread, state=TIMED_WAITING, group=TGRP-TestImpersonationWithHadoopAuth]
   [junit4]   2>         at sun.misc.Unsafe.park(Native Method)
   [junit4]   2>         at java.util.concurrent.locks.LockSupport.parkNanos(LockSupport.java:215)
   [junit4]   2>         at java.util.concurrent.locks.AbstractQueuedSynchronizer.doAcquireSharedNanos(AbstractQueuedSynchronizer.java:1037)
   [junit4]   2>         at java.util.concurrent.locks.AbstractQueuedSynchronizer.tryAcquireSharedNanos(AbstractQueuedSynchronizer.java:1328)
   [junit4]   2>         at java.util.concurrent.CountDownLatch.await(CountDownLatch.java:277)
   [junit4]   2>         at org.apache.curator.CuratorZookeeperClient.internalBlockUntilConnectedOrTimedOut(CuratorZookeeperClient.java:323)
   [junit4]   2>         at org.apache.curator.RetryLoop.callWithRetry(RetryLoop.java:105)
   [junit4]   2>         at org.apache.curator.framework.imps.GetDataBuilderImpl.pathInForeground(GetDataBuilderImpl.java:288)
   [junit4]   2>         at org.apache.curator.framework.imps.GetDataBuilderImpl.forPath(GetDataBuilderImpl.java:279)
   [junit4]   2>         at org.apache.curator.framework.imps.GetDataBuilderImpl.forPath(GetDataBuilderImpl.java:41)
   [junit4]   2>         at org.apache.curator.framework.recipes.shared.SharedValue.readValue(SharedValue.java:244)
   [junit4]   2>         at org.apache.curator.framework.recipes.shared.SharedValue.access$100(SharedValue.java:44)
   [junit4]   2>         at org.apache.curator.framework.recipes.shared.SharedValue$1.process(SharedValue.java:61)
   [junit4]   2>         at org.apache.curator.framework.imps.NamespaceWatcher.process(NamespaceWatcher.java:67)
   [junit4]   2>         at org.apache.zookeeper.ClientCnxn$EventThread.processEvent(ClientCnxn.java:530)
   [junit4]   2>         at org.apache.zookeeper.ClientCnxn$EventThread.run(ClientCnxn.java:505)
   [junit4]   2>    2) Thread[id=41184, name=jetty-launcher-8209-thread-1-EventThread, state=TIMED_WAITING, group=TGRP-TestImpersonationWithHadoopAuth]
   [junit4]   2>         at sun.misc.Unsafe.park(Native Method)
   [junit4]   2>         at java.util.concurrent.locks.LockSupport.parkNanos(LockSupport.java:215)
   [junit4]   2>         at java.util.concurrent.locks.AbstractQueuedSynchronizer.doAcquireSharedNanos(AbstractQueuedSynchronizer.java:1037)
   [junit4]   2>         at java.util.concurrent.locks.AbstractQueuedSynchronizer.tryAcquireSharedNanos(AbstractQueuedSynchronizer.java:1328)
   [junit4]   2>         at java.util.concurrent.CountDownLatch.await(CountDownLatch.java:277)
   [junit4]   2>         at org.apache.curator.CuratorZookeeperClient.internalBlockUntilConnectedOrTimedOut(CuratorZookeeperClient.java:323)
   [junit4]   2>         at org.apache.curator.RetryLoop.callWithRetry(RetryLoop.java:105)
   [junit4]   2>         at org.apache.curator.framework.imps.GetDataBuilderImpl.pathInForeground(GetDataBuilderImpl.java:288)
   [junit4]   2>         at org.apache.curator.framework.imps.GetDataBuilderImpl.forPath(GetDataBuilderImpl.java:279)
   [junit4]   2>         at org.apache.curator.framework.imps.GetDataBuilderImpl.forPath(GetDataBuilderImpl.java:41)
   [junit4]   2>         at org.apache.curator.framework.recipes.shared.SharedValue.readValue(SharedValue.java:244)
   [junit4]   2>         at org.apache.curator.framework.recipes.shared.SharedValue.access$100(SharedValue.java:44)
   [junit4]   2>         at org.apache.curator.framework.recipes.shared.SharedValue$1.process(SharedValue.java:61)
   [junit4]   2>         at org.apache.curator.framework.imps.NamespaceWatcher.process(NamespaceWatcher.java:67)
   [junit4]   2>         at org.apache.zookeeper.ClientCnxn$EventThread.processEvent(ClientCnxn.java:530)
   [junit4]   2>         at org.apache.zookeeper.ClientCnxn$EventThread.run(ClientCnxn.java:505)
   [junit4]   2> Oct 25, 2017 3:34:51 AM com.carrotsearch.randomizedtesting.ThreadLeakControl tryToInterruptAll
   [junit4]   2> INFO: Starting to interrupt leaked threads:
   [junit4]   2>    1) Thread[id=41174, name=jetty-launcher-8209-thread-2-EventThread, state=TIMED_WAITING, group=TGRP-TestImpersonationWithHadoopAuth]
   [junit4]   2>    2) Thread[id=41184, name=jetty-launcher-8209-thread-1-EventThread, state=TIMED_WAITING, group=TGRP-TestImpersonationWithHadoopAuth]
   [junit4]   2> 3903117 ERROR (jetty-launcher-8209-thread-2-EventThread) [n:127.0.0.1:54599_solr    ] o.a.c.f.i.CuratorFrameworkImpl Watcher exception
   [junit4]   2> java.lang.InterruptedException
   [junit4]   2> 	at java.util.concurrent.locks.AbstractQueuedSynchronizer.doAcquireSharedNanos(AbstractQueuedSynchronizer.java:1039)
   [junit4]   2> 	at java.util.concurrent.locks.AbstractQueuedSynchronizer.tryAcquireSharedNanos(AbstractQueuedSynchronizer.java:1328)
   [junit4]   2> 	at java.util.concurrent.CountDownLatch.await(CountDownLatch.java:277)
   [junit4]   2> 	at org.apache.curator.CuratorZookeeperClient.internalBlockUntilConnectedOrTimedOut(CuratorZookeeperClient.java:323)
   [junit4]   2> 	at org.apache.curator.RetryLoop.callWithRetry(RetryLoop.java:105)
   [junit4]   2> 	at org.apache.curator.framework.imps.GetDataBuilderImpl.pathInForeground(GetDataBuilderImpl.java:288)
   [junit4]   2> 	at org.apache.curator.framework.imps.GetDataBuilderImpl.forPath(GetDataBuilderImpl.java:279)
   [junit4]   2> 	at org.apache.curator.framework.imps.GetDataBuilderImpl.forPath(GetDataBuilderImpl.java:41)
   [junit4]   2> 	at org.apache.curator.framework.recipes.shared.SharedValue.readValue(SharedValue.java:244)
   [junit4]   2> 	at org.apache.curator.framework.recipes.shared.SharedValue.access$100(SharedValue.java:44)
   [junit4]   2> 	at org.apache.curator.framework.recipes.shared.SharedValue$1.process(SharedValue.java:61)
   [junit4]   2> 	at org.apache.curator.framework.imps.NamespaceWatcher.process(NamespaceWatcher.java:67)
   [junit4]   2> 	at org.apache.zookeeper.ClientCnxn$EventThread.processEvent(ClientCnxn.java:530)
   [junit4]   2> 	at org.apache.zookeeper.ClientCnxn$EventThread.run(ClientCnxn.java:505)
   [junit4]   2> 3903118 ERROR (jetty-launcher-8209-thread-1-EventThread) [n:127.0.0.1:38125_solr    ] o.a.c.f.i.CuratorFrameworkImpl Watcher exception
   [junit4]   2> java.lang.InterruptedException
   [junit4]   2> 	at java.util.concurrent.locks.AbstractQueuedSynchronizer.doAcquireSharedNanos(AbstractQueuedSynchronizer.java:1039)
   [junit4]   2> 	at java.util.concurrent.locks.AbstractQueuedSynchronizer.tryAcquireSharedNanos(AbstractQueuedSynchronizer.java:1328)
   [junit4]   2> 	at java.util.concurrent.CountDownLatch.await(CountDownLatch.java:277)
   [junit4]   2> 	at org.apache.curator.CuratorZookeeperClient.internalBlockUntilConnectedOrTimedOut(CuratorZookeeperClient.java:323)
   [junit4]   2> 	at org.apache.curator.RetryLoop.callWithRetry(RetryLoop.java:105)
   [junit4]   2> 	at org.apache.curator.framework.imps.GetDataBuilderImpl.pathInForeground(GetDataBuilderImpl.java:288)
   [junit4]   2> 	at org.apache.curator.framework.imps.GetDataBuilderImpl.forPath(GetDataBuilderImpl.java:279)
   [junit4]   2> 	at org.apache.curator.framework.imps.GetDataBuilderImpl.forPath(GetDataBuilderImpl.java:41)
   [junit4]   2> 	at org.apache.curator.framework.recipes.shared.SharedValue.readValue(SharedValue.java:244)
   [junit4]   2> 	at org.apache.curator.framework.recipes.shared.SharedValue.access$100(SharedValue.java:44)
   [junit4]   2> 	at org.apache.curator.framework.recipes.shared.SharedValue$1.process(SharedValue.java:61)
   [junit4]   2> 	at org.apache.curator.framework.imps.NamespaceWatcher.process(NamespaceWatcher.java:67)
   [junit4]   2> 	at org.apache.zookeeper.ClientCnxn$EventThread.processEvent(ClientCnxn.java:530)
   [junit4]   2> 	at org.apache.zookeeper.ClientCnxn$EventThread.run(ClientCnxn.java:505)
   [junit4]   2> Oct 25, 2017 3:34:51 AM com.carrotsearch.randomizedtesting.ThreadLeakControl tryToInterruptAll
   [junit4]   2> INFO: All leaked threads terminated.
   [junit4]   2> NOTE: test params are: codec=CheapBastard, sim=RandomSimilarity(queryNorm=false): {}, locale=th-TH-u-nu-thai-x-lvariant-TH, timezone=UTC
   [junit4]   2> NOTE: SunOS 5.11 amd64/Oracle Corporation 1.8.0_141 (64-bit)/cpus=3,threads=1,free=164057128,total=515899392
   [junit4]   2> NOTE: All tests run in this JVM: [TestFunctionQuery, TestSort, SolrCoreCheckLockOnStartupTest, DeleteReplicaTest, TestSchemaVersionResource, TestTolerantUpdateProcessorCloud, TestMergePolicyConfig, SampleTest, TemplateUpdateProcessorTest, TestCryptoKeys, QueryResultKeyTest, SmileWriterTest, TestRetrieveFieldsOptimizer, MoreLikeThisHandlerTest, TestSSLRandomization, UpdateRequestProcessorFactoryTest, DistribDocExpirationUpdateProcessorTest, HdfsWriteToMultipleCollectionsTest, ZkStateWriterTest, TestValueSourceCache, BasicFunctionalityTest, OpenExchangeRatesOrgProviderTest, RequestLoggingTest, TestOnReconnectListenerSupport, TestSolrCLIRunExample, PreAnalyzedFieldTest, TestLegacyTerms, TestUniqueKeyFieldResource, OverseerRolesTest, TestFieldResource, BlockJoinFacetSimpleTest, BitVectorTest, AddSchemaFieldsUpdateProcessorFactoryTest, LeaderElectionIntegrationTest, TestComponentsName, VMParamsZkACLAndCredentialsProvidersTest, TestCoreAdminApis, TestCollectionsAPIViaSolrCloudCluster, TestMaxScoreQueryParser, SchemaVersionSpecificBehaviorTest, ExecutePlanActionTest, TestDocumentBuilder, TestStressLucene, TestShortCircuitedRequests, TermsComponentTest, TestDFISimilarityFactory, BaseCdcrDistributedZkTest, TestFoldingMultitermQuery, TestUnifiedSolrHighlighter, ClassificationUpdateProcessorIntegrationTest, TestAnalyzedSuggestions, TestObjectReleaseTracker, TestPayloadScoreQParserPlugin, TestElisionMultitermQuery, ZkNodePropsTest, TestLegacyFieldReuse, AssignTest, FileUtilsTest, TestInPlaceUpdatesDistrib, TestSolrCloudWithKerberosAlt, BasicAuthStandaloneTest, ExitableDirectoryReaderTest, TestManagedSchemaThreadSafety, HealthCheckHandlerTest, LeaderFailureAfterFreshStartTest, TestStressUserVersions, TestSolrFieldCacheBean, TestClusterStateMutator, TestNumericTerms32, TestClusterProperties, ChaosMonkeyNothingIsSafeWithPullReplicasTest, JvmMetricsTest, CopyFieldTest, TestFieldCacheWithThreads, AutoAddReplicasIntegrationTest, SolrPluginUtilsTest, TestShardHandlerFactory, TestRandomCollapseQParserPlugin, TestBlobHandler, SolrIndexConfigTest, CollectionsAPIDistributedZkTest, TestPartialUpdateDeduplication, TestReload, TestRemoteStreaming, TestCloudRecovery, TestWordDelimiterFilterFactory, OpenCloseCoreStressTest, BlobRepositoryCloudTest, TestCloudPivotFacet, SimpleFacetsTest, AnalysisAfterCoreReloadTest, HdfsBasicDistributedZkTest, TestSuggestSpellingConverter, MBeansHandlerTest, ReplaceNodeTest, TestScoreJoinQPNoScore, TriggerIntegrationTest, TestJsonRequest, SolrCoreTest, TestManagedSchema, TestCopyFieldCollectionResource, TestNumericRangeQuery32, CursorMarkTest, RuleEngineTest, LeaderElectionContextKeyTest, SystemLogListenerTest, IgnoreCommitOptimizeUpdateProcessorFactoryTest, FullSolrCloudDistribCmdsTest, TestHashPartitioner, HttpTriggerListenerTest, TestInfoStreamLogging, TestDynamicFieldResource, SoftAutoCommitTest, TestGroupingSearch, TestDefaultStatsCache, DataDrivenBlockJoinTest, TestDocSet, TestExpandComponent, ConjunctionSolrSpellCheckerTest, TestDistributedMissingSort, SecurityConfHandlerTest, UpdateParamsTest, TestDocTermOrds, TolerantUpdateProcessorTest, SolrJmxReporterCloudTest, CollectionStateFormat2Test, StatsReloadRaceTest, TermVectorComponentTest, TestSystemCollAutoCreate, CollectionsAPIAsyncDistributedZkTest, LeaderInitiatedRecoveryOnShardRestartTest, TestFastOutputStream, QueryElevationComponentTest, TestCollationFieldDocValues, TestCustomDocTransformer, DistributedFacetPivotLargeTest, OverseerTaskQueueTest, EchoParamsTest, SystemInfoHandlerTest, HdfsTlogReplayBufferedWhileIndexingTest, FieldMutatingUpdateProcessorTest, TestSortByMinMaxFunction, TestHighFrequencyDictionaryFactory, TestQueryUtils, PreAnalyzedUpdateProcessorTest, SpellingQueryConverterTest, TestRuleBasedAuthorizationPlugin, PingRequestHandlerTest, TestCollationField, SolrCloudExampleTest, TestReRankQParserPlugin, TestEmbeddedSolrServerConstructors, SolrCoreMetricManagerTest, PreAnalyzedFieldManagedSchemaCloudTest, BlockDirectoryTest, TestCloudManagedSchema, HdfsRecoveryZkTest, TestFileDictionaryLookup, HLLUtilTest, TestPostingsSolrHighlighter, TestManagedSynonymFilterFactory, TestFieldCacheReopen, TestExactSharedStatsCache, TestCoreContainer, DeleteLastCustomShardedReplicaTest, TestRandomFaceting, TestDistributedGrouping, HdfsChaosMonkeySafeLeaderTest, TestFastWriter, TestJsonFacetRefinement, TestNumericTokenStream, TestChildDocTransformer, DeleteStatusTest, TestLuceneMatchVersion, BlockJoinFacetDistribTest, TestAuthorizationFramework, ZkSolrClientTest, SpatialHeatmapFacetsTest, AliasIntegrationTest, DocumentBuilderTest, AtomicUpdatesTest, RecoveryAfterSoftCommitTest, TestSolrDeletionPolicy1, PolyFieldTest, LukeRequestHandlerTest, TestStressCloudBlindAtomicUpdates, ChaosMonkeySafeLeaderTest, BasicDistributedZk2Test, SyncSliceTest, BasicZkTest, ClusterStateUpdateTest, LeaderElectionTest, TestZkChroot, TestRandomDVFaceting, ShardRoutingCustomTest, TestFaceting, TestRecovery, DistributedSpellCheckComponentTest, TermVectorComponentDistributedTest, ZkControllerTest, TestStressReorder, TestJoin, TestStressVersions, DistributedTermsComponentTest, StatsComponentTest, SpellCheckComponentTest, SolrCmdDistributorTest, PeerSyncTest, BadIndexSchemaTest, ConvertedLegacyTest, TestFiltering, TestLazyCores, TestBadConfig, TestIndexSearcher, ShowFileRequestHandlerTest, DistributedQueryElevationComponentTest, SolrIndexSplitterTest, SimplePostToolTest, SignatureUpdateProcessorFactoryTest, TestExtendedDismaxParser, SuggesterFSTTest, CoreAdminHandlerTest, DocValuesTest, SuggesterTSTTest, TestTrie, SpatialFilterTest, SuggesterWFSTTest, TestCSVLoader, NoCacheHeaderTest, TestUpdate, QueryEqualityTest, StatelessScriptUpdateProcessorFactoryTest, SortByFunctionTest, DocValuesMultiTest, DebugComponentTest, CacheHeaderTest, DisMaxRequestHandlerTest, TestWriterPerf, DirectSolrSpellCheckerTest, TestReversedWildcardFilterFactory, DocumentAnalysisRequestHandlerTest, TestQueryTypes, TestOmitPositions, FileBasedSpellCheckerTest, TestIndexingPerformance, TestSolrQueryParser, FastVectorHighlighterTest, IndexSchemaRuntimeFieldTest, LoggingHandlerTest, IndexSchemaTest, TestJmxIntegration, ReturnFieldsTest, TestCSVResponseWriter, JsonLoaderTest, BinaryUpdateRequestHandlerTest, CSVRequestHandlerTest, SearchHandlerTest, SOLR749Test, AlternateDirectoryTest, TestSolrIndexConfig, TestQuerySenderNoQuery, BadComponentTest, TestSolrDeletionPolicy2, MultiTermTest, TestSearchPerf, TestConfig, TestFuzzyAnalyzedSuggestions, ExternalFileFieldSortTest, TestSolrCoreProperties, NotRequiredUniqueKeyTest, TestPhraseSuggestions, SpellPossibilityIteratorTest, TestCharFilters, SynonymTokenizerTest, TestXIncludeConfig, TestSweetSpotSimilarityFactory, TestPerFieldSimilarity, TestLMJelinekMercerSimilarityFactory, TestBM25SimilarityFactory, ResourceLoaderTest, ScriptEngineTest, URLClassifyProcessorTest, PluginInfoTest, TestFastLRUCache, ChaosMonkeyNothingIsSafeTest, TestSystemIdResolver, PrimUtilsTest, DOMUtilTest, RAMDirectoryFactoryTest, ClusterStateTest, TestSolrJ, TestLRUCache, TestUtils, SliceStateTest, DistributedMLTComponentTest, TestRTGBase, DistributedIntervalFacetingTest, SolrTestCaseJ4Test, TestCrossCoreJoin, TestCursorMarkWithoutUniqueKey, TestHighlightDedupGrouping, TestSimpleTrackingShardHandler, TestLuceneIndexBackCompat, TestEmbeddedSolrServerSchemaAPI, TestJettySolrRunner, ActionThrottleTest, AddReplicaTest, AsyncCallRequestStatusResponseTest, CdcrReplicationDistributedZkTest, CdcrReplicationHandlerTest, CdcrRequestHandlerTest, ChaosMonkeySafeLeaderWithPullReplicasTest, CloudExitableDirectoryReaderTest, ConcurrentDeleteAndCreateCollectionTest, ConfigSetsAPITest, ConnectionManagerTest, CustomCollectionTest, DeleteShardTest, DistributedVersionInfoTest, DocValuesNotIndexedTest, MissingSegmentRecoveryTest, MoveReplicaHDFSTest, NodeMutatorTest, OutOfBoxZkACLAndCredentialsProvidersTest, OverriddenZkACLAndCredentialsProvidersTest, RestartWhileUpdatingTest, SSLMigrationTest, ShardSplitTest, TestPullReplica, TestReplicaProperties, TestSolrCloudWithDelegationTokens, TestSolrCloudWithSecureImpersonation, TestStressLiveNodes, TestTolerantUpdateProcessorRandomCloud, AutoScalingHandlerTest, HdfsAutoAddReplicasIntegrationTest, CoreSorterTest, HdfsDirectoryFactoryTest, TestDynamicLoading, TestConfigReload, TestReqParamsAPI, TestSQLHandler, TestSolrConfigHandlerConcurrent, DistributedFacetPivotLongTailTest, DistributedFacetPivotWhiteBoxTest, FacetPivotSmallTest, InfixSuggestersTest, ReplicaListTransformerTest, ShufflingReplicaListTransformerTest, SuggestComponentContextFilterQueryTest, TestDistributedStatsComponentCardinality, JavabinLoaderTest, TestSlowCompositeReaderWrapper, UninvertDocValuesMergePolicyTest, WrapperMergePolicyFactoryTest, CheckHdfsIndexTest, TestIntervalFaceting, TestMacros, TestExportWriter, TestSolrQueryResponse, TestSubQueryTransformer, TestManagedResource, TestManagedResourceStorage, TestRestManager, TestBulkSchemaAPI, TestDynamicFieldCollectionResource, TestFieldCollectionResource, TestFieldTypeCollectionResource, TestFieldTypeResource, TestSchemaResource, TestSerializedLuceneMatchVersion, TestManagedStopFilterFactory, DateRangeFieldTest, EnumFieldTest, TestCloudSchemaless, TestReloadDeadlock, TestSolr4Spatial2, TestTrieFacet, TestMinMaxOnMultiValuedField, TestOrdValues, BlockJoinFacetRandomTest, GraphQueryTest, TestCloudNestedDocsSort, TestScoreJoinQPScore, CloudMLTQParserTest, TestLRUStatsCache, TestSha256AuthenticationProvider, TestDelegationWithHadoopAuth, TestImpersonationWithHadoopAuth]
   [junit4]   2> NOTE: reproduce with: ant test  -Dtestcase=TestImpersonationWithHadoopAuth -Dtests.seed=A494B1E20F13937 -Dtests.slow=true -Dtests.locale=th-TH-u-nu-thai-x-lvariant-TH -Dtests.timezone=UTC -Dtests.asserts=true -Dtests.file.encoding=UTF-8
   [junit4] ERROR   0.00s J1 | TestImpersonationWithHadoopAuth (suite) <<<
   [junit4]    > Throwable #1: com.carrotsearch.randomizedtesting.ThreadLeakError: 2 threads leaked from SUITE scope at org.apache.solr.security.hadoop.TestImpersonationWithHadoopAuth: 
   [junit4]    >    1) Thread[id=41174, name=jetty-launcher-8209-thread-2-EventThread, state=TIMED_WAITING, group=TGRP-TestImpersonationWithHadoopAuth]
   [junit4]    >         at sun.misc.Unsafe.park(Native Method)
   [junit4]    >         at java.util.concurrent.locks.LockSupport.parkNanos(LockSupport.java:215)
   [junit4]    >         at java.util.concurrent.locks.AbstractQueuedSynchronizer.doAcquireSharedNanos(AbstractQueuedSynchronizer.java:1037)
   [junit4]    >         at java.util.concurrent.locks.AbstractQueuedSynchronizer.tryAcquireSharedNanos(AbstractQueuedSynchronizer.java:1328)
   [junit4]    >         at java.util.concurrent.CountDownLatch.await(CountDownLatch.java:277)
   [junit4]    >         at org.apache.curator.CuratorZookeeperClient.internalBlockUntilConnectedOrTimedOut(CuratorZookeeperClient.java:323)
   [junit4]    >         at org.apache.curator.RetryLoop.callWithRetry(RetryLoop.java:105)
   [junit4]    >         at org.apache.curator.framework.imps.GetDataBuilderImpl.pathInForeground(GetDataBuilderImpl.java:288)
   [junit4]    >         at org.apache.curator.framework.imps.GetDataBuilderImpl.forPath(GetDataBuilderImpl.java:279)
   [junit4]    >         at org.apache.curator.framework.imps.GetDataBuilderImpl.forPath(GetDataBuilderImpl.java:41)
   [junit4]    >         at org.apache.curator.framework.recipes.shared.SharedValue.readValue(SharedValue.java:244)
   [junit4]    >         at org.apache.curator.framework.recipes.shared.SharedValue.access$100(SharedValue.java:44)
   [junit4]    >         at org.apache.curator.framework.recipes.shared.SharedValue$1.process(SharedValue.java:61)
   [junit4]    >         at org.apache.curator.framework.imps.NamespaceWatcher.process(NamespaceWatcher.java:67)
   [junit4]    >         at org.apache.zookeeper.ClientCnxn$EventThread.processEvent(ClientCnxn.java:530)
   [junit4]    >         at org.apache.zookeeper.ClientCnxn$EventThread.run(ClientCnxn.java:505)
   [junit4]    >    2) Thread[id=41184, name=jetty-launcher-8209-thread-1-EventThread, state=TIMED_WAITING, group=TGRP-TestImpersonationWithHadoopAuth]
   [junit4]    >         at sun.misc.Unsafe.park(Native Method)
   [junit4]    >         at java.util.concurrent.locks.LockSupport.parkNanos(LockSupport.java:215)
   [junit4]    >         at java.util.concurrent.locks.AbstractQueuedSynchronizer.doAcquireSharedNanos(AbstractQueuedSynchronizer.java:1037)
   [junit4]    >         at java.util.concurrent.locks.AbstractQueuedSynchronizer.tryAcquireSharedNanos(AbstractQueuedSynchronizer.java:1328)
   [junit4]    >         at java.util.concurrent.CountDownLatch.await(CountDownLatch.java:277)
   [junit4]    >         at org.apache.curator.CuratorZookeeperClient.internalBlockUntilConnectedOrTimedOut(CuratorZookeeperClient.java:323)
   [junit4]    >         at org.apache.curator.RetryLoop.callWithRetry(RetryLoop.java:105)
   [junit4]    >         at org.apache.curator.framework.imps.GetDataBuilderImpl.pathInForeground(GetDataBuilderImpl.java:288)
   [junit4]    >         at org.apache.curator.framework.imps.GetDataBuilderImpl.forPath(GetDataBuilderImpl.java:279)
   [junit4]    >         at org.apache.curator.framework.imps.GetDataBuilderImpl.forPath(GetDataBuilderImpl.java:41)
   [junit4]    >         at org.apache.curator.framework.recipes.shared.SharedValue.readValue(SharedValue.java:244)
   [junit4]    >         at org.apache.curator.framework.recipes.shared.SharedValue.access$100(SharedValue.java:44)
   [junit4]    >         at org.apache.curator.framework.recipes.shared.SharedValue$1.process(SharedValue.java:61)
   [junit4]    >         at org.apache.curator.framework.imps.NamespaceWatcher.process(NamespaceWatcher.java:67)
   [junit4]    >         at org.apache.zookeeper.ClientCnxn$EventThread.processEvent(ClientCnxn.java:530)
   [junit4]    >         at org.apache.zookeeper.ClientCnxn$EventThread.run(ClientCnxn.java:505)
   [junit4]    > 	at __randomizedtesting.SeedInfo.seed([A494B1E20F13937]:0)
   [junit4] Completed [713/745 (1!)] on J1 in 43.76s, 10 tests, 1 error, 1 skipped <<< FAILURES!

[...truncated 24283 lines...]
-check-forbidden-all:
[forbidden-apis] Reading bundled API signatures: jdk-unsafe-1.8
[forbidden-apis] Reading bundled API signatures: jdk-deprecated-1.8
[forbidden-apis] Reading bundled API signatures: jdk-non-portable
[forbidden-apis] Reading bundled API signatures: jdk-reflection
[forbidden-apis] Reading bundled API signatures: commons-io-unsafe-2.5
[forbidden-apis] Reading API signatures: /export/home/jenkins/workspace/Lucene-Solr-master-Solaris/lucene/tools/forbiddenApis/base.txt
[forbidden-apis] Reading API signatures: /export/home/jenkins/workspace/Lucene-Solr-master-Solaris/lucene/tools/forbiddenApis/servlet-api.txt
[forbidden-apis] Reading API signatures: /export/home/jenkins/workspace/Lucene-Solr-master-Solaris/lucene/tools/forbiddenApis/solr.txt
[forbidden-apis] Loading classes to check...
[forbidden-apis] Scanning classes for violations...
[forbidden-apis] Forbidden method invocation: java.lang.String#format(java.lang.String,java.lang.Object[]) [Uses default locale]
[forbidden-apis]   in org.apache.solr.cloud.LeaderElectionContextKeyTest (LeaderElectionContextKeyTest.java:81)
[forbidden-apis] Scanned 3878 class file(s) for forbidden API invocations (in 3.21s), 1 error(s).

BUILD FAILED
/export/home/jenkins/workspace/Lucene-Solr-master-Solaris/build.xml:826: The following error occurred while executing this line:
/export/home/jenkins/workspace/Lucene-Solr-master-Solaris/build.xml:117: The following error occurred while executing this line:
/export/home/jenkins/workspace/Lucene-Solr-master-Solaris/solr/build.xml:376: The following error occurred while executing this line:
/export/home/jenkins/workspace/Lucene-Solr-master-Solaris/solr/common-build.xml:534: Check for forbidden API calls failed, see log.

Total time: 86 minutes 57 seconds
Build step 'Invoke Ant' marked build as failure
Archiving artifacts
[WARNINGS] Skipping publisher since build result is FAILURE
Recording test results
Email was triggered for: Failure - Any
Sending email for trigger: Failure - Any

Mime
View raw message