lucene-dev mailing list archives

Site index · List index
Message view « Date » · « Thread »
Top « Date » · « Thread »
From Policeman Jenkins Server <jenk...@thetaphi.de>
Subject [JENKINS] Lucene-Solr-7.x-MacOSX (64bit/jdk-9) - Build # 219 - Still Unstable!
Date Sun, 01 Oct 2017 01:17:04 GMT
Build: https://jenkins.thetaphi.de/job/Lucene-Solr-7.x-MacOSX/219/
Java: 64bit/jdk-9 -XX:+UseCompressedOops -XX:+UseConcMarkSweepGC --illegal-access=deny

2 tests failed.
FAILED:  org.apache.solr.cloud.CollectionsAPIDistributedZkTest.testCollectionsAPI

Error Message:
Error from server at http://127.0.0.1:60392/solr/awhollynewcollection_0_shard2_replica_n4: ClusterState says we are the leader (http://127.0.0.1:60392/solr/awhollynewcollection_0_shard2_replica_n4), but locally we don't think so. Request came from null

Stack Trace:
org.apache.solr.client.solrj.impl.CloudSolrClient$RouteException: Error from server at http://127.0.0.1:60392/solr/awhollynewcollection_0_shard2_replica_n4: ClusterState says we are the leader (http://127.0.0.1:60392/solr/awhollynewcollection_0_shard2_replica_n4), but locally we don't think so. Request came from null
	at __randomizedtesting.SeedInfo.seed([10DF767CA6D2627:497883D3CC5E09B2]:0)
	at org.apache.solr.client.solrj.impl.CloudSolrClient.directUpdate(CloudSolrClient.java:539)
	at org.apache.solr.client.solrj.impl.CloudSolrClient.sendRequest(CloudSolrClient.java:993)
	at org.apache.solr.client.solrj.impl.CloudSolrClient.requestWithRetryOnStaleState(CloudSolrClient.java:862)
	at org.apache.solr.client.solrj.impl.CloudSolrClient.request(CloudSolrClient.java:793)
	at org.apache.solr.client.solrj.SolrRequest.process(SolrRequest.java:178)
	at org.apache.solr.client.solrj.request.UpdateRequest.commit(UpdateRequest.java:233)
	at org.apache.solr.cloud.CollectionsAPIDistributedZkTest.testCollectionsAPI(CollectionsAPIDistributedZkTest.java:459)
	at java.base/jdk.internal.reflect.NativeMethodAccessorImpl.invoke0(Native Method)
	at java.base/jdk.internal.reflect.NativeMethodAccessorImpl.invoke(NativeMethodAccessorImpl.java:62)
	at java.base/jdk.internal.reflect.DelegatingMethodAccessorImpl.invoke(DelegatingMethodAccessorImpl.java:43)
	at java.base/java.lang.reflect.Method.invoke(Method.java:564)
	at com.carrotsearch.randomizedtesting.RandomizedRunner.invoke(RandomizedRunner.java:1737)
	at com.carrotsearch.randomizedtesting.RandomizedRunner$8.evaluate(RandomizedRunner.java:934)
	at com.carrotsearch.randomizedtesting.RandomizedRunner$9.evaluate(RandomizedRunner.java:970)
	at com.carrotsearch.randomizedtesting.RandomizedRunner$10.evaluate(RandomizedRunner.java:984)
	at com.carrotsearch.randomizedtesting.rules.SystemPropertiesRestoreRule$1.evaluate(SystemPropertiesRestoreRule.java:57)
	at org.apache.lucene.util.TestRuleSetupTeardownChained$1.evaluate(TestRuleSetupTeardownChained.java:49)
	at org.apache.lucene.util.AbstractBeforeAfterRule$1.evaluate(AbstractBeforeAfterRule.java:45)
	at org.apache.lucene.util.TestRuleThreadAndTestName$1.evaluate(TestRuleThreadAndTestName.java:48)
	at org.apache.lucene.util.TestRuleIgnoreAfterMaxFailures$1.evaluate(TestRuleIgnoreAfterMaxFailures.java:64)
	at org.apache.lucene.util.TestRuleMarkFailure$1.evaluate(TestRuleMarkFailure.java:47)
	at com.carrotsearch.randomizedtesting.rules.StatementAdapter.evaluate(StatementAdapter.java:36)
	at com.carrotsearch.randomizedtesting.ThreadLeakControl$StatementRunner.run(ThreadLeakControl.java:368)
	at com.carrotsearch.randomizedtesting.ThreadLeakControl.forkTimeoutingTask(ThreadLeakControl.java:817)
	at com.carrotsearch.randomizedtesting.ThreadLeakControl$3.evaluate(ThreadLeakControl.java:468)
	at com.carrotsearch.randomizedtesting.RandomizedRunner.runSingleTest(RandomizedRunner.java:943)
	at com.carrotsearch.randomizedtesting.RandomizedRunner$5.evaluate(RandomizedRunner.java:829)
	at com.carrotsearch.randomizedtesting.RandomizedRunner$6.evaluate(RandomizedRunner.java:879)
	at com.carrotsearch.randomizedtesting.RandomizedRunner$7.evaluate(RandomizedRunner.java:890)
	at com.carrotsearch.randomizedtesting.rules.StatementAdapter.evaluate(StatementAdapter.java:36)
	at com.carrotsearch.randomizedtesting.rules.SystemPropertiesRestoreRule$1.evaluate(SystemPropertiesRestoreRule.java:57)
	at org.apache.lucene.util.AbstractBeforeAfterRule$1.evaluate(AbstractBeforeAfterRule.java:45)
	at com.carrotsearch.randomizedtesting.rules.StatementAdapter.evaluate(StatementAdapter.java:36)
	at org.apache.lucene.util.TestRuleStoreClassName$1.evaluate(TestRuleStoreClassName.java:41)
	at com.carrotsearch.randomizedtesting.rules.NoShadowingOrOverridesOnMethodsRule$1.evaluate(NoShadowingOrOverridesOnMethodsRule.java:40)
	at com.carrotsearch.randomizedtesting.rules.NoShadowingOrOverridesOnMethodsRule$1.evaluate(NoShadowingOrOverridesOnMethodsRule.java:40)
	at com.carrotsearch.randomizedtesting.rules.StatementAdapter.evaluate(StatementAdapter.java:36)
	at com.carrotsearch.randomizedtesting.rules.StatementAdapter.evaluate(StatementAdapter.java:36)
	at org.apache.lucene.util.TestRuleAssertionsRequired$1.evaluate(TestRuleAssertionsRequired.java:53)
	at org.apache.lucene.util.TestRuleMarkFailure$1.evaluate(TestRuleMarkFailure.java:47)
	at org.apache.lucene.util.TestRuleIgnoreAfterMaxFailures$1.evaluate(TestRuleIgnoreAfterMaxFailures.java:64)
	at org.apache.lucene.util.TestRuleIgnoreTestSuites$1.evaluate(TestRuleIgnoreTestSuites.java:54)
	at com.carrotsearch.randomizedtesting.rules.StatementAdapter.evaluate(StatementAdapter.java:36)
	at com.carrotsearch.randomizedtesting.ThreadLeakControl$StatementRunner.run(ThreadLeakControl.java:368)
	at java.base/java.lang.Thread.run(Thread.java:844)
Caused by: org.apache.solr.client.solrj.impl.HttpSolrClient$RemoteSolrException: Error from server at http://127.0.0.1:60392/solr/awhollynewcollection_0_shard2_replica_n4: ClusterState says we are the leader (http://127.0.0.1:60392/solr/awhollynewcollection_0_shard2_replica_n4), but locally we don't think so. Request came from null
	at org.apache.solr.client.solrj.impl.HttpSolrClient.executeMethod(HttpSolrClient.java:627)
	at org.apache.solr.client.solrj.impl.HttpSolrClient.request(HttpSolrClient.java:253)
	at org.apache.solr.client.solrj.impl.HttpSolrClient.request(HttpSolrClient.java:242)
	at org.apache.solr.client.solrj.impl.LBHttpSolrClient.doRequest(LBHttpSolrClient.java:483)
	at org.apache.solr.client.solrj.impl.LBHttpSolrClient.request(LBHttpSolrClient.java:413)
	at org.apache.solr.client.solrj.impl.CloudSolrClient.lambda$directUpdate$0(CloudSolrClient.java:516)
	at java.base/java.util.concurrent.FutureTask.run(FutureTask.java:264)
	at org.apache.solr.common.util.ExecutorUtil$MDCAwareThreadPoolExecutor.lambda$execute$0(ExecutorUtil.java:188)
	at java.base/java.util.concurrent.ThreadPoolExecutor.runWorker(ThreadPoolExecutor.java:1167)
	at java.base/java.util.concurrent.ThreadPoolExecutor$Worker.run(ThreadPoolExecutor.java:641)
	... 1 more


FAILED:  org.apache.solr.cloud.TestTlogReplica.testOutOfOrderDBQWithInPlaceUpdates

Error Message:
Can not find doc 1 in http://127.0.0.1:56443/solr

Stack Trace:
java.lang.AssertionError: Can not find doc 1 in http://127.0.0.1:56443/solr
	at __randomizedtesting.SeedInfo.seed([10DF767CA6D2627:87CC0F8A953CF0C7]:0)
	at org.junit.Assert.fail(Assert.java:93)
	at org.junit.Assert.assertTrue(Assert.java:43)
	at org.junit.Assert.assertNotNull(Assert.java:526)
	at org.apache.solr.cloud.TestTlogReplica.checkRTG(TestTlogReplica.java:861)
	at org.apache.solr.cloud.TestTlogReplica.testOutOfOrderDBQWithInPlaceUpdates(TestTlogReplica.java:664)
	at java.base/jdk.internal.reflect.NativeMethodAccessorImpl.invoke0(Native Method)
	at java.base/jdk.internal.reflect.NativeMethodAccessorImpl.invoke(NativeMethodAccessorImpl.java:62)
	at java.base/jdk.internal.reflect.DelegatingMethodAccessorImpl.invoke(DelegatingMethodAccessorImpl.java:43)
	at java.base/java.lang.reflect.Method.invoke(Method.java:564)
	at com.carrotsearch.randomizedtesting.RandomizedRunner.invoke(RandomizedRunner.java:1737)
	at com.carrotsearch.randomizedtesting.RandomizedRunner$8.evaluate(RandomizedRunner.java:934)
	at com.carrotsearch.randomizedtesting.RandomizedRunner$9.evaluate(RandomizedRunner.java:970)
	at com.carrotsearch.randomizedtesting.RandomizedRunner$10.evaluate(RandomizedRunner.java:984)
	at com.carrotsearch.randomizedtesting.rules.SystemPropertiesRestoreRule$1.evaluate(SystemPropertiesRestoreRule.java:57)
	at org.apache.lucene.util.TestRuleSetupTeardownChained$1.evaluate(TestRuleSetupTeardownChained.java:49)
	at org.apache.lucene.util.AbstractBeforeAfterRule$1.evaluate(AbstractBeforeAfterRule.java:45)
	at org.apache.lucene.util.TestRuleThreadAndTestName$1.evaluate(TestRuleThreadAndTestName.java:48)
	at org.apache.lucene.util.TestRuleIgnoreAfterMaxFailures$1.evaluate(TestRuleIgnoreAfterMaxFailures.java:64)
	at org.apache.lucene.util.TestRuleMarkFailure$1.evaluate(TestRuleMarkFailure.java:47)
	at com.carrotsearch.randomizedtesting.rules.StatementAdapter.evaluate(StatementAdapter.java:36)
	at com.carrotsearch.randomizedtesting.ThreadLeakControl$StatementRunner.run(ThreadLeakControl.java:368)
	at com.carrotsearch.randomizedtesting.ThreadLeakControl.forkTimeoutingTask(ThreadLeakControl.java:817)
	at com.carrotsearch.randomizedtesting.ThreadLeakControl$3.evaluate(ThreadLeakControl.java:468)
	at com.carrotsearch.randomizedtesting.RandomizedRunner.runSingleTest(RandomizedRunner.java:943)
	at com.carrotsearch.randomizedtesting.RandomizedRunner$5.evaluate(RandomizedRunner.java:829)
	at com.carrotsearch.randomizedtesting.RandomizedRunner$6.evaluate(RandomizedRunner.java:879)
	at com.carrotsearch.randomizedtesting.RandomizedRunner$7.evaluate(RandomizedRunner.java:890)
	at com.carrotsearch.randomizedtesting.rules.StatementAdapter.evaluate(StatementAdapter.java:36)
	at com.carrotsearch.randomizedtesting.rules.SystemPropertiesRestoreRule$1.evaluate(SystemPropertiesRestoreRule.java:57)
	at org.apache.lucene.util.AbstractBeforeAfterRule$1.evaluate(AbstractBeforeAfterRule.java:45)
	at com.carrotsearch.randomizedtesting.rules.StatementAdapter.evaluate(StatementAdapter.java:36)
	at org.apache.lucene.util.TestRuleStoreClassName$1.evaluate(TestRuleStoreClassName.java:41)
	at com.carrotsearch.randomizedtesting.rules.NoShadowingOrOverridesOnMethodsRule$1.evaluate(NoShadowingOrOverridesOnMethodsRule.java:40)
	at com.carrotsearch.randomizedtesting.rules.NoShadowingOrOverridesOnMethodsRule$1.evaluate(NoShadowingOrOverridesOnMethodsRule.java:40)
	at com.carrotsearch.randomizedtesting.rules.StatementAdapter.evaluate(StatementAdapter.java:36)
	at com.carrotsearch.randomizedtesting.rules.StatementAdapter.evaluate(StatementAdapter.java:36)
	at org.apache.lucene.util.TestRuleAssertionsRequired$1.evaluate(TestRuleAssertionsRequired.java:53)
	at org.apache.lucene.util.TestRuleMarkFailure$1.evaluate(TestRuleMarkFailure.java:47)
	at org.apache.lucene.util.TestRuleIgnoreAfterMaxFailures$1.evaluate(TestRuleIgnoreAfterMaxFailures.java:64)
	at org.apache.lucene.util.TestRuleIgnoreTestSuites$1.evaluate(TestRuleIgnoreTestSuites.java:54)
	at com.carrotsearch.randomizedtesting.rules.StatementAdapter.evaluate(StatementAdapter.java:36)
	at com.carrotsearch.randomizedtesting.ThreadLeakControl$StatementRunner.run(ThreadLeakControl.java:368)
	at java.base/java.lang.Thread.run(Thread.java:844)




Build Log:
[...truncated 1723 lines...]
   [junit4] JVM J0: stderr was not empty, see: /Users/jenkins/workspace/Lucene-Solr-7.x-MacOSX/lucene/build/core/test/temp/junit4-J0-20170930_235106_3385245208096594513285.syserr
   [junit4] >>> JVM J0 emitted unexpected output (verbatim) ----
   [junit4] Java HotSpot(TM) 64-Bit Server VM warning: Option UseConcMarkSweepGC was deprecated in version 9.0 and will likely be removed in a future release.
   [junit4] <<< JVM J0: EOF ----

[...truncated 3 lines...]
   [junit4] JVM J1: stderr was not empty, see: /Users/jenkins/workspace/Lucene-Solr-7.x-MacOSX/lucene/build/core/test/temp/junit4-J1-20170930_235106_33817854612173313439142.syserr
   [junit4] >>> JVM J1 emitted unexpected output (verbatim) ----
   [junit4] Java HotSpot(TM) 64-Bit Server VM warning: Option UseConcMarkSweepGC was deprecated in version 9.0 and will likely be removed in a future release.
   [junit4] <<< JVM J1: EOF ----

[...truncated 288 lines...]
   [junit4] JVM J0: stderr was not empty, see: /Users/jenkins/workspace/Lucene-Solr-7.x-MacOSX/lucene/build/test-framework/test/temp/junit4-J0-20170930_235630_7395635605089902082461.syserr
   [junit4] >>> JVM J0 emitted unexpected output (verbatim) ----
   [junit4] Java HotSpot(TM) 64-Bit Server VM warning: Option UseConcMarkSweepGC was deprecated in version 9.0 and will likely be removed in a future release.
   [junit4] <<< JVM J0: EOF ----

[...truncated 3 lines...]
   [junit4] JVM J1: stderr was not empty, see: /Users/jenkins/workspace/Lucene-Solr-7.x-MacOSX/lucene/build/test-framework/test/temp/junit4-J1-20170930_235630_73910348385350245988550.syserr
   [junit4] >>> JVM J1 emitted unexpected output (verbatim) ----
   [junit4] Java HotSpot(TM) 64-Bit Server VM warning: Option UseConcMarkSweepGC was deprecated in version 9.0 and will likely be removed in a future release.
   [junit4] <<< JVM J1: EOF ----

[...truncated 1054 lines...]
   [junit4] JVM J1: stderr was not empty, see: /Users/jenkins/workspace/Lucene-Solr-7.x-MacOSX/lucene/build/analysis/common/test/temp/junit4-J1-20170930_235724_111909729868900078572.syserr
   [junit4] >>> JVM J1 emitted unexpected output (verbatim) ----
   [junit4] Java HotSpot(TM) 64-Bit Server VM warning: Option UseConcMarkSweepGC was deprecated in version 9.0 and will likely be removed in a future release.
   [junit4] <<< JVM J1: EOF ----

[...truncated 3 lines...]
   [junit4] JVM J0: stderr was not empty, see: /Users/jenkins/workspace/Lucene-Solr-7.x-MacOSX/lucene/build/analysis/common/test/temp/junit4-J0-20170930_235724_1113101370032117338091.syserr
   [junit4] >>> JVM J0 emitted unexpected output (verbatim) ----
   [junit4] Java HotSpot(TM) 64-Bit Server VM warning: Option UseConcMarkSweepGC was deprecated in version 9.0 and will likely be removed in a future release.
   [junit4] <<< JVM J0: EOF ----

[...truncated 229 lines...]
   [junit4] JVM J0: stderr was not empty, see: /Users/jenkins/workspace/Lucene-Solr-7.x-MacOSX/lucene/build/analysis/icu/test/temp/junit4-J0-20170930_235914_0066029883678134077411.syserr
   [junit4] >>> JVM J0 emitted unexpected output (verbatim) ----
   [junit4] Java HotSpot(TM) 64-Bit Server VM warning: Option UseConcMarkSweepGC was deprecated in version 9.0 and will likely be removed in a future release.
   [junit4] <<< JVM J0: EOF ----

   [junit4] JVM J1: stderr was not empty, see: /Users/jenkins/workspace/Lucene-Solr-7.x-MacOSX/lucene/build/analysis/icu/test/temp/junit4-J1-20170930_235914_0061194455539361195009.syserr
   [junit4] >>> JVM J1 emitted unexpected output (verbatim) ----
   [junit4] Java HotSpot(TM) 64-Bit Server VM warning: Option UseConcMarkSweepGC was deprecated in version 9.0 and will likely be removed in a future release.
   [junit4] <<< JVM J1: EOF ----

[...truncated 252 lines...]
   [junit4] JVM J0: stderr was not empty, see: /Users/jenkins/workspace/Lucene-Solr-7.x-MacOSX/lucene/build/analysis/kuromoji/test/temp/junit4-J0-20170930_235922_9842724262847804242520.syserr
   [junit4] >>> JVM J0 emitted unexpected output (verbatim) ----
   [junit4] Java HotSpot(TM) 64-Bit Server VM warning: Option UseConcMarkSweepGC was deprecated in version 9.0 and will likely be removed in a future release.
   [junit4] <<< JVM J0: EOF ----

   [junit4] JVM J1: stderr was not empty, see: /Users/jenkins/workspace/Lucene-Solr-7.x-MacOSX/lucene/build/analysis/kuromoji/test/temp/junit4-J1-20170930_235922_98416867709448299621718.syserr
   [junit4] >>> JVM J1 emitted unexpected output (verbatim) ----
   [junit4] Java HotSpot(TM) 64-Bit Server VM warning: Option UseConcMarkSweepGC was deprecated in version 9.0 and will likely be removed in a future release.
   [junit4] <<< JVM J1: EOF ----

[...truncated 154 lines...]
   [junit4] JVM J1: stderr was not empty, see: /Users/jenkins/workspace/Lucene-Solr-7.x-MacOSX/lucene/build/analysis/morfologik/test/temp/junit4-J1-20170930_235957_69912272511553392214845.syserr
   [junit4] >>> JVM J1 emitted unexpected output (verbatim) ----
   [junit4] Java HotSpot(TM) 64-Bit Server VM warning: Option UseConcMarkSweepGC was deprecated in version 9.0 and will likely be removed in a future release.
   [junit4] <<< JVM J1: EOF ----

[...truncated 3 lines...]
   [junit4] JVM J0: stderr was not empty, see: /Users/jenkins/workspace/Lucene-Solr-7.x-MacOSX/lucene/build/analysis/morfologik/test/temp/junit4-J0-20170930_235957_69913019962723118539666.syserr
   [junit4] >>> JVM J0 emitted unexpected output (verbatim) ----
   [junit4] Java HotSpot(TM) 64-Bit Server VM warning: Option UseConcMarkSweepGC was deprecated in version 9.0 and will likely be removed in a future release.
   [junit4] <<< JVM J0: EOF ----

[...truncated 160 lines...]
   [junit4] JVM J0: stderr was not empty, see: /Users/jenkins/workspace/Lucene-Solr-7.x-MacOSX/lucene/build/analysis/phonetic/test/temp/junit4-J0-20171001_000003_65912535399451212438761.syserr
   [junit4] >>> JVM J0 emitted unexpected output (verbatim) ----
   [junit4] Java HotSpot(TM) 64-Bit Server VM warning: Option UseConcMarkSweepGC was deprecated in version 9.0 and will likely be removed in a future release.
   [junit4] <<< JVM J0: EOF ----

[...truncated 9 lines...]
   [junit4] JVM J1: stderr was not empty, see: /Users/jenkins/workspace/Lucene-Solr-7.x-MacOSX/lucene/build/analysis/phonetic/test/temp/junit4-J1-20171001_000003_6593713521473544212014.syserr
   [junit4] >>> JVM J1 emitted unexpected output (verbatim) ----
   [junit4] Java HotSpot(TM) 64-Bit Server VM warning: Option UseConcMarkSweepGC was deprecated in version 9.0 and will likely be removed in a future release.
   [junit4] <<< JVM J1: EOF ----

[...truncated 151 lines...]
   [junit4] JVM J0: stderr was not empty, see: /Users/jenkins/workspace/Lucene-Solr-7.x-MacOSX/lucene/build/analysis/smartcn/test/temp/junit4-J0-20171001_000013_2521373523602160323565.syserr
   [junit4] >>> JVM J0 emitted unexpected output (verbatim) ----
   [junit4] Java HotSpot(TM) 64-Bit Server VM warning: Option UseConcMarkSweepGC was deprecated in version 9.0 and will likely be removed in a future release.
   [junit4] <<< JVM J0: EOF ----

[...truncated 3 lines...]
   [junit4] JVM J1: stderr was not empty, see: /Users/jenkins/workspace/Lucene-Solr-7.x-MacOSX/lucene/build/analysis/smartcn/test/temp/junit4-J1-20171001_000013_25416486196001556052075.syserr
   [junit4] >>> JVM J1 emitted unexpected output (verbatim) ----
   [junit4] Java HotSpot(TM) 64-Bit Server VM warning: Option UseConcMarkSweepGC was deprecated in version 9.0 and will likely be removed in a future release.
   [junit4] <<< JVM J1: EOF ----

[...truncated 156 lines...]
   [junit4] JVM J1: stderr was not empty, see: /Users/jenkins/workspace/Lucene-Solr-7.x-MacOSX/lucene/build/analysis/stempel/test/temp/junit4-J1-20171001_000021_88215084947431848783395.syserr
   [junit4] >>> JVM J1 emitted unexpected output (verbatim) ----
   [junit4] Java HotSpot(TM) 64-Bit Server VM warning: Option UseConcMarkSweepGC was deprecated in version 9.0 and will likely be removed in a future release.
   [junit4] <<< JVM J1: EOF ----

[...truncated 3 lines...]
   [junit4] JVM J0: stderr was not empty, see: /Users/jenkins/workspace/Lucene-Solr-7.x-MacOSX/lucene/build/analysis/stempel/test/temp/junit4-J0-20171001_000021_8824921846235794594551.syserr
   [junit4] >>> JVM J0 emitted unexpected output (verbatim) ----
   [junit4] Java HotSpot(TM) 64-Bit Server VM warning: Option UseConcMarkSweepGC was deprecated in version 9.0 and will likely be removed in a future release.
   [junit4] <<< JVM J0: EOF ----

[...truncated 167 lines...]
   [junit4] JVM J0: stderr was not empty, see: /Users/jenkins/workspace/Lucene-Solr-7.x-MacOSX/lucene/build/analysis/uima/test/temp/junit4-J0-20171001_000026_8065419930760468574229.syserr
   [junit4] >>> JVM J0 emitted unexpected output (verbatim) ----
   [junit4] Java HotSpot(TM) 64-Bit Server VM warning: Option UseConcMarkSweepGC was deprecated in version 9.0 and will likely be removed in a future release.
   [junit4] <<< JVM J0: EOF ----

[...truncated 211 lines...]
   [junit4] JVM J1: stderr was not empty, see: /Users/jenkins/workspace/Lucene-Solr-7.x-MacOSX/lucene/build/backward-codecs/test/temp/junit4-J1-20171001_000042_69818442371468158121082.syserr
   [junit4] >>> JVM J1 emitted unexpected output (verbatim) ----
   [junit4] Java HotSpot(TM) 64-Bit Server VM warning: Option UseConcMarkSweepGC was deprecated in version 9.0 and will likely be removed in a future release.
   [junit4] <<< JVM J1: EOF ----

[...truncated 9 lines...]
   [junit4] JVM J0: stderr was not empty, see: /Users/jenkins/workspace/Lucene-Solr-7.x-MacOSX/lucene/build/backward-codecs/test/temp/junit4-J0-20171001_000042_6975139425750566664768.syserr
   [junit4] >>> JVM J0 emitted unexpected output (verbatim) ----
   [junit4] Java HotSpot(TM) 64-Bit Server VM warning: Option UseConcMarkSweepGC was deprecated in version 9.0 and will likely be removed in a future release.
   [junit4] <<< JVM J0: EOF ----

[...truncated 1268 lines...]
   [junit4] JVM J0: stderr was not empty, see: /Users/jenkins/workspace/Lucene-Solr-7.x-MacOSX/lucene/build/benchmark/test/temp/junit4-J0-20171001_000208_581631935956249655216.syserr
   [junit4] >>> JVM J0 emitted unexpected output (verbatim) ----
   [junit4] Java HotSpot(TM) 64-Bit Server VM warning: Option UseConcMarkSweepGC was deprecated in version 9.0 and will likely be removed in a future release.
   [junit4] <<< JVM J0: EOF ----

   [junit4] JVM J1: stderr was not empty, see: /Users/jenkins/workspace/Lucene-Solr-7.x-MacOSX/lucene/build/benchmark/test/temp/junit4-J1-20171001_000208_58112212540024987004891.syserr
   [junit4] >>> JVM J1 emitted unexpected output (verbatim) ----
   [junit4] Java HotSpot(TM) 64-Bit Server VM warning: Option UseConcMarkSweepGC was deprecated in version 9.0 and will likely be removed in a future release.
   [junit4] <<< JVM J1: EOF ----

[...truncated 234 lines...]
   [junit4] JVM J1: stderr was not empty, see: /Users/jenkins/workspace/Lucene-Solr-7.x-MacOSX/lucene/build/classification/test/temp/junit4-J1-20171001_000220_9702074630808730659081.syserr
   [junit4] >>> JVM J1 emitted unexpected output (verbatim) ----
   [junit4] Java HotSpot(TM) 64-Bit Server VM warning: Option UseConcMarkSweepGC was deprecated in version 9.0 and will likely be removed in a future release.
   [junit4] <<< JVM J1: EOF ----

   [junit4] JVM J0: stderr was not empty, see: /Users/jenkins/workspace/Lucene-Solr-7.x-MacOSX/lucene/build/classification/test/temp/junit4-J0-20171001_000220_97017683503020568162601.syserr
   [junit4] >>> JVM J0 emitted unexpected output (verbatim) ----
   [junit4] Java HotSpot(TM) 64-Bit Server VM warning: Option UseConcMarkSweepGC was deprecated in version 9.0 and will likely be removed in a future release.
   [junit4] <<< JVM J0: EOF ----

[...truncated 257 lines...]
   [junit4] JVM J1: stderr was not empty, see: /Users/jenkins/workspace/Lucene-Solr-7.x-MacOSX/lucene/build/codecs/test/temp/junit4-J1-20171001_000239_64314341029193422579615.syserr
   [junit4] >>> JVM J1 emitted unexpected output (verbatim) ----
   [junit4] Java HotSpot(TM) 64-Bit Server VM warning: Option UseConcMarkSweepGC was deprecated in version 9.0 and will likely be removed in a future release.
   [junit4] <<< JVM J1: EOF ----

[...truncated 5 lines...]
   [junit4] JVM J0: stderr was not empty, see: /Users/jenkins/workspace/Lucene-Solr-7.x-MacOSX/lucene/build/codecs/test/temp/junit4-J0-20171001_000239_643251761059626084679.syserr
   [junit4] >>> JVM J0 emitted unexpected output (verbatim) ----
   [junit4] Java HotSpot(TM) 64-Bit Server VM warning: Option UseConcMarkSweepGC was deprecated in version 9.0 and will likely be removed in a future release.
   [junit4] <<< JVM J0: EOF ----

[...truncated 240 lines...]
   [junit4] JVM J1: stderr was not empty, see: /Users/jenkins/workspace/Lucene-Solr-7.x-MacOSX/lucene/build/demo/test/temp/junit4-J1-20171001_000448_64914727870615062680944.syserr
   [junit4] >>> JVM J1 emitted unexpected output (verbatim) ----
   [junit4] Java HotSpot(TM) 64-Bit Server VM warning: Option UseConcMarkSweepGC was deprecated in version 9.0 and will likely be removed in a future release.
   [junit4] <<< JVM J1: EOF ----

   [junit4] JVM J0: stderr was not empty, see: /Users/jenkins/workspace/Lucene-Solr-7.x-MacOSX/lucene/build/demo/test/temp/junit4-J0-20171001_000448_6495336915000205256142.syserr
   [junit4] >>> JVM J0 emitted unexpected output (verbatim) ----
   [junit4] Java HotSpot(TM) 64-Bit Server VM warning: Option UseConcMarkSweepGC was deprecated in version 9.0 and will likely be removed in a future release.
   [junit4] <<< JVM J0: EOF ----

[...truncated 167 lines...]
   [junit4] JVM J0: stderr was not empty, see: /Users/jenkins/workspace/Lucene-Solr-7.x-MacOSX/lucene/build/expressions/test/temp/junit4-J0-20171001_000452_449918461922990930121.syserr
   [junit4] >>> JVM J0 emitted unexpected output (verbatim) ----
   [junit4] Java HotSpot(TM) 64-Bit Server VM warning: Option UseConcMarkSweepGC was deprecated in version 9.0 and will likely be removed in a future release.
   [junit4] <<< JVM J0: EOF ----

[...truncated 6 lines...]
   [junit4] JVM J1: stderr was not empty, see: /Users/jenkins/workspace/Lucene-Solr-7.x-MacOSX/lucene/build/expressions/test/temp/junit4-J1-20171001_000452_44916671971939088821447.syserr
   [junit4] >>> JVM J1 emitted unexpected output (verbatim) ----
   [junit4] Java HotSpot(TM) 64-Bit Server VM warning: Option UseConcMarkSweepGC was deprecated in version 9.0 and will likely be removed in a future release.
   [junit4] <<< JVM J1: EOF ----

[...truncated 226 lines...]
   [junit4] JVM J0: stderr was not empty, see: /Users/jenkins/workspace/Lucene-Solr-7.x-MacOSX/lucene/build/facet/test/temp/junit4-J0-20171001_000458_45812327533915107199794.syserr
   [junit4] >>> JVM J0 emitted unexpected output (verbatim) ----
   [junit4] Java HotSpot(TM) 64-Bit Server VM warning: Option UseConcMarkSweepGC was deprecated in version 9.0 and will likely be removed in a future release.
   [junit4] <<< JVM J0: EOF ----

[...truncated 3 lines...]
   [junit4] JVM J1: stderr was not empty, see: /Users/jenkins/workspace/Lucene-Solr-7.x-MacOSX/lucene/build/facet/test/temp/junit4-J1-20171001_000458_4594692569577458428981.syserr
   [junit4] >>> JVM J1 emitted unexpected output (verbatim) ----
   [junit4] Java HotSpot(TM) 64-Bit Server VM warning: Option UseConcMarkSweepGC was deprecated in version 9.0 and will likely be removed in a future release.
   [junit4] <<< JVM J1: EOF ----

[...truncated 179 lines...]
   [junit4] JVM J1: stderr was not empty, see: /Users/jenkins/workspace/Lucene-Solr-7.x-MacOSX/lucene/build/grouping/test/temp/junit4-J1-20171001_000524_5209082867063518803146.syserr
   [junit4] >>> JVM J1 emitted unexpected output (verbatim) ----
   [junit4] Java HotSpot(TM) 64-Bit Server VM warning: Option UseConcMarkSweepGC was deprecated in version 9.0 and will likely be removed in a future release.
   [junit4] <<< JVM J1: EOF ----

[...truncated 3 lines...]
   [junit4] JVM J0: stderr was not empty, see: /Users/jenkins/workspace/Lucene-Solr-7.x-MacOSX/lucene/build/grouping/test/temp/junit4-J0-20171001_000524_52011586668423563148234.syserr
   [junit4] >>> JVM J0 emitted unexpected output (verbatim) ----
   [junit4] Java HotSpot(TM) 64-Bit Server VM warning: Option UseConcMarkSweepGC was deprecated in version 9.0 and will likely be removed in a future release.
   [junit4] <<< JVM J0: EOF ----

[...truncated 243 lines...]
   [junit4] JVM J1: stderr was not empty, see: /Users/jenkins/workspace/Lucene-Solr-7.x-MacOSX/lucene/build/highlighter/test/temp/junit4-J1-20171001_000533_1509674832743977752281.syserr
   [junit4] >>> JVM J1 emitted unexpected output (verbatim) ----
   [junit4] Java HotSpot(TM) 64-Bit Server VM warning: Option UseConcMarkSweepGC was deprecated in version 9.0 and will likely be removed in a future release.
   [junit4] <<< JVM J1: EOF ----

[...truncated 3 lines...]
   [junit4] JVM J0: stderr was not empty, see: /Users/jenkins/workspace/Lucene-Solr-7.x-MacOSX/lucene/build/highlighter/test/temp/junit4-J0-20171001_000533_15011256430554921684380.syserr
   [junit4] >>> JVM J0 emitted unexpected output (verbatim) ----
   [junit4] Java HotSpot(TM) 64-Bit Server VM warning: Option UseConcMarkSweepGC was deprecated in version 9.0 and will likely be removed in a future release.
   [junit4] <<< JVM J0: EOF ----

[...truncated 160 lines...]
   [junit4] JVM J1: stderr was not empty, see: /Users/jenkins/workspace/Lucene-Solr-7.x-MacOSX/lucene/build/join/test/temp/junit4-J1-20171001_000548_8114700424325167241397.syserr
   [junit4] >>> JVM J1 emitted unexpected output (verbatim) ----
   [junit4] Java HotSpot(TM) 64-Bit Server VM warning: Option UseConcMarkSweepGC was deprecated in version 9.0 and will likely be removed in a future release.
   [junit4] <<< JVM J1: EOF ----

[...truncated 6 lines...]
   [junit4] JVM J0: stderr was not empty, see: /Users/jenkins/workspace/Lucene-Solr-7.x-MacOSX/lucene/build/join/test/temp/junit4-J0-20171001_000548_8105173258797592212100.syserr
   [junit4] >>> JVM J0 emitted unexpected output (verbatim) ----
   [junit4] Java HotSpot(TM) 64-Bit Server VM warning: Option UseConcMarkSweepGC was deprecated in version 9.0 and will likely be removed in a future release.
   [junit4] <<< JVM J0: EOF ----

[...truncated 147 lines...]
   [junit4] JVM J0: stderr was not empty, see: /Users/jenkins/workspace/Lucene-Solr-7.x-MacOSX/lucene/build/memory/test/temp/junit4-J0-20171001_000601_96111665615423745623353.syserr
   [junit4] >>> JVM J0 emitted unexpected output (verbatim) ----
   [junit4] Java HotSpot(TM) 64-Bit Server VM warning: Option UseConcMarkSweepGC was deprecated in version 9.0 and will likely be removed in a future release.
   [junit4] <<< JVM J0: EOF ----

[...truncated 3 lines...]
   [junit4] JVM J1: stderr was not empty, see: /Users/jenkins/workspace/Lucene-Solr-7.x-MacOSX/lucene/build/memory/test/temp/junit4-J1-20171001_000601_9619697638210862454934.syserr
   [junit4] >>> JVM J1 emitted unexpected output (verbatim) ----
   [junit4] Java HotSpot(TM) 64-Bit Server VM warning: Option UseConcMarkSweepGC was deprecated in version 9.0 and will likely be removed in a future release.
   [junit4] <<< JVM J1: EOF ----

[...truncated 182 lines...]
   [junit4] JVM J0: stderr was not empty, see: /Users/jenkins/workspace/Lucene-Solr-7.x-MacOSX/lucene/build/misc/test/temp/junit4-J0-20171001_000610_59412195567217848649310.syserr
   [junit4] >>> JVM J0 emitted unexpected output (verbatim) ----
   [junit4] Java HotSpot(TM) 64-Bit Server VM warning: Option UseConcMarkSweepGC was deprecated in version 9.0 and will likely be removed in a future release.
   [junit4] <<< JVM J0: EOF ----

[...truncated 3 lines...]
   [junit4] JVM J1: stderr was not empty, see: /Users/jenkins/workspace/Lucene-Solr-7.x-MacOSX/lucene/build/misc/test/temp/junit4-J1-20171001_000610_59411055564804451693542.syserr
   [junit4] >>> JVM J1 emitted unexpected output (verbatim) ----
   [junit4] Java HotSpot(TM) 64-Bit Server VM warning: Option UseConcMarkSweepGC was deprecated in version 9.0 and will likely be removed in a future release.
   [junit4] <<< JVM J1: EOF ----

[...truncated 312 lines...]
   [junit4] JVM J0: stderr was not empty, see: /Users/jenkins/workspace/Lucene-Solr-7.x-MacOSX/lucene/build/queries/test/temp/junit4-J0-20171001_000630_4854542095797171831460.syserr
   [junit4] >>> JVM J0 emitted unexpected output (verbatim) ----
   [junit4] Java HotSpot(TM) 64-Bit Server VM warning: Option UseConcMarkSweepGC was deprecated in version 9.0 and will likely be removed in a future release.
   [junit4] <<< JVM J0: EOF ----

[...truncated 3 lines...]
   [junit4] JVM J1: stderr was not empty, see: /Users/jenkins/workspace/Lucene-Solr-7.x-MacOSX/lucene/build/queries/test/temp/junit4-J1-20171001_000630_485488912547157796167.syserr
   [junit4] >>> JVM J1 emitted unexpected output (verbatim) ----
   [junit4] Java HotSpot(TM) 64-Bit Server VM warning: Option UseConcMarkSweepGC was deprecated in version 9.0 and will likely be removed in a future release.
   [junit4] <<< JVM J1: EOF ----

[...truncated 227 lines...]
   [junit4] JVM J0: stderr was not empty, see: /Users/jenkins/workspace/Lucene-Solr-7.x-MacOSX/lucene/build/queryparser/test/temp/junit4-J0-20171001_000640_6171081580594743652213.syserr
   [junit4] >>> JVM J0 emitted unexpected output (verbatim) ----
   [junit4] Java HotSpot(TM) 64-Bit Server VM warning: Option UseConcMarkSweepGC was deprecated in version 9.0 and will likely be removed in a future release.
   [junit4] <<< JVM J0: EOF ----

   [junit4] JVM J1: stderr was not empty, see: /Users/jenkins/workspace/Lucene-Solr-7.x-MacOSX/lucene/build/queryparser/test/temp/junit4-J1-20171001_000640_6172780618334478616339.syserr
   [junit4] >>> JVM J1 emitted unexpected output (verbatim) ----
   [junit4] Java HotSpot(TM) 64-Bit Server VM warning: Option UseConcMarkSweepGC was deprecated in version 9.0 and will likely be removed in a future release.
   [junit4] <<< JVM J1: EOF ----

[...truncated 187 lines...]
   [junit4] JVM J1: stderr was not empty, see: /Users/jenkins/workspace/Lucene-Solr-7.x-MacOSX/lucene/build/replicator/test/temp/junit4-J1-20171001_000649_49416258278875409997470.syserr
   [junit4] >>> JVM J1 emitted unexpected output (verbatim) ----
   [junit4] Java HotSpot(TM) 64-Bit Server VM warning: Option UseConcMarkSweepGC was deprecated in version 9.0 and will likely be removed in a future release.
   [junit4] <<< JVM J1: EOF ----

[...truncated 23 lines...]
   [junit4] JVM J0: stderr was not empty, see: /Users/jenkins/workspace/Lucene-Solr-7.x-MacOSX/lucene/build/replicator/test/temp/junit4-J0-20171001_000649_49418001084255492649765.syserr
   [junit4] >>> JVM J0 emitted unexpected output (verbatim) ----
   [junit4] Java HotSpot(TM) 64-Bit Server VM warning: Option UseConcMarkSweepGC was deprecated in version 9.0 and will likely be removed in a future release.
   [junit4] <<< JVM J0: EOF ----

[...truncated 199 lines...]
   [junit4] JVM J0: stderr was not empty, see: /Users/jenkins/workspace/Lucene-Solr-7.x-MacOSX/lucene/build/sandbox/test/temp/junit4-J0-20171001_000704_9992080502420748989144.syserr
   [junit4] >>> JVM J0 emitted unexpected output (verbatim) ----
   [junit4] Java HotSpot(TM) 64-Bit Server VM warning: Option UseConcMarkSweepGC was deprecated in version 9.0 and will likely be removed in a future release.
   [junit4] <<< JVM J0: EOF ----

[...truncated 21 lines...]
   [junit4] JVM J1: stderr was not empty, see: /Users/jenkins/workspace/Lucene-Solr-7.x-MacOSX/lucene/build/sandbox/test/temp/junit4-J1-20171001_000704_999418702481816457115.syserr
   [junit4] >>> JVM J1 emitted unexpected output (verbatim) ----
   [junit4] Java HotSpot(TM) 64-Bit Server VM warning: Option UseConcMarkSweepGC was deprecated in version 9.0 and will likely be removed in a future release.
   [junit4] <<< JVM J1: EOF ----

[...truncated 415 lines...]
   [junit4] JVM J0: stderr was not empty, see: /Users/jenkins/workspace/Lucene-Solr-7.x-MacOSX/lucene/build/spatial-extras/test/temp/junit4-J0-20171001_000740_02315613997057856738117.syserr
   [junit4] >>> JVM J0 emitted unexpected output (verbatim) ----
   [junit4] Java HotSpot(TM) 64-Bit Server VM warning: Option UseConcMarkSweepGC was deprecated in version 9.0 and will likely be removed in a future release.
   [junit4] <<< JVM J0: EOF ----

[...truncated 3 lines...]
   [junit4] JVM J1: stderr was not empty, see: /Users/jenkins/workspace/Lucene-Solr-7.x-MacOSX/lucene/build/spatial-extras/test/temp/junit4-J1-20171001_000740_02311155474560025132840.syserr
   [junit4] >>> JVM J1 emitted unexpected output (verbatim) ----
   [junit4] Java HotSpot(TM) 64-Bit Server VM warning: Option UseConcMarkSweepGC was deprecated in version 9.0 and will likely be removed in a future release.
   [junit4] <<< JVM J1: EOF ----

[...truncated 146 lines...]
   [junit4] JVM J0: stderr was not empty, see: /Users/jenkins/workspace/Lucene-Solr-7.x-MacOSX/lucene/build/spatial/test/temp/junit4-J0-20171001_000754_9895371334018227272189.syserr
   [junit4] >>> JVM J0 emitted unexpected output (verbatim) ----
   [junit4] Java HotSpot(TM) 64-Bit Server VM warning: Option UseConcMarkSweepGC was deprecated in version 9.0 and will likely be removed in a future release.
   [junit4] <<< JVM J0: EOF ----

[...truncated 174 lines...]
   [junit4] JVM J0: stderr was not empty, see: /Users/jenkins/workspace/Lucene-Solr-7.x-MacOSX/lucene/build/spatial3d/test/temp/junit4-J0-20171001_000757_20515720193353020440649.syserr
   [junit4] >>> JVM J0 emitted unexpected output (verbatim) ----
   [junit4] Java HotSpot(TM) 64-Bit Server VM warning: Option UseConcMarkSweepGC was deprecated in version 9.0 and will likely be removed in a future release.
   [junit4] <<< JVM J0: EOF ----

[...truncated 5 lines...]
   [junit4] JVM J1: stderr was not empty, see: /Users/jenkins/workspace/Lucene-Solr-7.x-MacOSX/lucene/build/spatial3d/test/temp/junit4-J1-20171001_000757_20513483817170430504062.syserr
   [junit4] >>> JVM J1 emitted unexpected output (verbatim) ----
   [junit4] Java HotSpot(TM) 64-Bit Server VM warning: Option UseConcMarkSweepGC was deprecated in version 9.0 and will likely be removed in a future release.
   [junit4] <<< JVM J1: EOF ----

[...truncated 250 lines...]
   [junit4] JVM J0: stderr was not empty, see: /Users/jenkins/workspace/Lucene-Solr-7.x-MacOSX/lucene/build/suggest/test/temp/junit4-J0-20171001_000813_0708143729013337523199.syserr
   [junit4] >>> JVM J0 emitted unexpected output (verbatim) ----
   [junit4] Java HotSpot(TM) 64-Bit Server VM warning: Option UseConcMarkSweepGC was deprecated in version 9.0 and will likely be removed in a future release.
   [junit4] <<< JVM J0: EOF ----

[...truncated 3 lines...]
   [junit4] JVM J1: stderr was not empty, see: /Users/jenkins/workspace/Lucene-Solr-7.x-MacOSX/lucene/build/suggest/test/temp/junit4-J1-20171001_000813_07012900931341227907167.syserr
   [junit4] >>> JVM J1 emitted unexpected output (verbatim) ----
   [junit4] Java HotSpot(TM) 64-Bit Server VM warning: Option UseConcMarkSweepGC was deprecated in version 9.0 and will likely be removed in a future release.
   [junit4] <<< JVM J1: EOF ----

[...truncated 2027 lines...]
   [junit4] Suite: org.apache.solr.cloud.CollectionsAPIDistributedZkTest
   [junit4]   2> 396877 INFO  (SUITE-CollectionsAPIDistributedZkTest-seed#[10DF767CA6D2627]-worker) [    ] o.a.s.SolrTestCaseJ4 SecureRandom sanity checks: test.solr.allowed.securerandom=null & java.security.egd=file:/dev/./urandom
   [junit4]   2> Creating dataDir: /Users/jenkins/workspace/Lucene-Solr-7.x-MacOSX/solr/build/solr-core/test/J1/temp/solr.cloud.CollectionsAPIDistributedZkTest_10DF767CA6D2627-001/init-core-data-001
   [junit4]   2> 396878 WARN  (SUITE-CollectionsAPIDistributedZkTest-seed#[10DF767CA6D2627]-worker) [    ] o.a.s.SolrTestCaseJ4 startTrackingSearchers: numOpens=7 numCloses=7
   [junit4]   2> 396878 INFO  (SUITE-CollectionsAPIDistributedZkTest-seed#[10DF767CA6D2627]-worker) [    ] o.a.s.SolrTestCaseJ4 Using PointFields (NUMERIC_POINTS_SYSPROP=true) w/NUMERIC_DOCVALUES_SYSPROP=true
   [junit4]   2> 396878 INFO  (SUITE-CollectionsAPIDistributedZkTest-seed#[10DF767CA6D2627]-worker) [    ] o.a.s.SolrTestCaseJ4 Randomized ssl (false) and clientAuth (false) via: @org.apache.solr.util.RandomizeSSL(reason="", value=0.0/0.0, ssl=0.0/0.0, clientAuth=0.0/0.0) w/ MAC_OS_X supressed clientAuth
   [junit4]   2> 396879 INFO  (SUITE-CollectionsAPIDistributedZkTest-seed#[10DF767CA6D2627]-worker) [    ] o.a.s.c.MiniSolrCloudCluster Starting cluster of 4 servers in /Users/jenkins/workspace/Lucene-Solr-7.x-MacOSX/solr/build/solr-core/test/J1/temp/solr.cloud.CollectionsAPIDistributedZkTest_10DF767CA6D2627-001/tempDir-001
   [junit4]   2> 396879 INFO  (SUITE-CollectionsAPIDistributedZkTest-seed#[10DF767CA6D2627]-worker) [    ] o.a.s.c.ZkTestServer STARTING ZK TEST SERVER
   [junit4]   2> 396879 INFO  (Thread-1338) [    ] o.a.s.c.ZkTestServer client port:0.0.0.0/0.0.0.0:0
   [junit4]   2> 396879 INFO  (Thread-1338) [    ] o.a.s.c.ZkTestServer Starting server
   [junit4]   2> 396882 ERROR (Thread-1338) [    ] o.a.z.s.ZooKeeperServer ZKShutdownHandler is not registered, so ZooKeeper server won't take any action on ERROR or SHUTDOWN server state changes
   [junit4]   2> 396987 INFO  (SUITE-CollectionsAPIDistributedZkTest-seed#[10DF767CA6D2627]-worker) [    ] o.a.s.c.ZkTestServer start zk server on port:60389
   [junit4]   2> 396999 INFO  (jetty-launcher-971-thread-2) [    ] o.e.j.s.Server jetty-9.3.20.v20170531
   [junit4]   2> 396999 INFO  (jetty-launcher-971-thread-1) [    ] o.e.j.s.Server jetty-9.3.20.v20170531
   [junit4]   2> 396999 INFO  (jetty-launcher-971-thread-3) [    ] o.e.j.s.Server jetty-9.3.20.v20170531
   [junit4]   2> 397000 INFO  (jetty-launcher-971-thread-4) [    ] o.e.j.s.Server jetty-9.3.20.v20170531
   [junit4]   2> 397003 INFO  (jetty-launcher-971-thread-1) [    ] o.e.j.s.h.ContextHandler Started o.e.j.s.ServletContextHandler@7e27bba5{/solr,null,AVAILABLE}
   [junit4]   2> 397004 INFO  (jetty-launcher-971-thread-2) [    ] o.e.j.s.h.ContextHandler Started o.e.j.s.ServletContextHandler@2a4a5d7d{/solr,null,AVAILABLE}
   [junit4]   2> 397005 INFO  (jetty-launcher-971-thread-1) [    ] o.e.j.s.AbstractConnector Started ServerConnector@656f2655{HTTP/1.1,[http/1.1]}{127.0.0.1:60391}
   [junit4]   2> 397005 INFO  (jetty-launcher-971-thread-1) [    ] o.e.j.s.Server Started @398945ms
   [junit4]   2> 397005 INFO  (jetty-launcher-971-thread-1) [    ] o.a.s.c.s.e.JettySolrRunner Jetty properties: {hostContext=/solr, hostPort=60391}
   [junit4]   2> 397005 ERROR (jetty-launcher-971-thread-1) [    ] o.a.s.u.StartupLoggingUtils Missing Java Option solr.log.dir. Logging may be missing or incomplete.
   [junit4]   2> 397005 INFO  (jetty-launcher-971-thread-2) [    ] o.e.j.s.AbstractConnector Started ServerConnector@6c4dd82b{HTTP/1.1,[http/1.1]}{127.0.0.1:60392}
   [junit4]   2> 397005 INFO  (jetty-launcher-971-thread-2) [    ] o.e.j.s.Server Started @398946ms
   [junit4]   2> 397006 INFO  (jetty-launcher-971-thread-2) [    ] o.a.s.c.s.e.JettySolrRunner Jetty properties: {hostContext=/solr, hostPort=60392}
   [junit4]   2> 397006 ERROR (jetty-launcher-971-thread-2) [    ] o.a.s.u.StartupLoggingUtils Missing Java Option solr.log.dir. Logging may be missing or incomplete.
   [junit4]   2> 397006 INFO  (jetty-launcher-971-thread-1) [    ] o.a.s.s.SolrDispatchFilter  ___      _       Welcome to Apache Solr™ version 7.1.0
   [junit4]   2> 397006 INFO  (jetty-launcher-971-thread-1) [    ] o.a.s.s.SolrDispatchFilter / __| ___| |_ _   Starting in cloud mode on port null
   [junit4]   2> 397006 INFO  (jetty-launcher-971-thread-1) [    ] o.a.s.s.SolrDispatchFilter \__ \/ _ \ | '_|  Install dir: null, Default config dir: null
   [junit4]   2> 397006 INFO  (jetty-launcher-971-thread-1) [    ] o.a.s.s.SolrDispatchFilter |___/\___/_|_|    Start time: 2017-10-01T00:15:55.983417Z
   [junit4]   2> 397006 INFO  (jetty-launcher-971-thread-2) [    ] o.a.s.s.SolrDispatchFilter  ___      _       Welcome to Apache Solr™ version 7.1.0
   [junit4]   2> 397007 INFO  (jetty-launcher-971-thread-2) [    ] o.a.s.s.SolrDispatchFilter / __| ___| |_ _   Starting in cloud mode on port null
   [junit4]   2> 397007 INFO  (jetty-launcher-971-thread-2) [    ] o.a.s.s.SolrDispatchFilter \__ \/ _ \ | '_|  Install dir: null, Default config dir: null
   [junit4]   2> 397007 INFO  (jetty-launcher-971-thread-2) [    ] o.a.s.s.SolrDispatchFilter |___/\___/_|_|    Start time: 2017-10-01T00:15:55.984079Z
   [junit4]   2> 397008 INFO  (jetty-launcher-971-thread-4) [    ] o.e.j.s.h.ContextHandler Started o.e.j.s.ServletContextHandler@c5b5ed2{/solr,null,AVAILABLE}
   [junit4]   2> 397010 INFO  (jetty-launcher-971-thread-4) [    ] o.e.j.s.AbstractConnector Started ServerConnector@26bbc6eb{HTTP/1.1,[http/1.1]}{127.0.0.1:60393}
   [junit4]   2> 397010 INFO  (jetty-launcher-971-thread-4) [    ] o.e.j.s.Server Started @398951ms
   [junit4]   2> 397011 INFO  (jetty-launcher-971-thread-4) [    ] o.a.s.c.s.e.JettySolrRunner Jetty properties: {hostContext=/solr, hostPort=60393}
   [junit4]   2> 397011 ERROR (jetty-launcher-971-thread-4) [    ] o.a.s.u.StartupLoggingUtils Missing Java Option solr.log.dir. Logging may be missing or incomplete.
   [junit4]   2> 397011 INFO  (jetty-launcher-971-thread-4) [    ] o.a.s.s.SolrDispatchFilter  ___      _       Welcome to Apache Solr™ version 7.1.0
   [junit4]   2> 397011 INFO  (jetty-launcher-971-thread-4) [    ] o.a.s.s.SolrDispatchFilter / __| ___| |_ _   Starting in cloud mode on port null
   [junit4]   2> 397011 INFO  (jetty-launcher-971-thread-4) [    ] o.a.s.s.SolrDispatchFilter \__ \/ _ \ | '_|  Install dir: null, Default config dir: null
   [junit4]   2> 397011 INFO  (jetty-launcher-971-thread-4) [    ] o.a.s.s.SolrDispatchFilter |___/\___/_|_|    Start time: 2017-10-01T00:15:55.988843Z
   [junit4]   2> 397011 INFO  (jetty-launcher-971-thread-3) [    ] o.e.j.s.h.ContextHandler Started o.e.j.s.ServletContextHandler@2a203359{/solr,null,AVAILABLE}
   [junit4]   2> 397012 INFO  (jetty-launcher-971-thread-2) [    ] o.a.s.s.SolrDispatchFilter solr.xml found in ZooKeeper. Loading...
   [junit4]   2> 397012 INFO  (jetty-launcher-971-thread-3) [    ] o.e.j.s.AbstractConnector Started ServerConnector@303a5f6d{HTTP/1.1,[http/1.1]}{127.0.0.1:60396}
   [junit4]   2> 397012 INFO  (jetty-launcher-971-thread-3) [    ] o.e.j.s.Server Started @398953ms
   [junit4]   2> 397012 INFO  (jetty-launcher-971-thread-3) [    ] o.a.s.c.s.e.JettySolrRunner Jetty properties: {hostContext=/solr, hostPort=60396}
   [junit4]   2> 397013 ERROR (jetty-launcher-971-thread-3) [    ] o.a.s.u.StartupLoggingUtils Missing Java Option solr.log.dir. Logging may be missing or incomplete.
   [junit4]   2> 397013 INFO  (jetty-launcher-971-thread-3) [    ] o.a.s.s.SolrDispatchFilter  ___      _       Welcome to Apache Solr™ version 7.1.0
   [junit4]   2> 397013 INFO  (jetty-launcher-971-thread-3) [    ] o.a.s.s.SolrDispatchFilter / __| ___| |_ _   Starting in cloud mode on port null
   [junit4]   2> 397013 INFO  (jetty-launcher-971-thread-3) [    ] o.a.s.s.SolrDispatchFilter \__ \/ _ \ | '_|  Install dir: null, Default config dir: null
   [junit4]   2> 397013 INFO  (jetty-launcher-971-thread-3) [    ] o.a.s.s.SolrDispatchFilter |___/\___/_|_|    Start time: 2017-10-01T00:15:55.990868Z
   [junit4]   2> 397013 INFO  (jetty-launcher-971-thread-1) [    ] o.a.s.s.SolrDispatchFilter solr.xml found in ZooKeeper. Loading...
   [junit4]   2> 397016 INFO  (jetty-launcher-971-thread-4) [    ] o.a.s.s.SolrDispatchFilter solr.xml found in ZooKeeper. Loading...
   [junit4]   2> 397020 INFO  (jetty-launcher-971-thread-2) [    ] o.a.s.c.ZkContainer Zookeeper client=127.0.0.1:60389/solr
   [junit4]   2> 397020 INFO  (jetty-launcher-971-thread-3) [    ] o.a.s.s.SolrDispatchFilter solr.xml found in ZooKeeper. Loading...
   [junit4]   2> 397025 INFO  (jetty-launcher-971-thread-1) [    ] o.a.s.c.ZkContainer Zookeeper client=127.0.0.1:60389/solr
   [junit4]   2> 397029 INFO  (jetty-launcher-971-thread-4) [    ] o.a.s.c.ZkContainer Zookeeper client=127.0.0.1:60389/solr
   [junit4]   2> 397029 INFO  (jetty-launcher-971-thread-3) [    ] o.a.s.c.ZkContainer Zookeeper client=127.0.0.1:60389/solr
   [junit4]   2> 397202 INFO  (jetty-launcher-971-thread-2) [    ] o.a.s.c.Overseer Overseer (id=null) closing
   [junit4]   2> 397202 INFO  (jetty-launcher-971-thread-4) [    ] o.a.s.c.Overseer Overseer (id=null) closing
   [junit4]   2> 397203 INFO  (jetty-launcher-971-thread-1) [    ] o.a.s.c.Overseer Overseer (id=null) closing
   [junit4]   2> 397203 INFO  (jetty-launcher-971-thread-3) [    ] o.a.s.c.Overseer Overseer (id=null) closing
   [junit4]   2> 397204 INFO  (jetty-launcher-971-thread-2) [    ] o.a.s.c.OverseerElectionContext I am going to be the leader 127.0.0.1:60392_solr
   [junit4]   2> 397205 INFO  (jetty-launcher-971-thread-4) [    ] o.a.s.c.ZkController Register node as live in ZooKeeper:/live_nodes/127.0.0.1:60393_solr
   [junit4]   2> 397205 INFO  (jetty-launcher-971-thread-1) [    ] o.a.s.c.ZkController Register node as live in ZooKeeper:/live_nodes/127.0.0.1:60391_solr
   [junit4]   2> 397205 INFO  (jetty-launcher-971-thread-2) [    ] o.a.s.c.Overseer Overseer (id=98750756019109897-127.0.0.1:60392_solr-n_0000000000) starting
   [junit4]   2> 397205 INFO  (jetty-launcher-971-thread-3) [    ] o.a.s.c.ZkController Register node as live in ZooKeeper:/live_nodes/127.0.0.1:60396_solr
   [junit4]   2> 397207 INFO  (zkCallback-992-thread-1) [    ] o.a.s.c.c.ZkStateReader Updated live nodes from ZooKeeper... (0) -> (1)
   [junit4]   2> 397207 INFO  (zkCallback-993-thread-1) [    ] o.a.s.c.c.ZkStateReader Updated live nodes from ZooKeeper... (0) -> (1)
   [junit4]   2> 397208 INFO  (zkCallback-990-thread-1) [    ] o.a.s.c.c.ZkStateReader Updated live nodes from ZooKeeper... (0) -> (1)
   [junit4]   2> 397208 INFO  (zkCallback-991-thread-1) [    ] o.a.s.c.c.ZkStateReader Updated live nodes from ZooKeeper... (0) -> (1)
   [junit4]   2> 397209 INFO  (zkCallback-990-thread-1) [    ] o.a.s.c.c.ZkStateReader Updated live nodes from ZooKeeper... (1) -> (3)
   [junit4]   2> 397209 INFO  (zkCallback-992-thread-1) [    ] o.a.s.c.c.ZkStateReader Updated live nodes from ZooKeeper... (1) -> (3)
   [junit4]   2> 397209 INFO  (zkCallback-991-thread-1) [    ] o.a.s.c.c.ZkStateReader Updated live nodes from ZooKeeper... (1) -> (3)
   [junit4]   2> 397210 INFO  (zkCallback-993-thread-1) [    ] o.a.s.c.c.ZkStateReader Updated live nodes from ZooKeeper... (1) -> (3)
   [junit4]   2> 397245 INFO  (jetty-launcher-971-thread-2) [    ] o.a.s.c.ZkController Register node as live in ZooKeeper:/live_nodes/127.0.0.1:60392_solr
   [junit4]   2> 397248 INFO  (jetty-launcher-971-thread-3) [    ] o.a.s.m.r.SolrJmxReporter JMX monitoring for 'solr.node' (registry 'solr.node') enabled at server: com.sun.jmx.mbeanserver.JmxMBeanServer@480dc510
   [junit4]   2> 397258 INFO  (zkCallback-993-thread-1) [    ] o.a.s.c.c.ZkStateReader Updated live nodes from ZooKeeper... (3) -> (4)
   [junit4]   2> 397259 INFO  (jetty-launcher-971-thread-3) [    ] o.a.s.m.r.SolrJmxReporter JMX monitoring for 'solr.jvm' (registry 'solr.jvm') enabled at server: com.sun.jmx.mbeanserver.JmxMBeanServer@480dc510
   [junit4]   2> 397259 INFO  (jetty-launcher-971-thread-3) [    ] o.a.s.m.r.SolrJmxReporter JMX monitoring for 'solr.jetty' (registry 'solr.jetty') enabled at server: com.sun.jmx.mbeanserver.JmxMBeanServer@480dc510
   [junit4]   2> 397260 INFO  (jetty-launcher-971-thread-3) [    ] o.a.s.c.CorePropertiesLocator Found 0 core definitions underneath /Users/jenkins/workspace/Lucene-Solr-7.x-MacOSX/solr/build/solr-core/test/J1/temp/solr.cloud.CollectionsAPIDistributedZkTest_10DF767CA6D2627-001/tempDir-001/node3
   [junit4]   2> 397265 INFO  (zkCallback-990-thread-1) [    ] o.a.s.c.c.ZkStateReader Updated live nodes from ZooKeeper... (3) -> (4)
   [junit4]   2> 397265 INFO  (zkCallback-991-thread-1) [    ] o.a.s.c.c.ZkStateReader Updated live nodes from ZooKeeper... (3) -> (4)
   [junit4]   2> 397265 INFO  (zkCallback-992-thread-1) [    ] o.a.s.c.c.ZkStateReader Updated live nodes from ZooKeeper... (3) -> (4)
   [junit4]   2> 397305 INFO  (jetty-launcher-971-thread-1) [    ] o.a.s.m.r.SolrJmxReporter JMX monitoring for 'solr.node' (registry 'solr.node') enabled at server: com.sun.jmx.mbeanserver.JmxMBeanServer@480dc510
   [junit4]   2> 397309 INFO  (jetty-launcher-971-thread-4) [    ] o.a.s.m.r.SolrJmxReporter JMX monitoring for 'solr.node' (registry 'solr.node') enabled at server: com.sun.jmx.mbeanserver.JmxMBeanServer@480dc510
   [junit4]   2> 397373 INFO  (jetty-launcher-971-thread-1) [    ] o.a.s.m.r.SolrJmxReporter JMX monitoring for 'solr.jvm' (registry 'solr.jvm') enabled at server: com.sun.jmx.mbeanserver.JmxMBeanServer@480dc510
   [junit4]   2> 397373 INFO  (jetty-launcher-971-thread-1) [    ] o.a.s.m.r.SolrJmxReporter JMX monitoring for 'solr.jetty' (registry 'solr.jetty') enabled at server: com.sun.jmx.mbeanserver.JmxMBeanServer@480dc510
   [junit4]   2> 397379 INFO  (jetty-launcher-971-thread-4) [    ] o.a.s.m.r.SolrJmxReporter JMX monitoring for 'solr.jvm' (registry 'solr.jvm') enabled at server: com.sun.jmx.mbeanserver.JmxMBeanServer@480dc510
   [junit4]   2> 397379 INFO  (jetty-launcher-971-thread-4) [    ] o.a.s.m.r.SolrJmxReporter JMX monitoring for 'solr.jetty' (registry 'solr.jetty') enabled at server: com.sun.jmx.mbeanserver.JmxMBeanServer@480dc510
   [junit4]   2> 397379 INFO  (jetty-launcher-971-thread-1) [    ] o.a.s.c.CorePropertiesLocator Found 0 core definitions underneath /Users/jenkins/workspace/Lucene-Solr-7.x-MacOSX/solr/build/solr-core/test/J1/temp/solr.cloud.CollectionsAPIDistributedZkTest_10DF767CA6D2627-001/tempDir-001/node1
   [junit4]   2> 397380 INFO  (jetty-launcher-971-thread-4) [    ] o.a.s.c.CorePropertiesLocator Found 0 core definitions underneath /Users/jenkins/workspace/Lucene-Solr-7.x-MacOSX/solr/build/solr-core/test/J1/temp/solr.cloud.CollectionsAPIDistributedZkTest_10DF767CA6D2627-001/tempDir-001/node4
   [junit4]   2> 397381 INFO  (jetty-launcher-971-thread-2) [    ] o.a.s.m.r.SolrJmxReporter JMX monitoring for 'solr.node' (registry 'solr.node') enabled at server: com.sun.jmx.mbeanserver.JmxMBeanServer@480dc510
   [junit4]   2> 397389 INFO  (jetty-launcher-971-thread-2) [    ] o.a.s.m.r.SolrJmxReporter JMX monitoring for 'solr.jvm' (registry 'solr.jvm') enabled at server: com.sun.jmx.mbeanserver.JmxMBeanServer@480dc510
   [junit4]   2> 397389 INFO  (jetty-launcher-971-thread-2) [    ] o.a.s.m.r.SolrJmxReporter JMX monitoring for 'solr.jetty' (registry 'solr.jetty') enabled at server: com.sun.jmx.mbeanserver.JmxMBeanServer@480dc510
   [junit4]   2> 397391 INFO  (jetty-launcher-971-thread-2) [    ] o.a.s.c.CorePropertiesLocator Found 0 core definitions underneath /Users/jenkins/workspace/Lucene-Solr-7.x-MacOSX/solr/build/solr-core/test/J1/temp/solr.cloud.CollectionsAPIDistributedZkTest_10DF767CA6D2627-001/tempDir-001/node2
   [junit4]   2> 397472 INFO  (SUITE-CollectionsAPIDistributedZkTest-seed#[10DF767CA6D2627]-worker) [    ] o.a.s.c.c.ZkStateReader Updated live nodes from ZooKeeper... (0) -> (4)
   [junit4]   2> 397473 INFO  (SUITE-CollectionsAPIDistributedZkTest-seed#[10DF767CA6D2627]-worker) [    ] o.a.s.c.s.i.ZkClientClusterStateProvider Cluster at 127.0.0.1:60389/solr ready
   [junit4]   2> 397507 INFO  (TEST-CollectionsAPIDistributedZkTest.testDeleteNonExistentCollection-seed#[10DF767CA6D2627]) [    ] o.a.s.SolrTestCaseJ4 ###Starting testDeleteNonExistentCollection
   [junit4]   2> 397509 INFO  (TEST-CollectionsAPIDistributedZkTest.testDeleteNonExistentCollection-seed#[10DF767CA6D2627]) [    ] o.a.s.c.c.ZkStateReader Updated live nodes from ZooKeeper... (0) -> (4)
   [junit4]   2> 397513 INFO  (qtp212296285-5391) [    ] o.a.s.h.a.CollectionsHandler Invoked Collection Action :delete with params name=unknown_collection&action=DELETE&wt=javabin&version=2 and sendToOCPQueue=true
   [junit4]   2> 397517 INFO  (OverseerThreadFactory-2510-thread-1) [    ] o.a.s.c.OverseerCollectionMessageHandler Executing Collection Cmd : action=UNLOAD&deleteInstanceDir=true&deleteDataDir=true
   [junit4]   2> 397517 ERROR (OverseerThreadFactory-2510-thread-1) [    ] o.a.s.c.OverseerCollectionMessageHandler Collection: unknown_collection operation: delete failed:org.apache.solr.common.SolrException: Could not find collection : unknown_collection
   [junit4]   2> 	at org.apache.solr.common.cloud.ClusterState.getCollection(ClusterState.java:109)
   [junit4]   2> 	at org.apache.solr.cloud.OverseerCollectionMessageHandler.collectionCmd(OverseerCollectionMessageHandler.java:796)
   [junit4]   2> 	at org.apache.solr.cloud.DeleteCollectionCmd.call(DeleteCollectionCmd.java:88)
   [junit4]   2> 	at org.apache.solr.cloud.OverseerCollectionMessageHandler.processMessage(OverseerCollectionMessageHandler.java:228)
   [junit4]   2> 	at org.apache.solr.cloud.OverseerTaskProcessor$Runner.run(OverseerTaskProcessor.java:464)
   [junit4]   2> 	at org.apache.solr.common.util.ExecutorUtil$MDCAwareThreadPoolExecutor.lambda$execute$0(ExecutorUtil.java:188)
   [junit4]   2> 	at java.base/java.util.concurrent.ThreadPoolExecutor.runWorker(ThreadPoolExecutor.java:1167)
   [junit4]   2> 	at java.base/java.util.concurrent.ThreadPoolExecutor$Worker.run(ThreadPoolExecutor.java:641)
   [junit4]   2> 	at java.base/java.lang.Thread.run(Thread.java:844)
   [junit4]   2> 
   [junit4]   2> 397526 INFO  (qtp212296285-5391) [    ] o.a.s.s.HttpSolrCall [admin] webapp=null path=/admin/collections params={name=unknown_collection&action=DELETE&wt=javabin&version=2} status=400 QTime=13
   [junit4]   2> 397528 INFO  (qtp212296285-5392) [    ] o.a.s.h.a.CollectionsHandler Invoked Collection Action :create with params replicationFactor=2&collection.configName=conf&name=acollectionafterbaddelete&nrtReplicas=2&action=CREATE&numShards=1&wt=javabin&version=2 and sendToOCPQueue=true
   [junit4]   2> 397531 INFO  (OverseerThreadFactory-2510-thread-2) [    ] o.a.s.c.CreateCollectionCmd Create collection acollectionafterbaddelete
   [junit4]   2> 397531 INFO  (OverseerCollectionConfigSetProcessor-98750756019109897-127.0.0.1:60392_solr-n_0000000000) [    ] o.a.s.c.OverseerTaskQueue Response ZK path: /overseer/collection-queue-work/qnr-0000000000 doesn't exist.  Requestor may have disconnected from ZooKeeper
   [junit4]   2> 397664 INFO  (OverseerStateUpdate-98750756019109897-127.0.0.1:60392_solr-n_0000000000) [    ] o.a.s.c.o.SliceMutator createReplica() {
   [junit4]   2>   "operation":"ADDREPLICA",
   [junit4]   2>   "collection":"acollectionafterbaddelete",
   [junit4]   2>   "shard":"shard1",
   [junit4]   2>   "core":"acollectionafterbaddelete_shard1_replica_n1",
   [junit4]   2>   "state":"down",
   [junit4]   2>   "base_url":"http://127.0.0.1:60391/solr",
   [junit4]   2>   "type":"NRT"} 
   [junit4]   2> 397671 INFO  (OverseerStateUpdate-98750756019109897-127.0.0.1:60392_solr-n_0000000000) [    ] o.a.s.c.o.SliceMutator createReplica() {
   [junit4]   2>   "operation":"ADDREPLICA",
   [junit4]   2>   "collection":"acollectionafterbaddelete",
   [junit4]   2>   "shard":"shard1",
   [junit4]   2>   "core":"acollectionafterbaddelete_shard1_replica_n2",
   [junit4]   2>   "state":"down",
   [junit4]   2>   "base_url":"http://127.0.0.1:60396/solr",
   [junit4]   2>   "type":"NRT"} 
   [junit4]   2> 397901 INFO  (qtp593446520-5383) [    ] o.a.s.h.a.CoreAdminOperation core create command qt=/admin/cores&coreNodeName=core_node3&collection.configName=conf&newCollection=true&name=acollectionafterbaddelete_shard1_replica_n1&action=CREATE&numShards=1&collection=acollectionafterbaddelete&shard=shard1&wt=javabin&version=2&replicaType=NRT
   [junit4]   2> 397901 INFO  (qtp12545163-5409) [    ] o.a.s.h.a.CoreAdminOperation core create command qt=/admin/cores&coreNodeName=core_node4&collection.configName=conf&newCollection=true&name=acollectionafterbaddelete_shard1_replica_n2&action=CREATE&numShards=1&collection=acollectionafterbaddelete&shard=shard1&wt=javabin&version=2&replicaType=NRT
   [junit4]   2> 397901 INFO  (qtp593446520-5383) [    ] o.a.s.c.TransientSolrCoreCacheDefault Allocating transient cache for 2147483647 transient cores
   [junit4]   2> 397901 INFO  (qtp12545163-5409) [    ] o.a.s.c.TransientSolrCoreCacheDefault Allocating transient cache for 2147483647 transient cores
   [junit4]   2> 398030 INFO  (zkCallback-992-thread-1) [    ] o.a.s.c.c.ZkStateReader A cluster state change: [WatchedEvent state:SyncConnected type:NodeDataChanged path:/collections/acollectionafterbaddelete/state.json] for collection [acollectionafterbaddelete] has occurred - updating... (live nodes size: [4])
   [junit4]   2> 398030 INFO  (zkCallback-991-thread-1) [    ] o.a.s.c.c.ZkStateReader A cluster state change: [WatchedEvent state:SyncConnected type:NodeDataChanged path:/collections/acollectionafterbaddelete/state.json] for collection [acollectionafterbaddelete] has occurred - updating... (live nodes size: [4])
   [junit4]   2> 398030 INFO  (zkCallback-992-thread-2) [    ] o.a.s.c.c.ZkStateReader A cluster state change: [WatchedEvent state:SyncConnected type:NodeDataChanged path:/collections/acollectionafterbaddelete/state.json] for collection [acollectionafterbaddelete] has occurred - updating... (live nodes size: [4])
   [junit4]   2> 398031 INFO  (zkCallback-991-thread-2) [    ] o.a.s.c.c.ZkStateReader A cluster state change: [WatchedEvent state:SyncConnected type:NodeDataChanged path:/collections/acollectionafterbaddelete/state.json] for collection [acollectionafterbaddelete] has occurred - updating... (live nodes size: [4])
   [junit4]   2> 398928 INFO  (qtp12545163-5409) [    ] o.a.s.c.SolrConfig Using Lucene MatchVersion: 7.1.0
   [junit4]   2> 398928 INFO  (qtp593446520-5383) [    ] o.a.s.c.SolrConfig Using Lucene MatchVersion: 7.1.0
   [junit4]   2> 398942 INFO  (qtp593446520-5383) [    ] o.a.s.s.IndexSchema [acollectionafterbaddelete_shard1_replica_n1] Schema name=minimal
   [junit4]   2> 398942 INFO  (qtp12545163-5409) [    ] o.a.s.s.IndexSchema [acollectionafterbaddelete_shard1_replica_n2] Schema name=minimal
   [junit4]   2> 398944 INFO  (qtp12545163-5409) [    ] o.a.s.s.IndexSchema Loaded schema minimal/1.1 with uniqueid field id
   [junit4]   2> 398944 INFO  (qtp593446520-5383) [    ] o.a.s.s.IndexSchema Loaded schema minimal/1.1 with uniqueid field id
   [junit4]   2> 398944 INFO  (qtp12545163-5409) [    ] o.a.s.c.CoreContainer Creating SolrCore 'acollectionafterbaddelete_shard1_replica_n2' using configuration from collection acollectionafterbaddelete, trusted=true
   [junit4]   2> 398944 INFO  (qtp593446520-5383) [    ] o.a.s.c.CoreContainer Creating SolrCore 'acollectionafterbaddelete_shard1_replica_n1' using configuration from collection acollectionafterbaddelete, trusted=true
   [junit4]   2> 398945 INFO  (qtp12545163-5409) [    ] o.a.s.m.r.SolrJmxReporter JMX monitoring for 'solr.core.acollectionafterbaddelete.shard1.replica_n2' (registry 'solr.core.acollectionafterbaddelete.shard1.replica_n2') enabled at server: com.sun.jmx.mbeanserver.JmxMBeanServer@480dc510
   [junit4]   2> 398945 INFO  (qtp593446520-5383) [    ] o.a.s.m.r.SolrJmxReporter JMX monitoring for 'solr.core.acollectionafterbaddelete.shard1.replica_n1' (registry 'solr.core.acollectionafterbaddelete.shard1.replica_n1') enabled at server: com.sun.jmx.mbeanserver.JmxMBeanServer@480dc510
   [junit4]   2> 398945 INFO  (qtp12545163-5409) [    ] o.a.s.c.SolrCore solr.RecoveryStrategy.Builder
   [junit4]   2> 398945 INFO  (qtp12545163-5409) [    ] o.a.s.c.SolrCore [[acollectionafterbaddelete_shard1_replica_n2] ] Opening new SolrCore at [/Users/jenkins/workspace/Lucene-Solr-7.x-MacOSX/solr/build/solr-core/test/J1/temp/solr.cloud.CollectionsAPIDistributedZkTest_10DF767CA6D2627-001/tempDir-001/node3/acollectionafterbaddelete_shard1_replica_n2], dataDir=[/Users/jenkins/workspace/Lucene-Solr-7.x-MacOSX/solr/build/solr-core/test/J1/temp/solr.cloud.CollectionsAPIDistributedZkTest_10DF767CA6D2627-001/tempDir-001/node3/acollectionafterbaddelete_shard1_replica_n2/data/]
   [junit4]   2> 398945 INFO  (qtp593446520-5383) [    ] o.a.s.c.SolrCore solr.RecoveryStrategy.Builder
   [junit4]   2> 398946 INFO  (qtp593446520-5383) [    ] o.a.s.c.SolrCore [[acollectionafterbaddelete_shard1_replica_n1] ] Opening new SolrCore at [/Users/jenkins/workspace/Lucene-Solr-7.x-MacOSX/solr/build/solr-core/test/J1/temp/solr.cloud.CollectionsAPIDistributedZkTest_10DF767CA6D2627-001/tempDir-001/node1/acollectionafterbaddelete_shard1_replica_n1], dataDir=[/Users/jenkins/workspace/Lucene-Solr-7.x-MacOSX/solr/build/solr-core/test/J1/temp/solr.cloud.CollectionsAPIDistributedZkTest_10DF767CA6D2627-001/tempDir-001/node1/acollectionafterbaddelete_shard1_replica_n1/data/]
   [junit4]   2> 398995 INFO  (qtp593446520-5383) [    ] o.a.s.u.UpdateHandler Using UpdateLog implementation: org.apache.solr.update.UpdateLog
   [junit4]   2> 398995 INFO  (qtp12545163-5409) [    ] o.a.s.u.UpdateHandler Using UpdateLog implementation: org.apache.solr.update.UpdateLog
   [junit4]   2> 398995 INFO  (qtp12545163-5409) [    ] o.a.s.u.UpdateLog Initializing UpdateLog: dataDir=null defaultSyncLevel=FLUSH numRecordsToKeep=100 maxNumLogsToKeep=10 numVersionBuckets=65536
   [junit4]   2> 398995 INFO  (qtp593446520-5383) [    ] o.a.s.u.UpdateLog Initializing UpdateLog: dataDir=null defaultSyncLevel=FLUSH numRecordsToKeep=100 maxNumLogsToKeep=10 numVersionBuckets=65536
   [junit4]   2> 399002 INFO  (qtp12545163-5409) [    ] o.a.s.u.CommitTracker Hard AutoCommit: disabled
   [junit4]   2> 399002 INFO  (qtp12545163-5409) [    ] o.a.s.u.CommitTracker Soft AutoCommit: disabled
   [junit4]   2> 399003 INFO  (qtp593446520-5383) [    ] o.a.s.u.CommitTracker Hard AutoCommit: disabled
   [junit4]   2> 399003 INFO  (qtp593446520-5383) [    ] o.a.s.u.CommitTracker Soft AutoCommit: disabled
   [junit4]   2> 399004 INFO  (qtp12545163-5409) [    ] o.a.s.s.SolrIndexSearcher Opening [Searcher@36ec3b51[acollectionafterbaddelete_shard1_replica_n2] main]
   [junit4]   2> 399004 INFO  (qtp593446520-5383) [    ] o.a.s.s.SolrIndexSearcher Opening [Searcher@7dbf007a[acollectionafterbaddelete_shard1_replica_n1] main]
   [junit4]   2> 399005 INFO  (qtp12545163-5409) [    ] o.a.s.r.ManagedResourceStorage Configured ZooKeeperStorageIO with znodeBase: /configs/conf
   [junit4]   2> 399005 INFO  (qtp593446520-5383) [    ] o.a.s.r.ManagedResourceStorage Configured ZooKeeperStorageIO with znodeBase: /configs/conf
   [junit4]   2> 399006 INFO  (qtp12545163-5409) [    ] o.a.s.r.ManagedResourceStorage Loaded null at path _rest_managed.json using ZooKeeperStorageIO:path=/configs/conf
   [junit4]   2> 399006 INFO  (qtp593446520-5383) [    ] o.a.s.r.ManagedResourceStorage Loaded null at path _rest_managed.json using ZooKeeperStorageIO:path=/configs/conf
   [junit4]   2> 399006 INFO  (qtp12545163-5409) [    ] o.a.s.h.ReplicationHandler Commits will be reserved for 10000ms.
   [junit4]   2> 399006 INFO  (qtp593446520-5383) [    ] o.a.s.h.ReplicationHandler Commits will be reserved for 10000ms.
   [junit4]   2> 399007 INFO  (qtp593446520-5383) [    ] o.a.s.u.UpdateLog Could not find max version in index or recent updates, using new clock 1580012098535030784
   [junit4]   2> 399007 INFO  (qtp12545163-5409) [    ] o.a.s.u.UpdateLog Could not find max version in index or recent updates, using new clock 1580012098535030784
   [junit4]   2> 399007 INFO  (searcherExecutor-2518-thread-1) [    ] o.a.s.c.SolrCore [acollectionafterbaddelete_shard1_replica_n2] Registered new searcher Searcher@36ec3b51[acollectionafterbaddelete_shard1_replica_n2] main{ExitableDirectoryReader(UninvertingDirectoryReader())}
   [junit4]   2> 399008 INFO  (searcherExecutor-2519-thread-1) [    ] o.a.s.c.SolrCore [acollectionafterbaddelete_shard1_replica_n1] Registered new searcher Searcher@7dbf007a[acollectionafterbaddelete_shard1_replica_n1] main{ExitableDirectoryReader(UninvertingDirectoryReader())}
   [junit4]   2> 399014 INFO  (qtp12545163-5409) [    ] o.a.s.c.ShardLeaderElectionContext Enough replicas found to continue.
   [junit4]   2> 399014 INFO  (qtp12545163-5409) [    ] o.a.s.c.ShardLeaderElectionContext I may be the new leader - try and sync
   [junit4]   2> 399014 INFO  (qtp12545163-5409) [    ] o.a.s.c.SyncStrategy Sync replicas to http://127.0.0.1:60396/solr/acollectionafterbaddelete_shard1_replica_n2/
   [junit4]   2> 399014 INFO  (qtp12545163-5409) [    ] o.a.s.u.PeerSync PeerSync: core=acollectionafterbaddelete_shard1_replica_n2 url=http://127.0.0.1:60396/solr START replicas=[http://127.0.0.1:60391/solr/acollectionafterbaddelete_shard1_replica_n1/] nUpdates=100
   [junit4]   2> 399017 INFO  (qtp593446520-5385) [    ] o.a.s.c.S.Request [acollectionafterbaddelete_shard1_replica_n1]  webapp=/solr path=/get params={distrib=false&qt=/get&fingerprint=false&getVersions=100&wt=javabin&version=2} status=0 QTime=0
   [junit4]   2> 399129 INFO  (zkCallback-991-thread-2) [    ] o.a.s.c.c.ZkStateReader A cluster state change: [WatchedEvent state:SyncConnected type:NodeDataChanged path:/collections/acollectionafterbaddelete/state.json] for collection [acollectionafterbaddelete] has occurred - updating... (live nodes size: [4])
   [junit4]   2> 399129 INFO  (zkCallback-992-thread-1) [    ] o.a.s.c.c.ZkStateReader A cluster state change: [WatchedEvent state:SyncConnected type:NodeDataChanged path:/collections/acollectionafterbaddelete/state.json] for collection [acollectionafterbaddelete] has occurred - updating... (live nodes size: [4])
   [junit4]   2> 399129 INFO  (zkCallback-991-thread-1) [    ] o.a.s.c.c.ZkStateReader A cluster state change: [WatchedEvent state:SyncConnected type:NodeDataChanged path:/collections/acollectionafterbaddelete/state.json] for collection [acollectionafterbaddelete] has occurred - updating... (live nodes size: [4])
   [junit4]   2> 399129 INFO  (zkCallback-992-thread-2) [    ] o.a.s.c.c.ZkStateReader A cluster state change: [WatchedEvent state:SyncConnected type:NodeDataChanged path:/collections/acollectionafterbaddelete/state.json] for collection [acollectionafterbaddelete] has occurred - updating... (live nodes size: [4])
   [junit4]   2> 399325 INFO  (qtp12545163-5409) [    ] o.a.s.u.PeerSync PeerSync: core=acollectionafterbaddelete_shard1_replica_n2 url=http://127.0.0.1:60396/solr DONE.  We have no versions.  sync failed.
   [junit4]   2> 399325 INFO  (qtp12545163-5409) [    ] o.a.s.c.SyncStrategy Leader's attempt to sync with shard failed, moving to the next candidate
   [junit4]   2> 399325 INFO  (qtp12545163-5409) [    ] o.a.s.c.ShardLeaderElectionContext We failed sync, but we have no versions - we can't sync in that case - we were active before, so become leader anyway
   [junit4]   2> 399325 INFO  (qtp12545163-5409) [    ] o.a.s.c.ShardLeaderElectionContext Found all replicas participating in election, clear LIR
   [junit4]   2> 399336 INFO  (qtp12545163-5409) [    ] o.a.s.c.ShardLeaderElectionContext I am the new leader: http://127.0.0.1:60396/solr/acollectionafterbaddelete_shard1_replica_n2/ shard1
   [junit4]   2> 399452 INFO  (zkCallback-991-thread-1) [    ] o.a.s.c.c.ZkStateReader A cluster state change: [WatchedEvent state:SyncConnected type:NodeDataChanged path:/collections/acollectionafterbaddelete/state.json] for collection [acollectionafterbaddelete] has occurred - updating... (live nodes size: [4])
   [junit4]   2> 399452 INFO  (zkCallback-992-thread-2) [    ] o.a.s.c.c.ZkStateReader A cluster state change: [WatchedEvent state:SyncConnected type:NodeDataChanged path:/collections/acollectionafterbaddelete/state.json] for collection [acollectionafterbaddelete] has occurred - updating... (live nodes size: [4])
   [junit4]   2> 399452 INFO  (zkCallback-992-thread-1) [    ] o.a.s.c.c.ZkStateReader A cluster state change: [WatchedEvent state:SyncConnected type:NodeDataChanged path:/collections/acollectionafterbaddelete/state.json] for collection [acollectionafterbaddelete] has occurred - updating... (live nodes size: [4])
   [junit4]   2> 399452 INFO  (zkCallback-991-thread-2) [    ] o.a.s.c.c.ZkStateReader A cluster state change: [WatchedEvent state:SyncConnected type:NodeDataChanged path:/collections/acollectionafterbaddelete/state.json] for collection [acollectionafterbaddelete] has occurred - updating... (live nodes size: [4])
   [junit4]   2> 399510 INFO  (qtp12545163-5409) [    ] o.a.s.c.ZkController I am the leader, no recovery necessary
   [junit4]   2> 399514 INFO  (qtp12545163-5409) [    ] o.a.s.s.HttpSolrCall [admin] webapp=null path=/admin/cores params={qt=/admin/cores&coreNodeName=core_node4&collection.configName=conf&newCollection=true&name=acollectionafterbaddelete_shard1_replica_n2&action=CREATE&numShards=1&collection=acollectionafterbaddelete&shard=shard1&wt=javabin&version=2&replicaType=NRT} status=0 QTime=1615
   [junit4]   2> 399631 INFO  (zkCallback-991-thread-2) [    ] o.a.s.c.c.ZkStateReader A cluster state change: [WatchedEvent state:SyncConnected type:NodeDataChanged path:/collections/acollectionafterbaddelete/state.json] for collection [acollectionafterbaddelete] has occurred - updating... (live nodes size: [4])
   [junit4]   2> 399631 INFO  (zkCallback-992-thread-2) [    ] o.a.s.c.c.ZkStateReader A cluster state change: [WatchedEvent state:SyncConnected type:NodeDataChanged path:/collections/acollectionafterbaddelete/state.json] for collection [acollectionafterbaddelete] has occurred - updating... (live nodes size: [4])
   [junit4]   2> 399631 INFO  (zkCallback-991-thread-1) [    ] o.a.s.c.c.ZkStateReader A cluster state change: [WatchedEvent state:SyncConnected type:NodeDataChanged path:/collections/acollectionafterbaddelete/state.json] for collection [acollectionafterbaddelete] has occurred - updating... (live nodes size: [4])
   [junit4]   2> 399631 INFO  (zkCallback-992-thread-1) [    ] o.a.s.c.c.ZkStateReader A cluster state change: [WatchedEvent state:SyncConnected type:NodeDataChanged path:/collections/acollectionafterbaddelete/state.json] for collection [acollectionafterbaddelete] has occurred - updating... (live nodes size: [4])
   [junit4]   2> 400030 INFO  (qtp593446520-5383) [    ] o.a.s.s.HttpSolrCall [admin] webapp=null path=/admin/cores params={qt=/admin/cores&coreNodeName=core_node3&collection.configName=conf&newCollection=true&name=acollectionafterbaddelete_shard1_replica_n1&action=CREATE&numShards=1&collection=acollectionafterbaddelete&shard=shard1&wt=javabin&version=2&replicaType=NRT} status=0 QTime=2131
   [junit4]   2> 400036 INFO  (qtp212296285-5392) [    ] o.a.s.h.a.CollectionsHandler Wait for new collection to be active for at most 30 seconds. Check all shard replicas
   [junit4]   2> 400140 INFO  (zkCallback-992-thread-2) [    ] o.a.s.c.c.ZkStateReader A cluster state change: [WatchedEvent state:SyncConnected type:NodeDataChanged path:/collections/acollectionafterbaddelete/state.json] for collection [acollectionafterbaddelete] has occurred - updating... (live nodes size: [4])
   [junit4]   2> 400140 INFO  (zkCallback-991-thread-1) [    ] o.a.s.c.c.ZkStateReader A cluster state change: [WatchedEvent state:SyncConnected type:NodeDataChanged path:/collections/acollectionafterbaddelete/state.json] for collection [acollectionafterbaddelete] has occurred - updating... (live nodes size: [4])
   [junit4]   2> 400140 INFO  (zkCallback-991-thread-2) [    ] o.a.s.c.c.ZkStateReader A cluster state change: [WatchedEvent state:SyncConnected type:NodeDataChanged path:/collections/acollectionafterbaddelete/state.json] for collection [acollectionafterbaddelete] has occurred - updating... (live nodes size: [4])
   [junit4]   2> 400140 INFO  (zkCallback-992-thread-1) [    ] o.a.s.c.c.ZkStateReader A cluster state change: [WatchedEvent state:SyncConnected type:NodeDataChanged path:/collections/acollectionafterbaddelete/state.json] for collection [acollectionafterbaddelete] has occurred - updating... (live nodes size: [4])
   [junit4]   2> 401048 INFO  (qtp212296285-5392) [    ] o.a.s.s.HttpSolrCall [admin] webapp=null path=/admin/collections params={replicationFactor=2&collection.configName=conf&name=acollectionafterbaddelete&nrtReplicas=2&action=CREATE&numShards=1&wt=javabin&version=2} status=0 QTime=3520
   [junit4]   2> 401051 INFO  (TEST-CollectionsAPIDistributedZkTest.testDeleteNonExistentCollection-seed#[10DF767CA6D2627]) [    ] o.a.s.SolrTestCaseJ4 ###Ending testDeleteNonExistentCollection
   [junit4]   2> 401102 INFO  (TEST-CollectionsAPIDistributedZkTest.testBadActionNames-seed#[10DF767CA6D2627]) [    ] o.a.s.SolrTestCaseJ4 ###Starting testBadActionNames
   [junit4]   2> 401105 INFO  (TEST-CollectionsAPIDistributedZkTest.testBadActionNames-seed#[10DF767CA6D2627]) [    ] o.a.s.c.c.ZkStateReader Updated live nodes from ZooKeeper... (0) -> (4)
   [junit4]   2> 401107 INFO  (qtp212296285-5393) [    ] o.a.s.h.a.CollectionsHandler Invoked Collection Action :delete with params name=acollectionafterbaddelete&action=DELETE&wt=javabin&version=2 and sendToOCPQueue=true
   [junit4]   2> 401111 INFO  (OverseerCollectionConfigSetProcessor-98750756019109897-127.0.0.1:60392_solr-n_0000000000) [    ] o.a.s.c.OverseerTaskQueue Response ZK path: /overseer/collection-queue-work/qnr-0000000002 doesn't exist.  Requestor may have disconnected from ZooKeeper
   [junit4]   2> 401112 INFO  (OverseerThreadFactory-2510-thread-3) [    ] o.a.s.c.OverseerCollectionMessageHandler Executing Collection Cmd : action=UNLOAD&deleteInstanceDir=true&deleteDataDir=true
   [junit4]   2> 401113 INFO  (qtp12545163-5410) [    ] o.a.s.m.SolrMetricManager Closing metric reporters for registry=solr.core.acollectionafterbaddelete.shard1.replica_n2, tag=null
   [junit4]   2> 401113 INFO  (qtp12545163-5410) [    ] o.a.s.m.r.SolrJmxReporter Closing reporter [org.apache.solr.metrics.reporters.SolrJmxReporter@342c4443: rootName = null, domain = solr.core.acollectionafterbaddelete.shard1.replica_n2, service url = null, agent id = null] for registry solr.core.acollectionafterbaddelete.shard1.replica_n2 / com.codahale.metrics.MetricRegistry@5f33973e
   [junit4]   2> 401113 INFO  (qtp593446520-5386) [    ] o.a.s.m.SolrMetricManager Closing metric reporters for registry=solr.core.acollectionafterbaddelete.shard1.replica_n1, tag=null
   [junit4]   2> 401113 INFO  (qtp593446520-5386) [    ] o.a.s.m.r.SolrJmxReporter Closing reporter [org.apache.solr.metrics.reporters.SolrJmxReporter@7156d52f: rootName = null, domain = solr.core.acollectionafterbaddelete.shard1.replica_n1, service url = null, agent id = null] for registry solr.core.acollectionafterbaddelete.shard1.replica_n1 / com.codahale.metrics.MetricRegistry@690c704b
   [junit4]   2> 401125 INFO  (qtp12545163-5410) [    ] o.a.s.c.SolrCore [acollectionafterbaddelete_shard1_replica_n2]  CLOSING SolrCore org.apache.solr.core.SolrCore@69289cd8
   [junit4]   2> 401125 INFO  (qtp12545163-5410) [    ] o.a.s.m.SolrMetricManager Closing metric reporters for registry=solr.core.acollectionafterbaddelete.shard1.replica_n2, tag=1764269272
   [junit4]   2> 401125 INFO  (qtp12545163-5410) [    ] o.a.s.m.SolrMetricManager Closing metric reporters for registry=solr.collection.acollectionafterbaddelete.shard1.leader, tag=1764269272
   [junit4]   2> 401125 INFO  (qtp593446520-5386) [    ] o.a.s.c.SolrCore [acollectionafterbaddelete_shard1_replica_n1]  CLOSING SolrCore org.apache.solr.core.SolrCore@f7671e2
   [junit4]   2> 401125 INFO  (qtp593446520-5386) [    ] o.a.s.m.SolrMetricManager Closing metric reporters for registry=solr.core.acollectionafterbaddelete.shard1.replica_n1, tag=259420642
   [junit4]   2> 401125 INFO  (qtp593446520-5386) [    ] o.a.s.m.SolrMetricManager Closing metric reporters for registry=solr.collection.acollectionafterbaddelete.shard1.leader, tag=259420642
   [junit4]   2> 401128 INFO  (qtp593446520-5386) [    ] o.a.s.c.ShardLeaderElectionContextBase No version found for ephemeral leader parent node, won't remove previous leader registration.
   [junit4]   2> 401129 INFO  (qtp593446520-5386) [    ] o.a.s.s.HttpSolrCall [admin] webapp=null path=/admin/cores params={deleteInstanceDir=true&core=acollectionafterbaddelete_shard1_replica_n1&qt=/admin/cores&deleteDataDir=true&action=UNLOAD&wt=javabin&version=2} status=0 QTime=16
   [junit4]   2> 401129 WARN  (zkCallback-991-thread-2) [    ] o.a.s.c.LeaderElector Our node is no longer in line to be leader
   [junit4]   2> 401130 INFO  (qtp12545163-5410) [    ] o.a.s.s.HttpSolrCall [admin] webapp=null path=/admin/cores params={deleteInstanceDir=true&core=acollectionafterbaddelete_shard1_replica_n2&qt=/admin/cores&deleteDataDir=true&action=UNLOAD&wt=javabin&version=2} status=0 QTime=17
   [junit4]   2> 401861 INFO  (qtp212296285-5393) [    ] o.a.s.s.HttpSolrCall [admin] webapp=null path=/admin/collections params={name=acollectionafterbaddelete&action=DELETE&wt=javabin&version=2} status=0 QTime=753
   [junit4]   2> 401863 ERROR (qtp212296285-5394) [    ] o.a.s.h.RequestHandlerBase org.apache.solr.common.SolrException: Unknown action: BADACTION
   [junit4]   2> 	at org.apache.solr.handler.admin.CollectionsHandler.handleRequestBody(CollectionsHandler.java:205)
   [junit4]   2> 	at org.apache.solr.handler.RequestHandlerBase.handleRequest(RequestHandlerBase.java:177)
   [junit4]   2> 	at org.apache.solr.servlet.HttpSolrCall.handleAdmin(HttpSolrCall.java:745)
   [junit4]   2> 	at org.apache.solr.servlet.HttpSolrCall.handleAdminRequest(HttpSolrCall.java:726)
   [junit4]   2> 	at org.apache.solr.servlet.HttpSolrCall.call(HttpSolrCall.java:507)
   [junit4]   2> 	at org.apache.solr.servlet.SolrDispatchFilter.doFilter(SolrDispatchFilter.java:382)
   [junit4]   2> 	at org.apache.solr.servlet.SolrDispatchFilter.doFilter(SolrDispatchFilter.java:326)
   [junit4]   2> 	at org.eclipse.jetty.servlet.ServletHandler$CachedChain.doFilter(ServletHandler.java:1759)
   [junit4]   2> 	at org.apache.solr.client.solrj.embedded.JettySolrRunner$DebugFilter.doFilter(JettySolrRunner.java:139)
   [junit4]   2> 	at org.eclipse.jetty.servlet.ServletHandler$CachedChain.doFilter(ServletHandler.java:1759)
   [junit4]   2> 	at org.eclipse.jetty.servlet.ServletHandler.doHandle(ServletHandler.java:582)
   [junit4]   2> 	at org.eclipse.jetty.server.session.SessionHandler.doHandle(SessionHandler.java:224)
   [junit4]   2> 	at org.eclipse.jetty.server.handler.ContextHandler.doHandle(ContextHandler.java:1180)
   [junit4]   2> 	at org.eclipse.jetty.servlet.ServletHandler.doScope(ServletHandler.java:512)
   [junit4]   2> 	at org.eclipse.jetty.server.session.SessionHandler.doScope(SessionHandler.java:185)
   [junit4]   2> 	at org.eclipse.jetty.server.handler.ContextHandler.doScope(ContextHandler.java:1112)
   [junit4]   2> 	at org.eclipse.jetty.server.handler.ScopedHandler.handle(ScopedHandler.java:141)
   [junit4]   2> 	at org.eclipse.jetty.server.handler.gzip.GzipHandler.handle(GzipHandler.java:493)
   [junit4]   2> 	at org.eclipse.jetty.server.handler.HandlerWrapper.handle(HandlerWrapper.java:134)
   [junit4]   2> 	at org.eclipse.jetty.server.Server.handle(Server.java:534)
   [junit4]   2> 	at org.eclipse.jetty.server.HttpChannel.handle(HttpChannel.java:320)
   [junit4]   2> 	at org.eclipse.jetty.server.HttpConnection.onFillable(HttpConnection.java:251)
   [junit4]   2> 	at org.eclipse.jetty.io.AbstractConnection$ReadCallback.succeeded(AbstractConnection.java:283)
   [junit4]   2> 	at org.eclipse.jetty.io.FillInterest.fillable(FillInterest.java:108)
   [junit4]   2> 	at org.eclipse.jetty.io.SelectChannelEndPoint$2.run(SelectChannelEndPoint.java:93)
   [junit4]   2> 	at org.eclipse.jetty.util.thread.strategy.ExecuteProduceConsume.executeProduceConsume(ExecuteProduceConsume.java:303)
   [junit4]   2> 	at org.eclipse.jetty.util.thread.strategy.ExecuteProduceConsume.produceConsume(ExecuteProduceConsume.java:148)
   [junit4]   2> 	at org.eclipse.jetty.util.thread.strategy.ExecuteProduceConsume.run(ExecuteProduceConsume.java:136)
   [junit4]   2> 	at org.eclipse.jetty.util.thread.QueuedThreadPool.runJob(QueuedThreadPool.java:671)
   [junit4]   2> 	at org.eclipse.jetty.util.thread.QueuedThreadPool$2.run(QueuedThreadPool.java:589)
   [junit4]   2> 	at java.base/java.lang.Thread.run(Thread.java:844)
   [junit4]   2> 
   [junit4]   2> 401864 INFO  (qtp212296285-5394) [    ] o.a.s.s.HttpSolrCall [admin] webapp=null path=/admin/collections params={name=badactioncollection&action=BADACTION&numShards=2&wt=javabin&version=2} status=400 QTime=1
   [junit4]   2> 401864 INFO  (TEST-CollectionsAPIDistributedZkTest.testBadActionNames-seed#[10DF767CA6D2627]) [    ] o.a.s.SolrTestCaseJ4 ###Ending testBadActionNames
   [junit4]   2> 401917 INFO  (TEST-CollectionsAPIDistributedZkTest.testCreateNodeSet-seed#[10DF767CA6D2627]) [    ] o.a.s.SolrTestCaseJ4 ###Starting testCreateNodeSet
   [junit4]   2> 401919 INFO  (TEST-CollectionsAPIDistributedZkTest.testCreateNodeSet-seed#[10DF767CA6D2627]) [    ] o.a.s.c.c.ZkStateReader Updated live nodes from ZooKeeper... (0) -> (4)
   [junit4]   2> 401921 INFO  (qtp212296285-5395) [    ] o.a.s.h.a.CollectionsHandler Invoked Collection Action :create with params replicationFactor=1&collection.configName=conf&name=nodeset_collection&nrtReplicas=1&action=CREATE&numShards=2&createNodeSet=http://127.0.0.1:60391/solr,http://127.0.0.1:60396/solr&wt=javabin&version=2 and sendToOCPQueue=true
   [junit4]   2> 401924 INFO  (OverseerThreadFactory-2510-thread-4) [    ] o.a.s.c.CreateCollectionCmd Create collection nodeset_collection
   [junit4]   2> 401925 INFO  (OverseerCollectionConfigSetProcessor-98750756019109897-127.0.0.1:60392_solr-n_0000000000) [    ] o.a.s.c.OverseerTaskQueue Response ZK path: /overseer/collection-queue-work/qnr-0000000004 doesn't exist.  Requestor may have disconnected from ZooKeeper
   [junit4]   2> 401925 WARN  (OverseerThreadFactory-2510-thread-4) [    ] o.a.s.c.CreateCollectionCmd It is unusual to create a collection (nodeset_collection) without cores.
   [junit4]   2> 402154 INFO  (qtp212296285-5395) [    ] o.a.s.h.a.CollectionsHandler Wait for new collection to be active for at most 30 seconds. Check all shard replicas
   [junit4]   2> 402155 INFO  (qtp212296285-5395) [    ] o.a.s.s.HttpSolrCall [admin] webapp=null path=/admin/collections params={replicationFactor=1&collection.configName=conf&name=nodeset_collection&nrtReplicas=1&action=CREATE&numShards=2&createNodeSet=http://127.0.0.1:60391/solr,http://127.0.0.1:60396/solr&wt=javabin&version=2} status=0 QTime=234
   [junit4]   2> 402156 INFO  (TEST-CollectionsAPIDistributedZkTest.testCreateNodeSet-seed#[10DF767CA6D2627]) [    ] o.a.s.SolrTestCaseJ4 ###Ending testCreateNodeSet
   [junit4]   2> 402210 INFO  (TEST-CollectionsAPIDistributedZkTest.testCollectionReload-seed#[10DF767CA6D2627]) [    ] o.a.s.SolrTestCaseJ4 ###Starting testCollectionReload
   [junit4]   2> 402212 INFO  (TEST-CollectionsAPIDistributedZkTest.testCollectionReload-seed#[10DF767CA6D2627]) [    ] o.a.s.c.c.ZkStateReader Updated live nodes from ZooKeeper... (0) -> (4)
   [junit4]   2> 402215 INFO  (qtp212296285-5397) [    ] o.a.s.h.a.CollectionsHandler Invoked Collection Action :delete with params name=nodeset_collection&action=DELETE&wt=javabin&version=2 and sendToOCPQueue=true
   [junit4]   2> 402219 INFO  (OverseerCollectionConfigSetProcessor-98750756019109897-127.0.0.1:60392_solr-n_0000000000) [    ] o.a.s.c.OverseerTaskQueue Response ZK path: /overseer/collection-queue-work/qnr-0000000006 doesn't exist.  Requestor may have disconnected from ZooKeeper
   [junit4]   2> 402219 INFO  (OverseerThreadFactory-2510-thread-5) [    ] o.a.s.c.OverseerCollectionMessageHandler Executing Collection Cmd : action=UNLOAD&deleteInstanceDir=true&deleteDataDir=true
   [junit4]   2> 402940 INFO  (qtp212296285-5397) [    ] o.a.s.s.HttpSolrCall [admin] webapp=null path=/admin/collections params={name=nodeset_collection&action=DELETE&wt=javabin&version=2} status=0 QTime=725
   [junit4]   2> 402941 INFO  (qtp212296285-5389) [    ] o.a.s.h.a.CollectionsHandler Invoked Collection Action :create with params replicationFactor=2&collection.configName=conf&name=reloaded_collection&nrtReplicas=2&action=CREATE&numShards=2&wt=javabin&version=2 and sendToOCPQueue=true
   [junit4]   2> 402947 INFO  (OverseerThreadFactory-2510-thread-5) [    ] o.a.s.c.CreateCollectionCmd Create collection reloaded_collection
   [junit4]   2> 402948 INFO  (OverseerCollectionConfigSetProcessor-98750756019109897-127.0.0.1:60392_solr-n_0000000000) [    ] o.a.s.c.OverseerTaskQueue Response ZK path: /overseer/collection-queue-work/qnr-0000000008 doesn't exist.  Requestor may have disconnected from ZooKeeper
   [junit4]   2> 403185 INFO  (OverseerStateUpdate-98750756019109897-127.0.0.1:60392_solr-n_0000000000) [    ] o.a.s.c.o.SliceMutator createReplica() {
   [junit4]   2>   "operation":"ADDREPLICA",
   [junit4]   2>   "collection":"reloaded_collection",
   [junit4]   2>   "shard":"shard1",
   [junit4]   2>   "core":"reloaded_collection_shard1_replica_n1",
   [junit4]   2>   "state":"down",
   [junit4]   2>   "base_url":"http://127.0.0.1:60391/solr",
   [junit4]   2>   "type":"NRT"} 
   [junit4]   2> 403193 INFO  (OverseerStateUpdate-98750756019109897-127.0.0.1:60392_solr-n_0000000000) [    ] o.a.s.c.o.SliceMutator createReplica() {
   [junit4]   2>   "operation":"ADDREPLICA",
   [junit4]   2>   "collection":"reloaded_collection",
   [junit4]   2>   "shard":"shard1",
   [junit4]   2>   "core":"reloaded_collection_shard1_replica_n2",
   [junit4]   2>   "state":"down",
   [junit4]   2>   "base_url":"http://127.0.0.1:60396/solr",
   [junit4]   2>   "type":"NRT"} 
   [junit4]   2> 403201 INFO  (OverseerStateUpdate-98750756019109897-127.0.0.1:60392_solr-n_0000000000) [    ] o.a.s.c.o.SliceMutator createReplica() {
   [junit4]   2>   "operation":"ADDREPLICA",
   [junit4]   2>   "collection":"reloaded_collection",
   [junit4]   2>   "shard":"shard2",
   [junit4]   2>   "core":"reloaded_collection_shard2_replica_n4",
   [junit4]   2>   "state":"down",
   [junit4]   2>   "base_url":"http://127.0.0.1:60393/solr",
   [junit4]   2>   "type":"NRT"} 
   [junit4]   2> 403210 INFO  (OverseerStateUpdate-98750756019109897-127.0.0.1:60392_solr-n_0000000000) [    ] o.a.s.c.o.SliceMutator createReplica() {
   [junit4]   2>   "operation":"ADDREPLICA",
   [junit4]   2>   "collection":"reloaded_collection",
   [junit4]   2>   "shard":"shard2",
   [junit4]   2>   "core":"reloaded_collection_shard2_replica_n6",
   [junit4]   2>   "state":"down",
   [junit4]   2>   "base_url":"http://127.0.0.1:60392/solr",
   [junit4]   2>   "type":"NRT"} 
   [junit4]   2> 403432 INFO  (qtp593446520-5387) [    ] o.a.s.h.a.CoreAdminOperation core create command qt=/admin/cores&coreNodeName=core_node3&collection.configName=conf&newCollection=true&name=reloaded_collection_shard1_replica_n1&action=CREATE&numShards=2&collection=reloaded_collection&shard=shard1&wt=javabin&version=2&replicaType=NRT
   [junit4]   2> 403433 INFO  (qtp12545163-5411) [    ] o.a.s.h.a.CoreAdminOperation core create command qt=/admin/cores&coreNodeName=core_node5

[...truncated too long message...]

cted output (verbatim) ----
   [junit4] Java HotSpot(TM) 64-Bit Server VM warning: Option UseConcMarkSweepGC was deprecated in version 9.0 and will likely be removed in a future release.
   [junit4] <<< JVM J1: EOF ----

[...truncated 889 lines...]
   [junit4] JVM J0: stderr was not empty, see: /Users/jenkins/workspace/Lucene-Solr-7.x-MacOSX/solr/build/solr-solrj/test/temp/junit4-J0-20171001_010519_21511861566247699600884.syserr
   [junit4] >>> JVM J0 emitted unexpected output (verbatim) ----
   [junit4] Java HotSpot(TM) 64-Bit Server VM warning: Option UseConcMarkSweepGC was deprecated in version 9.0 and will likely be removed in a future release.
   [junit4] <<< JVM J0: EOF ----

[...truncated 3 lines...]
   [junit4] JVM J1: stderr was not empty, see: /Users/jenkins/workspace/Lucene-Solr-7.x-MacOSX/solr/build/solr-solrj/test/temp/junit4-J1-20171001_010519_2159186930841279951737.syserr
   [junit4] >>> JVM J1 emitted unexpected output (verbatim) ----
   [junit4] Java HotSpot(TM) 64-Bit Server VM warning: Option UseConcMarkSweepGC was deprecated in version 9.0 and will likely be removed in a future release.
   [junit4] <<< JVM J1: EOF ----

[...truncated 1362 lines...]
   [junit4] JVM J1: stderr was not empty, see: /Users/jenkins/workspace/Lucene-Solr-7.x-MacOSX/solr/build/contrib/solr-analysis-extras/test/temp/junit4-J1-20171001_010957_47915857197940790480210.syserr
   [junit4] >>> JVM J1 emitted unexpected output (verbatim) ----
   [junit4] Java HotSpot(TM) 64-Bit Server VM warning: Option UseConcMarkSweepGC was deprecated in version 9.0 and will likely be removed in a future release.
   [junit4] <<< JVM J1: EOF ----

   [junit4] JVM J0: stderr was not empty, see: /Users/jenkins/workspace/Lucene-Solr-7.x-MacOSX/solr/build/contrib/solr-analysis-extras/test/temp/junit4-J0-20171001_010957_4795415826895859218066.syserr
   [junit4] >>> JVM J0 emitted unexpected output (verbatim) ----
   [junit4] Java HotSpot(TM) 64-Bit Server VM warning: Option UseConcMarkSweepGC was deprecated in version 9.0 and will likely be removed in a future release.
   [junit4] <<< JVM J0: EOF ----

[...truncated 601 lines...]
   [junit4] JVM J0: stderr was not empty, see: /Users/jenkins/workspace/Lucene-Solr-7.x-MacOSX/solr/build/contrib/solr-analytics/test/temp/junit4-J0-20171001_011012_0654741464483959013047.syserr
   [junit4] >>> JVM J0 emitted unexpected output (verbatim) ----
   [junit4] Java HotSpot(TM) 64-Bit Server VM warning: Option UseConcMarkSweepGC was deprecated in version 9.0 and will likely be removed in a future release.
   [junit4] <<< JVM J0: EOF ----

[...truncated 3 lines...]
   [junit4] JVM J1: stderr was not empty, see: /Users/jenkins/workspace/Lucene-Solr-7.x-MacOSX/solr/build/contrib/solr-analytics/test/temp/junit4-J1-20171001_011012_0658292220719604149693.syserr
   [junit4] >>> JVM J1 emitted unexpected output (verbatim) ----
   [junit4] Java HotSpot(TM) 64-Bit Server VM warning: Option UseConcMarkSweepGC was deprecated in version 9.0 and will likely be removed in a future release.
   [junit4] <<< JVM J1: EOF ----

[...truncated 553 lines...]
   [junit4] JVM J1: stderr was not empty, see: /Users/jenkins/workspace/Lucene-Solr-7.x-MacOSX/solr/build/contrib/solr-clustering/test/temp/junit4-J1-20171001_011052_21312935226636710018027.syserr
   [junit4] >>> JVM J1 emitted unexpected output (verbatim) ----
   [junit4] Java HotSpot(TM) 64-Bit Server VM warning: Option UseConcMarkSweepGC was deprecated in version 9.0 and will likely be removed in a future release.
   [junit4] <<< JVM J1: EOF ----

[...truncated 3 lines...]
   [junit4] JVM J0: stderr was not empty, see: /Users/jenkins/workspace/Lucene-Solr-7.x-MacOSX/solr/build/contrib/solr-clustering/test/temp/junit4-J0-20171001_011052_2134704291953860912098.syserr
   [junit4] >>> JVM J0 emitted unexpected output (verbatim) ----
   [junit4] Java HotSpot(TM) 64-Bit Server VM warning: Option UseConcMarkSweepGC was deprecated in version 9.0 and will likely be removed in a future release.
   [junit4] <<< JVM J0: EOF ----

[...truncated 1257 lines...]
   [junit4] JVM J1: stderr was not empty, see: /Users/jenkins/workspace/Lucene-Solr-7.x-MacOSX/solr/build/contrib/solr-dataimporthandler-extras/test/temp/junit4-J1-20171001_011112_38515170292225530593261.syserr
   [junit4] >>> JVM J1 emitted unexpected output (verbatim) ----
   [junit4] Java HotSpot(TM) 64-Bit Server VM warning: Option UseConcMarkSweepGC was deprecated in version 9.0 and will likely be removed in a future release.
   [junit4] <<< JVM J1: EOF ----

[...truncated 3 lines...]
   [junit4] JVM J0: stderr was not empty, see: /Users/jenkins/workspace/Lucene-Solr-7.x-MacOSX/solr/build/contrib/solr-dataimporthandler-extras/test/temp/junit4-J0-20171001_011112_38513143581334256871128.syserr
   [junit4] >>> JVM J0 emitted unexpected output (verbatim) ----
   [junit4] Java HotSpot(TM) 64-Bit Server VM warning: Option UseConcMarkSweepGC was deprecated in version 9.0 and will likely be removed in a future release.
   [junit4] <<< JVM J0: EOF ----

[...truncated 646 lines...]
   [junit4] JVM J1: stderr was not empty, see: /Users/jenkins/workspace/Lucene-Solr-7.x-MacOSX/solr/build/contrib/solr-dataimporthandler/test/temp/junit4-J1-20171001_011122_2559362358551161465744.syserr
   [junit4] >>> JVM J1 emitted unexpected output (verbatim) ----
   [junit4] Java HotSpot(TM) 64-Bit Server VM warning: Option UseConcMarkSweepGC was deprecated in version 9.0 and will likely be removed in a future release.
   [junit4] <<< JVM J1: EOF ----

[...truncated 3 lines...]
   [junit4] JVM J0: stderr was not empty, see: /Users/jenkins/workspace/Lucene-Solr-7.x-MacOSX/solr/build/contrib/solr-dataimporthandler/test/temp/junit4-J0-20171001_011122_2551750317953276874334.syserr
   [junit4] >>> JVM J0 emitted unexpected output (verbatim) ----
   [junit4] Java HotSpot(TM) 64-Bit Server VM warning: Option UseConcMarkSweepGC was deprecated in version 9.0 and will likely be removed in a future release.
   [junit4] <<< JVM J0: EOF ----

[...truncated 554 lines...]
   [junit4] JVM J1: stderr was not empty, see: /Users/jenkins/workspace/Lucene-Solr-7.x-MacOSX/solr/build/contrib/solr-cell/test/temp/junit4-J1-20171001_011154_37815143922677711225382.syserr
   [junit4] >>> JVM J1 emitted unexpected output (verbatim) ----
   [junit4] Java HotSpot(TM) 64-Bit Server VM warning: Option UseConcMarkSweepGC was deprecated in version 9.0 and will likely be removed in a future release.
   [junit4] <<< JVM J1: EOF ----

[...truncated 6 lines...]
   [junit4] JVM J0: stderr was not empty, see: /Users/jenkins/workspace/Lucene-Solr-7.x-MacOSX/solr/build/contrib/solr-cell/test/temp/junit4-J0-20171001_011154_3788284507633442306128.syserr
   [junit4] >>> JVM J0 emitted unexpected output (verbatim) ----
   [junit4] Java HotSpot(TM) 64-Bit Server VM warning: Option UseConcMarkSweepGC was deprecated in version 9.0 and will likely be removed in a future release.
   [junit4] <<< JVM J0: EOF ----

[...truncated 561 lines...]
   [junit4] JVM J0: stderr was not empty, see: /Users/jenkins/workspace/Lucene-Solr-7.x-MacOSX/solr/build/contrib/solr-langid/test/temp/junit4-J0-20171001_011209_766624161246722429724.syserr
   [junit4] >>> JVM J0 emitted unexpected output (verbatim) ----
   [junit4] JVM J1: stderr was not empty, see: /Users/jenkins/workspace/Lucene-Solr-7.x-MacOSX/solr/build/contrib/solr-langid/test/temp/junit4-J1-20171001_011209_7666854011422023551567.syserr
   [junit4] Java HotSpot(TM) 64-Bit Server VM warning: Option UseConcMarkSweepGC was deprecated in version 9.0 and will likely be removed in a future release.
   [junit4] <<< JVM J0: EOF ----

[...truncated 654 lines...]
   [junit4] JVM J0: stderr was not empty, see: /Users/jenkins/workspace/Lucene-Solr-7.x-MacOSX/solr/build/contrib/solr-ltr/test/temp/junit4-J0-20171001_011218_7711916271850942593813.syserr
   [junit4] >>> JVM J0 emitted unexpected output (verbatim) ----
   [junit4] Java HotSpot(TM) 64-Bit Server VM warning: Option UseConcMarkSweepGC was deprecated in version 9.0 and will likely be removed in a future release.
   [junit4] <<< JVM J0: EOF ----

   [junit4] JVM J1: stderr was not empty, see: /Users/jenkins/workspace/Lucene-Solr-7.x-MacOSX/solr/build/contrib/solr-ltr/test/temp/junit4-J1-20171001_011218_7715646221529657025408.syserr
   [junit4] >>> JVM J1 emitted unexpected output (verbatim) ----
   [junit4] Java HotSpot(TM) 64-Bit Server VM warning: Option UseConcMarkSweepGC was deprecated in version 9.0 and will likely be removed in a future release.
   [junit4] <<< JVM J1: EOF ----

[...truncated 595 lines...]
   [junit4] JVM J1: stderr was not empty, see: /Users/jenkins/workspace/Lucene-Solr-7.x-MacOSX/solr/build/contrib/solr-uima/test/temp/junit4-J1-20171001_011248_16618239785609864481267.syserr
   [junit4] >>> JVM J1 emitted unexpected output (verbatim) ----
   [junit4] Java HotSpot(TM) 64-Bit Server VM warning: Option UseConcMarkSweepGC was deprecated in version 9.0 and will likely be removed in a future release.
   [junit4] <<< JVM J1: EOF ----

[...truncated 3 lines...]
   [junit4] JVM J0: stderr was not empty, see: /Users/jenkins/workspace/Lucene-Solr-7.x-MacOSX/solr/build/contrib/solr-uima/test/temp/junit4-J0-20171001_011248_1668008504555128903061.syserr
   [junit4] >>> JVM J0 emitted unexpected output (verbatim) ----
   [junit4] Java HotSpot(TM) 64-Bit Server VM warning: Option UseConcMarkSweepGC was deprecated in version 9.0 and will likely be removed in a future release.
   [junit4] <<< JVM J0: EOF ----

[...truncated 548 lines...]
   [junit4] JVM J0: stderr was not empty, see: /Users/jenkins/workspace/Lucene-Solr-7.x-MacOSX/solr/build/contrib/solr-velocity/test/temp/junit4-J0-20171001_011304_5117008305048885445673.syserr
   [junit4] >>> JVM J0 emitted unexpected output (verbatim) ----
   [junit4] Java HotSpot(TM) 64-Bit Server VM warning: Option UseConcMarkSweepGC was deprecated in version 9.0 and will likely be removed in a future release.
   [junit4] <<< JVM J0: EOF ----

[...truncated 31452 lines...]

Mime
View raw message