lucene-dev mailing list archives

Site index · List index
Message view « Date » · « Thread »
Top « Date » · « Thread »
From Apache Jenkins Server <jenk...@builds.apache.org>
Subject [JENKINS] Lucene-Solr-Tests-7.x - Build # 178 - Failure
Date Sun, 08 Oct 2017 21:03:11 GMT
Build: https://builds.apache.org/job/Lucene-Solr-Tests-7.x/178/

10 tests failed.
FAILED:  org.apache.solr.cloud.MoveReplicaHDFSTest.test

Error Message:
Could not load collection from ZK: movereplicatest_coll

Stack Trace:
org.apache.solr.common.SolrException: Could not load collection from ZK: movereplicatest_coll
	at __randomizedtesting.SeedInfo.seed([37A167B6A7C72C70:BFF5586C093B4188]:0)
	at org.apache.solr.common.cloud.ZkStateReader.getCollectionLive(ZkStateReader.java:1115)
	at org.apache.solr.common.cloud.ZkStateReader$LazyCollectionRef.get(ZkStateReader.java:648)
	at org.apache.solr.common.cloud.ClusterState.getCollectionOrNull(ClusterState.java:128)
	at org.apache.solr.common.cloud.ClusterState.getCollection(ClusterState.java:108)
	at org.apache.solr.cloud.SolrCloudTestCase.getCollectionState(SolrCloudTestCase.java:247)
	at org.apache.solr.cloud.MoveReplicaTest.test(MoveReplicaTest.java:153)
	at sun.reflect.NativeMethodAccessorImpl.invoke0(Native Method)
	at sun.reflect.NativeMethodAccessorImpl.invoke(NativeMethodAccessorImpl.java:62)
	at sun.reflect.DelegatingMethodAccessorImpl.invoke(DelegatingMethodAccessorImpl.java:43)
	at java.lang.reflect.Method.invoke(Method.java:498)
	at com.carrotsearch.randomizedtesting.RandomizedRunner.invoke(RandomizedRunner.java:1737)
	at com.carrotsearch.randomizedtesting.RandomizedRunner$8.evaluate(RandomizedRunner.java:934)
	at com.carrotsearch.randomizedtesting.RandomizedRunner$9.evaluate(RandomizedRunner.java:970)
	at com.carrotsearch.randomizedtesting.RandomizedRunner$10.evaluate(RandomizedRunner.java:984)
	at com.carrotsearch.randomizedtesting.rules.SystemPropertiesRestoreRule$1.evaluate(SystemPropertiesRestoreRule.java:57)
	at org.apache.lucene.util.TestRuleSetupTeardownChained$1.evaluate(TestRuleSetupTeardownChained.java:49)
	at org.apache.lucene.util.AbstractBeforeAfterRule$1.evaluate(AbstractBeforeAfterRule.java:45)
	at org.apache.lucene.util.TestRuleThreadAndTestName$1.evaluate(TestRuleThreadAndTestName.java:48)
	at org.apache.lucene.util.TestRuleIgnoreAfterMaxFailures$1.evaluate(TestRuleIgnoreAfterMaxFailures.java:64)
	at org.apache.lucene.util.TestRuleMarkFailure$1.evaluate(TestRuleMarkFailure.java:47)
	at com.carrotsearch.randomizedtesting.rules.StatementAdapter.evaluate(StatementAdapter.java:36)
	at com.carrotsearch.randomizedtesting.ThreadLeakControl$StatementRunner.run(ThreadLeakControl.java:368)
	at com.carrotsearch.randomizedtesting.ThreadLeakControl.forkTimeoutingTask(ThreadLeakControl.java:817)
	at com.carrotsearch.randomizedtesting.ThreadLeakControl$3.evaluate(ThreadLeakControl.java:468)
	at com.carrotsearch.randomizedtesting.RandomizedRunner.runSingleTest(RandomizedRunner.java:943)
	at com.carrotsearch.randomizedtesting.RandomizedRunner$5.evaluate(RandomizedRunner.java:829)
	at com.carrotsearch.randomizedtesting.RandomizedRunner$6.evaluate(RandomizedRunner.java:879)
	at com.carrotsearch.randomizedtesting.RandomizedRunner$7.evaluate(RandomizedRunner.java:890)
	at com.carrotsearch.randomizedtesting.rules.StatementAdapter.evaluate(StatementAdapter.java:36)
	at com.carrotsearch.randomizedtesting.rules.SystemPropertiesRestoreRule$1.evaluate(SystemPropertiesRestoreRule.java:57)
	at org.apache.lucene.util.AbstractBeforeAfterRule$1.evaluate(AbstractBeforeAfterRule.java:45)
	at com.carrotsearch.randomizedtesting.rules.StatementAdapter.evaluate(StatementAdapter.java:36)
	at org.apache.lucene.util.TestRuleStoreClassName$1.evaluate(TestRuleStoreClassName.java:41)
	at com.carrotsearch.randomizedtesting.rules.NoShadowingOrOverridesOnMethodsRule$1.evaluate(NoShadowingOrOverridesOnMethodsRule.java:40)
	at com.carrotsearch.randomizedtesting.rules.NoShadowingOrOverridesOnMethodsRule$1.evaluate(NoShadowingOrOverridesOnMethodsRule.java:40)
	at com.carrotsearch.randomizedtesting.rules.StatementAdapter.evaluate(StatementAdapter.java:36)
	at com.carrotsearch.randomizedtesting.rules.StatementAdapter.evaluate(StatementAdapter.java:36)
	at com.carrotsearch.randomizedtesting.rules.StatementAdapter.evaluate(StatementAdapter.java:36)
	at org.apache.lucene.util.TestRuleAssertionsRequired$1.evaluate(TestRuleAssertionsRequired.java:53)
	at org.apache.lucene.util.TestRuleMarkFailure$1.evaluate(TestRuleMarkFailure.java:47)
	at org.apache.lucene.util.TestRuleIgnoreAfterMaxFailures$1.evaluate(TestRuleIgnoreAfterMaxFailures.java:64)
	at org.apache.lucene.util.TestRuleIgnoreTestSuites$1.evaluate(TestRuleIgnoreTestSuites.java:54)
	at com.carrotsearch.randomizedtesting.rules.StatementAdapter.evaluate(StatementAdapter.java:36)
	at com.carrotsearch.randomizedtesting.ThreadLeakControl$StatementRunner.run(ThreadLeakControl.java:368)
	at java.lang.Thread.run(Thread.java:748)
Caused by: org.apache.zookeeper.KeeperException$SessionExpiredException: KeeperErrorCode = Session expired for /collections/movereplicatest_coll/state.json
	at org.apache.zookeeper.KeeperException.create(KeeperException.java:127)
	at org.apache.zookeeper.KeeperException.create(KeeperException.java:51)
	at org.apache.zookeeper.ZooKeeper.getData(ZooKeeper.java:1212)
	at org.apache.solr.common.cloud.SolrZkClient$7.execute(SolrZkClient.java:357)
	at org.apache.solr.common.cloud.SolrZkClient$7.execute(SolrZkClient.java:354)
	at org.apache.solr.common.cloud.ZkCmdExecutor.retryOperation(ZkCmdExecutor.java:60)
	at org.apache.solr.common.cloud.SolrZkClient.getData(SolrZkClient.java:354)
	at org.apache.solr.common.cloud.ZkStateReader.fetchCollectionState(ZkStateReader.java:1127)
	at org.apache.solr.common.cloud.ZkStateReader.getCollectionLive(ZkStateReader.java:1113)
	... 44 more


FAILED:  org.apache.solr.cloud.MultiThreadedOCPTest.test

Error Message:
Task 2 did not complete, final state: RUNNING expected same:<COMPLETED> was not:<RUNNING>

Stack Trace:
java.lang.AssertionError: Task 2 did not complete, final state: RUNNING expected same:<COMPLETED> was not:<RUNNING>
	at __randomizedtesting.SeedInfo.seed([37A167B6A7C72C70:BFF5586C093B4188]:0)
	at org.junit.Assert.fail(Assert.java:93)
	at org.junit.Assert.failNotSame(Assert.java:641)
	at org.junit.Assert.assertSame(Assert.java:580)
	at org.apache.solr.cloud.MultiThreadedOCPTest.testParallelCollectionAPICalls(MultiThreadedOCPTest.java:146)
	at org.apache.solr.cloud.MultiThreadedOCPTest.test(MultiThreadedOCPTest.java:63)
	at sun.reflect.NativeMethodAccessorImpl.invoke0(Native Method)
	at sun.reflect.NativeMethodAccessorImpl.invoke(NativeMethodAccessorImpl.java:62)
	at sun.reflect.DelegatingMethodAccessorImpl.invoke(DelegatingMethodAccessorImpl.java:43)
	at java.lang.reflect.Method.invoke(Method.java:498)
	at com.carrotsearch.randomizedtesting.RandomizedRunner.invoke(RandomizedRunner.java:1737)
	at com.carrotsearch.randomizedtesting.RandomizedRunner$8.evaluate(RandomizedRunner.java:934)
	at com.carrotsearch.randomizedtesting.RandomizedRunner$9.evaluate(RandomizedRunner.java:970)
	at com.carrotsearch.randomizedtesting.RandomizedRunner$10.evaluate(RandomizedRunner.java:984)
	at org.apache.solr.BaseDistributedSearchTestCase$ShardsRepeatRule$ShardsFixedStatement.callStatement(BaseDistributedSearchTestCase.java:993)
	at org.apache.solr.BaseDistributedSearchTestCase$ShardsRepeatRule$ShardsStatement.evaluate(BaseDistributedSearchTestCase.java:968)
	at com.carrotsearch.randomizedtesting.rules.SystemPropertiesRestoreRule$1.evaluate(SystemPropertiesRestoreRule.java:57)
	at org.apache.lucene.util.TestRuleSetupTeardownChained$1.evaluate(TestRuleSetupTeardownChained.java:49)
	at org.apache.lucene.util.AbstractBeforeAfterRule$1.evaluate(AbstractBeforeAfterRule.java:45)
	at org.apache.lucene.util.TestRuleThreadAndTestName$1.evaluate(TestRuleThreadAndTestName.java:48)
	at org.apache.lucene.util.TestRuleIgnoreAfterMaxFailures$1.evaluate(TestRuleIgnoreAfterMaxFailures.java:64)
	at org.apache.lucene.util.TestRuleMarkFailure$1.evaluate(TestRuleMarkFailure.java:47)
	at com.carrotsearch.randomizedtesting.rules.StatementAdapter.evaluate(StatementAdapter.java:36)
	at com.carrotsearch.randomizedtesting.ThreadLeakControl$StatementRunner.run(ThreadLeakControl.java:368)
	at com.carrotsearch.randomizedtesting.ThreadLeakControl.forkTimeoutingTask(ThreadLeakControl.java:817)
	at com.carrotsearch.randomizedtesting.ThreadLeakControl$3.evaluate(ThreadLeakControl.java:468)
	at com.carrotsearch.randomizedtesting.RandomizedRunner.runSingleTest(RandomizedRunner.java:943)
	at com.carrotsearch.randomizedtesting.RandomizedRunner$5.evaluate(RandomizedRunner.java:829)
	at com.carrotsearch.randomizedtesting.RandomizedRunner$6.evaluate(RandomizedRunner.java:879)
	at com.carrotsearch.randomizedtesting.RandomizedRunner$7.evaluate(RandomizedRunner.java:890)
	at com.carrotsearch.randomizedtesting.rules.StatementAdapter.evaluate(StatementAdapter.java:36)
	at com.carrotsearch.randomizedtesting.rules.SystemPropertiesRestoreRule$1.evaluate(SystemPropertiesRestoreRule.java:57)
	at org.apache.lucene.util.AbstractBeforeAfterRule$1.evaluate(AbstractBeforeAfterRule.java:45)
	at com.carrotsearch.randomizedtesting.rules.StatementAdapter.evaluate(StatementAdapter.java:36)
	at org.apache.lucene.util.TestRuleStoreClassName$1.evaluate(TestRuleStoreClassName.java:41)
	at com.carrotsearch.randomizedtesting.rules.NoShadowingOrOverridesOnMethodsRule$1.evaluate(NoShadowingOrOverridesOnMethodsRule.java:40)
	at com.carrotsearch.randomizedtesting.rules.NoShadowingOrOverridesOnMethodsRule$1.evaluate(NoShadowingOrOverridesOnMethodsRule.java:40)
	at com.carrotsearch.randomizedtesting.rules.StatementAdapter.evaluate(StatementAdapter.java:36)
	at com.carrotsearch.randomizedtesting.rules.StatementAdapter.evaluate(StatementAdapter.java:36)
	at com.carrotsearch.randomizedtesting.rules.StatementAdapter.evaluate(StatementAdapter.java:36)
	at org.apache.lucene.util.TestRuleAssertionsRequired$1.evaluate(TestRuleAssertionsRequired.java:53)
	at org.apache.lucene.util.TestRuleMarkFailure$1.evaluate(TestRuleMarkFailure.java:47)
	at org.apache.lucene.util.TestRuleIgnoreAfterMaxFailures$1.evaluate(TestRuleIgnoreAfterMaxFailures.java:64)
	at org.apache.lucene.util.TestRuleIgnoreTestSuites$1.evaluate(TestRuleIgnoreTestSuites.java:54)
	at com.carrotsearch.randomizedtesting.rules.StatementAdapter.evaluate(StatementAdapter.java:36)
	at com.carrotsearch.randomizedtesting.ThreadLeakControl$StatementRunner.run(ThreadLeakControl.java:368)
	at java.lang.Thread.run(Thread.java:748)


FAILED:  org.apache.solr.cloud.ShardSplitTest.testSplitAfterFailedSplit

Error Message:
expected:<1> but was:<2>

Stack Trace:
java.lang.AssertionError: expected:<1> but was:<2>
	at __randomizedtesting.SeedInfo.seed([37A167B6A7C72C70:CEECF4199BB261FA]:0)
	at org.junit.Assert.fail(Assert.java:93)
	at org.junit.Assert.failNotEquals(Assert.java:647)
	at org.junit.Assert.assertEquals(Assert.java:128)
	at org.junit.Assert.assertEquals(Assert.java:472)
	at org.junit.Assert.assertEquals(Assert.java:456)
	at org.apache.solr.cloud.ShardSplitTest.testSplitAfterFailedSplit(ShardSplitTest.java:279)
	at sun.reflect.NativeMethodAccessorImpl.invoke0(Native Method)
	at sun.reflect.NativeMethodAccessorImpl.invoke(NativeMethodAccessorImpl.java:62)
	at sun.reflect.DelegatingMethodAccessorImpl.invoke(DelegatingMethodAccessorImpl.java:43)
	at java.lang.reflect.Method.invoke(Method.java:498)
	at com.carrotsearch.randomizedtesting.RandomizedRunner.invoke(RandomizedRunner.java:1737)
	at com.carrotsearch.randomizedtesting.RandomizedRunner$8.evaluate(RandomizedRunner.java:934)
	at com.carrotsearch.randomizedtesting.RandomizedRunner$9.evaluate(RandomizedRunner.java:970)
	at com.carrotsearch.randomizedtesting.RandomizedRunner$10.evaluate(RandomizedRunner.java:984)
	at org.apache.solr.BaseDistributedSearchTestCase$ShardsRepeatRule$ShardsFixedStatement.callStatement(BaseDistributedSearchTestCase.java:993)
	at org.apache.solr.BaseDistributedSearchTestCase$ShardsRepeatRule$ShardsStatement.evaluate(BaseDistributedSearchTestCase.java:968)
	at com.carrotsearch.randomizedtesting.rules.SystemPropertiesRestoreRule$1.evaluate(SystemPropertiesRestoreRule.java:57)
	at org.apache.lucene.util.TestRuleSetupTeardownChained$1.evaluate(TestRuleSetupTeardownChained.java:49)
	at org.apache.lucene.util.AbstractBeforeAfterRule$1.evaluate(AbstractBeforeAfterRule.java:45)
	at org.apache.lucene.util.TestRuleThreadAndTestName$1.evaluate(TestRuleThreadAndTestName.java:48)
	at org.apache.lucene.util.TestRuleIgnoreAfterMaxFailures$1.evaluate(TestRuleIgnoreAfterMaxFailures.java:64)
	at org.apache.lucene.util.TestRuleMarkFailure$1.evaluate(TestRuleMarkFailure.java:47)
	at com.carrotsearch.randomizedtesting.rules.StatementAdapter.evaluate(StatementAdapter.java:36)
	at com.carrotsearch.randomizedtesting.ThreadLeakControl$StatementRunner.run(ThreadLeakControl.java:368)
	at com.carrotsearch.randomizedtesting.ThreadLeakControl.forkTimeoutingTask(ThreadLeakControl.java:817)
	at com.carrotsearch.randomizedtesting.ThreadLeakControl$3.evaluate(ThreadLeakControl.java:468)
	at com.carrotsearch.randomizedtesting.RandomizedRunner.runSingleTest(RandomizedRunner.java:943)
	at com.carrotsearch.randomizedtesting.RandomizedRunner$5.evaluate(RandomizedRunner.java:829)
	at com.carrotsearch.randomizedtesting.RandomizedRunner$6.evaluate(RandomizedRunner.java:879)
	at com.carrotsearch.randomizedtesting.RandomizedRunner$7.evaluate(RandomizedRunner.java:890)
	at com.carrotsearch.randomizedtesting.rules.StatementAdapter.evaluate(StatementAdapter.java:36)
	at com.carrotsearch.randomizedtesting.rules.SystemPropertiesRestoreRule$1.evaluate(SystemPropertiesRestoreRule.java:57)
	at org.apache.lucene.util.AbstractBeforeAfterRule$1.evaluate(AbstractBeforeAfterRule.java:45)
	at com.carrotsearch.randomizedtesting.rules.StatementAdapter.evaluate(StatementAdapter.java:36)
	at org.apache.lucene.util.TestRuleStoreClassName$1.evaluate(TestRuleStoreClassName.java:41)
	at com.carrotsearch.randomizedtesting.rules.NoShadowingOrOverridesOnMethodsRule$1.evaluate(NoShadowingOrOverridesOnMethodsRule.java:40)
	at com.carrotsearch.randomizedtesting.rules.NoShadowingOrOverridesOnMethodsRule$1.evaluate(NoShadowingOrOverridesOnMethodsRule.java:40)
	at com.carrotsearch.randomizedtesting.rules.StatementAdapter.evaluate(StatementAdapter.java:36)
	at com.carrotsearch.randomizedtesting.rules.StatementAdapter.evaluate(StatementAdapter.java:36)
	at com.carrotsearch.randomizedtesting.rules.StatementAdapter.evaluate(StatementAdapter.java:36)
	at org.apache.lucene.util.TestRuleAssertionsRequired$1.evaluate(TestRuleAssertionsRequired.java:53)
	at org.apache.lucene.util.TestRuleMarkFailure$1.evaluate(TestRuleMarkFailure.java:47)
	at org.apache.lucene.util.TestRuleIgnoreAfterMaxFailures$1.evaluate(TestRuleIgnoreAfterMaxFailures.java:64)
	at org.apache.lucene.util.TestRuleIgnoreTestSuites$1.evaluate(TestRuleIgnoreTestSuites.java:54)
	at com.carrotsearch.randomizedtesting.rules.StatementAdapter.evaluate(StatementAdapter.java:36)
	at com.carrotsearch.randomizedtesting.ThreadLeakControl$StatementRunner.run(ThreadLeakControl.java:368)
	at java.lang.Thread.run(Thread.java:748)


FAILED:  org.apache.solr.cloud.TestAuthenticationFramework.testBasics

Error Message:
Error from server at https://127.0.0.1:50121/solr/testcollection_shard1_replica_n2: Expected mime type application/octet-stream but got text/html. <html> <head> <meta http-equiv="Content-Type" content="text/html;charset=ISO-8859-1"/> <title>Error 404 </title> </head> <body> <h2>HTTP ERROR: 404</h2> <p>Problem accessing /solr/testcollection_shard1_replica_n2/update. Reason: <pre>    Can not find: /solr/testcollection_shard1_replica_n2/update</pre></p> <hr /><a href="http://eclipse.org/jetty">Powered by Jetty:// 9.3.20.v20170531</a><hr/> </body> </html> 

Stack Trace:
org.apache.solr.client.solrj.impl.CloudSolrClient$RouteException: Error from server at https://127.0.0.1:50121/solr/testcollection_shard1_replica_n2: Expected mime type application/octet-stream but got text/html. <html>
<head>
<meta http-equiv="Content-Type" content="text/html;charset=ISO-8859-1"/>
<title>Error 404 </title>
</head>
<body>
<h2>HTTP ERROR: 404</h2>
<p>Problem accessing /solr/testcollection_shard1_replica_n2/update. Reason:
<pre>    Can not find: /solr/testcollection_shard1_replica_n2/update</pre></p>
<hr /><a href="http://eclipse.org/jetty">Powered by Jetty:// 9.3.20.v20170531</a><hr/>
</body>
</html>

	at __randomizedtesting.SeedInfo.seed([37A167B6A7C72C70:A79C99A9F297200]:0)
	at org.apache.solr.client.solrj.impl.CloudSolrClient.directUpdate(CloudSolrClient.java:539)
	at org.apache.solr.client.solrj.impl.CloudSolrClient.sendRequest(CloudSolrClient.java:993)
	at org.apache.solr.client.solrj.impl.CloudSolrClient.requestWithRetryOnStaleState(CloudSolrClient.java:862)
	at org.apache.solr.client.solrj.impl.CloudSolrClient.request(CloudSolrClient.java:793)
	at org.apache.solr.client.solrj.SolrRequest.process(SolrRequest.java:178)
	at org.apache.solr.client.solrj.request.UpdateRequest.commit(UpdateRequest.java:233)
	at org.apache.solr.cloud.TestAuthenticationFramework.collectionCreateSearchDeleteTwice(TestAuthenticationFramework.java:126)
	at org.apache.solr.cloud.TestAuthenticationFramework.testBasics(TestAuthenticationFramework.java:74)
	at sun.reflect.NativeMethodAccessorImpl.invoke0(Native Method)
	at sun.reflect.NativeMethodAccessorImpl.invoke(NativeMethodAccessorImpl.java:62)
	at sun.reflect.DelegatingMethodAccessorImpl.invoke(DelegatingMethodAccessorImpl.java:43)
	at java.lang.reflect.Method.invoke(Method.java:498)
	at com.carrotsearch.randomizedtesting.RandomizedRunner.invoke(RandomizedRunner.java:1737)
	at com.carrotsearch.randomizedtesting.RandomizedRunner$8.evaluate(RandomizedRunner.java:934)
	at com.carrotsearch.randomizedtesting.RandomizedRunner$9.evaluate(RandomizedRunner.java:970)
	at com.carrotsearch.randomizedtesting.RandomizedRunner$10.evaluate(RandomizedRunner.java:984)
	at com.carrotsearch.randomizedtesting.rules.SystemPropertiesRestoreRule$1.evaluate(SystemPropertiesRestoreRule.java:57)
	at org.apache.lucene.util.TestRuleSetupTeardownChained$1.evaluate(TestRuleSetupTeardownChained.java:49)
	at org.apache.lucene.util.AbstractBeforeAfterRule$1.evaluate(AbstractBeforeAfterRule.java:45)
	at org.apache.lucene.util.TestRuleThreadAndTestName$1.evaluate(TestRuleThreadAndTestName.java:48)
	at org.apache.lucene.util.TestRuleIgnoreAfterMaxFailures$1.evaluate(TestRuleIgnoreAfterMaxFailures.java:64)
	at org.apache.lucene.util.TestRuleMarkFailure$1.evaluate(TestRuleMarkFailure.java:47)
	at com.carrotsearch.randomizedtesting.rules.StatementAdapter.evaluate(StatementAdapter.java:36)
	at com.carrotsearch.randomizedtesting.ThreadLeakControl$StatementRunner.run(ThreadLeakControl.java:368)
	at com.carrotsearch.randomizedtesting.ThreadLeakControl.forkTimeoutingTask(ThreadLeakControl.java:817)
	at com.carrotsearch.randomizedtesting.ThreadLeakControl$3.evaluate(ThreadLeakControl.java:468)
	at com.carrotsearch.randomizedtesting.RandomizedRunner.runSingleTest(RandomizedRunner.java:943)
	at com.carrotsearch.randomizedtesting.RandomizedRunner$5.evaluate(RandomizedRunner.java:829)
	at com.carrotsearch.randomizedtesting.RandomizedRunner$6.evaluate(RandomizedRunner.java:879)
	at com.carrotsearch.randomizedtesting.RandomizedRunner$7.evaluate(RandomizedRunner.java:890)
	at com.carrotsearch.randomizedtesting.rules.StatementAdapter.evaluate(StatementAdapter.java:36)
	at com.carrotsearch.randomizedtesting.rules.SystemPropertiesRestoreRule$1.evaluate(SystemPropertiesRestoreRule.java:57)
	at org.apache.lucene.util.AbstractBeforeAfterRule$1.evaluate(AbstractBeforeAfterRule.java:45)
	at com.carrotsearch.randomizedtesting.rules.StatementAdapter.evaluate(StatementAdapter.java:36)
	at org.apache.lucene.util.TestRuleStoreClassName$1.evaluate(TestRuleStoreClassName.java:41)
	at com.carrotsearch.randomizedtesting.rules.NoShadowingOrOverridesOnMethodsRule$1.evaluate(NoShadowingOrOverridesOnMethodsRule.java:40)
	at com.carrotsearch.randomizedtesting.rules.NoShadowingOrOverridesOnMethodsRule$1.evaluate(NoShadowingOrOverridesOnMethodsRule.java:40)
	at com.carrotsearch.randomizedtesting.rules.StatementAdapter.evaluate(StatementAdapter.java:36)
	at com.carrotsearch.randomizedtesting.rules.StatementAdapter.evaluate(StatementAdapter.java:36)
	at com.carrotsearch.randomizedtesting.rules.StatementAdapter.evaluate(StatementAdapter.java:36)
	at org.apache.lucene.util.TestRuleAssertionsRequired$1.evaluate(TestRuleAssertionsRequired.java:53)
	at org.apache.lucene.util.TestRuleMarkFailure$1.evaluate(TestRuleMarkFailure.java:47)
	at org.apache.lucene.util.TestRuleIgnoreAfterMaxFailures$1.evaluate(TestRuleIgnoreAfterMaxFailures.java:64)
	at org.apache.lucene.util.TestRuleIgnoreTestSuites$1.evaluate(TestRuleIgnoreTestSuites.java:54)
	at com.carrotsearch.randomizedtesting.rules.StatementAdapter.evaluate(StatementAdapter.java:36)
	at com.carrotsearch.randomizedtesting.ThreadLeakControl$StatementRunner.run(ThreadLeakControl.java:368)
	at java.lang.Thread.run(Thread.java:748)
Caused by: org.apache.solr.client.solrj.impl.HttpSolrClient$RemoteSolrException: Error from server at https://127.0.0.1:50121/solr/testcollection_shard1_replica_n2: Expected mime type application/octet-stream but got text/html. <html>
<head>
<meta http-equiv="Content-Type" content="text/html;charset=ISO-8859-1"/>
<title>Error 404 </title>
</head>
<body>
<h2>HTTP ERROR: 404</h2>
<p>Problem accessing /solr/testcollection_shard1_replica_n2/update. Reason:
<pre>    Can not find: /solr/testcollection_shard1_replica_n2/update</pre></p>
<hr /><a href="http://eclipse.org/jetty">Powered by Jetty:// 9.3.20.v20170531</a><hr/>
</body>
</html>

	at org.apache.solr.client.solrj.impl.HttpSolrClient.executeMethod(HttpSolrClient.java:591)
	at org.apache.solr.client.solrj.impl.HttpSolrClient.request(HttpSolrClient.java:253)
	at org.apache.solr.client.solrj.impl.HttpSolrClient.request(HttpSolrClient.java:242)
	at org.apache.solr.client.solrj.impl.LBHttpSolrClient.doRequest(LBHttpSolrClient.java:483)
	at org.apache.solr.client.solrj.impl.LBHttpSolrClient.request(LBHttpSolrClient.java:413)
	at org.apache.solr.client.solrj.impl.CloudSolrClient.lambda$directUpdate$0(CloudSolrClient.java:516)
	at java.util.concurrent.FutureTask.run(FutureTask.java:266)
	at org.apache.solr.common.util.ExecutorUtil$MDCAwareThreadPoolExecutor.lambda$execute$0(ExecutorUtil.java:188)
	at java.util.concurrent.ThreadPoolExecutor.runWorker(ThreadPoolExecutor.java:1149)
	at java.util.concurrent.ThreadPoolExecutor$Worker.run(ThreadPoolExecutor.java:624)
	... 1 more


FAILED:  org.apache.solr.cloud.TestPullReplicaErrorHandling.testPullReplicaDisconnectsFromZooKeeper

Error Message:
Didn't get expected doc count. Expected: 10, Found: 0

Stack Trace:
java.lang.AssertionError: Didn't get expected doc count. Expected: 10, Found: 0
	at __randomizedtesting.SeedInfo.seed([37A167B6A7C72C70:28E84735822D2310]:0)
	at org.junit.Assert.fail(Assert.java:93)
	at org.apache.solr.cloud.TestPullReplicaErrorHandling.assertNumDocs(TestPullReplicaErrorHandling.java:245)
	at org.apache.solr.cloud.TestPullReplicaErrorHandling.assertNumDocs(TestPullReplicaErrorHandling.java:250)
	at org.apache.solr.cloud.TestPullReplicaErrorHandling.testPullReplicaDisconnectsFromZooKeeper(TestPullReplicaErrorHandling.java:221)
	at sun.reflect.NativeMethodAccessorImpl.invoke0(Native Method)
	at sun.reflect.NativeMethodAccessorImpl.invoke(NativeMethodAccessorImpl.java:62)
	at sun.reflect.DelegatingMethodAccessorImpl.invoke(DelegatingMethodAccessorImpl.java:43)
	at java.lang.reflect.Method.invoke(Method.java:498)
	at com.carrotsearch.randomizedtesting.RandomizedRunner.invoke(RandomizedRunner.java:1737)
	at com.carrotsearch.randomizedtesting.RandomizedRunner$8.evaluate(RandomizedRunner.java:934)
	at com.carrotsearch.randomizedtesting.RandomizedRunner$9.evaluate(RandomizedRunner.java:970)
	at com.carrotsearch.randomizedtesting.RandomizedRunner$10.evaluate(RandomizedRunner.java:984)
	at com.carrotsearch.randomizedtesting.rules.SystemPropertiesRestoreRule$1.evaluate(SystemPropertiesRestoreRule.java:57)
	at org.apache.lucene.util.TestRuleSetupTeardownChained$1.evaluate(TestRuleSetupTeardownChained.java:49)
	at org.apache.lucene.util.AbstractBeforeAfterRule$1.evaluate(AbstractBeforeAfterRule.java:45)
	at org.apache.lucene.util.TestRuleThreadAndTestName$1.evaluate(TestRuleThreadAndTestName.java:48)
	at org.apache.lucene.util.TestRuleIgnoreAfterMaxFailures$1.evaluate(TestRuleIgnoreAfterMaxFailures.java:64)
	at org.apache.lucene.util.TestRuleMarkFailure$1.evaluate(TestRuleMarkFailure.java:47)
	at com.carrotsearch.randomizedtesting.rules.StatementAdapter.evaluate(StatementAdapter.java:36)
	at com.carrotsearch.randomizedtesting.ThreadLeakControl$StatementRunner.run(ThreadLeakControl.java:368)
	at com.carrotsearch.randomizedtesting.ThreadLeakControl.forkTimeoutingTask(ThreadLeakControl.java:817)
	at com.carrotsearch.randomizedtesting.ThreadLeakControl$3.evaluate(ThreadLeakControl.java:468)
	at com.carrotsearch.randomizedtesting.RandomizedRunner.runSingleTest(RandomizedRunner.java:943)
	at com.carrotsearch.randomizedtesting.RandomizedRunner$5.evaluate(RandomizedRunner.java:829)
	at com.carrotsearch.randomizedtesting.RandomizedRunner$6.evaluate(RandomizedRunner.java:879)
	at com.carrotsearch.randomizedtesting.RandomizedRunner$7.evaluate(RandomizedRunner.java:890)
	at com.carrotsearch.randomizedtesting.rules.StatementAdapter.evaluate(StatementAdapter.java:36)
	at com.carrotsearch.randomizedtesting.rules.SystemPropertiesRestoreRule$1.evaluate(SystemPropertiesRestoreRule.java:57)
	at org.apache.lucene.util.AbstractBeforeAfterRule$1.evaluate(AbstractBeforeAfterRule.java:45)
	at com.carrotsearch.randomizedtesting.rules.StatementAdapter.evaluate(StatementAdapter.java:36)
	at org.apache.lucene.util.TestRuleStoreClassName$1.evaluate(TestRuleStoreClassName.java:41)
	at com.carrotsearch.randomizedtesting.rules.NoShadowingOrOverridesOnMethodsRule$1.evaluate(NoShadowingOrOverridesOnMethodsRule.java:40)
	at com.carrotsearch.randomizedtesting.rules.NoShadowingOrOverridesOnMethodsRule$1.evaluate(NoShadowingOrOverridesOnMethodsRule.java:40)
	at com.carrotsearch.randomizedtesting.rules.StatementAdapter.evaluate(StatementAdapter.java:36)
	at com.carrotsearch.randomizedtesting.rules.StatementAdapter.evaluate(StatementAdapter.java:36)
	at com.carrotsearch.randomizedtesting.rules.StatementAdapter.evaluate(StatementAdapter.java:36)
	at org.apache.lucene.util.TestRuleAssertionsRequired$1.evaluate(TestRuleAssertionsRequired.java:53)
	at org.apache.lucene.util.TestRuleMarkFailure$1.evaluate(TestRuleMarkFailure.java:47)
	at org.apache.lucene.util.TestRuleIgnoreAfterMaxFailures$1.evaluate(TestRuleIgnoreAfterMaxFailures.java:64)
	at org.apache.lucene.util.TestRuleIgnoreTestSuites$1.evaluate(TestRuleIgnoreTestSuites.java:54)
	at com.carrotsearch.randomizedtesting.rules.StatementAdapter.evaluate(StatementAdapter.java:36)
	at com.carrotsearch.randomizedtesting.ThreadLeakControl$StatementRunner.run(ThreadLeakControl.java:368)
	at java.lang.Thread.run(Thread.java:748)


FAILED:  org.apache.solr.cloud.TestRequestStatusCollectionAPI.test

Error Message:
Could not load collection from ZK: collection1

Stack Trace:
org.apache.solr.common.SolrException: Could not load collection from ZK: collection1
	at __randomizedtesting.SeedInfo.seed([37A167B6A7C72C70:BFF5586C093B4188]:0)
	at org.apache.solr.common.cloud.ZkStateReader.getCollectionLive(ZkStateReader.java:1115)
	at org.apache.solr.common.cloud.ZkStateReader$LazyCollectionRef.get(ZkStateReader.java:648)
	at org.apache.solr.common.cloud.ClusterState.getCollectionOrNull(ClusterState.java:128)
	at org.apache.solr.cloud.AbstractFullDistribZkTestBase.getTotalReplicas(AbstractFullDistribZkTestBase.java:488)
	at org.apache.solr.cloud.AbstractFullDistribZkTestBase.createJettys(AbstractFullDistribZkTestBase.java:441)
	at org.apache.solr.cloud.AbstractFullDistribZkTestBase.createServers(AbstractFullDistribZkTestBase.java:334)
	at org.apache.solr.BaseDistributedSearchTestCase$ShardsRepeatRule$ShardsFixedStatement.callStatement(BaseDistributedSearchTestCase.java:991)
	at org.apache.solr.BaseDistributedSearchTestCase$ShardsRepeatRule$ShardsStatement.evaluate(BaseDistributedSearchTestCase.java:968)
	at com.carrotsearch.randomizedtesting.rules.SystemPropertiesRestoreRule$1.evaluate(SystemPropertiesRestoreRule.java:57)
	at org.apache.lucene.util.TestRuleSetupTeardownChained$1.evaluate(TestRuleSetupTeardownChained.java:49)
	at org.apache.lucene.util.AbstractBeforeAfterRule$1.evaluate(AbstractBeforeAfterRule.java:45)
	at org.apache.lucene.util.TestRuleThreadAndTestName$1.evaluate(TestRuleThreadAndTestName.java:48)
	at org.apache.lucene.util.TestRuleIgnoreAfterMaxFailures$1.evaluate(TestRuleIgnoreAfterMaxFailures.java:64)
	at org.apache.lucene.util.TestRuleMarkFailure$1.evaluate(TestRuleMarkFailure.java:47)
	at com.carrotsearch.randomizedtesting.rules.StatementAdapter.evaluate(StatementAdapter.java:36)
	at com.carrotsearch.randomizedtesting.ThreadLeakControl$StatementRunner.run(ThreadLeakControl.java:368)
	at com.carrotsearch.randomizedtesting.ThreadLeakControl.forkTimeoutingTask(ThreadLeakControl.java:817)
	at com.carrotsearch.randomizedtesting.ThreadLeakControl$3.evaluate(ThreadLeakControl.java:468)
	at com.carrotsearch.randomizedtesting.RandomizedRunner.runSingleTest(RandomizedRunner.java:943)
	at com.carrotsearch.randomizedtesting.RandomizedRunner$5.evaluate(RandomizedRunner.java:829)
	at com.carrotsearch.randomizedtesting.RandomizedRunner$6.evaluate(RandomizedRunner.java:879)
	at com.carrotsearch.randomizedtesting.RandomizedRunner$7.evaluate(RandomizedRunner.java:890)
	at com.carrotsearch.randomizedtesting.rules.StatementAdapter.evaluate(StatementAdapter.java:36)
	at com.carrotsearch.randomizedtesting.rules.SystemPropertiesRestoreRule$1.evaluate(SystemPropertiesRestoreRule.java:57)
	at org.apache.lucene.util.AbstractBeforeAfterRule$1.evaluate(AbstractBeforeAfterRule.java:45)
	at com.carrotsearch.randomizedtesting.rules.StatementAdapter.evaluate(StatementAdapter.java:36)
	at org.apache.lucene.util.TestRuleStoreClassName$1.evaluate(TestRuleStoreClassName.java:41)
	at com.carrotsearch.randomizedtesting.rules.NoShadowingOrOverridesOnMethodsRule$1.evaluate(NoShadowingOrOverridesOnMethodsRule.java:40)
	at com.carrotsearch.randomizedtesting.rules.NoShadowingOrOverridesOnMethodsRule$1.evaluate(NoShadowingOrOverridesOnMethodsRule.java:40)
	at com.carrotsearch.randomizedtesting.rules.StatementAdapter.evaluate(StatementAdapter.java:36)
	at com.carrotsearch.randomizedtesting.rules.StatementAdapter.evaluate(StatementAdapter.java:36)
	at com.carrotsearch.randomizedtesting.rules.StatementAdapter.evaluate(StatementAdapter.java:36)
	at org.apache.lucene.util.TestRuleAssertionsRequired$1.evaluate(TestRuleAssertionsRequired.java:53)
	at org.apache.lucene.util.TestRuleMarkFailure$1.evaluate(TestRuleMarkFailure.java:47)
	at org.apache.lucene.util.TestRuleIgnoreAfterMaxFailures$1.evaluate(TestRuleIgnoreAfterMaxFailures.java:64)
	at org.apache.lucene.util.TestRuleIgnoreTestSuites$1.evaluate(TestRuleIgnoreTestSuites.java:54)
	at com.carrotsearch.randomizedtesting.rules.StatementAdapter.evaluate(StatementAdapter.java:36)
	at com.carrotsearch.randomizedtesting.ThreadLeakControl$StatementRunner.run(ThreadLeakControl.java:368)
	at java.lang.Thread.run(Thread.java:748)
Caused by: org.apache.zookeeper.KeeperException$SessionExpiredException: KeeperErrorCode = Session expired for /collections/collection1/state.json
	at org.apache.zookeeper.KeeperException.create(KeeperException.java:127)
	at org.apache.zookeeper.KeeperException.create(KeeperException.java:51)
	at org.apache.zookeeper.ZooKeeper.getData(ZooKeeper.java:1212)
	at org.apache.solr.common.cloud.SolrZkClient$7.execute(SolrZkClient.java:357)
	at org.apache.solr.common.cloud.SolrZkClient$7.execute(SolrZkClient.java:354)
	at org.apache.solr.common.cloud.ZkCmdExecutor.retryOperation(ZkCmdExecutor.java:60)
	at org.apache.solr.common.cloud.SolrZkClient.getData(SolrZkClient.java:354)
	at org.apache.solr.common.cloud.ZkStateReader.fetchCollectionState(ZkStateReader.java:1127)
	at org.apache.solr.common.cloud.ZkStateReader.getCollectionLive(ZkStateReader.java:1113)
	... 38 more


FAILED:  org.apache.solr.cloud.TestTlogReplica.testKillTlogReplica

Error Message:
Replica core_node3 not up to date after 10 seconds expected:<1> but was:<0>

Stack Trace:
java.lang.AssertionError: Replica core_node3 not up to date after 10 seconds expected:<1> but was:<0>
	at __randomizedtesting.SeedInfo.seed([37A167B6A7C72C70:E893A3735664A37D]:0)
	at org.junit.Assert.fail(Assert.java:93)
	at org.junit.Assert.failNotEquals(Assert.java:647)
	at org.junit.Assert.assertEquals(Assert.java:128)
	at org.junit.Assert.assertEquals(Assert.java:472)
	at org.apache.solr.cloud.TestTlogReplica.waitForNumDocsInAllReplicas(TestTlogReplica.java:736)
	at org.apache.solr.cloud.TestTlogReplica.waitForNumDocsInAllReplicas(TestTlogReplica.java:724)
	at org.apache.solr.cloud.TestTlogReplica.waitForNumDocsInAllActiveReplicas(TestTlogReplica.java:720)
	at org.apache.solr.cloud.TestTlogReplica.waitForNumDocsInAllActiveReplicas(TestTlogReplica.java:715)
	at org.apache.solr.cloud.TestTlogReplica.testKillTlogReplica(TestTlogReplica.java:437)
	at sun.reflect.NativeMethodAccessorImpl.invoke0(Native Method)
	at sun.reflect.NativeMethodAccessorImpl.invoke(NativeMethodAccessorImpl.java:62)
	at sun.reflect.DelegatingMethodAccessorImpl.invoke(DelegatingMethodAccessorImpl.java:43)
	at java.lang.reflect.Method.invoke(Method.java:498)
	at com.carrotsearch.randomizedtesting.RandomizedRunner.invoke(RandomizedRunner.java:1737)
	at com.carrotsearch.randomizedtesting.RandomizedRunner$8.evaluate(RandomizedRunner.java:934)
	at com.carrotsearch.randomizedtesting.RandomizedRunner$9.evaluate(RandomizedRunner.java:970)
	at com.carrotsearch.randomizedtesting.RandomizedRunner$10.evaluate(RandomizedRunner.java:984)
	at com.carrotsearch.randomizedtesting.rules.SystemPropertiesRestoreRule$1.evaluate(SystemPropertiesRestoreRule.java:57)
	at org.apache.lucene.util.TestRuleSetupTeardownChained$1.evaluate(TestRuleSetupTeardownChained.java:49)
	at org.apache.lucene.util.AbstractBeforeAfterRule$1.evaluate(AbstractBeforeAfterRule.java:45)
	at org.apache.lucene.util.TestRuleThreadAndTestName$1.evaluate(TestRuleThreadAndTestName.java:48)
	at org.apache.lucene.util.TestRuleIgnoreAfterMaxFailures$1.evaluate(TestRuleIgnoreAfterMaxFailures.java:64)
	at org.apache.lucene.util.TestRuleMarkFailure$1.evaluate(TestRuleMarkFailure.java:47)
	at com.carrotsearch.randomizedtesting.rules.StatementAdapter.evaluate(StatementAdapter.java:36)
	at com.carrotsearch.randomizedtesting.ThreadLeakControl$StatementRunner.run(ThreadLeakControl.java:368)
	at com.carrotsearch.randomizedtesting.ThreadLeakControl.forkTimeoutingTask(ThreadLeakControl.java:817)
	at com.carrotsearch.randomizedtesting.ThreadLeakControl$3.evaluate(ThreadLeakControl.java:468)
	at com.carrotsearch.randomizedtesting.RandomizedRunner.runSingleTest(RandomizedRunner.java:943)
	at com.carrotsearch.randomizedtesting.RandomizedRunner$5.evaluate(RandomizedRunner.java:829)
	at com.carrotsearch.randomizedtesting.RandomizedRunner$6.evaluate(RandomizedRunner.java:879)
	at com.carrotsearch.randomizedtesting.RandomizedRunner$7.evaluate(RandomizedRunner.java:890)
	at com.carrotsearch.randomizedtesting.rules.StatementAdapter.evaluate(StatementAdapter.java:36)
	at com.carrotsearch.randomizedtesting.rules.SystemPropertiesRestoreRule$1.evaluate(SystemPropertiesRestoreRule.java:57)
	at org.apache.lucene.util.AbstractBeforeAfterRule$1.evaluate(AbstractBeforeAfterRule.java:45)
	at com.carrotsearch.randomizedtesting.rules.StatementAdapter.evaluate(StatementAdapter.java:36)
	at org.apache.lucene.util.TestRuleStoreClassName$1.evaluate(TestRuleStoreClassName.java:41)
	at com.carrotsearch.randomizedtesting.rules.NoShadowingOrOverridesOnMethodsRule$1.evaluate(NoShadowingOrOverridesOnMethodsRule.java:40)
	at com.carrotsearch.randomizedtesting.rules.NoShadowingOrOverridesOnMethodsRule$1.evaluate(NoShadowingOrOverridesOnMethodsRule.java:40)
	at com.carrotsearch.randomizedtesting.rules.StatementAdapter.evaluate(StatementAdapter.java:36)
	at com.carrotsearch.randomizedtesting.rules.StatementAdapter.evaluate(StatementAdapter.java:36)
	at com.carrotsearch.randomizedtesting.rules.StatementAdapter.evaluate(StatementAdapter.java:36)
	at org.apache.lucene.util.TestRuleAssertionsRequired$1.evaluate(TestRuleAssertionsRequired.java:53)
	at org.apache.lucene.util.TestRuleMarkFailure$1.evaluate(TestRuleMarkFailure.java:47)
	at org.apache.lucene.util.TestRuleIgnoreAfterMaxFailures$1.evaluate(TestRuleIgnoreAfterMaxFailures.java:64)
	at org.apache.lucene.util.TestRuleIgnoreTestSuites$1.evaluate(TestRuleIgnoreTestSuites.java:54)
	at com.carrotsearch.randomizedtesting.rules.StatementAdapter.evaluate(StatementAdapter.java:36)
	at com.carrotsearch.randomizedtesting.ThreadLeakControl$StatementRunner.run(ThreadLeakControl.java:368)
	at java.lang.Thread.run(Thread.java:748)


FAILED:  org.apache.solr.update.SoftAutoCommitTest.testSoftAndHardCommitMaxTimeDelete

Error Message:
searcher529 wasn't soon enough after soft529: Took 1143ms, >= acceptable 300ms (fudge)

Stack Trace:
java.lang.AssertionError: searcher529 wasn't soon enough after soft529: Took 1143ms, >= acceptable 300ms (fudge)
	at __randomizedtesting.SeedInfo.seed([37A167B6A7C72C70:F0EDDF2BBC6FE1C0]:0)
	at org.junit.Assert.fail(Assert.java:93)
	at org.junit.Assert.assertTrue(Assert.java:43)
	at org.apache.solr.update.SoftAutoCommitTest.testSoftAndHardCommitMaxTimeDelete(SoftAutoCommitTest.java:366)
	at sun.reflect.NativeMethodAccessorImpl.invoke0(Native Method)
	at sun.reflect.NativeMethodAccessorImpl.invoke(NativeMethodAccessorImpl.java:62)
	at sun.reflect.DelegatingMethodAccessorImpl.invoke(DelegatingMethodAccessorImpl.java:43)
	at java.lang.reflect.Method.invoke(Method.java:498)
	at com.carrotsearch.randomizedtesting.RandomizedRunner.invoke(RandomizedRunner.java:1737)
	at com.carrotsearch.randomizedtesting.RandomizedRunner$8.evaluate(RandomizedRunner.java:934)
	at com.carrotsearch.randomizedtesting.RandomizedRunner$9.evaluate(RandomizedRunner.java:970)
	at com.carrotsearch.randomizedtesting.RandomizedRunner$10.evaluate(RandomizedRunner.java:984)
	at com.carrotsearch.randomizedtesting.rules.SystemPropertiesRestoreRule$1.evaluate(SystemPropertiesRestoreRule.java:57)
	at org.apache.lucene.util.TestRuleSetupTeardownChained$1.evaluate(TestRuleSetupTeardownChained.java:49)
	at org.apache.lucene.util.AbstractBeforeAfterRule$1.evaluate(AbstractBeforeAfterRule.java:45)
	at org.apache.lucene.util.TestRuleThreadAndTestName$1.evaluate(TestRuleThreadAndTestName.java:48)
	at org.apache.lucene.util.TestRuleIgnoreAfterMaxFailures$1.evaluate(TestRuleIgnoreAfterMaxFailures.java:64)
	at org.apache.lucene.util.TestRuleMarkFailure$1.evaluate(TestRuleMarkFailure.java:47)
	at com.carrotsearch.randomizedtesting.rules.StatementAdapter.evaluate(StatementAdapter.java:36)
	at com.carrotsearch.randomizedtesting.ThreadLeakControl$StatementRunner.run(ThreadLeakControl.java:368)
	at com.carrotsearch.randomizedtesting.ThreadLeakControl.forkTimeoutingTask(ThreadLeakControl.java:817)
	at com.carrotsearch.randomizedtesting.ThreadLeakControl$3.evaluate(ThreadLeakControl.java:468)
	at com.carrotsearch.randomizedtesting.RandomizedRunner.runSingleTest(RandomizedRunner.java:943)
	at com.carrotsearch.randomizedtesting.RandomizedRunner$5.evaluate(RandomizedRunner.java:829)
	at com.carrotsearch.randomizedtesting.RandomizedRunner$6.evaluate(RandomizedRunner.java:879)
	at com.carrotsearch.randomizedtesting.RandomizedRunner$7.evaluate(RandomizedRunner.java:890)
	at com.carrotsearch.randomizedtesting.rules.StatementAdapter.evaluate(StatementAdapter.java:36)
	at com.carrotsearch.randomizedtesting.rules.SystemPropertiesRestoreRule$1.evaluate(SystemPropertiesRestoreRule.java:57)
	at org.apache.lucene.util.AbstractBeforeAfterRule$1.evaluate(AbstractBeforeAfterRule.java:45)
	at com.carrotsearch.randomizedtesting.rules.StatementAdapter.evaluate(StatementAdapter.java:36)
	at org.apache.lucene.util.TestRuleStoreClassName$1.evaluate(TestRuleStoreClassName.java:41)
	at com.carrotsearch.randomizedtesting.rules.NoShadowingOrOverridesOnMethodsRule$1.evaluate(NoShadowingOrOverridesOnMethodsRule.java:40)
	at com.carrotsearch.randomizedtesting.rules.NoShadowingOrOverridesOnMethodsRule$1.evaluate(NoShadowingOrOverridesOnMethodsRule.java:40)
	at com.carrotsearch.randomizedtesting.rules.StatementAdapter.evaluate(StatementAdapter.java:36)
	at com.carrotsearch.randomizedtesting.rules.StatementAdapter.evaluate(StatementAdapter.java:36)
	at com.carrotsearch.randomizedtesting.rules.StatementAdapter.evaluate(StatementAdapter.java:36)
	at org.apache.lucene.util.TestRuleAssertionsRequired$1.evaluate(TestRuleAssertionsRequired.java:53)
	at org.apache.lucene.util.TestRuleMarkFailure$1.evaluate(TestRuleMarkFailure.java:47)
	at org.apache.lucene.util.TestRuleIgnoreAfterMaxFailures$1.evaluate(TestRuleIgnoreAfterMaxFailures.java:64)
	at org.apache.lucene.util.TestRuleIgnoreTestSuites$1.evaluate(TestRuleIgnoreTestSuites.java:54)
	at com.carrotsearch.randomizedtesting.rules.StatementAdapter.evaluate(StatementAdapter.java:36)
	at com.carrotsearch.randomizedtesting.ThreadLeakControl$StatementRunner.run(ThreadLeakControl.java:368)
	at java.lang.Thread.run(Thread.java:748)


FAILED:  org.apache.solr.cloud.LeaderElectionContextKeyTest.test

Error Message:


Stack Trace:
java.lang.AssertionError
	at __randomizedtesting.SeedInfo.seed([37A167B6A7C72C70:BFF5586C093B4188]:0)
	at org.junit.Assert.fail(Assert.java:92)
	at org.junit.Assert.assertTrue(Assert.java:43)
	at org.junit.Assert.assertTrue(Assert.java:54)
	at org.apache.solr.cloud.LeaderElectionContextKeyTest.test(LeaderElectionContextKeyTest.java:88)
	at sun.reflect.NativeMethodAccessorImpl.invoke0(Native Method)
	at sun.reflect.NativeMethodAccessorImpl.invoke(NativeMethodAccessorImpl.java:62)
	at sun.reflect.DelegatingMethodAccessorImpl.invoke(DelegatingMethodAccessorImpl.java:43)
	at java.lang.reflect.Method.invoke(Method.java:498)
	at com.carrotsearch.randomizedtesting.RandomizedRunner.invoke(RandomizedRunner.java:1737)
	at com.carrotsearch.randomizedtesting.RandomizedRunner$8.evaluate(RandomizedRunner.java:934)
	at com.carrotsearch.randomizedtesting.RandomizedRunner$9.evaluate(RandomizedRunner.java:970)
	at com.carrotsearch.randomizedtesting.RandomizedRunner$10.evaluate(RandomizedRunner.java:984)
	at com.carrotsearch.randomizedtesting.rules.SystemPropertiesRestoreRule$1.evaluate(SystemPropertiesRestoreRule.java:57)
	at org.apache.lucene.util.TestRuleSetupTeardownChained$1.evaluate(TestRuleSetupTeardownChained.java:49)
	at org.apache.lucene.util.AbstractBeforeAfterRule$1.evaluate(AbstractBeforeAfterRule.java:45)
	at org.apache.lucene.util.TestRuleThreadAndTestName$1.evaluate(TestRuleThreadAndTestName.java:48)
	at org.apache.lucene.util.TestRuleIgnoreAfterMaxFailures$1.evaluate(TestRuleIgnoreAfterMaxFailures.java:64)
	at org.apache.lucene.util.TestRuleMarkFailure$1.evaluate(TestRuleMarkFailure.java:47)
	at com.carrotsearch.randomizedtesting.rules.StatementAdapter.evaluate(StatementAdapter.java:36)
	at com.carrotsearch.randomizedtesting.ThreadLeakControl$StatementRunner.run(ThreadLeakControl.java:368)
	at com.carrotsearch.randomizedtesting.ThreadLeakControl.forkTimeoutingTask(ThreadLeakControl.java:817)
	at com.carrotsearch.randomizedtesting.ThreadLeakControl$3.evaluate(ThreadLeakControl.java:468)
	at com.carrotsearch.randomizedtesting.RandomizedRunner.runSingleTest(RandomizedRunner.java:943)
	at com.carrotsearch.randomizedtesting.RandomizedRunner$5.evaluate(RandomizedRunner.java:829)
	at com.carrotsearch.randomizedtesting.RandomizedRunner$6.evaluate(RandomizedRunner.java:879)
	at com.carrotsearch.randomizedtesting.RandomizedRunner$7.evaluate(RandomizedRunner.java:890)
	at com.carrotsearch.randomizedtesting.rules.StatementAdapter.evaluate(StatementAdapter.java:36)
	at com.carrotsearch.randomizedtesting.rules.SystemPropertiesRestoreRule$1.evaluate(SystemPropertiesRestoreRule.java:57)
	at org.apache.lucene.util.AbstractBeforeAfterRule$1.evaluate(AbstractBeforeAfterRule.java:45)
	at com.carrotsearch.randomizedtesting.rules.StatementAdapter.evaluate(StatementAdapter.java:36)
	at org.apache.lucene.util.TestRuleStoreClassName$1.evaluate(TestRuleStoreClassName.java:41)
	at com.carrotsearch.randomizedtesting.rules.NoShadowingOrOverridesOnMethodsRule$1.evaluate(NoShadowingOrOverridesOnMethodsRule.java:40)
	at com.carrotsearch.randomizedtesting.rules.NoShadowingOrOverridesOnMethodsRule$1.evaluate(NoShadowingOrOverridesOnMethodsRule.java:40)
	at com.carrotsearch.randomizedtesting.rules.StatementAdapter.evaluate(StatementAdapter.java:36)
	at com.carrotsearch.randomizedtesting.rules.StatementAdapter.evaluate(StatementAdapter.java:36)
	at com.carrotsearch.randomizedtesting.rules.StatementAdapter.evaluate(StatementAdapter.java:36)
	at org.apache.lucene.util.TestRuleAssertionsRequired$1.evaluate(TestRuleAssertionsRequired.java:53)
	at org.apache.lucene.util.TestRuleMarkFailure$1.evaluate(TestRuleMarkFailure.java:47)
	at org.apache.lucene.util.TestRuleIgnoreAfterMaxFailures$1.evaluate(TestRuleIgnoreAfterMaxFailures.java:64)
	at org.apache.lucene.util.TestRuleIgnoreTestSuites$1.evaluate(TestRuleIgnoreTestSuites.java:54)
	at com.carrotsearch.randomizedtesting.rules.StatementAdapter.evaluate(StatementAdapter.java:36)
	at com.carrotsearch.randomizedtesting.ThreadLeakControl$StatementRunner.run(ThreadLeakControl.java:368)
	at java.lang.Thread.run(Thread.java:748)


FAILED:  org.apache.solr.cloud.TestTlogReplica.testOnlyLeaderIndexes

Error Message:
expected:<2> but was:<4>

Stack Trace:
java.lang.AssertionError: expected:<2> but was:<4>
	at __randomizedtesting.SeedInfo.seed([37A167B6A7C72C70:2BA01A3BD26252E3]:0)
	at org.junit.Assert.fail(Assert.java:93)
	at org.junit.Assert.failNotEquals(Assert.java:647)
	at org.junit.Assert.assertEquals(Assert.java:128)
	at org.junit.Assert.assertEquals(Assert.java:472)
	at org.junit.Assert.assertEquals(Assert.java:456)
	at org.apache.solr.cloud.TestTlogReplica.assertCopyOverOldUpdates(TestTlogReplica.java:909)
	at org.apache.solr.cloud.TestTlogReplica.testOnlyLeaderIndexes(TestTlogReplica.java:501)
	at sun.reflect.NativeMethodAccessorImpl.invoke0(Native Method)
	at sun.reflect.NativeMethodAccessorImpl.invoke(NativeMethodAccessorImpl.java:62)
	at sun.reflect.DelegatingMethodAccessorImpl.invoke(DelegatingMethodAccessorImpl.java:43)
	at java.lang.reflect.Method.invoke(Method.java:498)
	at com.carrotsearch.randomizedtesting.RandomizedRunner.invoke(RandomizedRunner.java:1737)
	at com.carrotsearch.randomizedtesting.RandomizedRunner$8.evaluate(RandomizedRunner.java:934)
	at com.carrotsearch.randomizedtesting.RandomizedRunner$9.evaluate(RandomizedRunner.java:970)
	at com.carrotsearch.randomizedtesting.RandomizedRunner$10.evaluate(RandomizedRunner.java:984)
	at com.carrotsearch.randomizedtesting.rules.SystemPropertiesRestoreRule$1.evaluate(SystemPropertiesRestoreRule.java:57)
	at org.apache.lucene.util.TestRuleSetupTeardownChained$1.evaluate(TestRuleSetupTeardownChained.java:49)
	at org.apache.lucene.util.AbstractBeforeAfterRule$1.evaluate(AbstractBeforeAfterRule.java:45)
	at org.apache.lucene.util.TestRuleThreadAndTestName$1.evaluate(TestRuleThreadAndTestName.java:48)
	at org.apache.lucene.util.TestRuleIgnoreAfterMaxFailures$1.evaluate(TestRuleIgnoreAfterMaxFailures.java:64)
	at org.apache.lucene.util.TestRuleMarkFailure$1.evaluate(TestRuleMarkFailure.java:47)
	at com.carrotsearch.randomizedtesting.rules.StatementAdapter.evaluate(StatementAdapter.java:36)
	at com.carrotsearch.randomizedtesting.ThreadLeakControl$StatementRunner.run(ThreadLeakControl.java:368)
	at com.carrotsearch.randomizedtesting.ThreadLeakControl.forkTimeoutingTask(ThreadLeakControl.java:817)
	at com.carrotsearch.randomizedtesting.ThreadLeakControl$3.evaluate(ThreadLeakControl.java:468)
	at com.carrotsearch.randomizedtesting.RandomizedRunner.runSingleTest(RandomizedRunner.java:943)
	at com.carrotsearch.randomizedtesting.RandomizedRunner$5.evaluate(RandomizedRunner.java:829)
	at com.carrotsearch.randomizedtesting.RandomizedRunner$6.evaluate(RandomizedRunner.java:879)
	at com.carrotsearch.randomizedtesting.RandomizedRunner$7.evaluate(RandomizedRunner.java:890)
	at com.carrotsearch.randomizedtesting.rules.StatementAdapter.evaluate(StatementAdapter.java:36)
	at com.carrotsearch.randomizedtesting.rules.SystemPropertiesRestoreRule$1.evaluate(SystemPropertiesRestoreRule.java:57)
	at org.apache.lucene.util.AbstractBeforeAfterRule$1.evaluate(AbstractBeforeAfterRule.java:45)
	at com.carrotsearch.randomizedtesting.rules.StatementAdapter.evaluate(StatementAdapter.java:36)
	at org.apache.lucene.util.TestRuleStoreClassName$1.evaluate(TestRuleStoreClassName.java:41)
	at com.carrotsearch.randomizedtesting.rules.NoShadowingOrOverridesOnMethodsRule$1.evaluate(NoShadowingOrOverridesOnMethodsRule.java:40)
	at com.carrotsearch.randomizedtesting.rules.NoShadowingOrOverridesOnMethodsRule$1.evaluate(NoShadowingOrOverridesOnMethodsRule.java:40)
	at com.carrotsearch.randomizedtesting.rules.StatementAdapter.evaluate(StatementAdapter.java:36)
	at com.carrotsearch.randomizedtesting.rules.StatementAdapter.evaluate(StatementAdapter.java:36)
	at com.carrotsearch.randomizedtesting.rules.StatementAdapter.evaluate(StatementAdapter.java:36)
	at org.apache.lucene.util.TestRuleAssertionsRequired$1.evaluate(TestRuleAssertionsRequired.java:53)
	at org.apache.lucene.util.TestRuleMarkFailure$1.evaluate(TestRuleMarkFailure.java:47)
	at org.apache.lucene.util.TestRuleIgnoreAfterMaxFailures$1.evaluate(TestRuleIgnoreAfterMaxFailures.java:64)
	at org.apache.lucene.util.TestRuleIgnoreTestSuites$1.evaluate(TestRuleIgnoreTestSuites.java:54)
	at com.carrotsearch.randomizedtesting.rules.StatementAdapter.evaluate(StatementAdapter.java:36)
	at com.carrotsearch.randomizedtesting.ThreadLeakControl$StatementRunner.run(ThreadLeakControl.java:368)
	at java.lang.Thread.run(Thread.java:748)




Build Log:
[...truncated 11901 lines...]
   [junit4] Suite: org.apache.solr.cloud.TestAuthenticationFramework
   [junit4]   2> 1097542 INFO  (SUITE-TestAuthenticationFramework-seed#[37A167B6A7C72C70]-worker) [    ] o.a.s.SolrTestCaseJ4 SecureRandom sanity checks: test.solr.allowed.securerandom=null & java.security.egd=file:/dev/./urandom
   [junit4]   2> Creating dataDir: /x1/jenkins/jenkins-slave/workspace/Lucene-Solr-Tests-7.x/solr/build/solr-core/test/J0/temp/solr.cloud.TestAuthenticationFramework_37A167B6A7C72C70-001/init-core-data-001
   [junit4]   2> 1097542 WARN  (SUITE-TestAuthenticationFramework-seed#[37A167B6A7C72C70]-worker) [    ] o.a.s.SolrTestCaseJ4 startTrackingSearchers: numOpens=14 numCloses=14
   [junit4]   2> 1097568 INFO  (SUITE-TestAuthenticationFramework-seed#[37A167B6A7C72C70]-worker) [    ] o.a.s.SolrTestCaseJ4 Using PointFields (NUMERIC_POINTS_SYSPROP=true) w/NUMERIC_DOCVALUES_SYSPROP=true
   [junit4]   2> 1097637 INFO  (SUITE-TestAuthenticationFramework-seed#[37A167B6A7C72C70]-worker) [    ] o.a.s.SolrTestCaseJ4 Randomized ssl (true) and clientAuth (false) via: @org.apache.solr.util.RandomizeSSL(reason=, ssl=NaN, value=NaN, clientAuth=NaN)
   [junit4]   2> 1097704 INFO  (TEST-TestAuthenticationFramework.testBasics-seed#[37A167B6A7C72C70]) [    ] o.a.s.c.MiniSolrCloudCluster Starting cluster of 2 servers in /x1/jenkins/jenkins-slave/workspace/Lucene-Solr-Tests-7.x/solr/build/solr-core/test/J0/temp/solr.cloud.TestAuthenticationFramework_37A167B6A7C72C70-001/tempDir-001
   [junit4]   2> 1097705 INFO  (TEST-TestAuthenticationFramework.testBasics-seed#[37A167B6A7C72C70]) [    ] o.a.s.c.ZkTestServer STARTING ZK TEST SERVER
   [junit4]   2> 1097719 INFO  (Thread-159) [    ] o.a.s.c.ZkTestServer client port:0.0.0.0/0.0.0.0:0
   [junit4]   2> 1097719 INFO  (Thread-159) [    ] o.a.s.c.ZkTestServer Starting server
   [junit4]   2> 1097819 INFO  (TEST-TestAuthenticationFramework.testBasics-seed#[37A167B6A7C72C70]) [    ] o.a.s.c.ZkTestServer start zk server on port:52481
   [junit4]   2> 1097887 ERROR (Thread-159) [    ] o.a.z.s.ZooKeeperServer ZKShutdownHandler is not registered, so ZooKeeper server won't take any action on ERROR or SHUTDOWN server state changes
   [junit4]   2> 1098273 INFO  (jetty-launcher-183-thread-2) [    ] o.e.j.s.Server jetty-9.3.20.v20170531
   [junit4]   2> 1098275 INFO  (jetty-launcher-183-thread-2) [    ] o.e.j.s.h.ContextHandler Started o.e.j.s.ServletContextHandler@4f0f42af{/solr,null,AVAILABLE}
   [junit4]   2> 1098277 INFO  (jetty-launcher-183-thread-2) [    ] o.e.j.s.AbstractConnector Started ServerConnector@643dc5c2{SSL,[ssl, http/1.1]}{127.0.0.1:45019}
   [junit4]   2> 1098277 INFO  (jetty-launcher-183-thread-2) [    ] o.e.j.s.Server Started @1120129ms
   [junit4]   2> 1098277 INFO  (jetty-launcher-183-thread-2) [    ] o.a.s.c.s.e.JettySolrRunner Jetty properties: {hostContext=/solr, hostPort=45019}
   [junit4]   2> 1098277 ERROR (jetty-launcher-183-thread-2) [    ] o.a.s.u.StartupLoggingUtils Missing Java Option solr.log.dir. Logging may be missing or incomplete.
   [junit4]   2> 1098277 INFO  (jetty-launcher-183-thread-2) [    ] o.a.s.s.SolrDispatchFilter  ___      _       Welcome to Apache Solr? version 7.1.0
   [junit4]   2> 1098277 INFO  (jetty-launcher-183-thread-2) [    ] o.a.s.s.SolrDispatchFilter / __| ___| |_ _   Starting in cloud mode on port null
   [junit4]   2> 1098277 INFO  (jetty-launcher-183-thread-2) [    ] o.a.s.s.SolrDispatchFilter \__ \/ _ \ | '_|  Install dir: null, Default config dir: null
   [junit4]   2> 1098277 INFO  (jetty-launcher-183-thread-2) [    ] o.a.s.s.SolrDispatchFilter |___/\___/_|_|    Start time: 2017-10-08T18:16:40.295Z
   [junit4]   2> 1098307 INFO  (jetty-launcher-183-thread-1) [    ] o.e.j.s.Server jetty-9.3.20.v20170531
   [junit4]   2> 1098386 INFO  (jetty-launcher-183-thread-1) [    ] o.e.j.s.h.ContextHandler Started o.e.j.s.ServletContextHandler@57ce6a4f{/solr,null,AVAILABLE}
   [junit4]   2> 1098387 INFO  (jetty-launcher-183-thread-1) [    ] o.e.j.s.AbstractConnector Started ServerConnector@5fc7666d{SSL,[ssl, http/1.1]}{127.0.0.1:50121}
   [junit4]   2> 1098387 INFO  (jetty-launcher-183-thread-1) [    ] o.e.j.s.Server Started @1120240ms
   [junit4]   2> 1098387 INFO  (jetty-launcher-183-thread-1) [    ] o.a.s.c.s.e.JettySolrRunner Jetty properties: {hostContext=/solr, hostPort=50121}
   [junit4]   2> 1098387 ERROR (jetty-launcher-183-thread-1) [    ] o.a.s.u.StartupLoggingUtils Missing Java Option solr.log.dir. Logging may be missing or incomplete.
   [junit4]   2> 1098387 INFO  (jetty-launcher-183-thread-1) [    ] o.a.s.s.SolrDispatchFilter  ___      _       Welcome to Apache Solr? version 7.1.0
   [junit4]   2> 1098387 INFO  (jetty-launcher-183-thread-1) [    ] o.a.s.s.SolrDispatchFilter / __| ___| |_ _   Starting in cloud mode on port null
   [junit4]   2> 1098387 INFO  (jetty-launcher-183-thread-1) [    ] o.a.s.s.SolrDispatchFilter \__ \/ _ \ | '_|  Install dir: null, Default config dir: null
   [junit4]   2> 1098387 INFO  (jetty-launcher-183-thread-1) [    ] o.a.s.s.SolrDispatchFilter |___/\___/_|_|    Start time: 2017-10-08T18:16:40.405Z
   [junit4]   2> 1098536 INFO  (jetty-launcher-183-thread-1) [    ] o.a.s.s.SolrDispatchFilter solr.xml found in ZooKeeper. Loading...
   [junit4]   2> 1098720 INFO  (jetty-launcher-183-thread-1) [    ] o.a.s.c.ZkContainer Zookeeper client=127.0.0.1:52481/solr
   [junit4]   2> 1098767 INFO  (jetty-launcher-183-thread-2) [    ] o.a.s.s.SolrDispatchFilter solr.xml found in ZooKeeper. Loading...
   [junit4]   2> 1099540 INFO  (jetty-launcher-183-thread-2) [    ] o.a.s.c.ZkContainer Zookeeper client=127.0.0.1:52481/solr
   [junit4]   2> 1099518 WARN  (NIOServerCxn.Factory:0.0.0.0/0.0.0.0:0) [    ] o.a.z.s.NIOServerCnxn caught end of stream exception
   [junit4]   2> EndOfStreamException: Unable to read additional data from client sessionid 0x15efd340a4d0002, likely client has closed socket
   [junit4]   2> 	at org.apache.zookeeper.server.NIOServerCnxn.doIO(NIOServerCnxn.java:239)
   [junit4]   2> 	at org.apache.zookeeper.server.NIOServerCnxnFactory.run(NIOServerCnxnFactory.java:203)
   [junit4]   2> 	at java.lang.Thread.run(Thread.java:748)
   [junit4]   2> 1100527 WARN  (NIOServerCxn.Factory:0.0.0.0/0.0.0.0:0) [    ] o.a.z.s.NIOServerCnxn caught end of stream exception
   [junit4]   2> EndOfStreamException: Unable to read additional data from client sessionid 0x15efd340a4d0005, likely client has closed socket
   [junit4]   2> 	at org.apache.zookeeper.server.NIOServerCnxn.doIO(NIOServerCnxn.java:239)
   [junit4]   2> 	at org.apache.zookeeper.server.NIOServerCnxnFactory.run(NIOServerCnxnFactory.java:203)
   [junit4]   2> 	at java.lang.Thread.run(Thread.java:748)
   [junit4]   2> 1100824 INFO  (jetty-launcher-183-thread-1) [n:127.0.0.1:50121_solr    ] o.a.s.c.Overseer Overseer (id=null) closing
   [junit4]   2> 1100825 INFO  (jetty-launcher-183-thread-1) [n:127.0.0.1:50121_solr    ] o.a.s.c.OverseerElectionContext I am going to be the leader 127.0.0.1:50121_solr
   [junit4]   2> 1100843 INFO  (jetty-launcher-183-thread-1) [n:127.0.0.1:50121_solr    ] o.a.s.c.Overseer Overseer (id=98794641801674756-127.0.0.1:50121_solr-n_0000000000) starting
   [junit4]   2> 1100863 INFO  (jetty-launcher-183-thread-1) [n:127.0.0.1:50121_solr    ] o.a.s.c.ZkController Register node as live in ZooKeeper:/live_nodes/127.0.0.1:50121_solr
   [junit4]   2> 1100910 INFO  (OverseerStateUpdate-98794641801674756-127.0.0.1:50121_solr-n_0000000000) [n:127.0.0.1:50121_solr    ] o.a.s.c.c.ZkStateReader Updated live nodes from ZooKeeper... (0) -> (1)
   [junit4]   2> 1101044 INFO  (jetty-launcher-183-thread-1) [n:127.0.0.1:50121_solr    ] o.a.s.c.CoreContainer Initializing authentication plugin: org.apache.solr.cloud.TestAuthenticationFramework$MockAuthenticationPlugin
   [junit4]   2> 1102305 INFO  (jetty-launcher-183-thread-1) [n:127.0.0.1:50121_solr    ] o.a.s.m.r.SolrJmxReporter JMX monitoring for 'solr_50121.solr.node' (registry 'solr.node') enabled at server: com.sun.jmx.mbeanserver.JmxMBeanServer@42d761ac
   [junit4]   2> 1102309 INFO  (jetty-launcher-183-thread-2) [n:127.0.0.1:45019_solr    ] o.a.s.c.c.ZkStateReader Updated live nodes from ZooKeeper... (0) -> (1)
   [junit4]   2> 1102310 INFO  (jetty-launcher-183-thread-2) [n:127.0.0.1:45019_solr    ] o.a.s.c.Overseer Overseer (id=null) closing
   [junit4]   2> 1102312 INFO  (jetty-launcher-183-thread-2) [n:127.0.0.1:45019_solr    ] o.a.s.c.ZkController Register node as live in ZooKeeper:/live_nodes/127.0.0.1:45019_solr
   [junit4]   2> 1102313 INFO  (zkCallback-191-thread-1-processing-n:127.0.0.1:50121_solr) [n:127.0.0.1:50121_solr    ] o.a.s.c.c.ZkStateReader Updated live nodes from ZooKeeper... (1) -> (2)
   [junit4]   2> 1102351 INFO  (zkCallback-196-thread-1-processing-n:127.0.0.1:45019_solr) [n:127.0.0.1:45019_solr    ] o.a.s.c.c.ZkStateReader Updated live nodes from ZooKeeper... (1) -> (2)
   [junit4]   2> 1102453 INFO  (jetty-launcher-183-thread-1) [n:127.0.0.1:50121_solr    ] o.a.s.m.r.SolrJmxReporter JMX monitoring for 'solr_50121.solr.jvm' (registry 'solr.jvm') enabled at server: com.sun.jmx.mbeanserver.JmxMBeanServer@42d761ac
   [junit4]   2> 1102453 INFO  (jetty-launcher-183-thread-1) [n:127.0.0.1:50121_solr    ] o.a.s.m.r.SolrJmxReporter JMX monitoring for 'solr_50121.solr.jetty' (registry 'solr.jetty') enabled at server: com.sun.jmx.mbeanserver.JmxMBeanServer@42d761ac
   [junit4]   2> 1102454 INFO  (jetty-launcher-183-thread-1) [n:127.0.0.1:50121_solr    ] o.a.s.c.CorePropertiesLocator Found 0 core definitions underneath /x1/jenkins/jenkins-slave/workspace/Lucene-Solr-Tests-7.x/solr/build/solr-core/test/J0/temp/solr.cloud.TestAuthenticationFramework_37A167B6A7C72C70-001/tempDir-001/node1/.
   [junit4]   2> 1102888 INFO  (jetty-launcher-183-thread-2) [n:127.0.0.1:45019_solr    ] o.a.s.c.CoreContainer Initializing authentication plugin: org.apache.solr.cloud.TestAuthenticationFramework$MockAuthenticationPlugin
   [junit4]   2> 1103782 INFO  (jetty-launcher-183-thread-2) [n:127.0.0.1:45019_solr    ] o.a.s.m.r.SolrJmxReporter JMX monitoring for 'solr_45019.solr.node' (registry 'solr.node') enabled at server: com.sun.jmx.mbeanserver.JmxMBeanServer@42d761ac
   [junit4]   2> 1103819 INFO  (jetty-launcher-183-thread-2) [n:127.0.0.1:45019_solr    ] o.a.s.m.r.SolrJmxReporter JMX monitoring for 'solr_45019.solr.jvm' (registry 'solr.jvm') enabled at server: com.sun.jmx.mbeanserver.JmxMBeanServer@42d761ac
   [junit4]   2> 1103819 INFO  (jetty-launcher-183-thread-2) [n:127.0.0.1:45019_solr    ] o.a.s.m.r.SolrJmxReporter JMX monitoring for 'solr_45019.solr.jetty' (registry 'solr.jetty') enabled at server: com.sun.jmx.mbeanserver.JmxMBeanServer@42d761ac
   [junit4]   2> 1103820 INFO  (jetty-launcher-183-thread-2) [n:127.0.0.1:45019_solr    ] o.a.s.c.CorePropertiesLocator Found 0 core definitions underneath /x1/jenkins/jenkins-slave/workspace/Lucene-Solr-Tests-7.x/solr/build/solr-core/test/J0/temp/solr.cloud.TestAuthenticationFramework_37A167B6A7C72C70-001/tempDir-001/node2/.
   [junit4]   2> 1104780 INFO  (TEST-TestAuthenticationFramework.testBasics-seed#[37A167B6A7C72C70]) [    ] o.a.s.c.c.ZkStateReader Updated live nodes from ZooKeeper... (0) -> (2)
   [junit4]   2> 1104787 INFO  (TEST-TestAuthenticationFramework.testBasics-seed#[37A167B6A7C72C70]) [    ] o.a.s.c.s.i.ZkClientClusterStateProvider Cluster at 127.0.0.1:52481/solr ready
   [junit4]   2> 1104799 INFO  (TEST-TestAuthenticationFramework.testBasics-seed#[37A167B6A7C72C70]) [    ] o.a.s.SolrTestCaseJ4 ###Starting testBasics
   [junit4]   2> 1106487 INFO  (qtp1998280498-1992) [n:127.0.0.1:50121_solr    ] o.a.s.h.a.CollectionsHandler Invoked Collection Action :create with params async=16de94a8-1f52-4843-b497-75d4611ed3a9&replicationFactor=2&collection.configName=solrCloudCollectionConfig&maxShardsPerNode=2&name=testcollection&nrtReplicas=2&action=CREATE&numShards=2&wt=javabin&version=2 and sendToOCPQueue=true
   [junit4]   2> 1106489 INFO  (qtp1998280498-1992) [n:127.0.0.1:50121_solr    ] o.a.s.s.HttpSolrCall [admin] webapp=null path=/admin/collections params={async=16de94a8-1f52-4843-b497-75d4611ed3a9&replicationFactor=2&collection.configName=solrCloudCollectionConfig&maxShardsPerNode=2&name=testcollection&nrtReplicas=2&action=CREATE&numShards=2&wt=javabin&version=2} status=0 QTime=2
   [junit4]   2> 1106535 INFO  (OverseerThreadFactory-548-thread-1-processing-n:127.0.0.1:50121_solr) [n:127.0.0.1:50121_solr    ] o.a.s.c.CreateCollectionCmd Create collection testcollection
   [junit4]   2> 1106590 INFO  (qtp1998280498-1985) [n:127.0.0.1:50121_solr    ] o.a.s.h.a.CollectionsHandler Invoked Collection Action :requeststatus with params requestid=16de94a8-1f52-4843-b497-75d4611ed3a9&action=REQUESTSTATUS&wt=javabin&version=2 and sendToOCPQueue=true
   [junit4]   2> 1106591 INFO  (qtp1998280498-1985) [n:127.0.0.1:50121_solr    ] o.a.s.s.HttpSolrCall [admin] webapp=null path=/admin/collections params={requestid=16de94a8-1f52-4843-b497-75d4611ed3a9&action=REQUESTSTATUS&wt=javabin&version=2} status=0 QTime=0
   [junit4]   2> 1106666 INFO  (OverseerStateUpdate-98794641801674756-127.0.0.1:50121_solr-n_0000000000) [n:127.0.0.1:50121_solr    ] o.a.s.c.o.SliceMutator createReplica() {
   [junit4]   2>   "operation":"ADDREPLICA",
   [junit4]   2>   "collection":"testcollection",
   [junit4]   2>   "shard":"shard1",
   [junit4]   2>   "core":"testcollection_shard1_replica_n1",
   [junit4]   2>   "state":"down",
   [junit4]   2>   "base_url":"https://127.0.0.1:45019/solr",
   [junit4]   2>   "type":"NRT"} 
   [junit4]   2> 1106736 INFO  (OverseerStateUpdate-98794641801674756-127.0.0.1:50121_solr-n_0000000000) [n:127.0.0.1:50121_solr    ] o.a.s.c.o.SliceMutator createReplica() {
   [junit4]   2>   "operation":"ADDREPLICA",
   [junit4]   2>   "collection":"testcollection",
   [junit4]   2>   "shard":"shard1",
   [junit4]   2>   "core":"testcollection_shard1_replica_n2",
   [junit4]   2>   "state":"down",
   [junit4]   2>   "base_url":"https://127.0.0.1:50121/solr",
   [junit4]   2>   "type":"NRT"} 
   [junit4]   2> 1106737 INFO  (OverseerStateUpdate-98794641801674756-127.0.0.1:50121_solr-n_0000000000) [n:127.0.0.1:50121_solr    ] o.a.s.c.o.SliceMutator createReplica() {
   [junit4]   2>   "operation":"ADDREPLICA",
   [junit4]   2>   "collection":"testcollection",
   [junit4]   2>   "shard":"shard2",
   [junit4]   2>   "core":"testcollection_shard2_replica_n3",
   [junit4]   2>   "state":"down",
   [junit4]   2>   "base_url":"https://127.0.0.1:45019/solr",
   [junit4]   2>   "type":"NRT"} 
   [junit4]   2> 1106748 INFO  (OverseerStateUpdate-98794641801674756-127.0.0.1:50121_solr-n_0000000000) [n:127.0.0.1:50121_solr    ] o.a.s.c.o.SliceMutator createReplica() {
   [junit4]   2>   "operation":"ADDREPLICA",
   [junit4]   2>   "collection":"testcollection",
   [junit4]   2>   "shard":"shard2",
   [junit4]   2>   "core":"testcollection_shard2_replica_n4",
   [junit4]   2>   "state":"down",
   [junit4]   2>   "base_url":"https://127.0.0.1:50121/solr",
   [junit4]   2>   "type":"NRT"} 
   [junit4]   2> 1107911 INFO  (qtp1998280498-1988) [n:127.0.0.1:50121_solr    ] o.a.s.h.a.CollectionsHandler Invoked Collection Action :requeststatus with params requestid=16de94a8-1f52-4843-b497-75d4611ed3a9&action=REQUESTSTATUS&wt=javabin&version=2 and sendToOCPQueue=true
   [junit4]   2> 1107912 INFO  (qtp1998280498-1988) [n:127.0.0.1:50121_solr    ] o.a.s.s.HttpSolrCall [admin] webapp=null path=/admin/collections params={requestid=16de94a8-1f52-4843-b497-75d4611ed3a9&action=REQUESTSTATUS&wt=javabin&version=2} status=0 QTime=1
   [junit4]   2> 1107991 INFO  (qtp1998280498-1990) [n:127.0.0.1:50121_solr    ] o.a.s.s.HttpSolrCall [admin] webapp=null path=/admin/cores params={qt=/admin/cores&collection.configName=solrCloudCollectionConfig&newCollection=true&collection=testcollection&version=2&replicaType=NRT&async=16de94a8-1f52-4843-b497-75d4611ed3a97738535152413980&coreNodeName=core_node8&name=testcollection_shard2_replica_n4&action=CREATE&numShards=2&shard=shard2&wt=javabin} status=0 QTime=19
   [junit4]   2> 1108014 INFO  (parallelCoreAdminExecutor-549-thread-1-processing-n:127.0.0.1:50121_solr 16de94a8-1f52-4843-b497-75d4611ed3a97738535152413980 CREATE) [n:127.0.0.1:50121_solr    ] o.a.s.h.a.CoreAdminOperation core create command qt=/admin/cores&collection.configName=solrCloudCollectionConfig&newCollection=true&collection=testcollection&version=2&replicaType=NRT&async=16de94a8-1f52-4843-b497-75d4611ed3a97738535152413980&coreNodeName=core_node8&name=testcollection_shard2_replica_n4&action=CREATE&numShards=2&shard=shard2&wt=javabin
   [junit4]   2> 1108015 INFO  (parallelCoreAdminExecutor-549-thread-1-processing-n:127.0.0.1:50121_solr 16de94a8-1f52-4843-b497-75d4611ed3a97738535152413980 CREATE) [n:127.0.0.1:50121_solr    ] o.a.s.c.TransientSolrCoreCacheDefault Allocating transient cache for 2147483647 transient cores
   [junit4]   2> 1108435 INFO  (qtp1998280498-1991) [n:127.0.0.1:50121_solr    ] o.a.s.s.HttpSolrCall [admin] webapp=null path=/admin/cores params={qt=/admin/cores&collection.configName=solrCloudCollectionConfig&newCollection=true&collection=testcollection&version=2&replicaType=NRT&async=16de94a8-1f52-4843-b497-75d4611ed3a97738535133211844&coreNodeName=core_node6&name=testcollection_shard1_replica_n2&action=CREATE&numShards=2&shard=shard1&wt=javabin} status=0 QTime=415
   [junit4]   2> 1108435 INFO  (parallelCoreAdminExecutor-549-thread-2-processing-n:127.0.0.1:50121_solr 16de94a8-1f52-4843-b497-75d4611ed3a97738535133211844 CREATE) [n:127.0.0.1:50121_solr    ] o.a.s.h.a.CoreAdminOperation core create command qt=/admin/cores&collection.configName=solrCloudCollectionConfig&newCollection=true&collection=testcollection&version=2&replicaType=NRT&async=16de94a8-1f52-4843-b497-75d4611ed3a97738535133211844&coreNodeName=core_node6&name=testcollection_shard1_replica_n2&action=CREATE&numShards=2&shard=shard1&wt=javabin
   [junit4]   2> 1108547 INFO  (zkCallback-191-thread-2-processing-n:127.0.0.1:50121_solr) [n:127.0.0.1:50121_solr    ] o.a.s.c.c.ZkStateReader A cluster state change: [WatchedEvent state:SyncConnected type:NodeDataChanged path:/collections/testcollection/state.json] for collection [testcollection] has occurred - updating... (live nodes size: [2])
   [junit4]   2> 1108547 INFO  (zkCallback-191-thread-1-processing-n:127.0.0.1:50121_solr) [n:127.0.0.1:50121_solr    ] o.a.s.c.c.ZkStateReader A cluster state change: [WatchedEvent state:SyncConnected type:NodeDataChanged path:/collections/testcollection/state.json] for collection [testcollection] has occurred - updating... (live nodes size: [2])
   [junit4]   2> 1108643 INFO  (qtp2124296350-1983) [n:127.0.0.1:45019_solr    ] o.a.s.s.HttpSolrCall [admin] webapp=null path=/admin/cores params={qt=/admin/cores&collection.configName=solrCloudCollectionConfig&newCollection=true&collection=testcollection&version=2&replicaType=NRT&async=16de94a8-1f52-4843-b497-75d4611ed3a97738535134511991&coreNodeName=core_node7&name=testcollection_shard2_replica_n3&action=CREATE&numShards=2&shard=shard2&wt=javabin} status=0 QTime=23
   [junit4]   2> 1108669 INFO  (parallelCoreAdminExecutor-551-thread-1-processing-n:127.0.0.1:45019_solr 16de94a8-1f52-4843-b497-75d4611ed3a97738535134511991 CREATE) [n:127.0.0.1:45019_solr    ] o.a.s.h.a.CoreAdminOperation core create command qt=/admin/cores&collection.configName=solrCloudCollectionConfig&newCollection=true&collection=testcollection&version=2&replicaType=NRT&async=16de94a8-1f52-4843-b497-75d4611ed3a97738535134511991&coreNodeName=core_node7&name=testcollection_shard2_replica_n3&action=CREATE&numShards=2&shard=shard2&wt=javabin
   [junit4]   2> 1108671 INFO  (parallelCoreAdminExecutor-551-thread-1-processing-n:127.0.0.1:45019_solr 16de94a8-1f52-4843-b497-75d4611ed3a97738535134511991 CREATE) [n:127.0.0.1:45019_solr    ] o.a.s.c.TransientSolrCoreCacheDefault Allocating transient cache for 2147483647 transient cores
   [junit4]   2> 1108789 INFO  (qtp2124296350-1977) [n:127.0.0.1:45019_solr    ] o.a.s.s.HttpSolrCall [admin] webapp=null path=/admin/cores params={qt=/admin/cores&collection.configName=solrCloudCollectionConfig&newCollection=true&collection=testcollection&version=2&replicaType=NRT&async=16de94a8-1f52-4843-b497-75d4611ed3a97738535115201824&coreNodeName=core_node5&name=testcollection_shard1_replica_n1&action=CREATE&numShards=2&shard=shard1&wt=javabin} status=0 QTime=53
   [junit4]   2> 1108790 INFO  (parallelCoreAdminExecutor-551-thread-2-processing-n:127.0.0.1:45019_solr 16de94a8-1f52-4843-b497-75d4611ed3a97738535115201824 CREATE) [n:127.0.0.1:45019_solr    ] o.a.s.h.a.CoreAdminOperation core create command qt=/admin/cores&collection.configName=solrCloudCollectionConfig&newCollection=true&collection=testcollection&version=2&replicaType=NRT&async=16de94a8-1f52-4843-b497-75d4611ed3a97738535115201824&coreNodeName=core_node5&name=testcollection_shard1_replica_n1&action=CREATE&numShards=2&shard=shard1&wt=javabin
   [junit4]   2> 1108871 INFO  (qtp1998280498-1992) [n:127.0.0.1:50121_solr    ] o.a.s.h.a.CoreAdminOperation Checking request status for : 16de94a8-1f52-4843-b497-75d4611ed3a97738535152413980
   [junit4]   2> 1108871 INFO  (qtp1998280498-1992) [n:127.0.0.1:50121_solr    ] o.a.s.s.HttpSolrCall [admin] webapp=null path=/admin/cores params={qt=/admin/cores&requestid=16de94a8-1f52-4843-b497-75d4611ed3a97738535152413980&action=REQUESTSTATUS&wt=javabin&version=2} status=0 QTime=0
   [junit4]   2> 1108915 INFO  (qtp1998280498-1985) [n:127.0.0.1:50121_solr    ] o.a.s.h.a.CollectionsHandler Invoked Collection Action :requeststatus with params requestid=16de94a8-1f52-4843-b497-75d4611ed3a9&action=REQUESTSTATUS&wt=javabin&version=2 and sendToOCPQueue=true
   [junit4]   2> 1108919 INFO  (qtp1998280498-1985) [n:127.0.0.1:50121_solr    ] o.a.s.s.HttpSolrCall [admin] webapp=null path=/admin/collections params={requestid=16de94a8-1f52-4843-b497-75d4611ed3a9&action=REQUESTSTATUS&wt=javabin&version=2} status=0 QTime=3
   [junit4]   2> 1109369 INFO  (zkCallback-191-thread-1-processing-n:127.0.0.1:50121_solr) [n:127.0.0.1:50121_solr    ] o.a.s.c.c.ZkStateReader A cluster state change: [WatchedEvent state:SyncConnected type:NodeDataChanged path:/collections/testcollection/state.json] for collection [testcollection] has occurred - updating... (live nodes size: [2])
   [junit4]   2> 1109369 INFO  (zkCallback-191-thread-2-processing-n:127.0.0.1:50121_solr) [n:127.0.0.1:50121_solr    ] o.a.s.c.c.ZkStateReader A cluster state change: [WatchedEvent state:SyncConnected type:NodeDataChanged path:/collections/testcollection/state.json] for collection [testcollection] has occurred - updating... (live nodes size: [2])
   [junit4]   2> 1109889 INFO  (parallelCoreAdminExecutor-549-thread-1-processing-n:127.0.0.1:50121_solr 16de94a8-1f52-4843-b497-75d4611ed3a97738535152413980 CREATE) [n:127.0.0.1:50121_solr c:testcollection s:shard2 r:core_node8 x:testcollection_shard2_replica_n4] o.a.s.c.SolrConfig Using Lucene MatchVersion: 7.1.0
   [junit4]   2> 1109921 INFO  (qtp1998280498-1989) [n:127.0.0.1:50121_solr    ] o.a.s.h.a.CollectionsHandler Invoked Collection Action :requeststatus with params requestid=16de94a8-1f52-4843-b497-75d4611ed3a9&action=REQUESTSTATUS&wt=javabin&version=2 and sendToOCPQueue=true
   [junit4]   2> 1109939 INFO  (qtp1998280498-1989) [n:127.0.0.1:50121_solr    ] o.a.s.s.HttpSolrCall [admin] webapp=null path=/admin/collections params={requestid=16de94a8-1f52-4843-b497-75d4611ed3a9&action=REQUESTSTATUS&wt=javabin&version=2} status=0 QTime=18
   [junit4]   2> 1109959 INFO  (zkCallback-191-thread-1-processing-n:127.0.0.1:50121_solr) [n:127.0.0.1:50121_solr    ] o.a.s.c.c.ZkStateReader A cluster state change: [WatchedEvent state:SyncConnected type:NodeDataChanged path:/collections/testcollection/state.json] for collection [testcollection] has occurred - updating... (live nodes size: [2])
   [junit4]   2> 1109959 INFO  (zkCallback-191-thread-2-processing-n:127.0.0.1:50121_solr) [n:127.0.0.1:50121_solr    ] o.a.s.c.c.ZkStateReader A cluster state change: [WatchedEvent state:SyncConnected type:NodeDataChanged path:/collections/testcollection/state.json] for collection [testcollection] has occurred - updating... (live nodes size: [2])
   [junit4]   2> 1109989 INFO  (parallelCoreAdminExecutor-549-thread-1-processing-n:127.0.0.1:50121_solr 16de94a8-1f52-4843-b497-75d4611ed3a97738535152413980 CREATE) [n:127.0.0.1:50121_solr c:testcollection s:shard2 r:core_node8 x:testcollection_shard2_replica_n4] o.a.s.s.IndexSchema [testcollection_shard2_replica_n4] Schema name=minimal
   [junit4]   2> 1110045 INFO  (parallelCoreAdminExecutor-549-thread-2-processing-n:127.0.0.1:50121_solr 16de94a8-1f52-4843-b497-75d4611ed3a97738535133211844 CREATE) [n:127.0.0.1:50121_solr c:testcollection s:shard1 r:core_node6 x:testcollection_shard1_replica_n2] o.a.s.c.SolrConfig Using Lucene MatchVersion: 7.1.0
   [junit4]   2> 1110083 INFO  (parallelCoreAdminExecutor-549-thread-2-processing-n:127.0.0.1:50121_solr 16de94a8-1f52-4843-b497-75d4611ed3a97738535133211844 CREATE) [n:127.0.0.1:50121_solr c:testcollection s:shard1 r:core_node6 x:testcollection_shard1_replica_n2] o.a.s.s.IndexSchema [testcollection_shard1_replica_n2] Schema name=minimal
   [junit4]   2> 1110085 INFO  (parallelCoreAdminExecutor-549-thread-2-processing-n:127.0.0.1:50121_solr 16de94a8-1f52-4843-b497-75d4611ed3a97738535133211844 CREATE) [n:127.0.0.1:50121_solr c:testcollection s:shard1 r:core_node6 x:testcollection_shard1_replica_n2] o.a.s.s.IndexSchema Loaded schema minimal/1.1 with uniqueid field id
   [junit4]   2> 1110085 INFO  (parallelCoreAdminExecutor-549-thread-2-processing-n:127.0.0.1:50121_solr 16de94a8-1f52-4843-b497-75d4611ed3a97738535133211844 CREATE) [n:127.0.0.1:50121_solr c:testcollection s:shard1 r:core_node6 x:testcollection_shard1_replica_n2] o.a.s.c.CoreContainer Creating SolrCore 'testcollection_shard1_replica_n2' using configuration from collection testcollection, trusted=true
   [junit4]   2> 1110085 INFO  (parallelCoreAdminExecutor-549-thread-2-processing-n:127.0.0.1:50121_solr 16de94a8-1f52-4843-b497-75d4611ed3a97738535133211844 CREATE) [n:127.0.0.1:50121_solr c:testcollection s:shard1 r:core_node6 x:testcollection_shard1_replica_n2] o.a.s.m.r.SolrJmxReporter JMX monitoring for 'solr_50121.solr.core.testcollection.shard1.replica_n2' (registry 'solr.core.testcollection.shard1.replica_n2') enabled at server: com.sun.jmx.mbeanserver.JmxMBeanServer@42d761ac
   [junit4]   2> 1110085 INFO  (parallelCoreAdminExecutor-549-thread-2-processing-n:127.0.0.1:50121_solr 16de94a8-1f52-4843-b497-75d4611ed3a97738535133211844 CREATE) [n:127.0.0.1:50121_solr c:testcollection s:shard1 r:core_node6 x:testcollection_shard1_replica_n2] o.a.s.c.SolrCore solr.RecoveryStrategy.Builder
   [junit4]   2> 1110086 INFO  (parallelCoreAdminExecutor-549-thread-2-processing-n:127.0.0.1:50121_solr 16de94a8-1f52-4843-b497-75d4611ed3a97738535133211844 CREATE) [n:127.0.0.1:50121_solr c:testcollection s:shard1 r:core_node6 x:testcollection_shard1_replica_n2] o.a.s.c.SolrCore [[testcollection_shard1_replica_n2] ] Opening new SolrCore at [/x1/jenkins/jenkins-slave/workspace/Lucene-Solr-Tests-7.x/solr/build/solr-core/test/J0/temp/solr.cloud.TestAuthenticationFramework_37A167B6A7C72C70-001/tempDir-001/node1/testcollection_shard1_replica_n2], dataDir=[/x1/jenkins/jenkins-slave/workspace/Lucene-Solr-Tests-7.x/solr/build/solr-core/test/J0/temp/solr.cloud.TestAuthenticationFramework_37A167B6A7C72C70-001/tempDir-001/node1/./testcollection_shard1_replica_n2/data/]
   [junit4]   2> 1110318 INFO  (parallelCoreAdminExecutor-549-thread-1-processing-n:127.0.0.1:50121_solr 16de94a8-1f52-4843-b497-75d4611ed3a97738535152413980 CREATE) [n:127.0.0.1:50121_solr c:testcollection s:shard2 r:core_node8 x:testcollection_shard2_replica_n4] o.a.s.s.IndexSchema Loaded schema minimal/1.1 with uniqueid field id
   [junit4]   2> 1110318 INFO  (parallelCoreAdminExecutor-549-thread-1-processing-n:127.0.0.1:50121_solr 16de94a8-1f52-4843-b497-75d4611ed3a97738535152413980 CREATE) [n:127.0.0.1:50121_solr c:testcollection s:shard2 r:core_node8 x:testcollection_shard2_replica_n4] o.a.s.c.CoreContainer Creating SolrCore 'testcollection_shard2_replica_n4' using configuration from collection testcollection, trusted=true
   [junit4]   2> 1110319 INFO  (parallelCoreAdminExecutor-549-thread-1-processing-n:127.0.0.1:50121_solr 16de94a8-1f52-4843-b497-75d4611ed3a97738535152413980 CREATE) [n:127.0.0.1:50121_solr c:testcollection s:shard2 r:core_node8 x:testcollection_shard2_replica_n4] o.a.s.m.r.SolrJmxReporter JMX monitoring for 'solr_50121.solr.core.testcollection.shard2.replica_n4' (registry 'solr.core.testcollection.shard2.replica_n4') enabled at server: com.sun.jmx.mbeanserver.JmxMBeanServer@42d761ac
   [junit4]   2> 1110319 INFO  (parallelCoreAdminExecutor-549-thread-1-processing-n:127.0.0.1:50121_solr 16de94a8-1f52-4843-b497-75d4611ed3a97738535152413980 CREATE) [n:127.0.0.1:50121_solr c:testcollection s:shard2 r:core_node8 x:testcollection_shard2_replica_n4] o.a.s.c.SolrCore solr.RecoveryStrategy.Builder
   [junit4]   2> 1110319 INFO  (parallelCoreAdminExecutor-549-thread-1-processing-n:127.0.0.1:50121_solr 16de94a8-1f52-4843-b497-75d4611ed3a97738535152413980 CREATE) [n:127.0.0.1:50121_solr c:testcollection s:shard2 r:core_node8 x:testcollection_shard2_replica_n4] o.a.s.c.SolrCore [[testcollection_shard2_replica_n4] ] Opening new SolrCore at [/x1/jenkins/jenkins-slave/workspace/Lucene-Solr-Tests-7.x/solr/build/solr-core/test/J0/temp/solr.cloud.TestAuthenticationFramework_37A167B6A7C72C70-001/tempDir-001/node1/testcollection_shard2_replica_n4], dataDir=[/x1/jenkins/jenkins-slave/workspace/Lucene-Solr-Tests-7.x/solr/build/solr-core/test/J0/temp/solr.cloud.TestAuthenticationFramework_37A167B6A7C72C70-001/tempDir-001/node1/./testcollection_shard2_replica_n4/data/]
   [junit4]   2> 1110338 INFO  (zkCallback-196-thread-1-processing-n:127.0.0.1:45019_solr) [n:127.0.0.1:45019_solr    ] o.a.s.c.c.ZkStateReader A cluster state change: [WatchedEvent state:SyncConnected type:NodeDataChanged path:/collections/testcollection/state.json] for collection [testcollection] has occurred - updating... (live nodes size: [2])
   [junit4]   2> 1110969 INFO  (qtp1998280498-1988) [n:127.0.0.1:50121_solr    ] o.a.s.h.a.CollectionsHandler Invoked Collection Action :requeststatus with params requestid=16de94a8-1f52-4843-b497-75d4611ed3a9&action=REQUESTSTATUS&wt=javabin&version=2 and sendToOCPQueue=true
   [junit4]   2> 1110972 INFO  (qtp1998280498-1988) [n:127.0.0.1:50121_solr    ] o.a.s.s.HttpSolrCall [admin] webapp=null path=/admin/collections params={requestid=16de94a8-1f52-4843-b497-75d4611ed3a9&action=REQUESTSTATUS&wt=javabin&version=2} status=0 QTime=3
   [junit4]   2> 1111475 INFO  (qtp1998280498-1992) [n:127.0.0.1:50121_solr    ] o.a.s.h.a.CoreAdminOperation Checking request status for : 16de94a8-1f52-4843-b497-75d4611ed3a97738535152413980
   [junit4]   2> 1111475 INFO  (qtp1998280498-1992) [n:127.0.0.1:50121_solr    ] o.a.s.s.HttpSolrCall [admin] webapp=null path=/admin/cores params={qt=/admin/cores&requestid=16de94a8-1f52-4843-b497-75d4611ed3a97738535152413980&action=REQUESTSTATUS&wt=javabin&version=2} status=0 QTime=0
   [junit4]   2> 1111728 INFO  (parallelCoreAdminExecutor-551-thread-1-processing-n:127.0.0.1:45019_solr 16de94a8-1f52-4843-b497-75d4611ed3a97738535134511991 CREATE) [n:127.0.0.1:45019_solr c:testcollection s:shard2 r:core_node7 x:testcollection_shard2_replica_n3] o.a.s.c.SolrConfig Using Lucene MatchVersion: 7.1.0
   [junit4]   2> 1111730 INFO  (parallelCoreAdminExecutor-551-thread-2-processing-n:127.0.0.1:45019_solr 16de94a8-1f52-4843-b497-75d4611ed3a97738535115201824 CREATE) [n:127.0.0.1:45019_solr c:testcollection s:shard1 r:core_node5 x:testcollection_shard1_replica_n1] o.a.s.c.SolrConfig Using Lucene MatchVersion: 7.1.0
   [junit4]   2> 1111738 INFO  (parallelCoreAdminExecutor-551-thread-2-processing-n:127.0.0.1:45019_solr 16de94a8-1f52-4843-b497-75d4611ed3a97738535115201824 CREATE) [n:127.0.0.1:45019_solr c:testcollection s:shard1 r:core_node5 x:testcollection_shard1_replica_n1] o.a.s.s.IndexSchema [testcollection_shard1_replica_n1] Schema name=minimal
   [junit4]   2> 1111852 INFO  (parallelCoreAdminExecutor-551-thread-2-processing-n:127.0.0.1:45019_solr 16de94a8-1f52-4843-b497-75d4611ed3a97738535115201824 CREATE) [n:127.0.0.1:45019_solr c:testcollection s:shard1 r:core_node5 x:testcollection_shard1_replica_n1] o.a.s.s.IndexSchema Loaded schema minimal/1.1 with uniqueid field id
   [junit4]   2> 1111852 INFO  (parallelCoreAdminExecutor-551-thread-2-processing-n:127.0.0.1:45019_solr 16de94a8-1f52-4843-b497-75d4611ed3a97738535115201824 CREATE) [n:127.0.0.1:45019_solr c:testcollection s:shard1 r:core_node5 x:testcollection_shard1_replica_n1] o.a.s.c.CoreContainer Creating SolrCore 'testcollection_shard1_replica_n1' using configuration from collection testcollection, trusted=true
   [junit4]   2> 1111852 INFO  (parallelCoreAdminExecutor-551-thread-2-processing-n:127.0.0.1:45019_solr 16de94a8-1f52-4843-b497-75d4611ed3a97738535115201824 CREATE) [n:127.0.0.1:45019_solr c:testcollection s:shard1 r:core_node5 x:testcollection_shard1_replica_n1] o.a.s.m.r.SolrJmxReporter JMX monitoring for 'solr_45019.solr.core.testcollection.shard1.replica_n1' (registry 'solr.core.testcollection.shard1.replica_n1') enabled at server: com.sun.jmx.mbeanserver.JmxMBeanServer@42d761ac
   [junit4]   2> 1111852 INFO  (parallelCoreAdminExecutor-551-thread-2-processing-n:127.0.0.1:45019_solr 16de94a8-1f52-4843-b497-75d4611ed3a97738535115201824 CREATE) [n:127.0.0.1:45019_solr c:testcollection s:shard1 r:core_node5 x:testcollection_shard1_replica_n1] o.a.s.c.SolrCore solr.RecoveryStrategy.Builder
   [junit4]   2> 1111852 INFO  (parallelCoreAdminExecutor-551-thread-2-processing-n:127.0.0.1:45019_solr 16de94a8-1f52-4843-b497-75d4611ed3a97738535115201824 CREATE) [n:127.0.0.1:45019_solr c:testcollection s:shard1 r:core_node5 x:testcollection_shard1_replica_n1] o.a.s.c.SolrCore [[testcollection_shard1_replica_n1] ] Opening new SolrCore at [/x1/jenkins/jenkins-slave/workspace/Lucene-Solr-Tests-7.x/solr/build/solr-core/test/J0/temp/solr.cloud.TestAuthenticationFramework_37A167B6A7C72C70-001/tempDir-001/node2/testcollection_shard1_replica_n1], dataDir=[/x1/jenkins/jenkins-slave/workspace/Lucene-Solr-Tests-7.x/solr/build/solr-core/test/J0/temp/solr.cloud.TestAuthenticationFramework_37A167B6A7C72C70-001/tempDir-001/node2/./testcollection_shard1_replica_n1/data/]
   [junit4]   2> 1111856 INFO  (parallelCoreAdminExecutor-551-thread-1-processing-n:127.0.0.1:45019_solr 16de94a8-1f52-4843-b497-75d4611ed3a97738535134511991 CREATE) [n:127.0.0.1:45019_solr c:testcollection s:shard2 r:core_node7 x:testcollection_shard2_replica_n3] o.a.s.s.IndexSchema [testcollection_shard2_replica_n3] Schema name=minimal
   [junit4]   2> 1111858 INFO  (parallelCoreAdminExecutor-551-thread-1-processing-n:127.0.0.1:45019_solr 16de94a8-1f52-4843-b497-75d4611ed3a97738535134511991 CREATE) [n:127.0.0.1:45019_solr c:testcollection s:shard2 r:core_node7 x:testcollection_shard2_replica_n3] o.a.s.s.IndexSchema Loaded schema minimal/1.1 with uniqueid field id
   [junit4]   2> 1111858 INFO  (parallelCoreAdminExecutor-551-thread-1-processing-n:127.0.0.1:45019_solr 16de94a8-1f52-4843-b497-75d4611ed3a97738535134511991 CREATE) [n:127.0.0.1:45019_solr c:testcollection s:shard2 r:core_node7 x:testcollection_shard2_replica_n3] o.a.s.c.CoreContainer Creating SolrCore 'testcollection_shard2_replica_n3' using configuration from collection testcollection, trusted=true
   [junit4]   2> 1111858 INFO  (parallelCoreAdminExecutor-551-thread-1-processing-n:127.0.0.1:45019_solr 16de94a8-1f52-4843-b497-75d4611ed3a97738535134511991 CREATE) [n:127.0.0.1:45019_solr c:testcollection s:shard2 r:core_node7 x:testcollection_shard2_replica_n3] o.a.s.m.r.SolrJmxReporter JMX monitoring for 'solr_45019.solr.core.testcollection.shard2.replica_n3' (registry 'solr.core.testcollection.shard2.replica_n3') enabled at server: com.sun.jmx.mbeanserver.JmxMBeanServer@42d761ac
   [junit4]   2> 1111980 INFO  (qtp1998280498-1990) [n:127.0.0.1:50121_solr    ] o.a.s.h.a.CollectionsHandler Invoked Collection Action :requeststatus with params requestid=16de94a8-1f52-4843-b497-75d4611ed3a9&action=REQUESTSTATUS&wt=javabin&version=2 and sendToOCPQueue=true
   [junit4]   2> 1111981 INFO  (qtp1998280498-1990) [n:127.0.0.1:50121_solr    ] o.a.s.s.HttpSolrCall [admin] webapp=null path=/admin/collections params={requestid=16de94a8-1f52-4843-b497-75d4611ed3a9&action=REQUESTSTATUS&wt=javabin&version=2} status=0 QTime=1
   [junit4]   2> 1111991 INFO  (parallelCoreAdminExecutor-551-thread-1-processing-n:127.0.0.1:45019_solr 16de94a8-1f52-4843-b497-75d4611ed3a97738535134511991 CREATE) [n:127.0.0.1:45019_solr c:testcollection s:shard2 r:core_node7 x:testcollection_shard2_replica_n3] o.a.s.c.SolrCore solr.RecoveryStrategy.Builder
   [junit4]   2> 1111991 INFO  (parallelCoreAdminExecutor-551-thread-1-processing-n:127.0.0.1:45019_solr 16de94a8-1f52-4843-b497-75d4611ed3a97738535134511991 CREATE) [n:127.0.0.1:45019_solr c:testcollection s:shard2 r:core_node7 x:testcollection_shard2_replica_n3] o.a.s.c.SolrCore [[testcollection_shard2_replica_n3] ] Opening new SolrCore at [/x1/jenkins/jenkins-slave/workspace/Lucene-Solr-Tests-7.x/solr/build/solr-core/test/J0/temp/solr.cloud.TestAuthenticationFramework_37A167B6A7C72C70-001/tempDir-001/node2/testcollection_shard2_replica_n3], dataDir=[/x1/jenkins/jenkins-slave/workspace/Lucene-Solr-Tests-7.x/solr/build/solr-core/test/J0/temp/solr.cloud.TestAuthenticationFramework_37A167B6A7C72C70-001/tempDir-001/node2/./testcollection_shard2_replica_n3/data/]
   [junit4]   2> 1112500 INFO  (qtp1998280498-1992) [n:127.0.0.1:50121_solr    ] o.a.s.h.a.CoreAdminOperation Checking request status for : 16de94a8-1f52-4843-b497-75d4611ed3a97738535152413980
   [junit4]   2> 1112500 INFO  (qtp1998280498-1992) [n:127.0.0.1:50121_solr    ] o.a.s.s.HttpSolrCall [admin] webapp=null path=/admin/cores params={qt=/admin/cores&requestid=16de94a8-1f52-4843-b497-75d4611ed3a97738535152413980&action=REQUESTSTATUS&wt=javabin&version=2} status=0 QTime=0
   [junit4]   2> 1112574 INFO  (parallelCoreAdminExecutor-549-thread-1-processing-n:127.0.0.1:50121_solr 16de94a8-1f52-4843-b497-75d4611ed3a97738535152413980 CREATE) [n:127.0.0.1:50121_solr c:testcollection s:shard2 r:core_node8 x:testcollection_shard2_replica_n4] o.a.s.u.UpdateHandler Using UpdateLog implementation: org.apache.solr.update.UpdateLog
   [junit4]   2> 1112574 INFO  (parallelCoreAdminExecutor-549-thread-1-processing-n:127.0.0.1:50121_solr 16de94a8-1f52-4843-b497-75d4611ed3a97738535152413980 CREATE) [n:127.0.0.1:50121_solr c:testcollection s:shard2 r:core_node8 x:testcollection_shard2_replica_n4] o.a.s.u.UpdateLog Initializing UpdateLog: dataDir=null defaultSyncLevel=FLUSH numRecordsToKeep=100 maxNumLogsToKeep=10 numVersionBuckets=65536
   [junit4]   2> 1112620 INFO  (parallelCoreAdminExecutor-549-thread-2-processing-n:127.0.0.1:50121_solr 16de94a8-1f52-4843-b497-75d4611ed3a97738535133211844 CREATE) [n:127.0.0.1:50121_solr c:testcollection s:shard1 r:core_node6 x:testcollection_shard1_replica_n2] o.a.s.u.UpdateHandler Using UpdateLog implementation: org.apache.solr.update.UpdateLog
   [junit4]   2> 1112620 INFO  (parallelCoreAdminExecutor-549-thread-2-processing-n:127.0.0.1:50121_solr 16de94a8-1f52-4843-b497-75d4611ed3a97738535133211844 CREATE) [n:127.0.0.1:50121_solr c:testcollection s:shard1 r:core_node6 x:testcollection_shard1_replica_n2] o.a.s.u.UpdateLog Initializing UpdateLog: dataDir=null defaultSyncLevel=FLUSH numRecordsToKeep=100 maxNumLogsToKeep=10 numVersionBuckets=65536
   [junit4]   2> 1112623 INFO  (parallelCoreAdminExecutor-549-thread-2-processing-n:127.0.0.1:50121_solr 16de94a8-1f52-4843-b497-75d4611ed3a97738535133211844 CREATE) [n:127.0.0.1:50121_solr c:testcollection s:shard1 r:core_node6 x:testcollection_shard1_replica_n2] o.a.s.u.CommitTracker Hard AutoCommit: disabled
   [junit4]   2> 1112623 INFO  (parallelCoreAdminExecutor-549-thread-2-processing-n:127.0.0.1:50121_solr 16de94a8-1f5

[...truncated too long message...]

ave/workspace/Lucene-Solr-Tests-7.x/solr/core/test-lib/apacheds-interceptor-kerberos-2.0.0-M15.jar:/x1/jenkins/jenkins-slave/workspace/Lucene-Solr-Tests-7.x/solr/core/test-lib/apacheds-interceptors-admin-2.0.0-M15.jar:/x1/jenkins/jenkins-slave/workspace/Lucene-Solr-Tests-7.x/solr/core/test-lib/apacheds-interceptors-authn-2.0.0-M15.jar:/x1/jenkins/jenkins-slave/workspace/Lucene-Solr-Tests-7.x/solr/core/test-lib/apacheds-interceptors-authz-2.0.0-M15.jar:/x1/jenkins/jenkins-slave/workspace/Lucene-Solr-Tests-7.x/solr/core/test-lib/apacheds-interceptors-changelog-2.0.0-M15.jar:/x1/jenkins/jenkins-slave/workspace/Lucene-Solr-Tests-7.x/solr/core/test-lib/apacheds-interceptors-collective-2.0.0-M15.jar:/x1/jenkins/jenkins-slave/workspace/Lucene-Solr-Tests-7.x/solr/core/test-lib/apacheds-interceptors-event-2.0.0-M15.jar:/x1/jenkins/jenkins-slave/workspace/Lucene-Solr-Tests-7.x/solr/core/test-lib/apacheds-interceptors-exception-2.0.0-M15.jar:/x1/jenkins/jenkins-slave/workspace/Lucene-Solr-Tests-7.x/solr/core/test-lib/apacheds-interceptors-journal-2.0.0-M15.jar:/x1/jenkins/jenkins-slave/workspace/Lucene-Solr-Tests-7.x/solr/core/test-lib/apacheds-interceptors-normalization-2.0.0-M15.jar:/x1/jenkins/jenkins-slave/workspace/Lucene-Solr-Tests-7.x/solr/core/test-lib/apacheds-interceptors-operational-2.0.0-M15.jar:/x1/jenkins/jenkins-slave/workspace/Lucene-Solr-Tests-7.x/solr/core/test-lib/apacheds-interceptors-referral-2.0.0-M15.jar:/x1/jenkins/jenkins-slave/workspace/Lucene-Solr-Tests-7.x/solr/core/test-lib/apacheds-interceptors-schema-2.0.0-M15.jar:/x1/jenkins/jenkins-slave/workspace/Lucene-Solr-Tests-7.x/solr/core/test-lib/apacheds-interceptors-subtree-2.0.0-M15.jar:/x1/jenkins/jenkins-slave/workspace/Lucene-Solr-Tests-7.x/solr/core/test-lib/apacheds-interceptors-trigger-2.0.0-M15.jar:/x1/jenkins/jenkins-slave/workspace/Lucene-Solr-Tests-7.x/solr/core/test-lib/apacheds-jdbm-partition-2.0.0-M15.jar:/x1/jenkins/jenkins-slave/workspace/Lucene-Solr-Tests-7.x/solr/core/test-lib/apacheds-jdbm1-2.0.0-M2.jar:/x1/jenkins/jenkins-slave/workspace/Lucene-Solr-Tests-7.x/solr/core/test-lib/apacheds-kerberos-codec-2.0.0-M15.jar:/x1/jenkins/jenkins-slave/workspace/Lucene-Solr-Tests-7.x/solr/core/test-lib/apacheds-ldif-partition-2.0.0-M15.jar:/x1/jenkins/jenkins-slave/workspace/Lucene-Solr-Tests-7.x/solr/core/test-lib/apacheds-mavibot-partition-2.0.0-M15.jar:/x1/jenkins/jenkins-slave/workspace/Lucene-Solr-Tests-7.x/solr/core/test-lib/apacheds-protocol-kerberos-2.0.0-M15.jar:/x1/jenkins/jenkins-slave/workspace/Lucene-Solr-Tests-7.x/solr/core/test-lib/apacheds-protocol-ldap-2.0.0-M15.jar:/x1/jenkins/jenkins-slave/workspace/Lucene-Solr-Tests-7.x/solr/core/test-lib/apacheds-protocol-shared-2.0.0-M15.jar:/x1/jenkins/jenkins-slave/workspace/Lucene-Solr-Tests-7.x/solr/core/test-lib/apacheds-xdbm-partition-2.0.0-M15.jar:/x1/jenkins/jenkins-slave/workspace/Lucene-Solr-Tests-7.x/solr/core/test-lib/api-all-1.0.0-M20.jar:/x1/jenkins/jenkins-slave/workspace/Lucene-Solr-Tests-7.x/solr/core/test-lib/bcprov-jdk15-1.45.jar:/x1/jenkins/jenkins-slave/workspace/Lucene-Solr-Tests-7.x/solr/core/test-lib/byte-buddy-1.6.2.jar:/x1/jenkins/jenkins-slave/workspace/Lucene-Solr-Tests-7.x/solr/core/test-lib/commons-collections-3.2.2.jar:/x1/jenkins/jenkins-slave/workspace/Lucene-Solr-Tests-7.x/solr/core/test-lib/commons-math3-3.6.1.jar:/x1/jenkins/jenkins-slave/workspace/Lucene-Solr-Tests-7.x/solr/core/test-lib/ehcache-core-2.4.4.jar:/x1/jenkins/jenkins-slave/workspace/Lucene-Solr-Tests-7.x/solr/core/test-lib/hadoop-common-2.7.4-tests.jar:/x1/jenkins/jenkins-slave/workspace/Lucene-Solr-Tests-7.x/solr/core/test-lib/hadoop-hdfs-2.7.4-tests.jar:/x1/jenkins/jenkins-slave/workspace/Lucene-Solr-Tests-7.x/solr/core/test-lib/hadoop-minikdc-2.7.4.jar:/x1/jenkins/jenkins-slave/workspace/Lucene-Solr-Tests-7.x/solr/core/test-lib/htrace-core-3.2.0-incubating.jar:/x1/jenkins/jenkins-slave/workspace/Lucene-Solr-Tests-7.x/solr/core/test-lib/jersey-core-1.9.jar:/x1/jenkins/jenkins-slave/workspace/Lucene-Solr-Tests-7.x/solr/core/test-lib/jersey-server-1.9.jar:/x1/jenkins/jenkins-slave/workspace/Lucene-Solr-Tests-7.x/solr/core/test-lib/jetty-6.1.26.jar:/x1/jenkins/jenkins-slave/workspace/Lucene-Solr-Tests-7.x/solr/core/test-lib/jetty-sslengine-6.1.26.jar:/x1/jenkins/jenkins-slave/workspace/Lucene-Solr-Tests-7.x/solr/core/test-lib/jetty-util-6.1.26.jar:/x1/jenkins/jenkins-slave/workspace/Lucene-Solr-Tests-7.x/solr/core/test-lib/mina-core-2.0.0-M5.jar:/x1/jenkins/jenkins-slave/workspace/Lucene-Solr-Tests-7.x/solr/core/test-lib/mockito-core-2.6.2.jar:/x1/jenkins/jenkins-slave/workspace/Lucene-Solr-Tests-7.x/solr/core/test-lib/netty-all-4.0.36.Final.jar:/x1/jenkins/jenkins-slave/workspace/Lucene-Solr-Tests-7.x/solr/core/test-lib/objenesis-2.5.jar:/x1/jenkins/jenkins-slave/workspace/Lucene-Solr-Tests-7.x/lucene/build/analysis/icu/lucene-analyzers-icu-7.1.0-SNAPSHOT.jar:/x1/jenkins/jenkins-slave/workspace/Lucene-Solr-Tests-7.x/solr/build/contrib/solr-analysis-extras/classes/java:/x1/jenkins/jenkins-slave/workspace/Lucene-Solr-Tests-7.x/lucene/build/queryparser/classes/test:/x1/jenkins/jenkins-slave/workspace/Lucene-Solr-Tests-7.x/lucene/build/backward-codecs/classes/test:/x1/jenkins/jenkins-slave/workspace/Lucene-Solr-Tests-7.x/solr/contrib/analysis-extras/lib/icu4j-59.1.jar:/home/jenkins/tools/ant/apache-ant-1.8.4/lib/ant-launcher.jar:/x1/jenkins/.ant/lib/ivy-2.3.0.jar:/home/jenkins/tools/ant/apache-ant-1.8.4/lib/ant-junit.jar:/home/jenkins/tools/ant/apache-ant-1.8.4/lib/ant-apache-log4j.jar:/home/jenkins/tools/ant/apache-ant-1.8.4/lib/ant-junit4.jar:/home/jenkins/tools/ant/apache-ant-1.8.4/lib/ant-jai.jar:/home/jenkins/tools/ant/apache-ant-1.8.4/lib/ant-javamail.jar:/home/jenkins/tools/ant/apache-ant-1.8.4/lib/ant-apache-bsf.jar:/home/jenkins/tools/ant/apache-ant-1.8.4/lib/ant-commons-net.jar:/home/jenkins/tools/ant/apache-ant-1.8.4/lib/ant-antlr.jar:/home/jenkins/tools/ant/apache-ant-1.8.4/lib/ant-jsch.jar:/home/jenkins/tools/ant/apache-ant-1.8.4/lib/ant-apache-oro.jar:/home/jenkins/tools/ant/apache-ant-1.8.4/lib/ant-commons-logging.jar:/home/jenkins/tools/ant/apache-ant-1.8.4/lib/ant.jar:/home/jenkins/tools/ant/apache-ant-1.8.4/lib/ant-netrexx.jar:/home/jenkins/tools/ant/apache-ant-1.8.4/lib/ant-testutil.jar:/home/jenkins/tools/ant/apache-ant-1.8.4/lib/ant-jdepend.jar:/home/jenkins/tools/ant/apache-ant-1.8.4/lib/ant-apache-bcel.jar:/home/jenkins/tools/ant/apache-ant-1.8.4/lib/ant-apache-xalan2.jar:/home/jenkins/tools/ant/apache-ant-1.8.4/lib/ant-apache-resolver.jar:/home/jenkins/tools/ant/apache-ant-1.8.4/lib/ant-jmf.jar:/home/jenkins/tools/ant/apache-ant-1.8.4/lib/ant-apache-regexp.jar:/home/jenkins/tools/ant/apache-ant-1.8.4/lib/ant-swing.jar:/usr/local/asfpackages/java/jdk1.8.0_144/lib/tools.jar:/x1/jenkins/.ivy2/cache/com.carrotsearch.randomizedtesting/junit4-ant/jars/junit4-ant-2.5.3.jar com.carrotsearch.ant.tasks.junit4.slave.SlaveMainSafe -eventsfile /x1/jenkins/jenkins-slave/workspace/Lucene-Solr-Tests-7.x/solr/build/solr-core/test/temp/junit4-J2-20171008_175759_1977567200374084864382.events @/x1/jenkins/jenkins-slave/workspace/Lucene-Solr-Tests-7.x/solr/build/solr-core/test/temp/junit4-J2-20171008_175759_1978285762864793074333.suites -stdin
   [junit4] ERROR: JVM J2 ended with an exception: Forked process returned with error code: 1. Very likely a JVM crash.  See process stdout at: /x1/jenkins/jenkins-slave/workspace/Lucene-Solr-Tests-7.x/solr/build/solr-core/test/temp/junit4-J2-20171008_175759_1974789280266346331942.sysout See process stderr at: /x1/jenkins/jenkins-slave/workspace/Lucene-Solr-Tests-7.x/solr/build/solr-core/test/temp/junit4-J2-20171008_175759_1972095051839868170461.syserr
   [junit4] 	at com.carrotsearch.ant.tasks.junit4.JUnit4.executeSlave(JUnit4.java:1519)
   [junit4] 	at com.carrotsearch.ant.tasks.junit4.JUnit4.access$000(JUnit4.java:126)
   [junit4] 	at com.carrotsearch.ant.tasks.junit4.JUnit4$2.call(JUnit4.java:982)
   [junit4] 	at com.carrotsearch.ant.tasks.junit4.JUnit4$2.call(JUnit4.java:979)
   [junit4] 	at java.util.concurrent.FutureTask.run(FutureTask.java:266)
   [junit4] 	at java.util.concurrent.ThreadPoolExecutor.runWorker(ThreadPoolExecutor.java:1149)
   [junit4] 	at java.util.concurrent.ThreadPoolExecutor$Worker.run(ThreadPoolExecutor.java:624)
   [junit4] 	at java.lang.Thread.run(Thread.java:748)

BUILD FAILED
/x1/jenkins/jenkins-slave/workspace/Lucene-Solr-Tests-7.x/build.xml:826: The following error occurred while executing this line:
/x1/jenkins/jenkins-slave/workspace/Lucene-Solr-Tests-7.x/build.xml:770: The following error occurred while executing this line:
/x1/jenkins/jenkins-slave/workspace/Lucene-Solr-Tests-7.x/build.xml:59: The following error occurred while executing this line:
/x1/jenkins/jenkins-slave/workspace/Lucene-Solr-Tests-7.x/solr/build.xml:262: The following error occurred while executing this line:
/x1/jenkins/jenkins-slave/workspace/Lucene-Solr-Tests-7.x/solr/common-build.xml:556: The following error occurred while executing this line:
/x1/jenkins/jenkins-slave/workspace/Lucene-Solr-Tests-7.x/lucene/common-build.xml:1494: The following error occurred while executing this line:
/x1/jenkins/jenkins-slave/workspace/Lucene-Solr-Tests-7.x/lucene/common-build.xml:1021: At least one slave process threw an exception, first: Forked process returned with error code: 1. Very likely a JVM crash.  See process stdout at: /x1/jenkins/jenkins-slave/workspace/Lucene-Solr-Tests-7.x/solr/build/solr-core/test/temp/junit4-J2-20171008_175759_1974789280266346331942.sysout See process stderr at: /x1/jenkins/jenkins-slave/workspace/Lucene-Solr-Tests-7.x/solr/build/solr-core/test/temp/junit4-J2-20171008_175759_1972095051839868170461.syserr

Total time: 340 minutes 39 seconds
Build step 'Invoke Ant' marked build as failure
Archiving artifacts
[Fast Archiver] No artifacts from Lucene-Solr-Tests-7.x #177 to compare, so performing full copy of artifacts
Recording test results
Email was triggered for: Failure - Any
Sending email for trigger: Failure - Any

Mime
View raw message