lucene-dev mailing list archives

Site index · List index
Message view « Date » · « Thread »
Top « Date » · « Thread »
From Policeman Jenkins Server <jenk...@thetaphi.de>
Subject [JENKINS] Lucene-Solr-7.x-Linux (32bit/jdk1.8.0_144) - Build # 621 - Still Unstable!
Date Tue, 17 Oct 2017 00:48:14 GMT
Build: https://jenkins.thetaphi.de/job/Lucene-Solr-7.x-Linux/621/
Java: 32bit/jdk1.8.0_144 -server -XX:+UseParallelGC

2 tests failed.
FAILED:  org.apache.solr.client.solrj.impl.CloudSolrClientTest.testHandlingOfStaleAlias

Error Message:
java.util.LinkedHashMap cannot be cast to org.apache.solr.common.util.NamedList

Stack Trace:
java.lang.ClassCastException: java.util.LinkedHashMap cannot be cast to org.apache.solr.common.util.NamedList
	at __randomizedtesting.SeedInfo.seed([730AA583F48244C7:6377E24A01614450]:0)
	at org.apache.solr.client.solrj.impl.HttpClusterStateProvider.fetchClusterState(HttpClusterStateProvider.java:142)
	at org.apache.solr.client.solrj.impl.HttpClusterStateProvider.getClusterProperties(HttpClusterStateProvider.java:276)
	at org.apache.solr.client.solrj.impl.ClusterStateProvider.getClusterProperty(ClusterStateProvider.java:65)
	at org.apache.solr.client.solrj.impl.CloudSolrClient.sendRequest(CloudSolrClient.java:1019)
	at org.apache.solr.client.solrj.impl.CloudSolrClient.requestWithRetryOnStaleState(CloudSolrClient.java:862)
	at org.apache.solr.client.solrj.impl.CloudSolrClient.request(CloudSolrClient.java:793)
	at org.apache.solr.client.solrj.SolrRequest.process(SolrRequest.java:178)
	at org.apache.solr.client.solrj.SolrRequest.process(SolrRequest.java:195)
	at org.apache.solr.client.solrj.impl.CloudSolrClientTest.testHandlingOfStaleAlias(CloudSolrClientTest.java:226)
	at sun.reflect.NativeMethodAccessorImpl.invoke0(Native Method)
	at sun.reflect.NativeMethodAccessorImpl.invoke(NativeMethodAccessorImpl.java:62)
	at sun.reflect.DelegatingMethodAccessorImpl.invoke(DelegatingMethodAccessorImpl.java:43)
	at java.lang.reflect.Method.invoke(Method.java:498)
	at com.carrotsearch.randomizedtesting.RandomizedRunner.invoke(RandomizedRunner.java:1737)
	at com.carrotsearch.randomizedtesting.RandomizedRunner$8.evaluate(RandomizedRunner.java:934)
	at com.carrotsearch.randomizedtesting.RandomizedRunner$9.evaluate(RandomizedRunner.java:970)
	at com.carrotsearch.randomizedtesting.RandomizedRunner$10.evaluate(RandomizedRunner.java:984)
	at org.junit.rules.ExpectedException$ExpectedExceptionStatement.evaluate(ExpectedException.java:110)
	at com.carrotsearch.randomizedtesting.rules.SystemPropertiesRestoreRule$1.evaluate(SystemPropertiesRestoreRule.java:57)
	at org.apache.lucene.util.TestRuleSetupTeardownChained$1.evaluate(TestRuleSetupTeardownChained.java:49)
	at org.apache.lucene.util.AbstractBeforeAfterRule$1.evaluate(AbstractBeforeAfterRule.java:45)
	at org.apache.lucene.util.TestRuleThreadAndTestName$1.evaluate(TestRuleThreadAndTestName.java:48)
	at org.apache.lucene.util.TestRuleIgnoreAfterMaxFailures$1.evaluate(TestRuleIgnoreAfterMaxFailures.java:64)
	at org.apache.lucene.util.TestRuleMarkFailure$1.evaluate(TestRuleMarkFailure.java:47)
	at com.carrotsearch.randomizedtesting.rules.StatementAdapter.evaluate(StatementAdapter.java:36)
	at com.carrotsearch.randomizedtesting.ThreadLeakControl$StatementRunner.run(ThreadLeakControl.java:368)
	at com.carrotsearch.randomizedtesting.ThreadLeakControl.forkTimeoutingTask(ThreadLeakControl.java:817)
	at com.carrotsearch.randomizedtesting.ThreadLeakControl$3.evaluate(ThreadLeakControl.java:468)
	at com.carrotsearch.randomizedtesting.RandomizedRunner.runSingleTest(RandomizedRunner.java:943)
	at com.carrotsearch.randomizedtesting.RandomizedRunner$5.evaluate(RandomizedRunner.java:829)
	at com.carrotsearch.randomizedtesting.RandomizedRunner$6.evaluate(RandomizedRunner.java:879)
	at com.carrotsearch.randomizedtesting.RandomizedRunner$7.evaluate(RandomizedRunner.java:890)
	at com.carrotsearch.randomizedtesting.rules.StatementAdapter.evaluate(StatementAdapter.java:36)
	at com.carrotsearch.randomizedtesting.rules.SystemPropertiesRestoreRule$1.evaluate(SystemPropertiesRestoreRule.java:57)
	at org.apache.lucene.util.AbstractBeforeAfterRule$1.evaluate(AbstractBeforeAfterRule.java:45)
	at com.carrotsearch.randomizedtesting.rules.StatementAdapter.evaluate(StatementAdapter.java:36)
	at org.apache.lucene.util.TestRuleStoreClassName$1.evaluate(TestRuleStoreClassName.java:41)
	at com.carrotsearch.randomizedtesting.rules.NoShadowingOrOverridesOnMethodsRule$1.evaluate(NoShadowingOrOverridesOnMethodsRule.java:40)
	at com.carrotsearch.randomizedtesting.rules.NoShadowingOrOverridesOnMethodsRule$1.evaluate(NoShadowingOrOverridesOnMethodsRule.java:40)
	at com.carrotsearch.randomizedtesting.rules.StatementAdapter.evaluate(StatementAdapter.java:36)
	at com.carrotsearch.randomizedtesting.rules.StatementAdapter.evaluate(StatementAdapter.java:36)
	at com.carrotsearch.randomizedtesting.rules.StatementAdapter.evaluate(StatementAdapter.java:36)
	at org.apache.lucene.util.TestRuleAssertionsRequired$1.evaluate(TestRuleAssertionsRequired.java:53)
	at org.apache.lucene.util.TestRuleMarkFailure$1.evaluate(TestRuleMarkFailure.java:47)
	at org.apache.lucene.util.TestRuleIgnoreAfterMaxFailures$1.evaluate(TestRuleIgnoreAfterMaxFailures.java:64)
	at org.apache.lucene.util.TestRuleIgnoreTestSuites$1.evaluate(TestRuleIgnoreTestSuites.java:54)
	at com.carrotsearch.randomizedtesting.rules.StatementAdapter.evaluate(StatementAdapter.java:36)
	at com.carrotsearch.randomizedtesting.ThreadLeakControl$StatementRunner.run(ThreadLeakControl.java:368)
	at java.lang.Thread.run(Thread.java:748)


FAILED:  org.apache.solr.cloud.TestCloudSearcherWarming.testRepFactor1LeaderStartup

Error Message:
 null Live Nodes: [127.0.0.1:35853_solr, 127.0.0.1:37729_solr] Last available state: DocCollection(testRepFactor1LeaderStartup//collections/testRepFactor1LeaderStartup/state.json/6)={   "pullReplicas":"0",   "replicationFactor":"1",   "shards":{"shard1":{       "range":"80000000-7fffffff",       "state":"active",       "replicas":{"core_node2":{           "core":"testRepFactor1LeaderStartup_shard1_replica_n1",           "base_url":"https://127.0.0.1:35853/solr",           "node_name":"127.0.0.1:35853_solr",           "state":"down",           "type":"NRT",           "leader":"true"}}}},   "router":{"name":"compositeId"},   "maxShardsPerNode":"1",   "autoAddReplicas":"false",   "nrtReplicas":"1",   "tlogReplicas":"0"}

Stack Trace:
java.lang.AssertionError: 
null
Live Nodes: [127.0.0.1:35853_solr, 127.0.0.1:37729_solr]
Last available state: DocCollection(testRepFactor1LeaderStartup//collections/testRepFactor1LeaderStartup/state.json/6)={
  "pullReplicas":"0",
  "replicationFactor":"1",
  "shards":{"shard1":{
      "range":"80000000-7fffffff",
      "state":"active",
      "replicas":{"core_node2":{
          "core":"testRepFactor1LeaderStartup_shard1_replica_n1",
          "base_url":"https://127.0.0.1:35853/solr",
          "node_name":"127.0.0.1:35853_solr",
          "state":"down",
          "type":"NRT",
          "leader":"true"}}}},
  "router":{"name":"compositeId"},
  "maxShardsPerNode":"1",
  "autoAddReplicas":"false",
  "nrtReplicas":"1",
  "tlogReplicas":"0"}
	at __randomizedtesting.SeedInfo.seed([97BCA7D594D35198:4094EA0D85331876]:0)
	at org.junit.Assert.fail(Assert.java:93)
	at org.apache.solr.cloud.SolrCloudTestCase.waitForState(SolrCloudTestCase.java:269)
	at org.apache.solr.cloud.TestCloudSearcherWarming.testRepFactor1LeaderStartup(TestCloudSearcherWarming.java:131)
	at sun.reflect.NativeMethodAccessorImpl.invoke0(Native Method)
	at sun.reflect.NativeMethodAccessorImpl.invoke(NativeMethodAccessorImpl.java:62)
	at sun.reflect.DelegatingMethodAccessorImpl.invoke(DelegatingMethodAccessorImpl.java:43)
	at java.lang.reflect.Method.invoke(Method.java:498)
	at com.carrotsearch.randomizedtesting.RandomizedRunner.invoke(RandomizedRunner.java:1737)
	at com.carrotsearch.randomizedtesting.RandomizedRunner$8.evaluate(RandomizedRunner.java:934)
	at com.carrotsearch.randomizedtesting.RandomizedRunner$9.evaluate(RandomizedRunner.java:970)
	at com.carrotsearch.randomizedtesting.RandomizedRunner$10.evaluate(RandomizedRunner.java:984)
	at com.carrotsearch.randomizedtesting.rules.SystemPropertiesRestoreRule$1.evaluate(SystemPropertiesRestoreRule.java:57)
	at org.apache.lucene.util.TestRuleSetupTeardownChained$1.evaluate(TestRuleSetupTeardownChained.java:49)
	at org.apache.lucene.util.AbstractBeforeAfterRule$1.evaluate(AbstractBeforeAfterRule.java:45)
	at org.apache.lucene.util.TestRuleThreadAndTestName$1.evaluate(TestRuleThreadAndTestName.java:48)
	at org.apache.lucene.util.TestRuleIgnoreAfterMaxFailures$1.evaluate(TestRuleIgnoreAfterMaxFailures.java:64)
	at org.apache.lucene.util.TestRuleMarkFailure$1.evaluate(TestRuleMarkFailure.java:47)
	at com.carrotsearch.randomizedtesting.rules.StatementAdapter.evaluate(StatementAdapter.java:36)
	at com.carrotsearch.randomizedtesting.ThreadLeakControl$StatementRunner.run(ThreadLeakControl.java:368)
	at com.carrotsearch.randomizedtesting.ThreadLeakControl.forkTimeoutingTask(ThreadLeakControl.java:817)
	at com.carrotsearch.randomizedtesting.ThreadLeakControl$3.evaluate(ThreadLeakControl.java:468)
	at com.carrotsearch.randomizedtesting.RandomizedRunner.runSingleTest(RandomizedRunner.java:943)
	at com.carrotsearch.randomizedtesting.RandomizedRunner$5.evaluate(RandomizedRunner.java:829)
	at com.carrotsearch.randomizedtesting.RandomizedRunner$6.evaluate(RandomizedRunner.java:879)
	at com.carrotsearch.randomizedtesting.RandomizedRunner$7.evaluate(RandomizedRunner.java:890)
	at com.carrotsearch.randomizedtesting.rules.StatementAdapter.evaluate(StatementAdapter.java:36)
	at com.carrotsearch.randomizedtesting.rules.SystemPropertiesRestoreRule$1.evaluate(SystemPropertiesRestoreRule.java:57)
	at org.apache.lucene.util.AbstractBeforeAfterRule$1.evaluate(AbstractBeforeAfterRule.java:45)
	at com.carrotsearch.randomizedtesting.rules.StatementAdapter.evaluate(StatementAdapter.java:36)
	at org.apache.lucene.util.TestRuleStoreClassName$1.evaluate(TestRuleStoreClassName.java:41)
	at com.carrotsearch.randomizedtesting.rules.NoShadowingOrOverridesOnMethodsRule$1.evaluate(NoShadowingOrOverridesOnMethodsRule.java:40)
	at com.carrotsearch.randomizedtesting.rules.NoShadowingOrOverridesOnMethodsRule$1.evaluate(NoShadowingOrOverridesOnMethodsRule.java:40)
	at com.carrotsearch.randomizedtesting.rules.StatementAdapter.evaluate(StatementAdapter.java:36)
	at com.carrotsearch.randomizedtesting.rules.StatementAdapter.evaluate(StatementAdapter.java:36)
	at com.carrotsearch.randomizedtesting.rules.StatementAdapter.evaluate(StatementAdapter.java:36)
	at org.apache.lucene.util.TestRuleAssertionsRequired$1.evaluate(TestRuleAssertionsRequired.java:53)
	at org.apache.lucene.util.TestRuleMarkFailure$1.evaluate(TestRuleMarkFailure.java:47)
	at org.apache.lucene.util.TestRuleIgnoreAfterMaxFailures$1.evaluate(TestRuleIgnoreAfterMaxFailures.java:64)
	at org.apache.lucene.util.TestRuleIgnoreTestSuites$1.evaluate(TestRuleIgnoreTestSuites.java:54)
	at com.carrotsearch.randomizedtesting.rules.StatementAdapter.evaluate(StatementAdapter.java:36)
	at com.carrotsearch.randomizedtesting.ThreadLeakControl$StatementRunner.run(ThreadLeakControl.java:368)
	at java.lang.Thread.run(Thread.java:748)




Build Log:
[...truncated 11709 lines...]
   [junit4] Suite: org.apache.solr.cloud.TestCloudSearcherWarming
   [junit4]   2> Creating dataDir: /home/jenkins/workspace/Lucene-Solr-7.x-Linux/solr/build/solr-core/test/J0/temp/solr.cloud.TestCloudSearcherWarming_97BCA7D594D35198-001/init-core-data-001
   [junit4]   2> 86354 INFO  (SUITE-TestCloudSearcherWarming-seed#[97BCA7D594D35198]-worker) [    ] o.a.s.SolrTestCaseJ4 Using TrieFields (NUMERIC_POINTS_SYSPROP=false) w/NUMERIC_DOCVALUES_SYSPROP=true
   [junit4]   2> 86355 INFO  (SUITE-TestCloudSearcherWarming-seed#[97BCA7D594D35198]-worker) [    ] o.a.s.SolrTestCaseJ4 Randomized ssl (true) and clientAuth (true) via: @org.apache.solr.util.RandomizeSSL(reason=, ssl=NaN, value=NaN, clientAuth=NaN)
   [junit4]   2> 86356 INFO  (SUITE-TestCloudSearcherWarming-seed#[97BCA7D594D35198]-worker) [    ] o.a.s.SolrTestCaseJ4 SecureRandom sanity checks: test.solr.allowed.securerandom=null & java.security.egd=file:/dev/./urandom
   [junit4]   2> 86357 INFO  (SUITE-TestCloudSearcherWarming-seed#[97BCA7D594D35198]-worker) [    ] o.a.s.c.MiniSolrCloudCluster Starting cluster of 1 servers in /home/jenkins/workspace/Lucene-Solr-7.x-Linux/solr/build/solr-core/test/J0/temp/solr.cloud.TestCloudSearcherWarming_97BCA7D594D35198-001/tempDir-001
   [junit4]   2> 86357 INFO  (SUITE-TestCloudSearcherWarming-seed#[97BCA7D594D35198]-worker) [    ] o.a.s.c.ZkTestServer STARTING ZK TEST SERVER
   [junit4]   2> 86358 INFO  (Thread-485) [    ] o.a.s.c.ZkTestServer client port:0.0.0.0/0.0.0.0:0
   [junit4]   2> 86358 INFO  (Thread-485) [    ] o.a.s.c.ZkTestServer Starting server
   [junit4]   2> 86360 ERROR (Thread-485) [    ] o.a.z.s.ZooKeeperServer ZKShutdownHandler is not registered, so ZooKeeper server won't take any action on ERROR or SHUTDOWN server state changes
   [junit4]   2> 86458 INFO  (SUITE-TestCloudSearcherWarming-seed#[97BCA7D594D35198]-worker) [    ] o.a.s.c.ZkTestServer start zk server on port:41917
   [junit4]   2> 86465 INFO  (jetty-launcher-102-thread-1) [    ] o.e.j.s.Server jetty-9.3.20.v20170531
   [junit4]   2> 86493 INFO  (jetty-launcher-102-thread-1) [    ] o.e.j.s.h.ContextHandler Started o.e.j.s.ServletContextHandler@15c3ccd{/solr,null,AVAILABLE}
   [junit4]   2> 86494 INFO  (jetty-launcher-102-thread-1) [    ] o.e.j.s.AbstractConnector Started ServerConnector@5900ac{SSL,[ssl, http/1.1]}{127.0.0.1:41665}
   [junit4]   2> 86494 INFO  (jetty-launcher-102-thread-1) [    ] o.e.j.s.Server Started @88069ms
   [junit4]   2> 86494 INFO  (jetty-launcher-102-thread-1) [    ] o.a.s.c.s.e.JettySolrRunner Jetty properties: {hostContext=/solr, hostPort=41665}
   [junit4]   2> 86494 ERROR (jetty-launcher-102-thread-1) [    ] o.a.s.u.StartupLoggingUtils Missing Java Option solr.log.dir. Logging may be missing or incomplete.
   [junit4]   2> 86494 INFO  (jetty-launcher-102-thread-1) [    ] o.a.s.s.SolrDispatchFilter  ___      _       Welcome to Apache Solr™ version 7.2.0
   [junit4]   2> 86494 INFO  (jetty-launcher-102-thread-1) [    ] o.a.s.s.SolrDispatchFilter / __| ___| |_ _   Starting in cloud mode on port null
   [junit4]   2> 86494 INFO  (jetty-launcher-102-thread-1) [    ] o.a.s.s.SolrDispatchFilter \__ \/ _ \ | '_|  Install dir: null, Default config dir: null
   [junit4]   2> 86494 INFO  (jetty-launcher-102-thread-1) [    ] o.a.s.s.SolrDispatchFilter |___/\___/_|_|    Start time: 2017-10-16T23:54:38.575Z
   [junit4]   2> 86499 INFO  (jetty-launcher-102-thread-1) [    ] o.a.s.s.SolrDispatchFilter solr.xml found in ZooKeeper. Loading...
   [junit4]   2> 86510 INFO  (jetty-launcher-102-thread-1) [    ] o.a.s.c.ZkContainer Zookeeper client=127.0.0.1:41917/solr
   [junit4]   2> 86566 INFO  (jetty-launcher-102-thread-1) [n:127.0.0.1:41665_solr    ] o.a.s.c.Overseer Overseer (id=null) closing
   [junit4]   2> 86567 INFO  (jetty-launcher-102-thread-1) [n:127.0.0.1:41665_solr    ] o.a.s.c.OverseerElectionContext I am going to be the leader 127.0.0.1:41665_solr
   [junit4]   2> 86567 INFO  (jetty-launcher-102-thread-1) [n:127.0.0.1:41665_solr    ] o.a.s.c.Overseer Overseer (id=98841269268643843-127.0.0.1:41665_solr-n_0000000000) starting
   [junit4]   2> 86574 INFO  (jetty-launcher-102-thread-1) [n:127.0.0.1:41665_solr    ] o.a.s.c.ZkController Register node as live in ZooKeeper:/live_nodes/127.0.0.1:41665_solr
   [junit4]   2> 86575 INFO  (zkCallback-109-thread-1-processing-n:127.0.0.1:41665_solr) [n:127.0.0.1:41665_solr    ] o.a.s.c.c.ZkStateReader Updated live nodes from ZooKeeper... (0) -> (1)
   [junit4]   2> 86684 INFO  (jetty-launcher-102-thread-1) [n:127.0.0.1:41665_solr    ] o.a.s.m.r.SolrJmxReporter JMX monitoring for 'solr_41665.solr.node' (registry 'solr.node') enabled at server: com.sun.jmx.mbeanserver.JmxMBeanServer@5f0060
   [junit4]   2> 86693 INFO  (jetty-launcher-102-thread-1) [n:127.0.0.1:41665_solr    ] o.a.s.m.r.SolrJmxReporter JMX monitoring for 'solr_41665.solr.jvm' (registry 'solr.jvm') enabled at server: com.sun.jmx.mbeanserver.JmxMBeanServer@5f0060
   [junit4]   2> 86693 INFO  (jetty-launcher-102-thread-1) [n:127.0.0.1:41665_solr    ] o.a.s.m.r.SolrJmxReporter JMX monitoring for 'solr_41665.solr.jetty' (registry 'solr.jetty') enabled at server: com.sun.jmx.mbeanserver.JmxMBeanServer@5f0060
   [junit4]   2> 86694 INFO  (jetty-launcher-102-thread-1) [n:127.0.0.1:41665_solr    ] o.a.s.c.CorePropertiesLocator Found 0 core definitions underneath /home/jenkins/workspace/Lucene-Solr-7.x-Linux/solr/build/solr-core/test/J0/temp/solr.cloud.TestCloudSearcherWarming_97BCA7D594D35198-001/tempDir-001/node1/.
   [junit4]   2> 86721 INFO  (SUITE-TestCloudSearcherWarming-seed#[97BCA7D594D35198]-worker) [    ] o.a.s.c.c.ZkStateReader Updated live nodes from ZooKeeper... (0) -> (1)
   [junit4]   2> 86721 INFO  (SUITE-TestCloudSearcherWarming-seed#[97BCA7D594D35198]-worker) [    ] o.a.s.c.s.i.ZkClientClusterStateProvider Cluster at 127.0.0.1:41917/solr ready
   [junit4]   2> 86729 INFO  (TEST-TestCloudSearcherWarming.testPeersyncFailureReplicationSuccess-seed#[97BCA7D594D35198]) [    ] o.a.s.SolrTestCaseJ4 ###Starting testPeersyncFailureReplicationSuccess
   [junit4]   2> 86777 INFO  (qtp959947-1113) [n:127.0.0.1:41665_solr    ] o.a.s.h.a.CollectionsHandler Invoked Collection Action :delete with params name=testRepFactor1LeaderStartup&action=DELETE&wt=javabin&version=2 and sendToOCPQueue=true
   [junit4]   2> 86786 INFO  (OverseerThreadFactory-439-thread-1-processing-n:127.0.0.1:41665_solr) [n:127.0.0.1:41665_solr    ] o.a.s.c.OverseerCollectionMessageHandler Executing Collection Cmd : action=UNLOAD&deleteInstanceDir=true&deleteDataDir=true
   [junit4]   2> 86786 ERROR (OverseerThreadFactory-439-thread-1-processing-n:127.0.0.1:41665_solr) [n:127.0.0.1:41665_solr    ] o.a.s.c.OverseerCollectionMessageHandler Collection: testRepFactor1LeaderStartup operation: delete failed:org.apache.solr.common.SolrException: Could not find collection : testRepFactor1LeaderStartup
   [junit4]   2> 	at org.apache.solr.common.cloud.ClusterState.getCollection(ClusterState.java:111)
   [junit4]   2> 	at org.apache.solr.cloud.OverseerCollectionMessageHandler.collectionCmd(OverseerCollectionMessageHandler.java:797)
   [junit4]   2> 	at org.apache.solr.cloud.DeleteCollectionCmd.call(DeleteCollectionCmd.java:91)
   [junit4]   2> 	at org.apache.solr.cloud.OverseerCollectionMessageHandler.processMessage(OverseerCollectionMessageHandler.java:229)
   [junit4]   2> 	at org.apache.solr.cloud.OverseerTaskProcessor$Runner.run(OverseerTaskProcessor.java:464)
   [junit4]   2> 	at org.apache.solr.common.util.ExecutorUtil$MDCAwareThreadPoolExecutor.lambda$execute$0(ExecutorUtil.java:188)
   [junit4]   2> 	at java.util.concurrent.ThreadPoolExecutor.runWorker(ThreadPoolExecutor.java:1149)
   [junit4]   2> 	at java.util.concurrent.ThreadPoolExecutor$Worker.run(ThreadPoolExecutor.java:624)
   [junit4]   2> 	at java.lang.Thread.run(Thread.java:748)
   [junit4]   2> 
   [junit4]   2> 86792 INFO  (qtp959947-1113) [n:127.0.0.1:41665_solr    ] o.a.s.s.HttpSolrCall [admin] webapp=null path=/admin/collections params={name=testRepFactor1LeaderStartup&action=DELETE&wt=javabin&version=2} status=400 QTime=15
   [junit4]   2> 86794 INFO  (qtp959947-1106) [n:127.0.0.1:41665_solr    ] o.a.s.h.a.CollectionsHandler Invoked Collection Action :delete with params name=testPeersyncFailureReplicationSuccess&action=DELETE&wt=javabin&version=2 and sendToOCPQueue=true
   [junit4]   2> 86796 INFO  (OverseerCollectionConfigSetProcessor-98841269268643843-127.0.0.1:41665_solr-n_0000000000) [n:127.0.0.1:41665_solr    ] o.a.s.c.OverseerTaskQueue Response ZK path: /overseer/collection-queue-work/qnr-0000000000 doesn't exist.  Requestor may have disconnected from ZooKeeper
   [junit4]   2> 86796 INFO  (OverseerThreadFactory-439-thread-2-processing-n:127.0.0.1:41665_solr) [n:127.0.0.1:41665_solr    ] o.a.s.c.OverseerCollectionMessageHandler Executing Collection Cmd : action=UNLOAD&deleteInstanceDir=true&deleteDataDir=true
   [junit4]   2> 86796 ERROR (OverseerThreadFactory-439-thread-2-processing-n:127.0.0.1:41665_solr) [n:127.0.0.1:41665_solr    ] o.a.s.c.OverseerCollectionMessageHandler Collection: testPeersyncFailureReplicationSuccess operation: delete failed:org.apache.solr.common.SolrException: Could not find collection : testPeersyncFailureReplicationSuccess
   [junit4]   2> 	at org.apache.solr.common.cloud.ClusterState.getCollection(ClusterState.java:111)
   [junit4]   2> 	at org.apache.solr.cloud.OverseerCollectionMessageHandler.collectionCmd(OverseerCollectionMessageHandler.java:797)
   [junit4]   2> 	at org.apache.solr.cloud.DeleteCollectionCmd.call(DeleteCollectionCmd.java:91)
   [junit4]   2> 	at org.apache.solr.cloud.OverseerCollectionMessageHandler.processMessage(OverseerCollectionMessageHandler.java:229)
   [junit4]   2> 	at org.apache.solr.cloud.OverseerTaskProcessor$Runner.run(OverseerTaskProcessor.java:464)
   [junit4]   2> 	at org.apache.solr.common.util.ExecutorUtil$MDCAwareThreadPoolExecutor.lambda$execute$0(ExecutorUtil.java:188)
   [junit4]   2> 	at java.util.concurrent.ThreadPoolExecutor.runWorker(ThreadPoolExecutor.java:1149)
   [junit4]   2> 	at java.util.concurrent.ThreadPoolExecutor$Worker.run(ThreadPoolExecutor.java:624)
   [junit4]   2> 	at java.lang.Thread.run(Thread.java:748)
   [junit4]   2> 
   [junit4]   2> 86799 INFO  (qtp959947-1106) [n:127.0.0.1:41665_solr    ] o.a.s.s.HttpSolrCall [admin] webapp=null path=/admin/collections params={name=testPeersyncFailureReplicationSuccess&action=DELETE&wt=javabin&version=2} status=400 QTime=5
   [junit4]   2> 86800 INFO  (qtp959947-1109) [n:127.0.0.1:41665_solr    ] o.a.s.h.a.CollectionsHandler Invoked Collection Action :create with params pullReplicas=0&replicationFactor=1&name=testPeersyncFailureReplicationSuccess&nrtReplicas=1&action=CREATE&numShards=1&tlogReplicas=0&createNodeSet=127.0.0.1:41665_solr&wt=javabin&version=2 and sendToOCPQueue=true
   [junit4]   2> 86817 INFO  (OverseerThreadFactory-439-thread-3-processing-n:127.0.0.1:41665_solr) [n:127.0.0.1:41665_solr    ] o.a.s.c.CreateCollectionCmd Create collection testPeersyncFailureReplicationSuccess
   [junit4]   2> 86817 INFO  (OverseerThreadFactory-439-thread-3-processing-n:127.0.0.1:41665_solr) [n:127.0.0.1:41665_solr    ] o.a.s.c.CreateCollectionCmd Only _default config set found, using it.
   [junit4]   2> 86817 INFO  (OverseerCollectionConfigSetProcessor-98841269268643843-127.0.0.1:41665_solr-n_0000000000) [n:127.0.0.1:41665_solr    ] o.a.s.c.OverseerTaskQueue Response ZK path: /overseer/collection-queue-work/qnr-0000000002 doesn't exist.  Requestor may have disconnected from ZooKeeper
   [junit4]   2> 86818 INFO  (OverseerThreadFactory-439-thread-3-processing-n:127.0.0.1:41665_solr) [n:127.0.0.1:41665_solr    ] o.a.s.c.c.ZkConfigManager Copying zk node /configs/_default/protwords.txt to /configs/testPeersyncFailureReplicationSuccess/protwords.txt
   [junit4]   2> 86818 INFO  (OverseerThreadFactory-439-thread-3-processing-n:127.0.0.1:41665_solr) [n:127.0.0.1:41665_solr    ] o.a.s.c.c.ZkConfigManager Copying zk node /configs/_default/managed-schema to /configs/testPeersyncFailureReplicationSuccess/managed-schema
   [junit4]   2> 86819 INFO  (OverseerThreadFactory-439-thread-3-processing-n:127.0.0.1:41665_solr) [n:127.0.0.1:41665_solr    ] o.a.s.c.c.ZkConfigManager Copying zk node /configs/_default/solrconfig.xml to /configs/testPeersyncFailureReplicationSuccess/solrconfig.xml
   [junit4]   2> 86820 INFO  (OverseerThreadFactory-439-thread-3-processing-n:127.0.0.1:41665_solr) [n:127.0.0.1:41665_solr    ] o.a.s.c.c.ZkConfigManager Copying zk node /configs/_default/synonyms.txt to /configs/testPeersyncFailureReplicationSuccess/synonyms.txt
   [junit4]   2> 86821 INFO  (OverseerThreadFactory-439-thread-3-processing-n:127.0.0.1:41665_solr) [n:127.0.0.1:41665_solr    ] o.a.s.c.c.ZkConfigManager Copying zk node /configs/_default/stopwords.txt to /configs/testPeersyncFailureReplicationSuccess/stopwords.txt
   [junit4]   2> 86822 INFO  (OverseerThreadFactory-439-thread-3-processing-n:127.0.0.1:41665_solr) [n:127.0.0.1:41665_solr    ] o.a.s.c.c.ZkConfigManager Copying zk node /configs/_default/lang/contractions_it.txt to /configs/testPeersyncFailureReplicationSuccess/lang/contractions_it.txt
   [junit4]   2> 86822 INFO  (OverseerThreadFactory-439-thread-3-processing-n:127.0.0.1:41665_solr) [n:127.0.0.1:41665_solr    ] o.a.s.c.c.ZkConfigManager Copying zk node /configs/_default/lang/stemdict_nl.txt to /configs/testPeersyncFailureReplicationSuccess/lang/stemdict_nl.txt
   [junit4]   2> 86823 INFO  (OverseerThreadFactory-439-thread-3-processing-n:127.0.0.1:41665_solr) [n:127.0.0.1:41665_solr    ] o.a.s.c.c.ZkConfigManager Copying zk node /configs/_default/lang/stopwords_hy.txt to /configs/testPeersyncFailureReplicationSuccess/lang/stopwords_hy.txt
   [junit4]   2> 86823 INFO  (OverseerThreadFactory-439-thread-3-processing-n:127.0.0.1:41665_solr) [n:127.0.0.1:41665_solr    ] o.a.s.c.c.ZkConfigManager Copying zk node /configs/_default/lang/stopwords_no.txt to /configs/testPeersyncFailureReplicationSuccess/lang/stopwords_no.txt
   [junit4]   2> 86824 INFO  (OverseerThreadFactory-439-thread-3-processing-n:127.0.0.1:41665_solr) [n:127.0.0.1:41665_solr    ] o.a.s.c.c.ZkConfigManager Copying zk node /configs/_default/lang/contractions_ca.txt to /configs/testPeersyncFailureReplicationSuccess/lang/contractions_ca.txt
   [junit4]   2> 86824 INFO  (OverseerThreadFactory-439-thread-3-processing-n:127.0.0.1:41665_solr) [n:127.0.0.1:41665_solr    ] o.a.s.c.c.ZkConfigManager Copying zk node /configs/_default/lang/stopwords_id.txt to /configs/testPeersyncFailureReplicationSuccess/lang/stopwords_id.txt
   [junit4]   2> 86825 INFO  (OverseerThreadFactory-439-thread-3-processing-n:127.0.0.1:41665_solr) [n:127.0.0.1:41665_solr    ] o.a.s.c.c.ZkConfigManager Copying zk node /configs/_default/lang/stopwords_ga.txt to /configs/testPeersyncFailureReplicationSuccess/lang/stopwords_ga.txt
   [junit4]   2> 86826 INFO  (OverseerThreadFactory-439-thread-3-processing-n:127.0.0.1:41665_solr) [n:127.0.0.1:41665_solr    ] o.a.s.c.c.ZkConfigManager Copying zk node /configs/_default/lang/stopwords_hi.txt to /configs/testPeersyncFailureReplicationSuccess/lang/stopwords_hi.txt
   [junit4]   2> 86826 INFO  (OverseerThreadFactory-439-thread-3-processing-n:127.0.0.1:41665_solr) [n:127.0.0.1:41665_solr    ] o.a.s.c.c.ZkConfigManager Copying zk node /configs/_default/lang/stopwords_da.txt to /configs/testPeersyncFailureReplicationSuccess/lang/stopwords_da.txt
   [junit4]   2> 86827 INFO  (OverseerThreadFactory-439-thread-3-processing-n:127.0.0.1:41665_solr) [n:127.0.0.1:41665_solr    ] o.a.s.c.c.ZkConfigManager Copying zk node /configs/_default/lang/stopwords_ja.txt to /configs/testPeersyncFailureReplicationSuccess/lang/stopwords_ja.txt
   [junit4]   2> 86829 INFO  (OverseerThreadFactory-439-thread-3-processing-n:127.0.0.1:41665_solr) [n:127.0.0.1:41665_solr    ] o.a.s.c.c.ZkConfigManager Copying zk node /configs/_default/lang/stopwords_pt.txt to /configs/testPeersyncFailureReplicationSuccess/lang/stopwords_pt.txt
   [junit4]   2> 86830 INFO  (OverseerThreadFactory-439-thread-3-processing-n:127.0.0.1:41665_solr) [n:127.0.0.1:41665_solr    ] o.a.s.c.c.ZkConfigManager Copying zk node /configs/_default/lang/stopwords_hu.txt to /configs/testPeersyncFailureReplicationSuccess/lang/stopwords_hu.txt
   [junit4]   2> 86830 INFO  (OverseerThreadFactory-439-thread-3-processing-n:127.0.0.1:41665_solr) [n:127.0.0.1:41665_solr    ] o.a.s.c.c.ZkConfigManager Copying zk node /configs/_default/lang/stopwords_el.txt to /configs/testPeersyncFailureReplicationSuccess/lang/stopwords_el.txt
   [junit4]   2> 86831 INFO  (OverseerThreadFactory-439-thread-3-processing-n:127.0.0.1:41665_solr) [n:127.0.0.1:41665_solr    ] o.a.s.c.c.ZkConfigManager Copying zk node /configs/_default/lang/stopwords_ru.txt to /configs/testPeersyncFailureReplicationSuccess/lang/stopwords_ru.txt
   [junit4]   2> 86831 INFO  (OverseerThreadFactory-439-thread-3-processing-n:127.0.0.1:41665_solr) [n:127.0.0.1:41665_solr    ] o.a.s.c.c.ZkConfigManager Copying zk node /configs/_default/lang/stopwords_tr.txt to /configs/testPeersyncFailureReplicationSuccess/lang/stopwords_tr.txt
   [junit4]   2> 86832 INFO  (OverseerThreadFactory-439-thread-3-processing-n:127.0.0.1:41665_solr) [n:127.0.0.1:41665_solr    ] o.a.s.c.c.ZkConfigManager Copying zk node /configs/_default/lang/stopwords_ar.txt to /configs/testPeersyncFailureReplicationSuccess/lang/stopwords_ar.txt
   [junit4]   2> 86833 INFO  (OverseerThreadFactory-439-thread-3-processing-n:127.0.0.1:41665_solr) [n:127.0.0.1:41665_solr    ] o.a.s.c.c.ZkConfigManager Copying zk node /configs/_default/lang/userdict_ja.txt to /configs/testPeersyncFailureReplicationSuccess/lang/userdict_ja.txt
   [junit4]   2> 86833 INFO  (OverseerThreadFactory-439-thread-3-processing-n:127.0.0.1:41665_solr) [n:127.0.0.1:41665_solr    ] o.a.s.c.c.ZkConfigManager Copying zk node /configs/_default/lang/stopwords_eu.txt to /configs/testPeersyncFailureReplicationSuccess/lang/stopwords_eu.txt
   [junit4]   2> 86834 INFO  (OverseerThreadFactory-439-thread-3-processing-n:127.0.0.1:41665_solr) [n:127.0.0.1:41665_solr    ] o.a.s.c.c.ZkConfigManager Copying zk node /configs/_default/lang/stopwords_it.txt to /configs/testPeersyncFailureReplicationSuccess/lang/stopwords_it.txt
   [junit4]   2> 86834 INFO  (OverseerThreadFactory-439-thread-3-processing-n:127.0.0.1:41665_solr) [n:127.0.0.1:41665_solr    ] o.a.s.c.c.ZkConfigManager Copying zk node /configs/_default/lang/stopwords_cz.txt to /configs/testPeersyncFailureReplicationSuccess/lang/stopwords_cz.txt
   [junit4]   2> 86835 INFO  (OverseerThreadFactory-439-thread-3-processing-n:127.0.0.1:41665_solr) [n:127.0.0.1:41665_solr    ] o.a.s.c.c.ZkConfigManager Copying zk node /configs/_default/lang/stoptags_ja.txt to /configs/testPeersyncFailureReplicationSuccess/lang/stoptags_ja.txt
   [junit4]   2> 86835 INFO  (OverseerThreadFactory-439-thread-3-processing-n:127.0.0.1:41665_solr) [n:127.0.0.1:41665_solr    ] o.a.s.c.c.ZkConfigManager Copying zk node /configs/_default/lang/contractions_fr.txt to /configs/testPeersyncFailureReplicationSuccess/lang/contractions_fr.txt
   [junit4]   2> 86836 INFO  (OverseerThreadFactory-439-thread-3-processing-n:127.0.0.1:41665_solr) [n:127.0.0.1:41665_solr    ] o.a.s.c.c.ZkConfigManager Copying zk node /configs/_default/lang/stopwords_de.txt to /configs/testPeersyncFailureReplicationSuccess/lang/stopwords_de.txt
   [junit4]   2> 86836 INFO  (OverseerThreadFactory-439-thread-3-processing-n:127.0.0.1:41665_solr) [n:127.0.0.1:41665_solr    ] o.a.s.c.c.ZkConfigManager Copying zk node /configs/_default/lang/stopwords_fa.txt to /configs/testPeersyncFailureReplicationSuccess/lang/stopwords_fa.txt
   [junit4]   2> 86837 INFO  (OverseerThreadFactory-439-thread-3-processing-n:127.0.0.1:41665_solr) [n:127.0.0.1:41665_solr    ] o.a.s.c.c.ZkConfigManager Copying zk node /configs/_default/lang/contractions_ga.txt to /configs/testPeersyncFailureReplicationSuccess/lang/contractions_ga.txt
   [junit4]   2> 86837 INFO  (OverseerThreadFactory-439-thread-3-processing-n:127.0.0.1:41665_solr) [n:127.0.0.1:41665_solr    ] o.a.s.c.c.ZkConfigManager Copying zk node /configs/_default/lang/stopwords_ca.txt to /configs/testPeersyncFailureReplicationSuccess/lang/stopwords_ca.txt
   [junit4]   2> 86838 INFO  (OverseerThreadFactory-439-thread-3-processing-n:127.0.0.1:41665_solr) [n:127.0.0.1:41665_solr    ] o.a.s.c.c.ZkConfigManager Copying zk node /configs/_default/lang/stopwords_nl.txt to /configs/testPeersyncFailureReplicationSuccess/lang/stopwords_nl.txt
   [junit4]   2> 86838 INFO  (OverseerThreadFactory-439-thread-3-processing-n:127.0.0.1:41665_solr) [n:127.0.0.1:41665_solr    ] o.a.s.c.c.ZkConfigManager Copying zk node /configs/_default/lang/stopwords_bg.txt to /configs/testPeersyncFailureReplicationSuccess/lang/stopwords_bg.txt
   [junit4]   2> 86839 INFO  (OverseerThreadFactory-439-thread-3-processing-n:127.0.0.1:41665_solr) [n:127.0.0.1:41665_solr    ] o.a.s.c.c.ZkConfigManager Copying zk node /configs/_default/lang/stopwords_lv.txt to /configs/testPeersyncFailureReplicationSuccess/lang/stopwords_lv.txt
   [junit4]   2> 86839 INFO  (OverseerThreadFactory-439-thread-3-processing-n:127.0.0.1:41665_solr) [n:127.0.0.1:41665_solr    ] o.a.s.c.c.ZkConfigManager Copying zk node /configs/_default/lang/stopwords_en.txt to /configs/testPeersyncFailureReplicationSuccess/lang/stopwords_en.txt
   [junit4]   2> 86840 INFO  (OverseerThreadFactory-439-thread-3-processing-n:127.0.0.1:41665_solr) [n:127.0.0.1:41665_solr    ] o.a.s.c.c.ZkConfigManager Copying zk node /configs/_default/lang/stopwords_es.txt to /configs/testPeersyncFailureReplicationSuccess/lang/stopwords_es.txt
   [junit4]   2> 86840 INFO  (OverseerThreadFactory-439-thread-3-processing-n:127.0.0.1:41665_solr) [n:127.0.0.1:41665_solr    ] o.a.s.c.c.ZkConfigManager Copying zk node /configs/_default/lang/stopwords_th.txt to /configs/testPeersyncFailureReplicationSuccess/lang/stopwords_th.txt
   [junit4]   2> 86841 INFO  (OverseerThreadFactory-439-thread-3-processing-n:127.0.0.1:41665_solr) [n:127.0.0.1:41665_solr    ] o.a.s.c.c.ZkConfigManager Copying zk node /configs/_default/lang/stopwords_ro.txt to /configs/testPeersyncFailureReplicationSuccess/lang/stopwords_ro.txt
   [junit4]   2> 86841 INFO  (OverseerThreadFactory-439-thread-3-processing-n:127.0.0.1:41665_solr) [n:127.0.0.1:41665_solr    ] o.a.s.c.c.ZkConfigManager Copying zk node /configs/_default/lang/stopwords_fr.txt to /configs/testPeersyncFailureReplicationSuccess/lang/stopwords_fr.txt
   [junit4]   2> 86842 INFO  (OverseerThreadFactory-439-thread-3-processing-n:127.0.0.1:41665_solr) [n:127.0.0.1:41665_solr    ] o.a.s.c.c.ZkConfigManager Copying zk node /configs/_default/lang/stopwords_sv.txt to /configs/testPeersyncFailureReplicationSuccess/lang/stopwords_sv.txt
   [junit4]   2> 86842 INFO  (OverseerThreadFactory-439-thread-3-processing-n:127.0.0.1:41665_solr) [n:127.0.0.1:41665_solr    ] o.a.s.c.c.ZkConfigManager Copying zk node /configs/_default/lang/stopwords_fi.txt to /configs/testPeersyncFailureReplicationSuccess/lang/stopwords_fi.txt
   [junit4]   2> 86843 INFO  (OverseerThreadFactory-439-thread-3-processing-n:127.0.0.1:41665_solr) [n:127.0.0.1:41665_solr    ] o.a.s.c.c.ZkConfigManager Copying zk node /configs/_default/lang/hyphenations_ga.txt to /configs/testPeersyncFailureReplicationSuccess/lang/hyphenations_ga.txt
   [junit4]   2> 86843 INFO  (OverseerThreadFactory-439-thread-3-processing-n:127.0.0.1:41665_solr) [n:127.0.0.1:41665_solr    ] o.a.s.c.c.ZkConfigManager Copying zk node /configs/_default/lang/stopwords_gl.txt to /configs/testPeersyncFailureReplicationSuccess/lang/stopwords_gl.txt
   [junit4]   2> 86844 INFO  (OverseerThreadFactory-439-thread-3-processing-n:127.0.0.1:41665_solr) [n:127.0.0.1:41665_solr    ] o.a.s.c.c.ZkConfigManager Copying zk node /configs/_default/params.json to /configs/testPeersyncFailureReplicationSuccess/params.json
   [junit4]   2> 86948 INFO  (OverseerStateUpdate-98841269268643843-127.0.0.1:41665_solr-n_0000000000) [n:127.0.0.1:41665_solr    ] o.a.s.c.o.SliceMutator createReplica() {
   [junit4]   2>   "operation":"ADDREPLICA",
   [junit4]   2>   "collection":"testPeersyncFailureReplicationSuccess",
   [junit4]   2>   "shard":"shard1",
   [junit4]   2>   "core":"testPeersyncFailureReplicationSuccess_shard1_replica_n1",
   [junit4]   2>   "state":"down",
   [junit4]   2>   "base_url":"https://127.0.0.1:41665/solr",
   [junit4]   2>   "type":"NRT"} 
   [junit4]   2> 87163 INFO  (qtp959947-1107) [n:127.0.0.1:41665_solr    ] o.a.s.h.a.CoreAdminOperation core create command qt=/admin/cores&coreNodeName=core_node2&collection.configName=testPeersyncFailureReplicationSuccess&newCollection=true&name=testPeersyncFailureReplicationSuccess_shard1_replica_n1&action=CREATE&numShards=1&collection=testPeersyncFailureReplicationSuccess&shard=shard1&wt=javabin&version=2&replicaType=NRT
   [junit4]   2> 87164 INFO  (qtp959947-1107) [n:127.0.0.1:41665_solr    ] o.a.s.c.TransientSolrCoreCacheDefault Allocating transient cache for 2147483647 transient cores
   [junit4]   2> 87272 INFO  (zkCallback-109-thread-1-processing-n:127.0.0.1:41665_solr) [n:127.0.0.1:41665_solr    ] o.a.s.c.c.ZkStateReader A cluster state change: [WatchedEvent state:SyncConnected type:NodeDataChanged path:/collections/testPeersyncFailureReplicationSuccess/state.json] for collection [testPeersyncFailureReplicationSuccess] has occurred - updating... (live nodes size: [1])
   [junit4]   2> 87272 INFO  (zkCallback-109-thread-2-processing-n:127.0.0.1:41665_solr) [n:127.0.0.1:41665_solr    ] o.a.s.c.c.ZkStateReader A cluster state change: [WatchedEvent state:SyncConnected type:NodeDataChanged path:/collections/testPeersyncFailureReplicationSuccess/state.json] for collection [testPeersyncFailureReplicationSuccess] has occurred - updating... (live nodes size: [1])
   [junit4]   2> 88178 INFO  (qtp959947-1107) [n:127.0.0.1:41665_solr c:testPeersyncFailureReplicationSuccess s:shard1 r:core_node2 x:testPeersyncFailureReplicationSuccess_shard1_replica_n1] o.a.s.c.RequestParams conf resource params.json loaded . version : 0 
   [junit4]   2> 88179 INFO  (qtp959947-1107) [n:127.0.0.1:41665_solr c:testPeersyncFailureReplicationSuccess s:shard1 r:core_node2 x:testPeersyncFailureReplicationSuccess_shard1_replica_n1] o.a.s.c.RequestParams request params refreshed to version 0
   [junit4]   2> 88180 WARN  (qtp959947-1107) [n:127.0.0.1:41665_solr c:testPeersyncFailureReplicationSuccess s:shard1 r:core_node2 x:testPeersyncFailureReplicationSuccess_shard1_replica_n1] o.a.s.c.SolrConfig Couldn't add files from /home/jenkins/workspace/Lucene-Solr-7.x-Linux/solr/build/solr-core/test/J0/temp/solr.cloud.TestCloudSearcherWarming_97BCA7D594D35198-001/tempDir-001/node1/testPeersyncFailureReplicationSuccess_shard1_replica_n1/../../../../contrib/extraction/lib filtered by .*\.jar to classpath: /home/jenkins/workspace/Lucene-Solr-7.x-Linux/solr/build/solr-core/test/J0/temp/solr.cloud.TestCloudSearcherWarming_97BCA7D594D35198-001/tempDir-001/node1/testPeersyncFailureReplicationSuccess_shard1_replica_n1/../../../../contrib/extraction/lib
   [junit4]   2> 88180 WARN  (qtp959947-1107) [n:127.0.0.1:41665_solr c:testPeersyncFailureReplicationSuccess s:shard1 r:core_node2 x:testPeersyncFailureReplicationSuccess_shard1_replica_n1] o.a.s.c.SolrConfig Couldn't add files from /home/jenkins/workspace/Lucene-Solr-7.x-Linux/solr/build/solr-core/test/J0/temp/solr.cloud.TestCloudSearcherWarming_97BCA7D594D35198-001/tempDir-001/node1/testPeersyncFailureReplicationSuccess_shard1_replica_n1/../../../../dist filtered by solr-cell-\d.*\.jar to classpath: /home/jenkins/workspace/Lucene-Solr-7.x-Linux/solr/build/solr-core/test/J0/temp/solr.cloud.TestCloudSearcherWarming_97BCA7D594D35198-001/tempDir-001/node1/testPeersyncFailureReplicationSuccess_shard1_replica_n1/../../../../dist
   [junit4]   2> 88180 WARN  (qtp959947-1107) [n:127.0.0.1:41665_solr c:testPeersyncFailureReplicationSuccess s:shard1 r:core_node2 x:testPeersyncFailureReplicationSuccess_shard1_replica_n1] o.a.s.c.SolrConfig Couldn't add files from /home/jenkins/workspace/Lucene-Solr-7.x-Linux/solr/build/solr-core/test/J0/temp/solr.cloud.TestCloudSearcherWarming_97BCA7D594D35198-001/tempDir-001/node1/testPeersyncFailureReplicationSuccess_shard1_replica_n1/../../../../contrib/clustering/lib filtered by .*\.jar to classpath: /home/jenkins/workspace/Lucene-Solr-7.x-Linux/solr/build/solr-core/test/J0/temp/solr.cloud.TestCloudSearcherWarming_97BCA7D594D35198-001/tempDir-001/node1/testPeersyncFailureReplicationSuccess_shard1_replica_n1/../../../../contrib/clustering/lib
   [junit4]   2> 88180 WARN  (qtp959947-1107) [n:127.0.0.1:41665_solr c:testPeersyncFailureReplicationSuccess s:shard1 r:core_node2 x:testPeersyncFailureReplicationSuccess_shard1_replica_n1] o.a.s.c.SolrConfig Couldn't add files from /home/jenkins/workspace/Lucene-Solr-7.x-Linux/solr/build/solr-core/test/J0/temp/solr.cloud.TestCloudSearcherWarming_97BCA7D594D35198-001/tempDir-001/node1/testPeersyncFailureReplicationSuccess_shard1_replica_n1/../../../../dist filtered by solr-clustering-\d.*\.jar to classpath: /home/jenkins/workspace/Lucene-Solr-7.x-Linux/solr/build/solr-core/test/J0/temp/solr.cloud.TestCloudSearcherWarming_97BCA7D594D35198-001/tempDir-001/node1/testPeersyncFailureReplicationSuccess_shard1_replica_n1/../../../../dist
   [junit4]   2> 88180 WARN  (qtp959947-1107) [n:127.0.0.1:41665_solr c:testPeersyncFailureReplicationSuccess s:shard1 r:core_node2 x:testPeersyncFailureReplicationSuccess_shard1_replica_n1] o.a.s.c.SolrConfig Couldn't add files from /home/jenkins/workspace/Lucene-Solr-7.x-Linux/solr/build/solr-core/test/J0/temp/solr.cloud.TestCloudSearcherWarming_97BCA7D594D35198-001/tempDir-001/node1/testPeersyncFailureReplicationSuccess_shard1_replica_n1/../../../../contrib/langid/lib filtered by .*\.jar to classpath: /home/jenkins/workspace/Lucene-Solr-7.x-Linux/solr/build/solr-core/test/J0/temp/solr.cloud.TestCloudSearcherWarming_97BCA7D594D35198-001/tempDir-001/node1/testPeersyncFailureReplicationSuccess_shard1_replica_n1/../../../../contrib/langid/lib
   [junit4]   2> 88181 WARN  (qtp959947-1107) [n:127.0.0.1:41665_solr c:testPeersyncFailureReplicationSuccess s:shard1 r:core_node2 x:testPeersyncFailureReplicationSuccess_shard1_replica_n1] o.a.s.c.SolrConfig Couldn't add files from /home/jenkins/workspace/Lucene-Solr-7.x-Linux/solr/build/solr-core/test/J0/temp/solr.cloud.TestCloudSearcherWarming_97BCA7D594D35198-001/tempDir-001/node1/testPeersyncFailureReplicationSuccess_shard1_replica_n1/../../../../dist filtered by solr-langid-\d.*\.jar to classpath: /home/jenkins/workspace/Lucene-Solr-7.x-Linux/solr/build/solr-core/test/J0/temp/solr.cloud.TestCloudSearcherWarming_97BCA7D594D35198-001/tempDir-001/node1/testPeersyncFailureReplicationSuccess_shard1_replica_n1/../../../../dist
   [junit4]   2> 88181 WARN  (qtp959947-1107) [n:127.0.0.1:41665_solr c:testPeersyncFailureReplicationSuccess s:shard1 r:core_node2 x:testPeersyncFailureReplicationSuccess_shard1_replica_n1] o.a.s.c.SolrConfig Couldn't add files from /home/jenkins/workspace/Lucene-Solr-7.x-Linux/solr/build/solr-core/test/J0/temp/solr.cloud.TestCloudSearcherWarming_97BCA7D594D35198-001/tempDir-001/node1/testPeersyncFailureReplicationSuccess_shard1_replica_n1/../../../../contrib/velocity/lib filtered by .*\.jar to classpath: /home/jenkins/workspace/Lucene-Solr-7.x-Linux/solr/build/solr-core/test/J0/temp/solr.cloud.TestCloudSearcherWarming_97BCA7D594D35198-001/tempDir-001/node1/testPeersyncFailureReplicationSuccess_shard1_replica_n1/../../../../contrib/velocity/lib
   [junit4]   2> 88181 WARN  (qtp959947-1107) [n:127.0.0.1:41665_solr c:testPeersyncFailureReplicationSuccess s:shard1 r:core_node2 x:testPeersyncFailureReplicationSuccess_shard1_replica_n1] o.a.s.c.SolrConfig Couldn't add files from /home/jenkins/workspace/Lucene-Solr-7.x-Linux/solr/build/solr-core/test/J0/temp/solr.cloud.TestCloudSearcherWarming_97BCA7D594D35198-001/tempDir-001/node1/testPeersyncFailureReplicationSuccess_shard1_replica_n1/../../../../dist filtered by solr-velocity-\d.*\.jar to classpath: /home/jenkins/workspace/Lucene-Solr-7.x-Linux/solr/build/solr-core/test/J0/temp/solr.cloud.TestCloudSearcherWarming_97BCA7D594D35198-001/tempDir-001/node1/testPeersyncFailureReplicationSuccess_shard1_replica_n1/../../../../dist
   [junit4]   2> 88184 INFO  (qtp959947-1107) [n:127.0.0.1:41665_solr c:testPeersyncFailureReplicationSuccess s:shard1 r:core_node2 x:testPeersyncFailureReplicationSuccess_shard1_replica_n1] o.a.s.c.SolrConfig Using Lucene MatchVersion: 7.2.0
   [junit4]   2> 88197 INFO  (qtp959947-1107) [n:127.0.0.1:41665_solr c:testPeersyncFailureReplicationSuccess s:shard1 r:core_node2 x:testPeersyncFailureReplicationSuccess_shard1_replica_n1] o.a.s.s.IndexSchema [testPeersyncFailureReplicationSuccess_shard1_replica_n1] Schema name=default-config
   [junit4]   2> 88394 INFO  (qtp959947-1107) [n:127.0.0.1:41665_solr c:testPeersyncFailureReplicationSuccess s:shard1 r:core_node2 x:testPeersyncFailureReplicationSuccess_shard1_replica_n1] o.a.s.s.IndexSchema Loaded schema default-config/1.6 with uniqueid field id
   [junit4]   2> 88413 INFO  (qtp959947-1107) [n:127.0.0.1:41665_solr c:testPeersyncFailureReplicationSuccess s:shard1 r:core_node2 x:testPeersyncFailureReplicationSuccess_shard1_replica_n1] o.a.s.c.CoreContainer Creating SolrCore 'testPeersyncFailureReplicationSuccess_shard1_replica_n1' using configuration from collection testPeersyncFailureReplicationSuccess, trusted=true
   [junit4]   2> 88414 INFO  (qtp959947-1107) [n:127.0.0.1:41665_solr c:testPeersyncFailureReplicationSuccess s:shard1 r:core_node2 x:testPeersyncFailureReplicationSuccess_shard1_replica_n1] o.a.s.m.r.SolrJmxReporter JMX monitoring for 'solr_41665.solr.core.testPeersyncFailureReplicationSuccess.shard1.replica_n1' (registry 'solr.core.testPeersyncFailureReplicationSuccess.shard1.replica_n1') enabled at server: com.sun.jmx.mbeanserver.JmxMBeanServer@5f0060
   [junit4]   2> 88419 INFO  (qtp959947-1107) [n:127.0.0.1:41665_solr c:testPeersyncFailureReplicationSuccess s:shard1 r:core_node2 x:testPeersyncFailureReplicationSuccess_shard1_replica_n1] o.a.s.c.SolrCore solr.RecoveryStrategy.Builder
   [junit4]   2> 88419 INFO  (qtp959947-1107) [n:127.0.0.1:41665_solr c:testPeersyncFailureReplicationSuccess s:shard1 r:core_node2 x:testPeersyncFailureReplicationSuccess_shard1_replica_n1] o.a.s.c.SolrCore [[testPeersyncFailureReplicationSuccess_shard1_replica_n1] ] Opening new SolrCore at [/home/jenkins/workspace/Lucene-Solr-7.x-Linux/solr/build/solr-core/test/J0/temp/solr.cloud.TestCloudSearcherWarming_97BCA7D594D35198-001/tempDir-001/node1/testPeersyncFailureReplicationSuccess_shard1_replica_n1], dataDir=[/home/jenkins/workspace/Lucene-Solr-7.x-Linux/solr/build/solr-core/test/J0/temp/solr.cloud.TestCloudSearcherWarming_97BCA7D594D35198-001/tempDir-001/node1/./testPeersyncFailureReplicationSuccess_shard1_replica_n1/data/]
   [junit4]   2> 88464 INFO  (qtp959947-1107) [n:127.0.0.1:41665_solr c:testPeersyncFailureReplicationSuccess s:shard1 r:core_node2 x:testPeersyncFailureReplicationSuccess_shard1_replica_n1] o.a.s.r.XSLTResponseWriter xsltCacheLifetimeSeconds=5
   [junit4]   2> 88631 INFO  (qtp959947-1107) [n:127.0.0.1:41665_solr c:testPeersyncFailureReplicationSuccess s:shard1 r:core_node2 x:testPeersyncFailureReplicationSuccess_shard1_replica_n1] o.a.s.u.UpdateHandler Using UpdateLog implementation: org.apache.solr.update.UpdateLog
   [junit4]   2> 88631 INFO  (qtp959947-1107) [n:127.0.0.1:41665_solr c:testPeersyncFailureReplicationSuccess s:shard1 r:core_node2 x:testPeersyncFailureReplicationSuccess_shard1_replica_n1] o.a.s.u.UpdateLog Initializing UpdateLog: dataDir= defaultSyncLevel=FLUSH numRecordsToKeep=100 maxNumLogsToKeep=10 numVersionBuckets=65536
   [junit4]   2> 88632 INFO  (qtp959947-1107) [n:127.0.0.1:41665_solr c:testPeersyncFailureReplicationSuccess s:shard1 r:core_node2 x:testPeersyncFailureReplicationSuccess_shard1_replica_n1] o.a.s.u.CommitTracker Hard AutoCommit: if uncommited for 15000ms; 
   [junit4]   2> 88632 INFO  (qtp959947-1107) [n:127.0.0.1:41665_solr c:testPeersyncFailureReplicationSuccess s:shard1 r:core_node2 x:testPeersyncFailureReplicationSuccess_shard1_replica_n1] o.a.s.u.CommitTracker Soft AutoCommit: disabled
   [junit4]   2> 88634 INFO  (qtp959947-1107) [n:127.0.0.1:41665_solr c:testPeersyncFailureReplicationSuccess s:shard1 r:core_node2 x:testPeersyncFailureReplicationSuccess_shard1_replica_n1] o.a.s.s.SolrIndexSearcher Opening [Searcher@67b693[testPeersyncFailureReplicationSuccess_shard1_replica_n1] main]
   [junit4]   2> 88635 INFO  (qtp959947-1107) [n:127.0.0.1:41665_solr c:testPeersyncFailureReplicationSuccess s:shard1 r:core_node2 x:testPeersyncFailureReplicationSuccess_shard1_replica_n1] o.a.s.r.ManagedResourceStorage Configured ZooKeeperStorageIO with znodeBase: /configs/testPeersyncFailureReplicationSuccess
   [junit4]   2> 88636 INFO  (qtp959947-1107) [n:127.0.0.1:41665_solr c:testPeersyncFailureReplicationSuccess s:shard1 r:core_node2 x:testPeersyncFailureReplicationSuccess_shard1_replica_n1] o.a.s.r.ManagedResourceStorage Loaded null at path _rest_managed.json using ZooKeeperStorageIO:path=/configs/testPeersyncFailureReplicationSuccess
   [junit4]   2> 88636 INFO  (qtp959947-1107) [n:127.0.0.1:41665_solr c:testPeersyncFailureReplicationSuccess s:shard1 r:core_node2 x:testPeersyncFailureReplicationSuccess_shard1_replica_n1] o.a.s.s.ZkIndexSchemaReader Creating ZooKeeper watch for the managed schema at /configs/testPeersyncFailureReplicationSuccess/managed-schema
   [junit4]   2> 88636 INFO  (qtp959947-1107) [n:127.0.0.1:41665_solr c:testPeersyncFailureReplicationSuccess s:shard1 r:core_node2 x:testPeersyncFailureReplicationSuccess_shard1_replica_n1] o.a.s.s.ZkIndexSchemaReader Current schema version 0 is already the latest
   [junit4]   2> 88636 INFO  (qtp959947-1107) [n:127.0.0.1:41665_solr c:testPeersyncFailureReplicationSuccess s:shard1 r:core_node2 x:testPeersyncFailureReplicationSuccess_shard1_replica_n1] o.a.s.h.c.SpellCheckComponent Initializing spell checkers
   [junit4]   2> 88642 INFO  (qtp959947-1107) [n:127.0.0.1:41665_solr c:testPeersyncFailureReplicationSuccess s:shard1 r:core_node2 x:testPeersyncFailureReplicationSuccess_shard1_replica_n1] o.a.s.s.DirectSolrSpellChecker init: {name=default,field=_text_,classname=solr.DirectSolrSpellChecker,distanceMeasure=internal,accuracy=0.5,maxEdits=2,minPrefix=1,maxInspections=5,minQueryLength=4,maxQueryFrequency=0.01}
   [junit4]   2> 88652 INFO  (qtp959947-1107) [n:127.0.0.1:41665_solr c:testPeersyncFailureReplicationSuccess s:shard1 r:core_node2 x:testPeersyncFailureReplicationSuccess_shard1_replica_n1] o.a.s.h.ReplicationHandler Commits will be reserved for 10000ms.
   [junit4]   2> 88652 INFO  (qtp959947-1107) [n:127.0.0.1:41665_solr c:testPeersyncFailureReplicationSuccess s:shard1 r:core_node2 x:testPeersyncFailureReplicationSuccess_shard1_replica_n1] o.a.s.u.UpdateLog Could not find max version in index or recent updates, using new clock 1581460310702686208
   [junit4]   2> 88652 INFO  (searcherExecutor-442-thread-1-processing-n:127.0.0.1:41665_solr x:testPeersyncFailureReplicationSuccess_shard1_replica_n1 s:shard1 c:testPeersyncFailureReplicationSuccess r:core_node2) [n:127.0.0.1:41665_solr c:testPeersyncFailureReplicationSuccess s:shard1 r:core_node2 x:testPeersyncFailureReplicationSuccess_shard1_replica_n1] o.a.s.c.QuerySenderListener QuerySenderListener sending requests to Searcher@67b693[testPeersyncFailureReplicationSuccess_shard1_replica_n1] main{ExitableDirectoryReader(UninvertingDirectoryReader())}
   [junit4]   2> 88652 INFO  (searcherExecutor-442-thread-1-processing-n:127.0.0.1:41665_solr x:testPeersyncFailureReplicationSuccess_shard1_replica_n1 s:shard1 c:testPeersyncFailureReplicationSuccess r:core_node2) [n:127.0.0.1:41665_solr c:testPeersyncFailureReplicationSuccess s:shard1 r:core_node2 x:testPeersyncFailureReplicationSuccess_shard1_replica_n1] o.a.s.c.QuerySenderListener QuerySenderListener done.
   [junit4]   2> 88652 INFO  (searcherExecutor-442-thread-1-processing-n:127.0.0.1:41665_solr x:testPeersyncFailureReplicationSuccess_shard1_replica_n1 s:shard1 c:testPeersyncFailureReplicationSuccess r:core_node2) [n:127.0.0.1:41665_solr c:testPeersyncFailureReplicationSuccess s:shard1 r:core_node2 x:testPeersyncFailureReplicationSuccess_shard1_replica_n1] o.a.s.h.c.SpellCheckComponent Loading spell index for spellchecker: default
   [junit4]   2> 88654 INFO  (searcherExecutor-442-thread-1-processing-n:127.0.0.1:41665_solr x:testPeersyncFailureReplicationSuccess_shard1_replica_n1 s:shard1 c:testPeersyncFailureReplicationSuccess r:core_node2) [n:127.0.0.1:41665_solr c:testPeersyncFailureReplicationSuccess s:shard1 r:core_node2 x:testPeersyncFailureReplicationSuccess_shard1_replica_n1] o.a.s.c.SolrCore [testPeersyncFailureReplicationSuccess_shard1_replica_n1] Registered new searcher Searcher@67b693[testPeersyncFailureReplicationSuccess_shard1_replica_n1] main{ExitableDirectoryReader(UninvertingDirectoryReader())}
   [junit4]   2> 88655 INFO  (qtp959947-1107) [n:127.0.0.1:41665_solr c:testPeersyncFailureReplicationSuccess s:shard1 r:core_node2 x:testPeersyncFailureReplicationSuccess_shard1_replica_n1] o.a.s.c.ShardLeaderElectionContext Enough replicas found to continue.
   [junit4]   2> 88655 INFO  (qtp959947-1107) [n:127.0.0.1:41665_solr c:testPeersyncFailureReplicationSuccess s:shard1 r:core_node2 x:testPeersyncFailureReplicationSuccess_shard1_replica_n1] o.a.s.c.ShardLeaderElectionContext I may be the new leader - try and sync
   [junit4]   2> 88655 INFO  (qtp959947-1107) [n:127.0.0.1:41665_solr c:testPeersyncFailureReplicationSuccess s:shard1 r:core_node2 x:testPeersyncFailureReplicationSuccess_shard1_replica_n1] o.a.s.c.SyncStrategy Sync replicas to https://127.0.0.1:41665/solr/testPeersyncFailureReplicationSuccess_shard1_replica_n1/
   [junit4]   2> 88655 INFO  (qtp959947-1107) [n:127.0.0.1:41665_solr c:testPeersyncFailureReplicationSuccess s:shard1 r:core_node2 x:testPeersyncFailureReplicationSuccess_shard1_replica_n1] o.a.s.c.SyncStrategy Sync Success - now sync replicas to me
   [junit4]   2> 88655 INFO  (qtp959947-1107) [n:127.0.0.1:41665_solr c:testPeersyncFailureReplicationSuccess s:shard1 r:core_node2 x:testPeersyncFailureReplicationSuccess_shard1_replica_n1] o.a.s.c.SyncStrategy https://127.0.0.1:41665/solr/testPeersyncFailureReplicationSuccess_shard1_replica_n1/ has no replicas
   [junit4]   2> 88655 INFO  (qtp959947-1107) [n:127.0.0.1:41665_solr c:testPeersyncFailureReplicationSuccess s:shard1 r:core_node2 x:testPeersyncFailureReplicationSuccess_shard1_replica_n1] o.a.s.c.ShardLeaderElectionContext Found all replicas participating in election, clear LIR
   [junit4]   2> 88656 INFO  (qtp959947-1107) [n:127.0.0.1:41665_solr c:testPeersyncFailureReplicationSuccess s:shard1 r:core_node2 x:testPeersyncFailureReplicationSuccess_shard1_replica_n1] o.a.s.c.ShardLeaderElectionContext I am the new leader: https://127.0.0.1:41665/solr/testPeersyncFailureReplicationSuccess_shard1_replica_n1/ shard1
   [junit4]   2> 88758 INFO  (zkCallback-109-thread-3-processing-n:127.0.0.1:41665_solr) [n:127.0.0.1:41665_solr    ] o.a.s.c.c.ZkStateReader A cluster state change: [WatchedEvent state:SyncConnected type:NodeDataChanged path:/collections/testPeersyncFailureReplicationSuccess/state.json] for collection [testPeersyncFailureReplicationSuccess] has occurred - updating... (live nodes size: [1])
   [junit4]   2> 88758 INFO  (zkCallback-109-thread-2-processing-n:127.0.0.1:41665_solr) [n:127.0.0.1:41665_solr    ] o.a.s.c.c.ZkStateReader A cluster state change: [WatchedEvent state:SyncConnected type:NodeDataChanged path:/collections/testPeersyncFailureReplicationSuccess/state.json] for collection [testPeersyncFailureReplicationSuccess] has occurred - updating... (live nodes size: [1])
   [junit4]   2> 88807 INFO  (qtp959947-1107) [n:127.0.0.1:41665_solr c:testPeersyncFailureReplicationSuccess s:shard1 r:core_node2 x:testPeersyncFailureReplicationSuccess_shard1_replica_n1] o.a.s.c.ZkController I am the leader, no recovery necessary
   [junit4]   2> 88808 INFO  (qtp959947-1107) [n:127.0.0.1:41665_solr c:testPeersyncFailureReplicationSuccess s:shard1 r:core_node2 x:testPeersyncFailureReplicationSuccess_shard1_replica_n1] o.a.s.s.HttpSolrCall [admin] webapp=null path=/admin/cores params={qt=/admin/cores&coreNodeName=core_node2&collection.configName=testPeersyncFailureReplicationSuccess&newCollection=true&name=testPeersyncFailureReplicationSuccess_shard1_replica_n1&action=CREATE&numShards=1&collection=testPeersyncFailureReplicationSuccess&shard=shard1&wt=javabin&version=2&replicaType=NRT} status=0 QTime=1644
   [junit4]   2> 88810 INFO  (qtp959947-1109) [n:127.0.0.1:41665_solr    ] o.a.s.h.a.CollectionsHandler Wait for new collection to be active for at most 30 seconds. Check all shard replicas
   [junit4]   2> 88819 INFO  (OverseerCollectionConfigSetProcessor-98841269268643843-127.0.0.1:41665_solr-n_0000000000) [n:127.0.0.1:41665_solr    ] o.a.s.c.OverseerTaskQueue Response ZK path: /overseer/collection-queue-work/qnr-0000000004 doesn't exist.  Requestor may have disconnected from ZooKeeper
   [junit4]   2> 88909 INFO  (zkCallback-109-thread-3-processing-n:127.0.0.1:41665_solr) [n:127.0.0.1:41665_solr    ] o.a.s.c.c.ZkStateReader A cluster state change: [WatchedEvent state:SyncConnected type:NodeDataChanged path:/collections/testPeersyncFailureReplicationSuccess/state.json] for collection [testPeersyncFailureReplicationSuccess] has occurred - updating... (live nodes size: [1])
   [junit4]   2> 88909 INFO  (zkCallback-109-thread-2-processing-n:127.0.0.1:41665_solr) [n:127.0.0.1:41665_solr    ] o.a.s.c.c.ZkStateReader A cluster state change: [WatchedEvent state:SyncConnected type:NodeDataChanged path:/collections/testPeersyncFailureReplicationSuccess/state.json] for collection [testPeersyncFailureReplicationSuccess] has occurred - updating... (live nodes size: [1])
   [junit4]   2> 89810 INFO  (qtp959947-1109) [n:127.0.0.1:41665_solr    ] o.a.s.s.HttpSolrCall [admin] webapp=null path=/admin/collections params={pullReplicas=0&replicationFactor=1&name=testPeersyncFailureReplicationSuccess&nrtReplicas=1&action=CREATE&numShards=1&tlogReplicas=0&createNodeSet=127.0.0.1:41665_solr&wt=javabin&version=2} status=0 QTime=3010
   [junit4]   2> java.lang.RuntimeException
   [junit4]   2> 	at org.apache.solr.cloud.TestCloudSearcherWarming$SleepingSolrEventListener.init(TestCloudSearcherWarming.java:306)
   [junit4]   2> 	at org.apache.solr.core.SolrCore.createInitInstance(SolrCore.java:827)
   [junit4]   2> 	at org.apache.solr.handler.SolrConfigHandler$Command.verifyClass(SolrConfigHandler.java:562)
   [junit4]   2> 	at org.apache.solr.handler.SolrConfigHandler$Command.updateNamedPlugin(SolrConfigHandler.java:533)
   [junit4]   2> 	at org.apache.solr.handler.SolrConfigHandler$Command.handleCommands(SolrConfigHandler.java:482)
   [junit4]   2> 	at org.apache.solr.handler.SolrConfigHandler$Command.handlePOST(SolrConfigHandler.java:346)
   [junit4]   2> 	at org.apache.solr.handler.SolrConfigHandler$Command.access$100(SolrConfigHandler.java:159)
   [junit4]   2> 	at org.apache.solr.handler.SolrConfigHandler.handleRequestBody(SolrConfigHandler.java:137)
   [junit4]   2> 	at org.apache.solr.handler.RequestHandlerBase.handleRequest(RequestHandlerBase.java:177)
   [junit4]   2> 	at org.apache.solr.core.SolrCore.execute(SolrCore.java:2484)
   [junit4]   2> 	at org.apache.solr.servlet.HttpSolrCall.execute(HttpSolrCall.java:720)
   [junit4]   2> 	at org.apache.solr.servlet.HttpSolrCall.call(HttpSolrCall.java:526)
   [junit4]   2> 	at org.apache.solr.servlet.SolrDispatchFilter.doFilter(SolrDispatchFilter.java:382)
   [junit4]   2> 	at org.apache.solr.servlet.SolrDispatchFilter.doFilter(SolrDispatchFilter.java:326)
   [junit4]   2> 	at org.eclipse.jetty.servlet.ServletHandler$CachedChain.doFilter(ServletHandler.java:1759)
   [junit4]   2> 	at org.apache.solr.client.solrj.embedded.JettySolrRunner$DebugFilter.doFilter(JettySolrRunner.java:139)
   [junit4]   2> 	at org.eclipse.jetty.servlet.ServletHandler$CachedChain.doFilter(ServletHandler.java:1759)
   [junit4]   2> 	at org.eclipse.jetty.servlet.ServletHandler.doHandle(ServletHandler.java:582)
   [junit4]   2> 	at org.eclipse.jetty.server.session.SessionHandler.doHandle(SessionHandler.java:224)
   [junit4]   2> 	at org.eclipse.jetty.server.handler.ContextHandler.doHandle(ContextHandler.java:1180)
   [junit4]   2> 	at org.eclipse.jetty.servlet.ServletHandler.doScope(ServletHandler.java:512)
   [junit4]   2> 	at org.eclipse.jetty.server.session.SessionHandler.doScope(SessionHandler.java:185)
   [junit4]   2> 	at org.eclipse.jetty.server.handler.ContextHandler.doScope(ContextHandler.java:1112)
   [junit4]   2> 	at org.eclipse.jetty.server.handler.ScopedHandler.handle(ScopedHandler.java:141)
   [junit4]   2> 	at org.eclipse.jetty.server.handler.gzip.GzipHandler.handle(GzipHandler.java:426)
   [junit4]   2> 	at org.eclipse.jetty.server.handler.HandlerWrapper.handle(HandlerWrapper.java:134)
   [junit4]   2> 	at org.eclipse.jetty.server.Server.handle(Server.java:534)
   [junit4]   2> 	at org.eclipse.jetty.server.HttpChannel.handle(HttpChannel.java:320)
   [junit4]   2> 	at org.eclipse.jetty.server.HttpConnection.onFillable(HttpConnection.java:251)
   [junit4]   2> 	at org.eclipse.jetty.io.AbstractConnection$ReadCallback.succeeded(AbstractConnection.java:283)
   [junit4]   2> 	at org.eclipse.jetty.io.FillInterest.fillable(FillInterest.java:108)
   [junit4]   2> 	at org.eclipse.jetty.io.ssl.SslConnection.onFillable(SslConnection.java:251)
   [junit4]   2> 	at org.eclipse.jetty.io.AbstractConnection$ReadCallback.succeeded(AbstractConnection.java:283)
   [junit4]   2> 	at org.eclipse.jetty.io.FillInterest.fillable(FillInterest.java:108)
   [junit4]   2> 	at org.eclipse.jetty.io.SelectChannelEndPoint$2.run(SelectChannelEndPoint.java:93)
   [junit4]   2> 	at org.eclipse.jetty.util.thread.strategy.ExecuteProduceConsume.executeProduceConsume(ExecuteProduceConsume.java:303)
   [junit4]   2> 	at org.eclipse.jetty.util.thread.strategy.ExecuteProduceConsume.produceConsume(ExecuteProduceConsume.java:148)
   [junit4]   2> 	at org.eclipse.jetty.util.thread.strategy.ExecuteProduceConsume.run(ExecuteProduceConsume.java:136)
   [junit4]   2> 	at org.eclipse.jetty.util.thread.QueuedThreadPool.runJob(QueuedThreadPool.java:671)
   [junit4]   2> 	at org.eclipse.jetty.util.thread.QueuedThreadPool$2.run(QueuedThreadPool.java:589)
   [junit4]   2> 	at java.lang.Thread.run(Thread.java:748)
   [junit4]   1> {event=newSearcher}
   [junit4]   2> java.lang.RuntimeException
   [junit4]   2> 	at org.apache.solr.cloud.TestCloudSearcherWarming$SleepingSolrEventListener.init(TestCloudSearcherWarming.java:306)
   [junit4]   2> 	at org.apache.solr.core.SolrCore.createInitInstance(SolrCore.java:827)
   [junit4]   2> 	at org.apache.solr.handler.SolrConfigHandler$Command.verifyClass(SolrConfigHandler.java:562)
   [junit4]   2> 	at org.apache.solr.handler.SolrConfigHandler$Command.updateNamedPlugin(SolrConfigHandler.java:533)
   [junit4]   2> 	at org.apache.solr.handler.SolrConfigHandler$Command.handleCommands(SolrConfigHandler.java:482)
   [junit4]   2> 	at org.apache.solr.handler.SolrConfigHandler$Command.handlePOST(SolrConfigHandler.java:346)
   [junit4]   2> 	at org.apache.solr.handler.SolrConfigHandler$Command.access$100(SolrConfigHandler.java:159)
   [junit4]   2> 	at org.apache.solr.handler.SolrConfigHandler.handleRequestBody(SolrConfigHandler.java:137)
   [junit4]   2> 	at org.apache.solr.handler.RequestHandlerBase.handleRequest(RequestHandlerBase.java:177)
   [junit4]   2> 	at org.apache.solr.core.SolrCore.execute(SolrCore.java:2484)
   [junit4]   2> 	at org.apache.solr.servlet.HttpSolrCall.execute(HttpSolrCall.java:720)
   [junit4]   2> 	at org.apache.solr.servlet.HttpSolrCall.call(HttpSolrCall.java:526)
   [junit4]   2> 	at org.apache.solr.servlet.SolrDispatchFilter.doFilter(SolrDispatchFilter.java:382)
   [junit4]   2> 	at org.apache.solr.servlet.SolrDispatchFilter.doFilter(SolrDispatchFilter.java:326)
   [junit4]   2> 	at org.eclipse.jetty.servlet.ServletHandler$CachedChain.doFilter(ServletHandler.java:1759)
   [junit4]   2> 	at org.apache.solr.client.solrj.embedded.JettySolrRunner$DebugFilter.doFilter(JettySolrRunner.java:139)
   [junit4]   2> 	at org.eclipse.jetty.servlet.ServletHandler$CachedChain.doFilter(ServletHandler.java:1759)
   [junit4]   2> 	at org.eclipse.jetty.servlet.ServletHandler.doHandle(ServletHandler.java:582)
   [junit4]   2> 	at org.eclipse.jetty.server.session.SessionHandler.doHandle(SessionHandler.java:224)
   [junit4]   2> 	at org.eclipse.jetty.server.handler.ContextHandler.doHandle(ContextHandler.java:1180)
   [junit4]   2> 	at org.eclipse.jetty.servlet.ServletHandler.doScope(ServletHandler.java:512)
   [junit4]   2> 	at org.eclipse.jetty.server.session.SessionHandler.doScope(SessionHandler.java:185)
   [junit4]   2> 	at org.eclipse.jetty.server.handler.ContextHandler.doScope(ContextHandler.java:1112)
   [junit4]   2> 	at org.eclipse.jetty.server.handler.ScopedHandler.handle(ScopedHandler.java:141)
   [junit4]   2> 	at org.eclipse.jetty.server.handler.gzip.GzipHandler.handle(GzipHandler.java:426)
   [junit4]   2> 	at org.eclipse.jetty.server.handler.HandlerWrapper.handle(HandlerWrapper.java:134)
   [junit4]   2> 	at org.eclipse.jetty.server.Server.handle(Server.java:534)
   [junit4]   2> 	at org.eclipse.jetty.server.HttpChannel.handle(HttpChannel.java:320)
   [junit4]   2> 	at org.eclipse.jetty.server.HttpConnection.onFillable(HttpConnection.java:251)
   [junit4]   2> 	at org.eclipse.jetty.io.AbstractConnection$ReadCallback.succeeded(AbstractConnection.java:283)
   [junit4]   2> 	at org.eclipse.jetty.io.FillInterest.fillable(FillInterest.java:108)
   [junit4]   2> 	at org.eclipse.jetty.io.ssl.SslConnection.onFillable(SslConnection.java:251)
   [junit4]   2> 	at org.eclipse.jetty.io.AbstractConnection$ReadCallback.succeeded(AbstractConnection.java:283)
   [junit4]   2> 	at org.eclipse.jetty.io.FillInterest.fillable(FillInterest.java:108)
   [junit4]   2> 	at org.eclipse.jetty.io.SelectChannelEndPoint$2.run(SelectChannelEndPoint.java:93)
   [junit4]   2> 	at org.eclipse.jetty.util.thread.strategy.ExecuteProduceConsume.executeProduceConsume(ExecuteProduceConsume.java:303)
   [junit4]   2> 	at org.eclipse.jetty.util.thread.strategy.ExecuteProduceConsume.produceConsume(ExecuteProduceConsume.java:148)
   [junit4]   2> 	at org.eclipse.jetty.util.thread.strategy.ExecuteProduceConsume.run(ExecuteProduceConsume.java:136)
   [junit4]   2> 	at org.eclipse.jetty.util.thread.QueuedThreadPool.runJob(QueuedThreadPool.java:671)
   [junit4]   2> 	at org.eclipse.jetty.util.thread.QueuedThreadPool$2.run(QueuedThreadPool.java:589)
   [junit4]   2> 	at java.lang.Thread.run(Thread.java:748)
   [junit4]   1> {event=firstSearcher}
   [junit4]   2> 89824 INFO  (qtp959947-1112) [n:127.0.0.1:41665_solr c:testPeersyncFailureReplicationSuccess s:shard1 r:core_node2 x:testPeersyncFailureReplicationSuccess_shard1_replica_n1] o.a.s.h.SolrConfigHandler Executed config commands successfully and persisted to ZK [{"add-listener":{
   [junit4]   2>     "name":"newSearcherListener",
   [junit4]   2>     "event":"newSearcher",
   [junit4]   2>     "class":"org.apache.solr.cloud.TestCloudSearcherWarming$SleepingSolrEventListener"}}, {"add-listener":{
   [junit4]   2>     "name":"firstSearcherListener",
   [junit4]   2>     "event":"firstSearcher",
   [junit4]   2>     "class":"org.apache.solr.cloud.TestCloudSearcherWarming$SleepingSolrEventListener"}}]
   [junit4]   2> 89824 INFO  (Thread-495) [n:127.0.0.1:41665_solr    ] o.a.s.c.SolrCore config update listener called for core testPeersyncFailureReplicationSuccess_shard1_replica_n1
   [junit4]   2> 89824 INFO  (Thread-495) [n:127.0.0.1:41665_solr    ] o.a.s.c.SolrCore core reload testPeersyncFailureReplicationSuccess_shard1_replica_n1
   [junit4]   2> 89825 INFO  (qtp959947-1112) [n:127.0.0.1:41665_solr c:testPeersyncFailureReplicationSuccess s:shard1 r:core_node2 x:testPeersyncFailureReplicationSuccess_shard1_replica_n1] o.a.s.h.SolrConfigHandler Waiting up to 30 secs for 1 replicas to set the property overlay to be of version 0 for collection testPeersyncFailureReplicationSuccess
   [junit4]   2> 89826 INFO  (solrHandlerExecutor-447-thread-1-processing-n:127.0.0.1:41665_solr x:testPeersyncFailureReplicationSuccess_shard1_replica_n1 s:shard1 c:testPeersyncFailureReplicationSuccess r:core_node2) [n:127.0.0.1:41665_solr c:testPeersyncFailureReplicationSuccess s:shard1 r:core_node2 x:testPeersyncFailureReplicationSuccess_shard1_replica_n1] o.a.s.h.SolrConfigHandler Time elapsed : 0 secs, maxWait 30
   [junit4]   2> 89833 INFO  (Thread-495) [n:127.0.0.1:41665_solr    ] o.a.s.c.RequestParams conf resource params.json loaded . version : 0 
   [junit4]   2> 89833 INFO  (Thread-495) [n:127.0.0.1:41665_solr    ] o.a.s.c.RequestParams request params refreshed to version 0
   [junit4]   2> 89833 WARN  (Thread-495) [n:127.0.0.1:41665_solr    ] o.a.s.c.SolrConfig Couldn't add files from /home/jenkins/workspace/Lucene-Solr-7.x-Linux/solr/build/solr-core/test/J0/temp/solr.cloud.TestCloudSearcherWarming_97BCA7D594D35198-001/tempDir-001/node1/testPeersyncFailureReplicationSuccess_shard1_replica_n1/../../../../contrib/extraction/lib filtered by .*\.jar to classpath: /home/jenkins/workspace/Lucene-Solr-7.x-Linux/solr/build/solr-core/test/J0/temp/solr.cloud.TestCloudSearcherWarming_97BCA7D594D35198-001/tempDir-001/node1/testPeersyncFailureReplicationSuccess_shard1_replica_n1/../../../../contrib/extraction/lib
   [junit4]   2> 89834 WARN  (Thread-495) [n:127.0.0.1:41665_solr    ] o.a.s.c.SolrConfig Couldn't add files from /home/jenkins/workspace/Lucene-Solr-7.x-Linux/solr/build/solr-core/test/J0/temp/solr.cloud.TestCloudSearcherWarming_97BCA7D594D35198-001/tempDir-001/node1/testPeersyncFailureReplicationSuccess_shard1_replica_n1/../../../../dist filtered by solr-cell-\d.*\.jar to classpath: /home/jenkins/workspace/Lucene-Solr-7.x-Linux/solr/build/solr-core/test/J0/temp/solr.cloud.TestCloudSearcherWarming_97BCA7D594D35198-001/tempDir-001/node1/testPeersyncFailureReplicationSuccess_shard1_replica_n1/../../../../dist
   [junit4]   2> 89834 WARN  (Thread-495) [n:127.0.0.1:41665_solr    ] o.a.s.c.SolrConfig Couldn't add files from /home/jenkins/workspace/Lucene-Solr-7.x-Linux/solr/build/solr-core/test/J0/temp/solr.cloud.TestCloudSearcherWarming_97BCA7D594D35198-001/tempDir-001/node1/testPeersyncFailureReplicationSuccess_shard1_replica_n1/../../../../contrib/clustering/lib filtered by .*\.jar to classpath: /home/jenkins/workspace/Lucene-Solr-7.x-Linux/solr/build/solr-core/test/J0/temp/solr.cloud.TestCloudSearcherWarming_97BCA7D594D35198-001/tempDir-001/node1/testPeersyncFailureReplicationSuccess_shard1_replica_n1/../../../../contrib/clustering/lib
   [junit4]   2> 89834 WARN  (Thread-495) [n:127.0.0.1:41665_solr    ] o.a.s.c.SolrConfig Couldn't add files from /home/jenkins/workspace/Lucene-Solr-7.x-Linux/solr/build/solr-core/test/J0/temp/solr.cloud.TestCloudSearcherWarming_97BCA7D594D35198-001/tempDir-001/node1/testPeersyncFailureReplicationSuccess_shard1_replica_n1/../../../../dist filtered by solr-clustering-\d.*\.jar to classpath: /home/jenkins/workspace/Lucene-Solr-7.x-Linux/solr/build/solr-core/test/J0/temp/solr.cloud.TestCloudSearcherWarming_97BCA7D594D35198-001/tempDir-001/node1/testPeersyncFailureReplicationSuccess_shard1_replica_n1/../../../../dist
   [junit4]   2> 89834 WARN  (Thread-495) [n:127.0.0.1:41665_solr    ] o.a.s.c.SolrConfig Couldn't add files from /home/jenkins/workspace/Lucene-Solr-7.x-Linux/solr/build/solr-core/test/J0/temp/solr.cloud.TestCloudSearcherWarming_97BCA7D594D35198-001/tempDir-001/node1/testPeersyncFailureReplicationSuccess_shard1_replica_n1/../../../../contrib/langid/lib filtered by .*\.jar to classpath: /home/jenkins/workspace/Lucene-Solr-7.x-Linux/solr/build/solr-core/test/J0/temp/solr.cloud.TestCloudSearcherWarming_97BCA7D594D35198-001/tempDir-001/node1/testPeersyncFailureReplicationSuccess_shard1_replica_n1/../../../../contrib/langid/lib
   [junit4]   2> 89834 WARN  (Thread-495) [n:127.0.0.1:41665_solr    ] o.a.s.c.SolrConfig Couldn't add files from /home/jenkins/workspace/Lucene-Solr-7.x-Linux/solr/build/solr-core/test/J0/temp/solr.cloud.TestCloudSearcherWarming_97BCA7D594D35198-001/tempDir-001/node1/testPeersyncFailureReplicationSuccess_shard1_replica_n1/../../../../dist filtered by solr-langid-\d.*\.jar to classpath: /home/jenkins/workspace/Lucene-Solr-7.x-Linux/solr/build/solr-core/test/J0/temp/solr.cloud.TestCloudSearcherWarming_97BCA7D594D35198-001/tempDir-001/node1/testPeersyncFailureReplicationSuccess_shard1_replica_n1/../../../../dist
   [junit4]   2> 89834 WARN  (Thread-495) [n:127.0.0.1:41665_solr    ] o.a.s.c.SolrConfig Couldn't add files from /home/jenkins/workspace/Lucene-Solr-7.x-Linux/solr/build/solr-core/test/J0/temp/solr.cloud.TestCloudSearcherWarming_97BCA7D594D35198-001/tempDir-001/node1/testPeersyncFailureReplicationSuccess_shard1_replica_n1/../../../../contrib/velocity/lib filtered by .*\.jar to classpath: /home/jenkins/workspace/Lucene-Solr-7.x-Linux/solr/build/solr-core/test/J0/temp/solr.cloud.TestCloudSearcherWarming_97BCA7D594D35198-001/tempDir-001/node1/testPeersyncFailureReplicationSuccess_shard1_replica_n1/../../../../contrib/velocity/lib
   [junit4]   2> 89834 WARN  (Thread-495) [n:127.0.0.1:41665_solr    ] o.a.s.c.SolrConfig Couldn't add files from /home/jenkins/workspace/Lucene-Solr-7.x-Linux/solr/build/solr-core/test/J0/temp/solr.cloud.TestCloudSearcherWarming_97BCA7D594D35198-001/tempDir-001/node1/testPeersyncFailureReplicationSuccess_shard1_replica_n1/../../../../dist filtered by solr-velocity-\d.*\.jar to classpath: /home/jenkins/workspace/Lucene-Solr-7.x-Linux/solr/build/solr-core/test/J0/temp/solr.cloud.TestCloudSearcherWarming_97BCA7D594D35198-001/tempDir-001/node1/testPeersyncFailureReplicationSuccess_shard1_replica_n1/../../../../dist
   [junit4]   2> 89839 INFO  (Thread-495) [n:127.0.0.1:41665_solr    ] o.a.s.c.SolrConfig Using Lucene MatchVersion: 7.2.0
   [junit4]   2> 89868 INFO  (Thread-495) [n:127.0.0.1:41665_solr    ] o.a.s.s.IndexSchema [testPeersyncFailureReplicationSuccess_shard1_replica_n1] Schema name=default-config
   [junit4]   2> 89935 INFO  (qtp959947-1108) [n:127.0.0.1:41665_solr c:testPeersyncFailureReplicationSuccess s:shard1 r:core_node2 x:testPeersyncFailureReplicationSuccess_shard1_replica_n1] o.a.s.h.SolrConfigHandler expecting overlay version 0 but my version is -1
   [junit4]   2> 89935 INFO  (qtp959947-1108) [n:127.0.0.1:41665_solr c:testPeersyncFailureReplicationSuccess s:shard1 r:core_node2 x:testPeersyncFailureReplicationSuccess_shard1_replica_n1] o.a.s.c.S.Request [testPeersyncFailureReplicationSuccess_shard1_replica_n1]  webapp=/solr path=/config/znodeVersion params={overlay=0&wt=javabin&version=2} status=0 QTime=0
   [junit4]   2> 89938 INFO  (SolrConfigHandler-refreshconf) [n:127.0.0.1:41665_solr c:testPeersyncFailureReplicationSuccess s:shard1 r:core_node2 x:testPeersyncFailureReplicationSuccess_shard1_replica_n1] o.a.s.h.SolrConfigHandler Another reload is in progress . Not doing anything
   [junit4]   2> 89938 INFO  (solrHandlerExecutor-447-thread-1-processing-n:127.0.0.1:41665_solr x:testPeersyncFailureReplicationSuccess_shard1_replica_n1 s:shard1 c:testPeersyncFailureReplicationSuccess r:core_node2) [n:127.0.0.1:41665_solr c:testPeersyncFailureReplicationSuccess s:shard1 r:core_node2 x:testPeersyncFailureReplicationSuccess_shard1_replica_n1] o.a.s.h.SolrConfigHandler Could not get expectedVersion 0 from https://127.0.0.1:41665/solr/testPeersyncFailureReplicationSuccess_shard1_replica_n1/ for prop overlay   after 1 attempts
   [junit4]   2> 89938 INFO  (solrHandlerExecutor-447-thread-1-processing-n:127.0.0.1:41665_solr x:testPeersyncFailureReplicationSuccess_shard1_replica_n1 s:shard1 c:testPeersyncFailureReplicationSuccess r:core_node2) [n:127.0.0.1:41665_solr c:testPeersyncFailureReplicationSuccess s:shard1 r:core_node2 x:testPeersyncFailureReplicationSuccess_shard1_replica_n1] o.a.s.h.SolrConfigHandler Time elapsed : 0 secs, maxWait 30
   [junit4]   2> 89976 INFO  (Thread-495) [n:127.0.0.1:41665_solr    ] o.a.s.s.IndexSchema Loaded schema default-config/1.6 with uniqueid field id
   [junit4]   2> 89994 INFO  (Thread-495) [n:127.0.0.1:41665_solr    ] o.a.s.c.CoreContainer Reloading SolrCore 'testPeersyncFailureReplicationSuccess_shard1_replica_n1' using configuration from collection testPeersyncFailureReplicationSuccess
   [junit4]   2> 90015 INFO  (Thread-495) [n:127.0.0.1:41665_solr c:testPeersyncFailureReplicationSuccess s:shard1 r:core_node2 x:testPeersyncFailureReplicationSuccess_shard1_replica_n1] o.a.s.m.r.SolrJmxReporter JMX monitoring for 'solr_41665.solr.core.testPeersyncFailureReplicationSuccess.shard1.replica_n1' (registry 'solr.core.testPeersyncFailureReplicationSuccess.shard1.replica_n1') enabled at server: com.sun.jmx.mbeanserver.JmxMBeanServer@5f0060
   [junit4]   2> 90015 INFO  (Thread-495) [n:127.0.0.1:41665_solr c:testPeersyncFailureReplicationSuccess s:shard1 r:core_node2 x:testPeersyncFailureReplicationSuccess_shard1_replica_n1] o.a.s.c.SolrCore [[testPeersyncFailureReplicationSuccess_shard1_replica_n1] ] Opening new SolrCore at [/home/jenkins/workspace/Lucene-Solr-7.x-Linux/solr/build/solr-core/test/J0/temp/solr.cloud.TestCloudSearcherWarming_97BCA7D594D35198-001/tempDir-001/node1/testPeersyncFailureReplicationSuccess_shard1_replica_n1], dataDir=[/home/jenkins/workspace/Lucene-Solr-7.x-Linux/solr/build/solr-core/test/J0/temp/solr.cloud.TestCloudSearcherWarming_97BCA7D594D35198-001/tempDir-001/node1/./testPeersyncFailureReplicationSuccess_shard1_replica_n1/data/]
   [junit4]   2> java.lang.RuntimeException
   [junit4]   2> 	at org.apache.solr.cloud.TestCloudSearcherWarming$SleepingSolrEventListener.init(TestCloudSearcherWarming.java:306)
   [junit4]   2> 	at org.apache.solr.core.SolrCore.createInitInstance(SolrCore.java:827)
   [junit4]   2> 	at org.apache.solr.core.SolrCore.initListeners(SolrCore.java:574)
   [junit4]   2> 	at org.apache.solr.core.SolrCore.<init>(SolrCore.java:927)
   [junit4]   2> 	at org.apache.solr.core.SolrCore.reload(SolrCore.java:637)
   [junit4]   2> 	at org.apache.solr.core.CoreContainer.reload(CoreContainer.java:1279)
   [junit4]   2> 	at org.apache.solr.core.SolrCore.lambda$getConfListener$20(SolrCore.java:2950)
   [junit4]   2> 	at org.apache.solr.cloud.ZkController.lambda$fireEventListeners$5(ZkController.java:2545)
   [junit4]   2> 	at java.lang.Thread.run(Thread.java:748)
   [junit4]   1> {event=newSearcher}
   [junit4]   2> java.lang.RuntimeException
   [junit4]   2> 	at org.apache.solr.cloud.TestCloudSearcherWarming$SleepingSolrEventListener.init(TestCloudSearcherWarming.java:306)
   [junit4]   2> 	at org.apache.solr.core.SolrCore.createInitInstance(SolrCore.java:827)
   [junit4]   2> 	at org.apache.solr.core.SolrCore.initListeners(SolrCore.java:570)
   [junit4]   2> 	at org.apache.solr.core.SolrCore.<init>(SolrCore.java:927)
   [junit4]   2> 	at org.apache.solr.core.SolrCore.reload(SolrCore.java:637)
   [junit4]   2> 	at org.apache.solr.core.CoreContainer.reload(CoreContainer.java:1279)
   [junit4]   2> 	at org.apache.solr.core.SolrCore.lambda$getConfListener$20(SolrCore.java:2950)
   [junit4]   2> 	at org.apache.solr.cloud.ZkController.lambda$fireEventListeners$5(ZkController.java:2545)
   [junit4]   2> 	at java.lang.Thread.run(Thread.java:748)
   [junit4]   1> {event=firstSearcher}
   [junit4]   2> 90020 INFO  (Thread-495) [n:127.0.0.1:41665_solr c:testPeersyncFailureReplicationSuccess s:shard1 r:core_node2 x:testPeersyncFailureReplicationSuccess_shard1_replica_n1] o.a.s.r.XSLTResponseWriter xsltCacheLifetimeSeconds=5
   [junit4]   2> 90047 INFO  (qtp959947-1107) [n:127.0.0.1:41665_solr c:testPeersyncFailureReplicationSuccess s:shard1 r:core_node2 x:testPeersyncFailureReplicationSuccess_shard1_replica_n1] o.a.s.h.SolrConfigHandler expecting overlay version 0 but my version is -1
   [junit4]   2> 90048 INFO  (qtp959947-1107) [n:127.0.0.1:41665_solr c:testPeersyncFailureReplicationSuccess s:shard1 r:core_node2 x:testPeersyncFailureReplicationSuccess_shard1_replica_n1] o.a.s.c.S.Request [testPeersyncFailureReplicationSuccess_shard1_replica_n1]  webapp=/solr path=/config/znodeVersion params={overlay=0&wt=javabin&version=2} status=0 QTime=0
   [junit4]   2> 90048 INFO  (solrHandlerExecutor-447-thread-1-processing-n:127.0.0.1:41665_solr x:testPeersyncFailureReplicationSuccess_shard1_replica_n1 s:shard1 c:testPeersyncFailureReplicationSuccess r:core_node2) [n:127.0.0.1:41665_solr c:testPeersyncFailureReplicationSuccess s:shard1 r:core_node2 x:testPeersyncFailureReplicationSuccess_shard1_replica_n1] o.a.s.h.SolrConfigHandler Could not get expectedVersion 0 from https://127.0.0.1:41665/solr/testPeersyncFailureReplicationSuccess_shard1_replica_n1/ for prop overlay   after 2 attempts
   [junit4]   2> 90048 INFO  (solrHandlerExecutor-447-thread-1-processing-n:127.0.0.1:41665_solr x:testPeersyncFailureReplicationSuccess_shard1_replica_n1 s:shard1 c:testPeersyncFailureReplicationSuccess r:core_node2) [n:127.0.0.1:41665_solr c:testPeersyncFailureReplicationSuccess s:shard1 r:core_node2 x:testPeersyncFailureReplicationSuccess_shard1_replica_n1] o.a.s.h.SolrConfigHandler Time elapsed : 0 secs, maxWait 30
   [junit4]   2> 90049 INFO  (SolrConfigHandler-refreshconf) [n:127.0.0.1:41665_solr c:testPeersyncFailureReplicationSuccess s:shard1 r:core_node2 x:testPeersyncFailureReplicationSuccess_shard1_replica_n1] o.a.s.h.SolrConfigHandler Another reload is in progress . Not doing anything
   [junit4]   2> 90060 INFO  (Thread-495) [n:127.0.0.1:41665_solr c:testPeersyncFailureReplicationSuccess s:shard1 r:core_node2 x:testPeersyncFailureReplicationSuccess_shard1_replica_n1] o.a.s.u.CommitTracker Hard AutoCommit: if uncommited for 15000ms; 
   [junit4]   2> 90060 INFO  (Thread-495) [n:127.0.0.1:41665_solr c:testPeersyncFailureReplicationSuccess s:shard1 r:core_node2 x:testPeersyncFailureReplicationSuccess_shard1_replica_n1] o.a.s.u.CommitTracker Soft AutoCommit: disabled
   [junit4]   2> 90062 INFO  (Thread-495) [n:127.0.0.1:41665_solr c:testPeersyncFailureReplicationSuccess s:shard1 r:core_node2 x:testPeersyncFailureReplicationSuccess_shard1_replica_n1] o.a.s.s.SolrIndexSearcher Opening [Searcher@158b090[testPeersyncFailureReplicationSuccess_shard1_replica_n1] main]
   [junit4]   2> 90063 INFO  (Thread-495) [n:127.0.0.1:41665_solr c:testPeersyncFailureReplicationSuccess s:shard1 r:core_node2 x:testPeersyncFailureReplicationSuccess_shard1_replica_n1] o.a.s.r.ManagedResourceStorage Configured ZooKeeperStorageIO with znodeBase: /configs/testPeersyncFailureReplicationSuccess
   [junit4]   2> 90063 INFO  (Thread-495) [n:127.0.0.1:41665_solr c:testPeersyncFailureReplicationSuccess s:shard1 r:core_node2 x:testPeersyncFailureReplicationSuccess_shard1_replica_n1] o.a.s.r.ManagedResourceStorage Loaded null at path _rest_managed.json using ZooKeeperStorageIO:path=/configs/testPeersyncFailureReplicationSuccess
   [junit4]   2> 90063 INFO  (Thread-495) [n:127.0.0.1:41665_solr c:testPeersyncFailureReplicationSuccess s:shard1 r:core_node2 x:testPeersyncFailureReplicationSuccess_shard1_replica_n1] o.a.s.s.ZkIndexSchemaReader Creating ZooKeeper watch for the managed schema at /configs/testPeersyncFailureReplicationSuccess/managed-schema
   [junit4]   2> 90063 INFO  (Thread-495) [n:127.0.0.1:41665_solr c:testPeersyncFailureReplicationSuccess s:shard1 r:core_node2 x:testPeersyncFailureReplicationSuccess_shard1_replica_n1] o.a.s.s.ZkIndexSchemaReader Current schema version 0 is already the latest
   [junit4]   2> 90064 INFO  (Thread-495) [n:127.0.0.1:41665_solr c:testPeersyncFailureReplicationSuccess s:shard1 r:core_node2 x:testPeersyncFailureReplicationSuccess_shard1_replica_n1] o.a.s.h.c.SpellCheckComponent Initializing spell checkers
   [junit4]   2> 90064 INFO  (Thread-495) [n:127.0.0.1:41665_solr c:testPeersyncFailureReplicationSuccess s:shard1 r:core_node2 x:testPeersyncFailureReplicationSuccess_shard1_replica_n1] o.a.s.s.DirectSolrSpellChecker init: {name=default,field=_text_,classname=solr.DirectSolrSpellChecker,distanceMeasure=internal,accuracy=0.5,maxEdits=2,minPrefix=1,maxInspections=5,minQueryLength=4,maxQueryFrequency=0.01}
   [junit4]   2> 90065 INFO  (Thread-495) [n:127.0.0.1:41665_solr c:testPeersyncFailureReplicationSuccess s:shard1 r:core_node2 x:testPeersyncFailureReplicationSuccess_shard1_replica_n1] o.a.s.h.ReplicationHandler Commits will be reserved for 10000ms.
   [junit4]   2> 90065 INFO  (searcherExecutor-448-thread-1-processing-n:127.0.0.1:41665_solr x:testPeersyncFailureReplicationSuccess_shard1_replica_n1 s:shard1 c:testPeersyncFailureReplicationSuccess r:core_node2) [n:127.0.0.1:41665_solr c:testPeersyncFailureReplicationSuccess s:shard1 r:core_node2 x:testPeersyncFailureReplicationSuccess_shard1_replica_n1] o.a.s.c.QuerySenderListener QuerySenderListener sending requests to Searcher@158b090[testPeersyncFailureReplicationSuccess_shard1_replica_n1] main{ExitableDirectoryReader(UninvertingDirectoryReader())}
   [junit4]   2> 90066 INFO  (searcherExecutor-448-thread-1-processing-n:127.0.0.1:41665_solr x:testPeersyncFailureReplicationSuccess_shard1_replica_n1 s:shard1 c:testPeersyncFailureReplicationSuccess r:core_node2) [n:127.0.0.1:41665_solr c:testPeersyncFailureReplicationSuccess s:shard1 r:core_node2 x:testPeersyncFailureReplicationSuccess_shard1_replica_n1] o.a.s.c.QuerySenderListener QuerySenderListener done.
   [junit4]   2> 90067 INFO  (searcherExecutor-448-thread-1-processing-n:127.0.0.1:41665_solr x:testPeersyncFailureReplicationSuccess_shard1_replica_n1 s:shard1 c:testPeersyncFailureReplicationSuccess r:core_node2) [n:127.0.0.1:41665_solr c:testPeersyncFailureReplicationSuccess s:shard1 r:core_node2 x:testPeersyncFailureReplicationSuccess_shard1_replica_n1] o.a.s.h.c.SpellCheckComponent Loading spell index for spellchecker: default
   [junit4]   2> 90069 INFO  (searcherExecutor-448-thread-1-processing-n:127.0.0.1:41665_solr x:testPeersyncFailureReplicationSuccess_shard1_replica_n1 s:shard1 c:testPeersyncFailureReplicationSuccess r:core_node2) [n:127.0.0.1:41665_solr c:testPeersyncFailureReplicationSuccess s:shard1 r:core_node2 x:testPeersyncFailureReplicationSuccess_shard1_replica_n1] o.a.s.c.SolrCore [testPeersyncFailureReplicationSuccess_shard1_replica_n1] Registered new searcher Searcher@158b090[testPeersyncFailureReplicationSuccess_shard1_replica_n1] main{ExitableDirectoryReader(UninvertingDirectoryReader())}
   [junit4]   2> 90069 INFO  (Thread-495) [n:127.0.0.1:41665_solr c:testPeersyncFailureReplicationSuccess s:shard1 r:core_node2 x:testPeersyncFailureReplicationSuccess_shard1_replica_n1] o.a.s.u.UpdateLog Could not find max version in index or recent updates, using new clock 1581460312188518400
   [junit4]   2> 90072 INFO  (Thread-495) [n:127.0.0.1:41665_solr c:testPeersyncFailureReplicationSuccess s:shard1 r:core_node2 x:testPeersyncFailureReplicationSuccess_shard1_replica_n1] o.a.s.u.DefaultSolrCoreState New IndexWriter is ready to be used.
   [junit4]   2> 90073 INFO  (Thread-495) [n:127.0.0.1:41665_solr c:testPeersyncFailureReplicationSuccess s:shard1 r:core_node2 x:testPeersyncFailureReplicationSuccess_shard1_replica_n1] o.a.s.s.SolrIndexSearcher Opening [Searcher@1682f35[testPeersyncFailureReplicationSuccess_shard1_replica_n1] main]
   [junit4]   2> 90073 INFO  (searcherExecutor-448-thread-1-processing-n:127.0.0.1:41665_solr x:testPeersyncFailureReplicationSuccess_shard1_replica_n1 s:shard1 c:testPeersyncFailureReplicationSuccess r:core_node2) [n:127.0.0.1:41665_solr c:testPeersyncFailureReplicationSuccess s:shard1 r:core_node2 x:testPeersyncFailureReplicationSuccess_shard1_replica_n1] o.a.s.c.QuerySenderListener QuerySenderListener sending requests to Searcher@1682f35[testPeersyncFailureReplicationSuccess_shard1_replica_n1] main{ExitableDirectoryReader(UninvertingDirectoryReader())}
   [junit4]   2> 90073 INFO  (searcherExecutor-448-thread-1-processing-n:127.0.0.1:41665_solr x:testPeersyncFailureReplicationSuccess_shard1_replica_n1 s:shard1 c:testPeersyncFailureReplicationSuccess r:core_node2) [n:127.0.0.1:41665_solr c:testPeersyncFailureReplicationSuccess s:shard1 r:core_node2 x:testPeersyncFailureReplicationSuccess_shard1_replica_n1] o.a.s.c.QuerySenderListener QuerySenderListener done.
   [junit4]   2> 90076 INFO  (searcherExecutor-448-thread-1-processing-n:127.0.0.1:41665_solr x:testPeersyncFailureReplicationSuccess_shard1_replica_n1 s:shard1 c:testPeersyncFailureReplicationSuccess r:core_node2) [n:127.0.0.1:41665_solr c:testPeersyncFailureReplicationSuccess s:shard1 r:core_node2 x:testPeersyncFailureReplicationSuccess_shard1_replica_n1] o.a.s.c.SolrCore [testPeersyncFailureReplicationSuccess_shard1_replica_n1] Registered new searcher Searcher@1682f35[testPeersyncFailureReplicationSuccess_shard1_replica_n1] main{ExitableDirectoryReader(UninvertingDirectoryReader())}
   [junit4]   2> 90149 INFO  (qtp959947-1109) [n:127.0.0.1:41665_solr c:testPeersyncFailureReplicationSuccess s:shard1 r:core_node2 x:testPeersyncFailureReplicationSuccess_shard1_replica_n1] o.a.s.h.SolrConfigHandler I already have the expected version 0 of config
   [junit4]   2> 90149 INFO  (qtp959947-1109) [n:127.0.0.1:41665_solr c:testPeersyncFailureReplicationSuccess s:shard1 r:core_node2 x:testPeersyncFailureReplicationSuccess_shard1_replica_n1] o.a.s.h.SolrConfigHandler isStale false , resourceloader org.apache.solr.cloud.ZkSolrResourceLoader
   [junit4]   2> 90149 INFO  (qtp959947-1109) [n:127.0.0.1:41665_solr c:testPeersyncFailureReplicationSuccess s:shard1 r:core_node2 x:testPeersyncFailureReplicationSuccess_shard1_replica_n1] o.a.s.c.S.Request [testPeersyncFailureReplicationSuccess_shard1_replica_n1]  webapp=/solr path=/config/znodeVersion params={overlay=0&wt=javabin&version=2} status=0 QTime=0
   [junit4]   2> 90150 INFO  (qtp959947-1112) [n:127.0.0.1:41665_solr c:testPeersyncFailureReplicationSuccess s:shard1 r:core_node2 x:testPeersyncFailureReplicationSuccess_shard1_replica_n1] o.a.s.h.SolrConfigHandler Took 326.0ms to set the property overlay to be of version 0 for collection testPeersyncFailureReplicationSuccess
   [junit4]   2> 90150 INFO  (qtp959947-1112) [n:127.0.0.1:41665_solr c:testPeersyncFailureReplicationSuccess s:shard1 r:core_node2 x:testPeersyncFailureReplicationSuccess_shard1_replica_n1] o.a.s.c.S.Request [testPeersyncFailureReplicationSuccess_shard1_replica_n1]  webapp=/solr path=/config params={wt=javabin&version=2} status=0 QTime=333
   [junit4]   2> 90151 INFO  (qtp959947-1112) [n:127.0.0.1:41665_solr c:testPeersyncFailureReplicationSuccess s:shard1 r:core_node2 x:testPeersyncFailureReplicationSuccess_shard1_replica_n1] o.a.s.c.SolrCore [testPeersyncFailureReplicationSuccess_shard1_replic

[...truncated too long message...]

nager Closing metric reporters for registry=solr.collection.2nd_collection.shard2.leader, tag=31869545
   [junit4]   2> 83067 WARN  (zkCallback-149-thread-1-processing-n:127.0.0.1:33757_solr) [n:127.0.0.1:33757_solr    ] o.a.s.c.c.ZkStateReader ZooKeeper watch triggered, but Solr cannot talk to ZK: [KeeperErrorCode = Session expired for /live_nodes]
   [junit4]   2> 83073 WARN  (NIOServerCxn.Factory:0.0.0.0/0.0.0.0:0) [    ] o.a.z.s.NIOServerCnxn caught end of stream exception
   [junit4]   2> EndOfStreamException: Unable to read additional data from client sessionid 0x15f27c560c00009, likely client has closed socket
   [junit4]   2> 	at org.apache.zookeeper.server.NIOServerCnxn.doIO(NIOServerCnxn.java:239)
   [junit4]   2> 	at org.apache.zookeeper.server.NIOServerCnxnFactory.run(NIOServerCnxnFactory.java:203)
   [junit4]   2> 	at java.lang.Thread.run(Thread.java:748)
   [junit4]   2> 83073 INFO  (jetty-closer-133-thread-1) [    ] o.e.j.s.h.ContextHandler Stopped o.e.j.s.ServletContextHandler@9043ca{/solr,null,UNAVAILABLE}
   [junit4]   2> 83073 INFO  (zkCallback-144-thread-1-processing-n:127.0.0.1:44191_solr) [n:127.0.0.1:44191_solr    ] o.a.s.c.c.ZkStateReader Updated live nodes from ZooKeeper... (3) -> (2)
   [junit4]   2> 83074 INFO  (zkCallback-145-thread-4-processing-n:127.0.0.1:46559_solr) [n:127.0.0.1:46559_solr    ] o.a.s.c.c.ZkStateReader Updated live nodes from ZooKeeper... (3) -> (2)
   [junit4]   2> 83074 INFO  (jetty-closer-133-thread-3) [    ] o.a.s.c.Overseer Overseer (id=98841445510676487-127.0.0.1:46559_solr-n_0000000000) closing
   [junit4]   2> 83074 INFO  (OverseerStateUpdate-98841445510676487-127.0.0.1:46559_solr-n_0000000000) [n:127.0.0.1:46559_solr    ] o.a.s.c.Overseer Overseer Loop exiting : 127.0.0.1:46559_solr
   [junit4]   2> 83076 WARN  (OverseerAutoScalingTriggerThread-98841445510676487-127.0.0.1:46559_solr-n_0000000000) [n:127.0.0.1:46559_solr    ] o.a.s.c.a.OverseerTriggerThread OverseerTriggerThread woken up but we are closed, exiting.
   [junit4]   2> 83077 INFO  (zkCallback-145-thread-1-processing-n:127.0.0.1:46559_solr) [n:127.0.0.1:46559_solr    ] o.a.s.c.c.ZkStateReader Updated live nodes from ZooKeeper... (2) -> (1)
   [junit4]   2> 83080 WARN  (NIOServerCxn.Factory:0.0.0.0/0.0.0.0:0) [    ] o.a.z.s.NIOServerCnxn caught end of stream exception
   [junit4]   2> EndOfStreamException: Unable to read additional data from client sessionid 0x15f27c560c00006, likely client has closed socket
   [junit4]   2> 	at org.apache.zookeeper.server.NIOServerCnxn.doIO(NIOServerCnxn.java:239)
   [junit4]   2> 	at org.apache.zookeeper.server.NIOServerCnxnFactory.run(NIOServerCnxnFactory.java:203)
   [junit4]   2> 	at java.lang.Thread.run(Thread.java:748)
   [junit4]   2> 84574 WARN  (zkCallback-144-thread-1-processing-n:127.0.0.1:44191_solr) [n:127.0.0.1:44191_solr    ] o.a.s.c.ZkController Unable to register nodeLost path for 127.0.0.1:33757_solr
   [junit4]   2> org.apache.zookeeper.KeeperException$SessionExpiredException: KeeperErrorCode = Session expired for /autoscaling/nodeLost/127.0.0.1:33757_solr
   [junit4]   2> 	at org.apache.zookeeper.KeeperException.create(KeeperException.java:127)
   [junit4]   2> 	at org.apache.zookeeper.KeeperException.create(KeeperException.java:51)
   [junit4]   2> 	at org.apache.zookeeper.ZooKeeper.create(ZooKeeper.java:783)
   [junit4]   2> 	at org.apache.solr.common.cloud.SolrZkClient$9.execute(SolrZkClient.java:392)
   [junit4]   2> 	at org.apache.solr.common.cloud.SolrZkClient$9.execute(SolrZkClient.java:389)
   [junit4]   2> 	at org.apache.solr.common.cloud.ZkCmdExecutor.retryOperation(ZkCmdExecutor.java:60)
   [junit4]   2> 	at org.apache.solr.common.cloud.SolrZkClient.create(SolrZkClient.java:389)
   [junit4]   2> 	at org.apache.solr.cloud.ZkController.lambda$registerLiveNodesListener$2(ZkController.java:879)
   [junit4]   2> 	at org.apache.solr.common.cloud.ZkStateReader.lambda$refreshLiveNodes$1(ZkStateReader.java:747)
   [junit4]   2> 	at java.util.concurrent.ConcurrentHashMap$KeySetView.forEach(ConcurrentHashMap.java:4649)
   [junit4]   2> 	at org.apache.solr.common.cloud.ZkStateReader.refreshLiveNodes(ZkStateReader.java:746)
   [junit4]   2> 	at org.apache.solr.common.cloud.ZkStateReader.access$1000(ZkStateReader.java:72)
   [junit4]   2> 	at org.apache.solr.common.cloud.ZkStateReader$LiveNodeWatcher.refreshAndWatch(ZkStateReader.java:1152)
   [junit4]   2> 	at org.apache.solr.common.cloud.ZkStateReader$LiveNodeWatcher.process(ZkStateReader.java:1147)
   [junit4]   2> 	at org.apache.solr.common.cloud.SolrZkClient$3.lambda$process$0(SolrZkClient.java:269)
   [junit4]   2> 	at java.util.concurrent.Executors$RunnableAdapter.call(Executors.java:511)
   [junit4]   2> 	at java.util.concurrent.FutureTask.run(FutureTask.java:266)
   [junit4]   2> 	at org.apache.solr.common.util.ExecutorUtil$MDCAwareThreadPoolExecutor.lambda$execute$0(ExecutorUtil.java:188)
   [junit4]   2> 	at java.util.concurrent.ThreadPoolExecutor.runWorker(ThreadPoolExecutor.java:1149)
   [junit4]   2> 	at java.util.concurrent.ThreadPoolExecutor$Worker.run(ThreadPoolExecutor.java:624)
   [junit4]   2> 	at java.lang.Thread.run(Thread.java:748)
   [junit4]   2> 84575 WARN  (zkCallback-144-thread-2-processing-n:127.0.0.1:44191_solr) [n:127.0.0.1:44191_solr    ] o.a.s.c.c.ZkStateReader ZooKeeper watch triggered, but Solr cannot talk to ZK: [KeeperErrorCode = Session expired for /live_nodes]
   [junit4]   2> 84575 INFO  (jetty-closer-133-thread-2) [    ] o.e.j.s.h.ContextHandler Stopped o.e.j.s.ServletContextHandler@81037f{/solr,null,UNAVAILABLE}
   [junit4]   2> 84580 WARN  (zkCallback-145-thread-3-processing-n:127.0.0.1:46559_solr) [n:127.0.0.1:46559_solr    ] o.a.s.c.c.ZkStateReader ZooKeeper watch triggered, but Solr cannot talk to ZK: [KeeperErrorCode = Session expired for /live_nodes]
   [junit4]   2> 84581 INFO  (jetty-closer-133-thread-3) [    ] o.e.j.s.h.ContextHandler Stopped o.e.j.s.ServletContextHandler@1e83404{/solr,null,UNAVAILABLE}
   [junit4]   2> 84581 ERROR (SUITE-CloudSolrClientTest-seed#[730AA583F48244C7]-worker) [    ] o.a.z.s.ZooKeeperServer ZKShutdownHandler is not registered, so ZooKeeper server won't take any action on ERROR or SHUTDOWN server state changes
   [junit4]   2> 84581 INFO  (SUITE-CloudSolrClientTest-seed#[730AA583F48244C7]-worker) [    ] o.a.s.c.ZkTestServer connecting to 127.0.0.1:43875 43875
   [junit4]   2> 89610 INFO  (Thread-276) [    ] o.a.s.c.ZkTestServer connecting to 127.0.0.1:43875 43875
   [junit4]   2> 89610 WARN  (Thread-276) [    ] o.a.s.c.ZkTestServer Watch limit violations: 
   [junit4]   2> Maximum concurrent create/delete watches above limit:
   [junit4]   2> 
   [junit4]   2> 	7	/solr/aliases.json
   [junit4]   2> 	3	/solr/security.json
   [junit4]   2> 	3	/solr/configs/conf
   [junit4]   2> 
   [junit4]   2> Maximum concurrent data watches above limit:
   [junit4]   2> 
   [junit4]   2> 	21	/solr/collections/foo/state.json
   [junit4]   2> 	18	/solr/collections/localShardsTestColl/state.json
   [junit4]   2> 	10	/solr/collections/collection1/state.json
   [junit4]   2> 	10	/solr/collections/2nd_collection/state.json
   [junit4]   2> 	10	/solr/collections/multicollection2/state.json
   [junit4]   2> 	10	/solr/collections/multicollection1/state.json
   [junit4]   2> 	7	/solr/clusterprops.json
   [junit4]   2> 	7	/solr/clusterstate.json
   [junit4]   2> 	5	/solr/collections/overwrite/state.json
   [junit4]   2> 	2	/solr/collections/localShardsTestColl/leader_elect/shard3/election/98841445510676486-core_node18-n_0000000000
   [junit4]   2> 	2	/solr/collections/localShardsTestColl/leader_elect/shard1/election/98841445510676486-core_node7-n_0000000000
   [junit4]   2> 	2	/solr/overseer_elect/election/98841445510676487-127.0.0.1:46559_solr-n_0000000000
   [junit4]   2> 
   [junit4]   2> Maximum concurrent children watches above limit:
   [junit4]   2> 
   [junit4]   2> 	7	/solr/live_nodes
   [junit4]   2> 	7	/solr/collections
   [junit4]   2> 
   [junit4]   2> NOTE: leaving temporary files on disk at: /home/jenkins/workspace/Lucene-Solr-7.x-Linux/solr/build/solr-solrj/test/J1/temp/solr.client.solrj.impl.CloudSolrClientTest_730AA583F48244C7-001
   [junit4]   2> NOTE: test params are: codec=Asserting(Lucene70): {multiDefault=FST50, a_t=FST50, title_s=FST50, id=PostingsFormat(name=LuceneFixedGap), text=Lucene50(blocksize=128)}, docValues:{_version_=DocValuesFormat(name=Lucene70), multiDefault=DocValuesFormat(name=Direct), title_s=DocValuesFormat(name=Direct), intDefault=DocValuesFormat(name=Lucene70), id=DocValuesFormat(name=Lucene70), timestamp=DocValuesFormat(name=Direct)}, maxPointsInLeafNode=1613, maxMBSortInHeap=7.976315974250062, sim=RandomSimilarity(queryNorm=false): {}, locale=es-HN, timezone=VST
   [junit4]   2> NOTE: Linux 4.10.0-33-generic i386/Oracle Corporation 1.8.0_144 (32-bit)/cpus=8,threads=1,free=171678600,total=283377664
   [junit4]   2> NOTE: All tests run in this JVM: [LessThanEqualToEvaluatorTest, CloudSolrClientBuilderTest, SelectWithEvaluatorsTest, ArcCosineEvaluatorTest, TangentEvaluatorTest, SineEvaluatorTest, ClientUtilsTest, UuidEvaluatorTest, MultiplyEvaluatorTest, TestUpdateRequestCodec, QueryResponseTest, TestSolrJErrorHandling, ArrayEvaluatorTest, PowerEvaluatorTest, FacetFieldTest, TestFastInputStream, ExclusiveOrEvaluatorTest, HttpSolrClientBuilderTest, SolrDocumentTest, NoOpResponseParserTest, CoalesceEvaluatorTest, TestCollectionAdminRequest, SolrQueryTest, SolrExampleStreamingBinaryTest, SolrExampleXMLTest, SolrExampleEmbeddedTest, TestBatchUpdate, JettyWebappTest, TestSolrProperties, SolrParamTest, MergeIndexesEmbeddedTest, TestNamedListCodec, TestDocumentObjectBinder, ContentStreamTest, ModifiableSolrParamsTest, TestXMLEscaping, FieldAnalysisResponseTest, NamedListTest, AnlysisResponseBaseTest, GetByIdTest, SolrSchemalessExampleTest, TestLBHttpSolrClient, TestPolicy, CloudSolrClientTest]
   [junit4] Completed [89/145 (1!)] on J1 in 29.87s, 15 tests, 1 error <<< FAILURES!

[...truncated 42068 lines...]

Mime
View raw message