lucene-dev mailing list archives

Site index · List index
Message view « Date » · « Thread »
Top « Date » · « Thread »
From Apache Jenkins Server <jenk...@builds.apache.org>
Subject [JENKINS] Lucene-Solr-NightlyTests-master - Build # 1403 - Failure
Date Tue, 17 Oct 2017 20:00:43 GMT
Build: https://builds.apache.org/job/Lucene-Solr-NightlyTests-master/1403/

13 tests failed.
FAILED:  org.apache.lucene.index.TestIndexSorting.testRandom3

Error Message:
Test abandoned because suite timeout was reached.

Stack Trace:
java.lang.Exception: Test abandoned because suite timeout was reached.
	at __randomizedtesting.SeedInfo.seed([4A73DD356EFE1222]:0)


FAILED:  junit.framework.TestSuite.org.apache.lucene.index.TestIndexSorting

Error Message:
Suite timeout exceeded (>= 7200000 msec).

Stack Trace:
java.lang.Exception: Suite timeout exceeded (>= 7200000 msec).
	at __randomizedtesting.SeedInfo.seed([4A73DD356EFE1222]:0)


FAILED:  org.apache.solr.cloud.ShardSplitTest.testSplitAfterFailedSplit

Error Message:
Shard split did not succeed after a previous failed split attempt left sub-shards in construction state

Stack Trace:
java.lang.AssertionError: Shard split did not succeed after a previous failed split attempt left sub-shards in construction state
	at __randomizedtesting.SeedInfo.seed([F02C81D8640D9F8F:96112775878D205]:0)
	at org.junit.Assert.fail(Assert.java:93)
	at org.apache.solr.cloud.ShardSplitTest.testSplitAfterFailedSplit(ShardSplitTest.java:294)
	at sun.reflect.NativeMethodAccessorImpl.invoke0(Native Method)
	at sun.reflect.NativeMethodAccessorImpl.invoke(NativeMethodAccessorImpl.java:62)
	at sun.reflect.DelegatingMethodAccessorImpl.invoke(DelegatingMethodAccessorImpl.java:43)
	at java.lang.reflect.Method.invoke(Method.java:498)
	at com.carrotsearch.randomizedtesting.RandomizedRunner.invoke(RandomizedRunner.java:1737)
	at com.carrotsearch.randomizedtesting.RandomizedRunner$8.evaluate(RandomizedRunner.java:934)
	at com.carrotsearch.randomizedtesting.RandomizedRunner$9.evaluate(RandomizedRunner.java:970)
	at com.carrotsearch.randomizedtesting.RandomizedRunner$10.evaluate(RandomizedRunner.java:984)
	at org.apache.solr.BaseDistributedSearchTestCase$ShardsRepeatRule$ShardsFixedStatement.callStatement(BaseDistributedSearchTestCase.java:993)
	at org.apache.solr.BaseDistributedSearchTestCase$ShardsRepeatRule$ShardsStatement.evaluate(BaseDistributedSearchTestCase.java:968)
	at com.carrotsearch.randomizedtesting.rules.SystemPropertiesRestoreRule$1.evaluate(SystemPropertiesRestoreRule.java:57)
	at org.apache.lucene.util.TestRuleSetupTeardownChained$1.evaluate(TestRuleSetupTeardownChained.java:49)
	at org.apache.lucene.util.AbstractBeforeAfterRule$1.evaluate(AbstractBeforeAfterRule.java:45)
	at org.apache.lucene.util.TestRuleThreadAndTestName$1.evaluate(TestRuleThreadAndTestName.java:48)
	at org.apache.lucene.util.TestRuleIgnoreAfterMaxFailures$1.evaluate(TestRuleIgnoreAfterMaxFailures.java:64)
	at org.apache.lucene.util.TestRuleMarkFailure$1.evaluate(TestRuleMarkFailure.java:47)
	at com.carrotsearch.randomizedtesting.rules.StatementAdapter.evaluate(StatementAdapter.java:36)
	at com.carrotsearch.randomizedtesting.ThreadLeakControl$StatementRunner.run(ThreadLeakControl.java:368)
	at com.carrotsearch.randomizedtesting.ThreadLeakControl.forkTimeoutingTask(ThreadLeakControl.java:817)
	at com.carrotsearch.randomizedtesting.ThreadLeakControl$3.evaluate(ThreadLeakControl.java:468)
	at com.carrotsearch.randomizedtesting.RandomizedRunner.runSingleTest(RandomizedRunner.java:943)
	at com.carrotsearch.randomizedtesting.RandomizedRunner$5.evaluate(RandomizedRunner.java:829)
	at com.carrotsearch.randomizedtesting.RandomizedRunner$6.evaluate(RandomizedRunner.java:879)
	at com.carrotsearch.randomizedtesting.RandomizedRunner$7.evaluate(RandomizedRunner.java:890)
	at com.carrotsearch.randomizedtesting.rules.StatementAdapter.evaluate(StatementAdapter.java:36)
	at com.carrotsearch.randomizedtesting.rules.SystemPropertiesRestoreRule$1.evaluate(SystemPropertiesRestoreRule.java:57)
	at org.apache.lucene.util.AbstractBeforeAfterRule$1.evaluate(AbstractBeforeAfterRule.java:45)
	at com.carrotsearch.randomizedtesting.rules.StatementAdapter.evaluate(StatementAdapter.java:36)
	at org.apache.lucene.util.TestRuleStoreClassName$1.evaluate(TestRuleStoreClassName.java:41)
	at com.carrotsearch.randomizedtesting.rules.NoShadowingOrOverridesOnMethodsRule$1.evaluate(NoShadowingOrOverridesOnMethodsRule.java:40)
	at com.carrotsearch.randomizedtesting.rules.NoShadowingOrOverridesOnMethodsRule$1.evaluate(NoShadowingOrOverridesOnMethodsRule.java:40)
	at com.carrotsearch.randomizedtesting.rules.StatementAdapter.evaluate(StatementAdapter.java:36)
	at com.carrotsearch.randomizedtesting.rules.StatementAdapter.evaluate(StatementAdapter.java:36)
	at com.carrotsearch.randomizedtesting.rules.StatementAdapter.evaluate(StatementAdapter.java:36)
	at org.apache.lucene.util.TestRuleAssertionsRequired$1.evaluate(TestRuleAssertionsRequired.java:53)
	at org.apache.lucene.util.TestRuleMarkFailure$1.evaluate(TestRuleMarkFailure.java:47)
	at org.apache.lucene.util.TestRuleIgnoreAfterMaxFailures$1.evaluate(TestRuleIgnoreAfterMaxFailures.java:64)
	at org.apache.lucene.util.TestRuleIgnoreTestSuites$1.evaluate(TestRuleIgnoreTestSuites.java:54)
	at com.carrotsearch.randomizedtesting.rules.StatementAdapter.evaluate(StatementAdapter.java:36)
	at com.carrotsearch.randomizedtesting.ThreadLeakControl$StatementRunner.run(ThreadLeakControl.java:368)
	at java.lang.Thread.run(Thread.java:748)


FAILED:  org.apache.solr.cloud.autoscaling.AutoAddReplicasIntegrationTest.testSimple

Error Message:
Error from server at https://127.0.0.1:39062/solr: KeeperErrorCode = NoNode for /overseer/collection-queue-work/qnr-0000000004

Stack Trace:
org.apache.solr.client.solrj.impl.HttpSolrClient$RemoteSolrException: Error from server at https://127.0.0.1:39062/solr: KeeperErrorCode = NoNode for /overseer/collection-queue-work/qnr-0000000004
	at __randomizedtesting.SeedInfo.seed([F02C81D8640D9F8F:C89FA52643FE4B5E]:0)
	at org.apache.solr.client.solrj.impl.HttpSolrClient.executeMethod(HttpSolrClient.java:626)
	at org.apache.solr.client.solrj.impl.HttpSolrClient.request(HttpSolrClient.java:253)
	at org.apache.solr.client.solrj.impl.HttpSolrClient.request(HttpSolrClient.java:242)
	at org.apache.solr.client.solrj.impl.LBHttpSolrClient.doRequest(LBHttpSolrClient.java:483)
	at org.apache.solr.client.solrj.impl.LBHttpSolrClient.request(LBHttpSolrClient.java:413)
	at org.apache.solr.client.solrj.impl.CloudSolrClient.sendRequest(CloudSolrClient.java:1121)
	at org.apache.solr.client.solrj.impl.CloudSolrClient.requestWithRetryOnStaleState(CloudSolrClient.java:862)
	at org.apache.solr.client.solrj.impl.CloudSolrClient.request(CloudSolrClient.java:793)
	at org.apache.solr.client.solrj.SolrRequest.process(SolrRequest.java:178)
	at org.apache.solr.client.solrj.SolrRequest.process(SolrRequest.java:195)
	at org.apache.solr.cloud.autoscaling.AutoAddReplicasIntegrationTest.testSimple(AutoAddReplicasIntegrationTest.java:78)
	at sun.reflect.NativeMethodAccessorImpl.invoke0(Native Method)
	at sun.reflect.NativeMethodAccessorImpl.invoke(NativeMethodAccessorImpl.java:62)
	at sun.reflect.DelegatingMethodAccessorImpl.invoke(DelegatingMethodAccessorImpl.java:43)
	at java.lang.reflect.Method.invoke(Method.java:498)
	at com.carrotsearch.randomizedtesting.RandomizedRunner.invoke(RandomizedRunner.java:1737)
	at com.carrotsearch.randomizedtesting.RandomizedRunner$8.evaluate(RandomizedRunner.java:934)
	at com.carrotsearch.randomizedtesting.RandomizedRunner$9.evaluate(RandomizedRunner.java:970)
	at com.carrotsearch.randomizedtesting.RandomizedRunner$10.evaluate(RandomizedRunner.java:984)
	at com.carrotsearch.randomizedtesting.rules.SystemPropertiesRestoreRule$1.evaluate(SystemPropertiesRestoreRule.java:57)
	at org.apache.lucene.util.TestRuleSetupTeardownChained$1.evaluate(TestRuleSetupTeardownChained.java:49)
	at org.apache.lucene.util.AbstractBeforeAfterRule$1.evaluate(AbstractBeforeAfterRule.java:45)
	at org.apache.lucene.util.TestRuleThreadAndTestName$1.evaluate(TestRuleThreadAndTestName.java:48)
	at org.apache.lucene.util.TestRuleIgnoreAfterMaxFailures$1.evaluate(TestRuleIgnoreAfterMaxFailures.java:64)
	at org.apache.lucene.util.TestRuleMarkFailure$1.evaluate(TestRuleMarkFailure.java:47)
	at com.carrotsearch.randomizedtesting.rules.StatementAdapter.evaluate(StatementAdapter.java:36)
	at com.carrotsearch.randomizedtesting.ThreadLeakControl$StatementRunner.run(ThreadLeakControl.java:368)
	at com.carrotsearch.randomizedtesting.ThreadLeakControl.forkTimeoutingTask(ThreadLeakControl.java:817)
	at com.carrotsearch.randomizedtesting.ThreadLeakControl$3.evaluate(ThreadLeakControl.java:468)
	at com.carrotsearch.randomizedtesting.RandomizedRunner.runSingleTest(RandomizedRunner.java:943)
	at com.carrotsearch.randomizedtesting.RandomizedRunner$5.evaluate(RandomizedRunner.java:829)
	at com.carrotsearch.randomizedtesting.RandomizedRunner$6.evaluate(RandomizedRunner.java:879)
	at com.carrotsearch.randomizedtesting.RandomizedRunner$7.evaluate(RandomizedRunner.java:890)
	at com.carrotsearch.randomizedtesting.rules.StatementAdapter.evaluate(StatementAdapter.java:36)
	at com.carrotsearch.randomizedtesting.rules.SystemPropertiesRestoreRule$1.evaluate(SystemPropertiesRestoreRule.java:57)
	at org.apache.lucene.util.AbstractBeforeAfterRule$1.evaluate(AbstractBeforeAfterRule.java:45)
	at com.carrotsearch.randomizedtesting.rules.StatementAdapter.evaluate(StatementAdapter.java:36)
	at org.apache.lucene.util.TestRuleStoreClassName$1.evaluate(TestRuleStoreClassName.java:41)
	at com.carrotsearch.randomizedtesting.rules.NoShadowingOrOverridesOnMethodsRule$1.evaluate(NoShadowingOrOverridesOnMethodsRule.java:40)
	at com.carrotsearch.randomizedtesting.rules.NoShadowingOrOverridesOnMethodsRule$1.evaluate(NoShadowingOrOverridesOnMethodsRule.java:40)
	at com.carrotsearch.randomizedtesting.rules.StatementAdapter.evaluate(StatementAdapter.java:36)
	at com.carrotsearch.randomizedtesting.rules.StatementAdapter.evaluate(StatementAdapter.java:36)
	at com.carrotsearch.randomizedtesting.rules.StatementAdapter.evaluate(StatementAdapter.java:36)
	at org.apache.lucene.util.TestRuleAssertionsRequired$1.evaluate(TestRuleAssertionsRequired.java:53)
	at org.apache.lucene.util.TestRuleMarkFailure$1.evaluate(TestRuleMarkFailure.java:47)
	at org.apache.lucene.util.TestRuleIgnoreAfterMaxFailures$1.evaluate(TestRuleIgnoreAfterMaxFailures.java:64)
	at org.apache.lucene.util.TestRuleIgnoreTestSuites$1.evaluate(TestRuleIgnoreTestSuites.java:54)
	at com.carrotsearch.randomizedtesting.rules.StatementAdapter.evaluate(StatementAdapter.java:36)
	at com.carrotsearch.randomizedtesting.ThreadLeakControl$StatementRunner.run(ThreadLeakControl.java:368)
	at java.lang.Thread.run(Thread.java:748)


FAILED:  org.apache.solr.cloud.autoscaling.ComputePlanActionTest.testNodeLost

Error Message:
Trigger was not fired even after 10 seconds

Stack Trace:
java.lang.AssertionError: Trigger was not fired even after 10 seconds
	at __randomizedtesting.SeedInfo.seed([F02C81D8640D9F8F:4F394F26E7E7FA09]:0)
	at org.junit.Assert.fail(Assert.java:93)
	at org.junit.Assert.assertTrue(Assert.java:43)
	at org.apache.solr.cloud.autoscaling.ComputePlanActionTest.testNodeLost(ComputePlanActionTest.java:194)
	at sun.reflect.NativeMethodAccessorImpl.invoke0(Native Method)
	at sun.reflect.NativeMethodAccessorImpl.invoke(NativeMethodAccessorImpl.java:62)
	at sun.reflect.DelegatingMethodAccessorImpl.invoke(DelegatingMethodAccessorImpl.java:43)
	at java.lang.reflect.Method.invoke(Method.java:498)
	at com.carrotsearch.randomizedtesting.RandomizedRunner.invoke(RandomizedRunner.java:1737)
	at com.carrotsearch.randomizedtesting.RandomizedRunner$8.evaluate(RandomizedRunner.java:934)
	at com.carrotsearch.randomizedtesting.RandomizedRunner$9.evaluate(RandomizedRunner.java:970)
	at com.carrotsearch.randomizedtesting.RandomizedRunner$10.evaluate(RandomizedRunner.java:984)
	at com.carrotsearch.randomizedtesting.rules.SystemPropertiesRestoreRule$1.evaluate(SystemPropertiesRestoreRule.java:57)
	at org.apache.lucene.util.TestRuleSetupTeardownChained$1.evaluate(TestRuleSetupTeardownChained.java:49)
	at org.apache.lucene.util.AbstractBeforeAfterRule$1.evaluate(AbstractBeforeAfterRule.java:45)
	at org.apache.lucene.util.TestRuleThreadAndTestName$1.evaluate(TestRuleThreadAndTestName.java:48)
	at org.apache.lucene.util.TestRuleIgnoreAfterMaxFailures$1.evaluate(TestRuleIgnoreAfterMaxFailures.java:64)
	at org.apache.lucene.util.TestRuleMarkFailure$1.evaluate(TestRuleMarkFailure.java:47)
	at com.carrotsearch.randomizedtesting.rules.StatementAdapter.evaluate(StatementAdapter.java:36)
	at com.carrotsearch.randomizedtesting.ThreadLeakControl$StatementRunner.run(ThreadLeakControl.java:368)
	at com.carrotsearch.randomizedtesting.ThreadLeakControl.forkTimeoutingTask(ThreadLeakControl.java:817)
	at com.carrotsearch.randomizedtesting.ThreadLeakControl$3.evaluate(ThreadLeakControl.java:468)
	at com.carrotsearch.randomizedtesting.RandomizedRunner.runSingleTest(RandomizedRunner.java:943)
	at com.carrotsearch.randomizedtesting.RandomizedRunner$5.evaluate(RandomizedRunner.java:829)
	at com.carrotsearch.randomizedtesting.RandomizedRunner$6.evaluate(RandomizedRunner.java:879)
	at com.carrotsearch.randomizedtesting.RandomizedRunner$7.evaluate(RandomizedRunner.java:890)
	at com.carrotsearch.randomizedtesting.rules.StatementAdapter.evaluate(StatementAdapter.java:36)
	at com.carrotsearch.randomizedtesting.rules.SystemPropertiesRestoreRule$1.evaluate(SystemPropertiesRestoreRule.java:57)
	at org.apache.lucene.util.AbstractBeforeAfterRule$1.evaluate(AbstractBeforeAfterRule.java:45)
	at com.carrotsearch.randomizedtesting.rules.StatementAdapter.evaluate(StatementAdapter.java:36)
	at org.apache.lucene.util.TestRuleStoreClassName$1.evaluate(TestRuleStoreClassName.java:41)
	at com.carrotsearch.randomizedtesting.rules.NoShadowingOrOverridesOnMethodsRule$1.evaluate(NoShadowingOrOverridesOnMethodsRule.java:40)
	at com.carrotsearch.randomizedtesting.rules.NoShadowingOrOverridesOnMethodsRule$1.evaluate(NoShadowingOrOverridesOnMethodsRule.java:40)
	at com.carrotsearch.randomizedtesting.rules.StatementAdapter.evaluate(StatementAdapter.java:36)
	at com.carrotsearch.randomizedtesting.rules.StatementAdapter.evaluate(StatementAdapter.java:36)
	at com.carrotsearch.randomizedtesting.rules.StatementAdapter.evaluate(StatementAdapter.java:36)
	at org.apache.lucene.util.TestRuleAssertionsRequired$1.evaluate(TestRuleAssertionsRequired.java:53)
	at org.apache.lucene.util.TestRuleMarkFailure$1.evaluate(TestRuleMarkFailure.java:47)
	at org.apache.lucene.util.TestRuleIgnoreAfterMaxFailures$1.evaluate(TestRuleIgnoreAfterMaxFailures.java:64)
	at org.apache.lucene.util.TestRuleIgnoreTestSuites$1.evaluate(TestRuleIgnoreTestSuites.java:54)
	at com.carrotsearch.randomizedtesting.rules.StatementAdapter.evaluate(StatementAdapter.java:36)
	at com.carrotsearch.randomizedtesting.ThreadLeakControl$StatementRunner.run(ThreadLeakControl.java:368)
	at java.lang.Thread.run(Thread.java:748)


FAILED:  org.apache.solr.cloud.autoscaling.TriggerIntegrationTest.testEventQueue

Error Message:
action wasn't interrupted

Stack Trace:
java.lang.AssertionError: action wasn't interrupted
	at __randomizedtesting.SeedInfo.seed([F02C81D8640D9F8F:3999C3766D6A597A]:0)
	at org.junit.Assert.fail(Assert.java:93)
	at org.junit.Assert.assertTrue(Assert.java:43)
	at org.apache.solr.cloud.autoscaling.TriggerIntegrationTest.testEventQueue(TriggerIntegrationTest.java:684)
	at sun.reflect.NativeMethodAccessorImpl.invoke0(Native Method)
	at sun.reflect.NativeMethodAccessorImpl.invoke(NativeMethodAccessorImpl.java:62)
	at sun.reflect.DelegatingMethodAccessorImpl.invoke(DelegatingMethodAccessorImpl.java:43)
	at java.lang.reflect.Method.invoke(Method.java:498)
	at com.carrotsearch.randomizedtesting.RandomizedRunner.invoke(RandomizedRunner.java:1737)
	at com.carrotsearch.randomizedtesting.RandomizedRunner$8.evaluate(RandomizedRunner.java:934)
	at com.carrotsearch.randomizedtesting.RandomizedRunner$9.evaluate(RandomizedRunner.java:970)
	at com.carrotsearch.randomizedtesting.RandomizedRunner$10.evaluate(RandomizedRunner.java:984)
	at com.carrotsearch.randomizedtesting.rules.SystemPropertiesRestoreRule$1.evaluate(SystemPropertiesRestoreRule.java:57)
	at org.apache.lucene.util.TestRuleSetupTeardownChained$1.evaluate(TestRuleSetupTeardownChained.java:49)
	at org.apache.lucene.util.AbstractBeforeAfterRule$1.evaluate(AbstractBeforeAfterRule.java:45)
	at org.apache.lucene.util.TestRuleThreadAndTestName$1.evaluate(TestRuleThreadAndTestName.java:48)
	at org.apache.lucene.util.TestRuleIgnoreAfterMaxFailures$1.evaluate(TestRuleIgnoreAfterMaxFailures.java:64)
	at org.apache.lucene.util.TestRuleMarkFailure$1.evaluate(TestRuleMarkFailure.java:47)
	at com.carrotsearch.randomizedtesting.rules.StatementAdapter.evaluate(StatementAdapter.java:36)
	at com.carrotsearch.randomizedtesting.ThreadLeakControl$StatementRunner.run(ThreadLeakControl.java:368)
	at com.carrotsearch.randomizedtesting.ThreadLeakControl.forkTimeoutingTask(ThreadLeakControl.java:817)
	at com.carrotsearch.randomizedtesting.ThreadLeakControl$3.evaluate(ThreadLeakControl.java:468)
	at com.carrotsearch.randomizedtesting.RandomizedRunner.runSingleTest(RandomizedRunner.java:943)
	at com.carrotsearch.randomizedtesting.RandomizedRunner$5.evaluate(RandomizedRunner.java:829)
	at com.carrotsearch.randomizedtesting.RandomizedRunner$6.evaluate(RandomizedRunner.java:879)
	at com.carrotsearch.randomizedtesting.RandomizedRunner$7.evaluate(RandomizedRunner.java:890)
	at com.carrotsearch.randomizedtesting.rules.StatementAdapter.evaluate(StatementAdapter.java:36)
	at com.carrotsearch.randomizedtesting.rules.SystemPropertiesRestoreRule$1.evaluate(SystemPropertiesRestoreRule.java:57)
	at org.apache.lucene.util.AbstractBeforeAfterRule$1.evaluate(AbstractBeforeAfterRule.java:45)
	at com.carrotsearch.randomizedtesting.rules.StatementAdapter.evaluate(StatementAdapter.java:36)
	at org.apache.lucene.util.TestRuleStoreClassName$1.evaluate(TestRuleStoreClassName.java:41)
	at com.carrotsearch.randomizedtesting.rules.NoShadowingOrOverridesOnMethodsRule$1.evaluate(NoShadowingOrOverridesOnMethodsRule.java:40)
	at com.carrotsearch.randomizedtesting.rules.NoShadowingOrOverridesOnMethodsRule$1.evaluate(NoShadowingOrOverridesOnMethodsRule.java:40)
	at com.carrotsearch.randomizedtesting.rules.StatementAdapter.evaluate(StatementAdapter.java:36)
	at com.carrotsearch.randomizedtesting.rules.StatementAdapter.evaluate(StatementAdapter.java:36)
	at com.carrotsearch.randomizedtesting.rules.StatementAdapter.evaluate(StatementAdapter.java:36)
	at org.apache.lucene.util.TestRuleAssertionsRequired$1.evaluate(TestRuleAssertionsRequired.java:53)
	at org.apache.lucene.util.TestRuleMarkFailure$1.evaluate(TestRuleMarkFailure.java:47)
	at org.apache.lucene.util.TestRuleIgnoreAfterMaxFailures$1.evaluate(TestRuleIgnoreAfterMaxFailures.java:64)
	at org.apache.lucene.util.TestRuleIgnoreTestSuites$1.evaluate(TestRuleIgnoreTestSuites.java:54)
	at com.carrotsearch.randomizedtesting.rules.StatementAdapter.evaluate(StatementAdapter.java:36)
	at com.carrotsearch.randomizedtesting.ThreadLeakControl$StatementRunner.run(ThreadLeakControl.java:368)
	at java.lang.Thread.run(Thread.java:748)


FAILED:  org.apache.solr.security.TestPKIAuthenticationPlugin.test

Error Message:


Stack Trace:
java.lang.NullPointerException
	at __randomizedtesting.SeedInfo.seed([F02C81D8640D9F8F:7878BE02CAF1F277]:0)
	at org.apache.solr.security.TestPKIAuthenticationPlugin.test(TestPKIAuthenticationPlugin.java:100)
	at sun.reflect.NativeMethodAccessorImpl.invoke0(Native Method)
	at sun.reflect.NativeMethodAccessorImpl.invoke(NativeMethodAccessorImpl.java:62)
	at sun.reflect.DelegatingMethodAccessorImpl.invoke(DelegatingMethodAccessorImpl.java:43)
	at java.lang.reflect.Method.invoke(Method.java:498)
	at com.carrotsearch.randomizedtesting.RandomizedRunner.invoke(RandomizedRunner.java:1737)
	at com.carrotsearch.randomizedtesting.RandomizedRunner$8.evaluate(RandomizedRunner.java:934)
	at com.carrotsearch.randomizedtesting.RandomizedRunner$9.evaluate(RandomizedRunner.java:970)
	at com.carrotsearch.randomizedtesting.RandomizedRunner$10.evaluate(RandomizedRunner.java:984)
	at com.carrotsearch.randomizedtesting.rules.SystemPropertiesRestoreRule$1.evaluate(SystemPropertiesRestoreRule.java:57)
	at org.apache.lucene.util.TestRuleSetupTeardownChained$1.evaluate(TestRuleSetupTeardownChained.java:49)
	at org.apache.lucene.util.AbstractBeforeAfterRule$1.evaluate(AbstractBeforeAfterRule.java:45)
	at org.apache.lucene.util.TestRuleThreadAndTestName$1.evaluate(TestRuleThreadAndTestName.java:48)
	at org.apache.lucene.util.TestRuleIgnoreAfterMaxFailures$1.evaluate(TestRuleIgnoreAfterMaxFailures.java:64)
	at org.apache.lucene.util.TestRuleMarkFailure$1.evaluate(TestRuleMarkFailure.java:47)
	at com.carrotsearch.randomizedtesting.rules.StatementAdapter.evaluate(StatementAdapter.java:36)
	at com.carrotsearch.randomizedtesting.ThreadLeakControl$StatementRunner.run(ThreadLeakControl.java:368)
	at com.carrotsearch.randomizedtesting.ThreadLeakControl.forkTimeoutingTask(ThreadLeakControl.java:817)
	at com.carrotsearch.randomizedtesting.ThreadLeakControl$3.evaluate(ThreadLeakControl.java:468)
	at com.carrotsearch.randomizedtesting.RandomizedRunner.runSingleTest(RandomizedRunner.java:943)
	at com.carrotsearch.randomizedtesting.RandomizedRunner$5.evaluate(RandomizedRunner.java:829)
	at com.carrotsearch.randomizedtesting.RandomizedRunner$6.evaluate(RandomizedRunner.java:879)
	at com.carrotsearch.randomizedtesting.RandomizedRunner$7.evaluate(RandomizedRunner.java:890)
	at com.carrotsearch.randomizedtesting.rules.StatementAdapter.evaluate(StatementAdapter.java:36)
	at com.carrotsearch.randomizedtesting.rules.SystemPropertiesRestoreRule$1.evaluate(SystemPropertiesRestoreRule.java:57)
	at org.apache.lucene.util.AbstractBeforeAfterRule$1.evaluate(AbstractBeforeAfterRule.java:45)
	at com.carrotsearch.randomizedtesting.rules.StatementAdapter.evaluate(StatementAdapter.java:36)
	at org.apache.lucene.util.TestRuleStoreClassName$1.evaluate(TestRuleStoreClassName.java:41)
	at com.carrotsearch.randomizedtesting.rules.NoShadowingOrOverridesOnMethodsRule$1.evaluate(NoShadowingOrOverridesOnMethodsRule.java:40)
	at com.carrotsearch.randomizedtesting.rules.NoShadowingOrOverridesOnMethodsRule$1.evaluate(NoShadowingOrOverridesOnMethodsRule.java:40)
	at com.carrotsearch.randomizedtesting.rules.StatementAdapter.evaluate(StatementAdapter.java:36)
	at com.carrotsearch.randomizedtesting.rules.StatementAdapter.evaluate(StatementAdapter.java:36)
	at com.carrotsearch.randomizedtesting.rules.StatementAdapter.evaluate(StatementAdapter.java:36)
	at org.apache.lucene.util.TestRuleAssertionsRequired$1.evaluate(TestRuleAssertionsRequired.java:53)
	at org.apache.lucene.util.TestRuleMarkFailure$1.evaluate(TestRuleMarkFailure.java:47)
	at org.apache.lucene.util.TestRuleIgnoreAfterMaxFailures$1.evaluate(TestRuleIgnoreAfterMaxFailures.java:64)
	at org.apache.lucene.util.TestRuleIgnoreTestSuites$1.evaluate(TestRuleIgnoreTestSuites.java:54)
	at com.carrotsearch.randomizedtesting.rules.StatementAdapter.evaluate(StatementAdapter.java:36)
	at com.carrotsearch.randomizedtesting.ThreadLeakControl$StatementRunner.run(ThreadLeakControl.java:368)
	at java.lang.Thread.run(Thread.java:748)


FAILED:  org.apache.solr.cloud.hdfs.HdfsRestartWhileUpdatingTest.test

Error Message:
shard1 is not consistent.  Got 582 from https://127.0.0.1:47806/collection1_shard1_replica_n23 (previous client) and got 337 from https://127.0.0.1:58092/collection1_shard1_replica_n25

Stack Trace:
java.lang.AssertionError: shard1 is not consistent.  Got 582 from https://127.0.0.1:47806/collection1_shard1_replica_n23 (previous client) and got 337 from https://127.0.0.1:58092/collection1_shard1_replica_n25
	at __randomizedtesting.SeedInfo.seed([F02C81D8640D9F8F:7878BE02CAF1F277]:0)
	at org.junit.Assert.fail(Assert.java:93)
	at org.apache.solr.cloud.AbstractFullDistribZkTestBase.checkShardConsistency(AbstractFullDistribZkTestBase.java:1323)
	at org.apache.solr.cloud.AbstractFullDistribZkTestBase.checkShardConsistency(AbstractFullDistribZkTestBase.java:1302)
	at org.apache.solr.cloud.RestartWhileUpdatingTest.test(RestartWhileUpdatingTest.java:155)
	at sun.reflect.NativeMethodAccessorImpl.invoke0(Native Method)
	at sun.reflect.NativeMethodAccessorImpl.invoke(NativeMethodAccessorImpl.java:62)
	at sun.reflect.DelegatingMethodAccessorImpl.invoke(DelegatingMethodAccessorImpl.java:43)
	at java.lang.reflect.Method.invoke(Method.java:498)
	at com.carrotsearch.randomizedtesting.RandomizedRunner.invoke(RandomizedRunner.java:1737)
	at com.carrotsearch.randomizedtesting.RandomizedRunner$8.evaluate(RandomizedRunner.java:934)
	at com.carrotsearch.randomizedtesting.RandomizedRunner$9.evaluate(RandomizedRunner.java:970)
	at com.carrotsearch.randomizedtesting.RandomizedRunner$10.evaluate(RandomizedRunner.java:984)
	at org.apache.solr.BaseDistributedSearchTestCase$ShardsRepeatRule$ShardsFixedStatement.callStatement(BaseDistributedSearchTestCase.java:993)
	at org.apache.solr.BaseDistributedSearchTestCase$ShardsRepeatRule$ShardsStatement.evaluate(BaseDistributedSearchTestCase.java:968)
	at com.carrotsearch.randomizedtesting.rules.SystemPropertiesRestoreRule$1.evaluate(SystemPropertiesRestoreRule.java:57)
	at org.apache.lucene.util.TestRuleSetupTeardownChained$1.evaluate(TestRuleSetupTeardownChained.java:49)
	at org.apache.lucene.util.AbstractBeforeAfterRule$1.evaluate(AbstractBeforeAfterRule.java:45)
	at org.apache.lucene.util.TestRuleThreadAndTestName$1.evaluate(TestRuleThreadAndTestName.java:48)
	at org.apache.lucene.util.TestRuleIgnoreAfterMaxFailures$1.evaluate(TestRuleIgnoreAfterMaxFailures.java:64)
	at org.apache.lucene.util.TestRuleMarkFailure$1.evaluate(TestRuleMarkFailure.java:47)
	at com.carrotsearch.randomizedtesting.rules.StatementAdapter.evaluate(StatementAdapter.java:36)
	at com.carrotsearch.randomizedtesting.ThreadLeakControl$StatementRunner.run(ThreadLeakControl.java:368)
	at com.carrotsearch.randomizedtesting.ThreadLeakControl.forkTimeoutingTask(ThreadLeakControl.java:817)
	at com.carrotsearch.randomizedtesting.ThreadLeakControl$3.evaluate(ThreadLeakControl.java:468)
	at com.carrotsearch.randomizedtesting.RandomizedRunner.runSingleTest(RandomizedRunner.java:943)
	at com.carrotsearch.randomizedtesting.RandomizedRunner$5.evaluate(RandomizedRunner.java:829)
	at com.carrotsearch.randomizedtesting.RandomizedRunner$6.evaluate(RandomizedRunner.java:879)
	at com.carrotsearch.randomizedtesting.RandomizedRunner$7.evaluate(RandomizedRunner.java:890)
	at com.carrotsearch.randomizedtesting.rules.StatementAdapter.evaluate(StatementAdapter.java:36)
	at com.carrotsearch.randomizedtesting.rules.SystemPropertiesRestoreRule$1.evaluate(SystemPropertiesRestoreRule.java:57)
	at org.apache.lucene.util.AbstractBeforeAfterRule$1.evaluate(AbstractBeforeAfterRule.java:45)
	at com.carrotsearch.randomizedtesting.rules.StatementAdapter.evaluate(StatementAdapter.java:36)
	at org.apache.lucene.util.TestRuleStoreClassName$1.evaluate(TestRuleStoreClassName.java:41)
	at com.carrotsearch.randomizedtesting.rules.NoShadowingOrOverridesOnMethodsRule$1.evaluate(NoShadowingOrOverridesOnMethodsRule.java:40)
	at com.carrotsearch.randomizedtesting.rules.NoShadowingOrOverridesOnMethodsRule$1.evaluate(NoShadowingOrOverridesOnMethodsRule.java:40)
	at com.carrotsearch.randomizedtesting.rules.StatementAdapter.evaluate(StatementAdapter.java:36)
	at com.carrotsearch.randomizedtesting.rules.StatementAdapter.evaluate(StatementAdapter.java:36)
	at com.carrotsearch.randomizedtesting.rules.StatementAdapter.evaluate(StatementAdapter.java:36)
	at org.apache.lucene.util.TestRuleAssertionsRequired$1.evaluate(TestRuleAssertionsRequired.java:53)
	at org.apache.lucene.util.TestRuleMarkFailure$1.evaluate(TestRuleMarkFailure.java:47)
	at org.apache.lucene.util.TestRuleIgnoreAfterMaxFailures$1.evaluate(TestRuleIgnoreAfterMaxFailures.java:64)
	at org.apache.lucene.util.TestRuleIgnoreTestSuites$1.evaluate(TestRuleIgnoreTestSuites.java:54)
	at com.carrotsearch.randomizedtesting.rules.StatementAdapter.evaluate(StatementAdapter.java:36)
	at com.carrotsearch.randomizedtesting.ThreadLeakControl$StatementRunner.run(ThreadLeakControl.java:368)
	at java.lang.Thread.run(Thread.java:748)


FAILED:  org.apache.solr.cloud.DistribJoinFromCollectionTest.testNoScore

Error Message:
Error from server at https://127.0.0.1:35489/solr/to_2x2_shard1_replica_n3: Error from server at https://127.0.0.1:57328/solr/to_2x2_shard2_replica_n7: SolrCloud join: Collection 'from_1x4Alias' not found!

Stack Trace:
org.apache.solr.client.solrj.impl.HttpSolrClient$RemoteSolrException: Error from server at https://127.0.0.1:35489/solr/to_2x2_shard1_replica_n3: Error from server at https://127.0.0.1:57328/solr/to_2x2_shard2_replica_n7: SolrCloud join: Collection 'from_1x4Alias' not found!
	at __randomizedtesting.SeedInfo.seed([F02C81D8640D9F8F:4FA38D6A9A4180C3]:0)
	at org.apache.solr.client.solrj.impl.HttpSolrClient.executeMethod(HttpSolrClient.java:626)
	at org.apache.solr.client.solrj.impl.HttpSolrClient.request(HttpSolrClient.java:253)
	at org.apache.solr.client.solrj.impl.HttpSolrClient.request(HttpSolrClient.java:242)
	at org.apache.solr.client.solrj.impl.LBHttpSolrClient.doRequest(LBHttpSolrClient.java:483)
	at org.apache.solr.client.solrj.impl.LBHttpSolrClient.request(LBHttpSolrClient.java:413)
	at org.apache.solr.client.solrj.impl.CloudSolrClient.sendRequest(CloudSolrClient.java:1121)
	at org.apache.solr.client.solrj.impl.CloudSolrClient.requestWithRetryOnStaleState(CloudSolrClient.java:862)
	at org.apache.solr.client.solrj.impl.CloudSolrClient.request(CloudSolrClient.java:793)
	at org.apache.solr.client.solrj.SolrClient.request(SolrClient.java:1219)
	at org.apache.solr.cloud.DistribJoinFromCollectionTest.testJoins(DistribJoinFromCollectionTest.java:174)
	at org.apache.solr.cloud.DistribJoinFromCollectionTest.testNoScore(DistribJoinFromCollectionTest.java:121)
	at sun.reflect.NativeMethodAccessorImpl.invoke0(Native Method)
	at sun.reflect.NativeMethodAccessorImpl.invoke(NativeMethodAccessorImpl.java:62)
	at sun.reflect.DelegatingMethodAccessorImpl.invoke(DelegatingMethodAccessorImpl.java:43)
	at java.lang.reflect.Method.invoke(Method.java:498)
	at com.carrotsearch.randomizedtesting.RandomizedRunner.invoke(RandomizedRunner.java:1737)
	at com.carrotsearch.randomizedtesting.RandomizedRunner$8.evaluate(RandomizedRunner.java:934)
	at com.carrotsearch.randomizedtesting.RandomizedRunner$9.evaluate(RandomizedRunner.java:970)
	at com.carrotsearch.randomizedtesting.RandomizedRunner$10.evaluate(RandomizedRunner.java:984)
	at com.carrotsearch.randomizedtesting.rules.SystemPropertiesRestoreRule$1.evaluate(SystemPropertiesRestoreRule.java:57)
	at org.apache.lucene.util.TestRuleSetupTeardownChained$1.evaluate(TestRuleSetupTeardownChained.java:49)
	at org.apache.lucene.util.AbstractBeforeAfterRule$1.evaluate(AbstractBeforeAfterRule.java:45)
	at org.apache.lucene.util.TestRuleThreadAndTestName$1.evaluate(TestRuleThreadAndTestName.java:48)
	at org.apache.lucene.util.TestRuleIgnoreAfterMaxFailures$1.evaluate(TestRuleIgnoreAfterMaxFailures.java:64)
	at org.apache.lucene.util.TestRuleMarkFailure$1.evaluate(TestRuleMarkFailure.java:47)
	at com.carrotsearch.randomizedtesting.rules.StatementAdapter.evaluate(StatementAdapter.java:36)
	at com.carrotsearch.randomizedtesting.ThreadLeakControl$StatementRunner.run(ThreadLeakControl.java:368)
	at com.carrotsearch.randomizedtesting.ThreadLeakControl.forkTimeoutingTask(ThreadLeakControl.java:817)
	at com.carrotsearch.randomizedtesting.ThreadLeakControl$3.evaluate(ThreadLeakControl.java:468)
	at com.carrotsearch.randomizedtesting.RandomizedRunner.runSingleTest(RandomizedRunner.java:943)
	at com.carrotsearch.randomizedtesting.RandomizedRunner$5.evaluate(RandomizedRunner.java:829)
	at com.carrotsearch.randomizedtesting.RandomizedRunner$6.evaluate(RandomizedRunner.java:879)
	at com.carrotsearch.randomizedtesting.RandomizedRunner$7.evaluate(RandomizedRunner.java:890)
	at com.carrotsearch.randomizedtesting.rules.StatementAdapter.evaluate(StatementAdapter.java:36)
	at com.carrotsearch.randomizedtesting.rules.SystemPropertiesRestoreRule$1.evaluate(SystemPropertiesRestoreRule.java:57)
	at org.apache.lucene.util.AbstractBeforeAfterRule$1.evaluate(AbstractBeforeAfterRule.java:45)
	at com.carrotsearch.randomizedtesting.rules.StatementAdapter.evaluate(StatementAdapter.java:36)
	at org.apache.lucene.util.TestRuleStoreClassName$1.evaluate(TestRuleStoreClassName.java:41)
	at com.carrotsearch.randomizedtesting.rules.NoShadowingOrOverridesOnMethodsRule$1.evaluate(NoShadowingOrOverridesOnMethodsRule.java:40)
	at com.carrotsearch.randomizedtesting.rules.NoShadowingOrOverridesOnMethodsRule$1.evaluate(NoShadowingOrOverridesOnMethodsRule.java:40)
	at com.carrotsearch.randomizedtesting.rules.StatementAdapter.evaluate(StatementAdapter.java:36)
	at com.carrotsearch.randomizedtesting.rules.StatementAdapter.evaluate(StatementAdapter.java:36)
	at com.carrotsearch.randomizedtesting.rules.StatementAdapter.evaluate(StatementAdapter.java:36)
	at org.apache.lucene.util.TestRuleAssertionsRequired$1.evaluate(TestRuleAssertionsRequired.java:53)
	at org.apache.lucene.util.TestRuleMarkFailure$1.evaluate(TestRuleMarkFailure.java:47)
	at org.apache.lucene.util.TestRuleIgnoreAfterMaxFailures$1.evaluate(TestRuleIgnoreAfterMaxFailures.java:64)
	at org.apache.lucene.util.TestRuleIgnoreTestSuites$1.evaluate(TestRuleIgnoreTestSuites.java:54)
	at com.carrotsearch.randomizedtesting.rules.StatementAdapter.evaluate(StatementAdapter.java:36)
	at com.carrotsearch.randomizedtesting.ThreadLeakControl$StatementRunner.run(ThreadLeakControl.java:368)
	at java.lang.Thread.run(Thread.java:748)


FAILED:  org.apache.solr.cloud.LeaderFailoverAfterPartitionTest.test

Error Message:
Didn't see all replicas for shard shard1 in c8n_1x3_lf come up within 90000 ms! ClusterState: {   "control_collection":{     "pullReplicas":"0",     "replicationFactor":"1",     "shards":{"shard1":{         "range":"80000000-7fffffff",         "state":"active",         "replicas":{"core_node2":{             "core":"control_collection_shard1_replica_n1",             "base_url":"http://127.0.0.1:51365",             "node_name":"127.0.0.1:51365_",             "state":"active",             "type":"NRT",             "leader":"true"}}}},     "router":{"name":"compositeId"},     "maxShardsPerNode":"1",     "autoAddReplicas":"false",     "nrtReplicas":"1",     "tlogReplicas":"0"},   "c8n_1x3_lf":{     "pullReplicas":"0",     "replicationFactor":"1",     "shards":{"shard1":{         "range":"80000000-7fffffff",         "state":"active",         "replicas":{           "core_node4":{             "core":"c8n_1x3_lf_shard1_replica_t2",             "base_url":"http://127.0.0.1:58296",             "node_name":"127.0.0.1:58296_",             "state":"active",             "type":"TLOG"},           "core_node5":{             "core":"c8n_1x3_lf_shard1_replica_t3",             "base_url":"http://127.0.0.1:57688",             "node_name":"127.0.0.1:57688_",             "state":"active",             "type":"TLOG",             "leader":"true"},           "core_node6":{             "state":"down",             "base_url":"http://127.0.0.1:44518",             "core":"c8n_1x3_lf_shard1_replica_t1",             "node_name":"127.0.0.1:44518_",             "type":"TLOG"}}}},     "router":{"name":"compositeId"},     "maxShardsPerNode":"1",     "autoAddReplicas":"false",     "nrtReplicas":"0",     "tlogReplicas":"3"},   "collection1":{     "pullReplicas":"0",     "replicationFactor":"1",     "shards":{       "shard1":{         "range":"80000000-ffffffff",         "state":"active",         "replicas":{"core_node44":{             "core":"collection1_shard1_replica_t43",             "base_url":"http://127.0.0.1:58296",             "node_name":"127.0.0.1:58296_",             "state":"active",             "type":"TLOG",             "leader":"true"}}},       "shard2":{         "range":"0-7fffffff",         "state":"active",         "replicas":{           "core_node42":{             "core":"collection1_shard2_replica_t41",             "base_url":"http://127.0.0.1:44518",             "node_name":"127.0.0.1:44518_",             "state":"active",             "type":"TLOG",             "leader":"true"},           "core_node46":{             "core":"collection1_shard2_replica_t45",             "base_url":"http://127.0.0.1:57688",             "node_name":"127.0.0.1:57688_",             "state":"active",             "type":"TLOG"}}}},     "router":{"name":"compositeId"},     "maxShardsPerNode":"1",     "autoAddReplicas":"false",     "nrtReplicas":"1",     "tlogReplicas":"0"}}

Stack Trace:
java.lang.AssertionError: Didn't see all replicas for shard shard1 in c8n_1x3_lf come up within 90000 ms! ClusterState: {
  "control_collection":{
    "pullReplicas":"0",
    "replicationFactor":"1",
    "shards":{"shard1":{
        "range":"80000000-7fffffff",
        "state":"active",
        "replicas":{"core_node2":{
            "core":"control_collection_shard1_replica_n1",
            "base_url":"http://127.0.0.1:51365",
            "node_name":"127.0.0.1:51365_",
            "state":"active",
            "type":"NRT",
            "leader":"true"}}}},
    "router":{"name":"compositeId"},
    "maxShardsPerNode":"1",
    "autoAddReplicas":"false",
    "nrtReplicas":"1",
    "tlogReplicas":"0"},
  "c8n_1x3_lf":{
    "pullReplicas":"0",
    "replicationFactor":"1",
    "shards":{"shard1":{
        "range":"80000000-7fffffff",
        "state":"active",
        "replicas":{
          "core_node4":{
            "core":"c8n_1x3_lf_shard1_replica_t2",
            "base_url":"http://127.0.0.1:58296",
            "node_name":"127.0.0.1:58296_",
            "state":"active",
            "type":"TLOG"},
          "core_node5":{
            "core":"c8n_1x3_lf_shard1_replica_t3",
            "base_url":"http://127.0.0.1:57688",
            "node_name":"127.0.0.1:57688_",
            "state":"active",
            "type":"TLOG",
            "leader":"true"},
          "core_node6":{
            "state":"down",
            "base_url":"http://127.0.0.1:44518",
            "core":"c8n_1x3_lf_shard1_replica_t1",
            "node_name":"127.0.0.1:44518_",
            "type":"TLOG"}}}},
    "router":{"name":"compositeId"},
    "maxShardsPerNode":"1",
    "autoAddReplicas":"false",
    "nrtReplicas":"0",
    "tlogReplicas":"3"},
  "collection1":{
    "pullReplicas":"0",
    "replicationFactor":"1",
    "shards":{
      "shard1":{
        "range":"80000000-ffffffff",
        "state":"active",
        "replicas":{"core_node44":{
            "core":"collection1_shard1_replica_t43",
            "base_url":"http://127.0.0.1:58296",
            "node_name":"127.0.0.1:58296_",
            "state":"active",
            "type":"TLOG",
            "leader":"true"}}},
      "shard2":{
        "range":"0-7fffffff",
        "state":"active",
        "replicas":{
          "core_node42":{
            "core":"collection1_shard2_replica_t41",
            "base_url":"http://127.0.0.1:44518",
            "node_name":"127.0.0.1:44518_",
            "state":"active",
            "type":"TLOG",
            "leader":"true"},
          "core_node46":{
            "core":"collection1_shard2_replica_t45",
            "base_url":"http://127.0.0.1:57688",
            "node_name":"127.0.0.1:57688_",
            "state":"active",
            "type":"TLOG"}}}},
    "router":{"name":"compositeId"},
    "maxShardsPerNode":"1",
    "autoAddReplicas":"false",
    "nrtReplicas":"1",
    "tlogReplicas":"0"}}
	at __randomizedtesting.SeedInfo.seed([F02C81D8640D9F8F:7878BE02CAF1F277]:0)
	at org.junit.Assert.fail(Assert.java:93)
	at org.apache.solr.cloud.AbstractFullDistribZkTestBase.ensureAllReplicasAreActive(AbstractFullDistribZkTestBase.java:1996)
	at org.apache.solr.cloud.LeaderFailoverAfterPartitionTest.testRf3WithLeaderFailover(LeaderFailoverAfterPartitionTest.java:99)
	at org.apache.solr.cloud.LeaderFailoverAfterPartitionTest.test(LeaderFailoverAfterPartitionTest.java:56)
	at sun.reflect.NativeMethodAccessorImpl.invoke0(Native Method)
	at sun.reflect.NativeMethodAccessorImpl.invoke(NativeMethodAccessorImpl.java:62)
	at sun.reflect.DelegatingMethodAccessorImpl.invoke(DelegatingMethodAccessorImpl.java:43)
	at java.lang.reflect.Method.invoke(Method.java:498)
	at com.carrotsearch.randomizedtesting.RandomizedRunner.invoke(RandomizedRunner.java:1737)
	at com.carrotsearch.randomizedtesting.RandomizedRunner$8.evaluate(RandomizedRunner.java:934)
	at com.carrotsearch.randomizedtesting.RandomizedRunner$9.evaluate(RandomizedRunner.java:970)
	at com.carrotsearch.randomizedtesting.RandomizedRunner$10.evaluate(RandomizedRunner.java:984)
	at org.apache.solr.BaseDistributedSearchTestCase$ShardsRepeatRule$ShardsFixedStatement.callStatement(BaseDistributedSearchTestCase.java:993)
	at org.apache.solr.BaseDistributedSearchTestCase$ShardsRepeatRule$ShardsStatement.evaluate(BaseDistributedSearchTestCase.java:968)
	at com.carrotsearch.randomizedtesting.rules.SystemPropertiesRestoreRule$1.evaluate(SystemPropertiesRestoreRule.java:57)
	at org.apache.lucene.util.TestRuleSetupTeardownChained$1.evaluate(TestRuleSetupTeardownChained.java:49)
	at org.apache.lucene.util.AbstractBeforeAfterRule$1.evaluate(AbstractBeforeAfterRule.java:45)
	at org.apache.lucene.util.TestRuleThreadAndTestName$1.evaluate(TestRuleThreadAndTestName.java:48)
	at org.apache.lucene.util.TestRuleIgnoreAfterMaxFailures$1.evaluate(TestRuleIgnoreAfterMaxFailures.java:64)
	at org.apache.lucene.util.TestRuleMarkFailure$1.evaluate(TestRuleMarkFailure.java:47)
	at com.carrotsearch.randomizedtesting.rules.StatementAdapter.evaluate(StatementAdapter.java:36)
	at com.carrotsearch.randomizedtesting.ThreadLeakControl$StatementRunner.run(ThreadLeakControl.java:368)
	at com.carrotsearch.randomizedtesting.ThreadLeakControl.forkTimeoutingTask(ThreadLeakControl.java:817)
	at com.carrotsearch.randomizedtesting.ThreadLeakControl$3.evaluate(ThreadLeakControl.java:468)
	at com.carrotsearch.randomizedtesting.RandomizedRunner.runSingleTest(RandomizedRunner.java:943)
	at com.carrotsearch.randomizedtesting.RandomizedRunner$5.evaluate(RandomizedRunner.java:829)
	at com.carrotsearch.randomizedtesting.RandomizedRunner$6.evaluate(RandomizedRunner.java:879)
	at com.carrotsearch.randomizedtesting.RandomizedRunner$7.evaluate(RandomizedRunner.java:890)
	at com.carrotsearch.randomizedtesting.rules.StatementAdapter.evaluate(StatementAdapter.java:36)
	at com.carrotsearch.randomizedtesting.rules.SystemPropertiesRestoreRule$1.evaluate(SystemPropertiesRestoreRule.java:57)
	at org.apache.lucene.util.AbstractBeforeAfterRule$1.evaluate(AbstractBeforeAfterRule.java:45)
	at com.carrotsearch.randomizedtesting.rules.StatementAdapter.evaluate(StatementAdapter.java:36)
	at org.apache.lucene.util.TestRuleStoreClassName$1.evaluate(TestRuleStoreClassName.java:41)
	at com.carrotsearch.randomizedtesting.rules.NoShadowingOrOverridesOnMethodsRule$1.evaluate(NoShadowingOrOverridesOnMethodsRule.java:40)
	at com.carrotsearch.randomizedtesting.rules.NoShadowingOrOverridesOnMethodsRule$1.evaluate(NoShadowingOrOverridesOnMethodsRule.java:40)
	at com.carrotsearch.randomizedtesting.rules.StatementAdapter.evaluate(StatementAdapter.java:36)
	at com.carrotsearch.randomizedtesting.rules.StatementAdapter.evaluate(StatementAdapter.java:36)
	at com.carrotsearch.randomizedtesting.rules.StatementAdapter.evaluate(StatementAdapter.java:36)
	at org.apache.lucene.util.TestRuleAssertionsRequired$1.evaluate(TestRuleAssertionsRequired.java:53)
	at org.apache.lucene.util.TestRuleMarkFailure$1.evaluate(TestRuleMarkFailure.java:47)
	at org.apache.lucene.util.TestRuleIgnoreAfterMaxFailures$1.evaluate(TestRuleIgnoreAfterMaxFailures.java:64)
	at org.apache.lucene.util.TestRuleIgnoreTestSuites$1.evaluate(TestRuleIgnoreTestSuites.java:54)
	at com.carrotsearch.randomizedtesting.rules.StatementAdapter.evaluate(StatementAdapter.java:36)
	at com.carrotsearch.randomizedtesting.ThreadLeakControl$StatementRunner.run(ThreadLeakControl.java:368)
	at java.lang.Thread.run(Thread.java:748)


FAILED:  org.apache.solr.cloud.SharedFSAutoReplicaFailoverTest.test

Error Message:
Expected numSlices=5 numReplicas=1 but found DocCollection(solrj_collection3//collections/solrj_collection3/state.json/38)={   "pullReplicas":"0",   "replicationFactor":"1",   "shards":{     "shard1":{       "range":"80000000-b332ffff",       "state":"active",       "replicas":{"core_node4":{           "dataDir":"hdfs://localhost:53778/solr_hdfs_home/solrj_collection3/core_node4/data/",           "base_url":"http://127.0.0.1:44325/ddj",           "node_name":"127.0.0.1:44325_ddj",           "type":"NRT",           "ulogDir":"hdfs://localhost:53778/solr_hdfs_home/solrj_collection3/core_node4/data/tlog",           "core":"solrj_collection3_shard1_replica_n1",           "state":"active",           "leader":"true"}}},     "shard2":{       "range":"b3330000-e665ffff",       "state":"active",       "replicas":{"core_node6":{           "dataDir":"hdfs://localhost:53778/solr_hdfs_home/solrj_collection3/core_node6/data/",           "base_url":"http://127.0.0.1:36086/ddj",           "node_name":"127.0.0.1:36086_ddj",           "type":"NRT",           "ulogDir":"hdfs://localhost:53778/solr_hdfs_home/solrj_collection3/core_node6/data/tlog",           "core":"solrj_collection3_shard2_replica_n2",           "state":"active",           "leader":"true"}}},     "shard3":{       "range":"e6660000-1998ffff",       "state":"active",       "replicas":{}},     "shard4":{       "range":"19990000-4ccbffff",       "state":"active",       "replicas":{"core_node9":{           "dataDir":"hdfs://localhost:53778/solr_hdfs_home/solrj_collection3/core_node9/data/",           "base_url":"http://127.0.0.1:44325/ddj",           "node_name":"127.0.0.1:44325_ddj",           "type":"NRT",           "ulogDir":"hdfs://localhost:53778/solr_hdfs_home/solrj_collection3/core_node9/data/tlog",           "core":"solrj_collection3_shard4_replica_n5",           "state":"active",           "leader":"true"}}},     "shard5":{       "range":"4ccc0000-7fffffff",       "state":"active",       "replicas":{"core_node10":{           "dataDir":"hdfs://localhost:53778/solr_hdfs_home/solrj_collection3/core_node10/data/",           "base_url":"http://127.0.0.1:44325/ddj",           "node_name":"127.0.0.1:44325_ddj",           "type":"NRT",           "ulogDir":"hdfs://localhost:53778/solr_hdfs_home/solrj_collection3/core_node10/data/tlog",           "core":"solrj_collection3_shard5_replica_n7",           "state":"active",           "leader":"true"}}}},   "router":{     "field":"myOwnField",     "name":"compositeId"},   "maxShardsPerNode":"1",   "autoAddReplicas":"true",   "nrtReplicas":"1",   "tlogReplicas":"0"} with /live_nodes: [127.0.0.1:52576_ddj, 127.0.0.1:37135_ddj, 127.0.0.1:44325_ddj, 127.0.0.1:36086_ddj, 127.0.0.1:37789_ddj]

Stack Trace:
java.lang.AssertionError: Expected numSlices=5 numReplicas=1 but found DocCollection(solrj_collection3//collections/solrj_collection3/state.json/38)={
  "pullReplicas":"0",
  "replicationFactor":"1",
  "shards":{
    "shard1":{
      "range":"80000000-b332ffff",
      "state":"active",
      "replicas":{"core_node4":{
          "dataDir":"hdfs://localhost:53778/solr_hdfs_home/solrj_collection3/core_node4/data/",
          "base_url":"http://127.0.0.1:44325/ddj",
          "node_name":"127.0.0.1:44325_ddj",
          "type":"NRT",
          "ulogDir":"hdfs://localhost:53778/solr_hdfs_home/solrj_collection3/core_node4/data/tlog",
          "core":"solrj_collection3_shard1_replica_n1",
          "state":"active",
          "leader":"true"}}},
    "shard2":{
      "range":"b3330000-e665ffff",
      "state":"active",
      "replicas":{"core_node6":{
          "dataDir":"hdfs://localhost:53778/solr_hdfs_home/solrj_collection3/core_node6/data/",
          "base_url":"http://127.0.0.1:36086/ddj",
          "node_name":"127.0.0.1:36086_ddj",
          "type":"NRT",
          "ulogDir":"hdfs://localhost:53778/solr_hdfs_home/solrj_collection3/core_node6/data/tlog",
          "core":"solrj_collection3_shard2_replica_n2",
          "state":"active",
          "leader":"true"}}},
    "shard3":{
      "range":"e6660000-1998ffff",
      "state":"active",
      "replicas":{}},
    "shard4":{
      "range":"19990000-4ccbffff",
      "state":"active",
      "replicas":{"core_node9":{
          "dataDir":"hdfs://localhost:53778/solr_hdfs_home/solrj_collection3/core_node9/data/",
          "base_url":"http://127.0.0.1:44325/ddj",
          "node_name":"127.0.0.1:44325_ddj",
          "type":"NRT",
          "ulogDir":"hdfs://localhost:53778/solr_hdfs_home/solrj_collection3/core_node9/data/tlog",
          "core":"solrj_collection3_shard4_replica_n5",
          "state":"active",
          "leader":"true"}}},
    "shard5":{
      "range":"4ccc0000-7fffffff",
      "state":"active",
      "replicas":{"core_node10":{
          "dataDir":"hdfs://localhost:53778/solr_hdfs_home/solrj_collection3/core_node10/data/",
          "base_url":"http://127.0.0.1:44325/ddj",
          "node_name":"127.0.0.1:44325_ddj",
          "type":"NRT",
          "ulogDir":"hdfs://localhost:53778/solr_hdfs_home/solrj_collection3/core_node10/data/tlog",
          "core":"solrj_collection3_shard5_replica_n7",
          "state":"active",
          "leader":"true"}}}},
  "router":{
    "field":"myOwnField",
    "name":"compositeId"},
  "maxShardsPerNode":"1",
  "autoAddReplicas":"true",
  "nrtReplicas":"1",
  "tlogReplicas":"0"} with /live_nodes: [127.0.0.1:52576_ddj, 127.0.0.1:37135_ddj, 127.0.0.1:44325_ddj, 127.0.0.1:36086_ddj, 127.0.0.1:37789_ddj]
	at __randomizedtesting.SeedInfo.seed([F02C81D8640D9F8F:7878BE02CAF1F277]:0)
	at org.junit.Assert.fail(Assert.java:93)
	at org.apache.solr.cloud.SharedFSAutoReplicaFailoverTest.assertSliceAndReplicaCount(SharedFSAutoReplicaFailoverTest.java:413)
	at org.apache.solr.cloud.SharedFSAutoReplicaFailoverTest.testBasics(SharedFSAutoReplicaFailoverTest.java:271)
	at org.apache.solr.cloud.SharedFSAutoReplicaFailoverTest.test(SharedFSAutoReplicaFailoverTest.java:143)
	at sun.reflect.NativeMethodAccessorImpl.invoke0(Native Method)
	at sun.reflect.NativeMethodAccessorImpl.invoke(NativeMethodAccessorImpl.java:62)
	at sun.reflect.DelegatingMethodAccessorImpl.invoke(DelegatingMethodAccessorImpl.java:43)
	at java.lang.reflect.Method.invoke(Method.java:498)
	at com.carrotsearch.randomizedtesting.RandomizedRunner.invoke(RandomizedRunner.java:1737)
	at com.carrotsearch.randomizedtesting.RandomizedRunner$8.evaluate(RandomizedRunner.java:934)
	at com.carrotsearch.randomizedtesting.RandomizedRunner$9.evaluate(RandomizedRunner.java:970)
	at com.carrotsearch.randomizedtesting.RandomizedRunner$10.evaluate(RandomizedRunner.java:984)
	at org.apache.solr.BaseDistributedSearchTestCase$ShardsRepeatRule$ShardsFixedStatement.callStatement(BaseDistributedSearchTestCase.java:993)
	at org.apache.solr.BaseDistributedSearchTestCase$ShardsRepeatRule$ShardsStatement.evaluate(BaseDistributedSearchTestCase.java:968)
	at com.carrotsearch.randomizedtesting.rules.SystemPropertiesRestoreRule$1.evaluate(SystemPropertiesRestoreRule.java:57)
	at org.apache.lucene.util.TestRuleSetupTeardownChained$1.evaluate(TestRuleSetupTeardownChained.java:49)
	at org.apache.lucene.util.AbstractBeforeAfterRule$1.evaluate(AbstractBeforeAfterRule.java:45)
	at org.apache.lucene.util.TestRuleThreadAndTestName$1.evaluate(TestRuleThreadAndTestName.java:48)
	at org.apache.lucene.util.TestRuleIgnoreAfterMaxFailures$1.evaluate(TestRuleIgnoreAfterMaxFailures.java:64)
	at org.apache.lucene.util.TestRuleMarkFailure$1.evaluate(TestRuleMarkFailure.java:47)
	at com.carrotsearch.randomizedtesting.rules.StatementAdapter.evaluate(StatementAdapter.java:36)
	at com.carrotsearch.randomizedtesting.ThreadLeakControl$StatementRunner.run(ThreadLeakControl.java:368)
	at com.carrotsearch.randomizedtesting.ThreadLeakControl.forkTimeoutingTask(ThreadLeakControl.java:817)
	at com.carrotsearch.randomizedtesting.ThreadLeakControl$3.evaluate(ThreadLeakControl.java:468)
	at com.carrotsearch.randomizedtesting.RandomizedRunner.runSingleTest(RandomizedRunner.java:943)
	at com.carrotsearch.randomizedtesting.RandomizedRunner$5.evaluate(RandomizedRunner.java:829)
	at com.carrotsearch.randomizedtesting.RandomizedRunner$6.evaluate(RandomizedRunner.java:879)
	at com.carrotsearch.randomizedtesting.RandomizedRunner$7.evaluate(RandomizedRunner.java:890)
	at com.carrotsearch.randomizedtesting.rules.StatementAdapter.evaluate(StatementAdapter.java:36)
	at com.carrotsearch.randomizedtesting.rules.SystemPropertiesRestoreRule$1.evaluate(SystemPropertiesRestoreRule.java:57)
	at org.apache.lucene.util.AbstractBeforeAfterRule$1.evaluate(AbstractBeforeAfterRule.java:45)
	at com.carrotsearch.randomizedtesting.rules.StatementAdapter.evaluate(StatementAdapter.java:36)
	at org.apache.lucene.util.TestRuleStoreClassName$1.evaluate(TestRuleStoreClassName.java:41)
	at com.carrotsearch.randomizedtesting.rules.NoShadowingOrOverridesOnMethodsRule$1.evaluate(NoShadowingOrOverridesOnMethodsRule.java:40)
	at com.carrotsearch.randomizedtesting.rules.NoShadowingOrOverridesOnMethodsRule$1.evaluate(NoShadowingOrOverridesOnMethodsRule.java:40)
	at com.carrotsearch.randomizedtesting.rules.StatementAdapter.evaluate(StatementAdapter.java:36)
	at com.carrotsearch.randomizedtesting.rules.StatementAdapter.evaluate(StatementAdapter.java:36)
	at com.carrotsearch.randomizedtesting.rules.StatementAdapter.evaluate(StatementAdapter.java:36)
	at org.apache.lucene.util.TestRuleAssertionsRequired$1.evaluate(TestRuleAssertionsRequired.java:53)
	at org.apache.lucene.util.TestRuleMarkFailure$1.evaluate(TestRuleMarkFailure.java:47)
	at org.apache.lucene.util.TestRuleIgnoreAfterMaxFailures$1.evaluate(TestRuleIgnoreAfterMaxFailures.java:64)
	at org.apache.lucene.util.TestRuleIgnoreTestSuites$1.evaluate(TestRuleIgnoreTestSuites.java:54)
	at com.carrotsearch.randomizedtesting.rules.StatementAdapter.evaluate(StatementAdapter.java:36)
	at com.carrotsearch.randomizedtesting.ThreadLeakControl$StatementRunner.run(ThreadLeakControl.java:368)
	at java.lang.Thread.run(Thread.java:748)


FAILED:  org.apache.solr.cloud.TestStressLiveNodes.testStress

Error Message:
iter1851 6 != 1 expected:<[127.0.0.1:54041_solr, thrasher-T1851_0-0, thrasher-T1851_1-0, thrasher-T1851_2-0, thrasher-T1851_3-0, thrasher-T1851_4-0]> but was:<[127.0.0.1:54041_solr]>

Stack Trace:
java.lang.AssertionError: iter1851 6 != 1 expected:<[127.0.0.1:54041_solr, thrasher-T1851_0-0, thrasher-T1851_1-0, thrasher-T1851_2-0, thrasher-T1851_3-0, thrasher-T1851_4-0]> but was:<[127.0.0.1:54041_solr]>
	at __randomizedtesting.SeedInfo.seed([F02C81D8640D9F8F:E537FC19E7FA67F4]:0)
	at org.junit.Assert.fail(Assert.java:93)
	at org.junit.Assert.failNotEquals(Assert.java:647)
	at org.junit.Assert.assertEquals(Assert.java:128)
	at org.apache.solr.cloud.TestStressLiveNodes.testStress(TestStressLiveNodes.java:203)
	at sun.reflect.NativeMethodAccessorImpl.invoke0(Native Method)
	at sun.reflect.NativeMethodAccessorImpl.invoke(NativeMethodAccessorImpl.java:62)
	at sun.reflect.DelegatingMethodAccessorImpl.invoke(DelegatingMethodAccessorImpl.java:43)
	at java.lang.reflect.Method.invoke(Method.java:498)
	at com.carrotsearch.randomizedtesting.RandomizedRunner.invoke(RandomizedRunner.java:1737)
	at com.carrotsearch.randomizedtesting.RandomizedRunner$8.evaluate(RandomizedRunner.java:934)
	at com.carrotsearch.randomizedtesting.RandomizedRunner$9.evaluate(RandomizedRunner.java:970)
	at com.carrotsearch.randomizedtesting.RandomizedRunner$10.evaluate(RandomizedRunner.java:984)
	at com.carrotsearch.randomizedtesting.rules.SystemPropertiesRestoreRule$1.evaluate(SystemPropertiesRestoreRule.java:57)
	at org.apache.lucene.util.TestRuleSetupTeardownChained$1.evaluate(TestRuleSetupTeardownChained.java:49)
	at org.apache.lucene.util.AbstractBeforeAfterRule$1.evaluate(AbstractBeforeAfterRule.java:45)
	at org.apache.lucene.util.TestRuleThreadAndTestName$1.evaluate(TestRuleThreadAndTestName.java:48)
	at org.apache.lucene.util.TestRuleIgnoreAfterMaxFailures$1.evaluate(TestRuleIgnoreAfterMaxFailures.java:64)
	at org.apache.lucene.util.TestRuleMarkFailure$1.evaluate(TestRuleMarkFailure.java:47)
	at com.carrotsearch.randomizedtesting.rules.StatementAdapter.evaluate(StatementAdapter.java:36)
	at com.carrotsearch.randomizedtesting.ThreadLeakControl$StatementRunner.run(ThreadLeakControl.java:368)
	at com.carrotsearch.randomizedtesting.ThreadLeakControl.forkTimeoutingTask(ThreadLeakControl.java:817)
	at com.carrotsearch.randomizedtesting.ThreadLeakControl$3.evaluate(ThreadLeakControl.java:468)
	at com.carrotsearch.randomizedtesting.RandomizedRunner.runSingleTest(RandomizedRunner.java:943)
	at com.carrotsearch.randomizedtesting.RandomizedRunner$5.evaluate(RandomizedRunner.java:829)
	at com.carrotsearch.randomizedtesting.RandomizedRunner$6.evaluate(RandomizedRunner.java:879)
	at com.carrotsearch.randomizedtesting.RandomizedRunner$7.evaluate(RandomizedRunner.java:890)
	at com.carrotsearch.randomizedtesting.rules.StatementAdapter.evaluate(StatementAdapter.java:36)
	at com.carrotsearch.randomizedtesting.rules.SystemPropertiesRestoreRule$1.evaluate(SystemPropertiesRestoreRule.java:57)
	at org.apache.lucene.util.AbstractBeforeAfterRule$1.evaluate(AbstractBeforeAfterRule.java:45)
	at com.carrotsearch.randomizedtesting.rules.StatementAdapter.evaluate(StatementAdapter.java:36)
	at org.apache.lucene.util.TestRuleStoreClassName$1.evaluate(TestRuleStoreClassName.java:41)
	at com.carrotsearch.randomizedtesting.rules.NoShadowingOrOverridesOnMethodsRule$1.evaluate(NoShadowingOrOverridesOnMethodsRule.java:40)
	at com.carrotsearch.randomizedtesting.rules.NoShadowingOrOverridesOnMethodsRule$1.evaluate(NoShadowingOrOverridesOnMethodsRule.java:40)
	at com.carrotsearch.randomizedtesting.rules.StatementAdapter.evaluate(StatementAdapter.java:36)
	at com.carrotsearch.randomizedtesting.rules.StatementAdapter.evaluate(StatementAdapter.java:36)
	at com.carrotsearch.randomizedtesting.rules.StatementAdapter.evaluate(StatementAdapter.java:36)
	at org.apache.lucene.util.TestRuleAssertionsRequired$1.evaluate(TestRuleAssertionsRequired.java:53)
	at org.apache.lucene.util.TestRuleMarkFailure$1.evaluate(TestRuleMarkFailure.java:47)
	at org.apache.lucene.util.TestRuleIgnoreAfterMaxFailures$1.evaluate(TestRuleIgnoreAfterMaxFailures.java:64)
	at org.apache.lucene.util.TestRuleIgnoreTestSuites$1.evaluate(TestRuleIgnoreTestSuites.java:54)
	at com.carrotsearch.randomizedtesting.rules.StatementAdapter.evaluate(StatementAdapter.java:36)
	at com.carrotsearch.randomizedtesting.ThreadLeakControl$StatementRunner.run(ThreadLeakControl.java:368)
	at java.lang.Thread.run(Thread.java:748)


FAILED:  org.apache.solr.cloud.TestStressCloudBlindAtomicUpdates.test_dv_stored

Error Message:
java.lang.RuntimeException: Could not load collection from ZK: test_col

Stack Trace:
java.util.concurrent.ExecutionException: java.lang.RuntimeException: Could not load collection from ZK: test_col
	at __randomizedtesting.SeedInfo.seed([F02C81D8640D9F8F:6210E05CD84AA257]:0)
	at java.util.concurrent.FutureTask.report(FutureTask.java:122)
	at java.util.concurrent.FutureTask.get(FutureTask.java:192)
	at org.apache.solr.cloud.TestStressCloudBlindAtomicUpdates.checkField(TestStressCloudBlindAtomicUpdates.java:283)
	at org.apache.solr.cloud.TestStressCloudBlindAtomicUpdates.test_dv_stored(TestStressCloudBlindAtomicUpdates.java:205)
	at sun.reflect.NativeMethodAccessorImpl.invoke0(Native Method)
	at sun.reflect.NativeMethodAccessorImpl.invoke(NativeMethodAccessorImpl.java:62)
	at sun.reflect.DelegatingMethodAccessorImpl.invoke(DelegatingMethodAccessorImpl.java:43)
	at java.lang.reflect.Method.invoke(Method.java:498)
	at com.carrotsearch.randomizedtesting.RandomizedRunner.invoke(RandomizedRunner.java:1737)
	at com.carrotsearch.randomizedtesting.RandomizedRunner$8.evaluate(RandomizedRunner.java:934)
	at com.carrotsearch.randomizedtesting.RandomizedRunner$9.evaluate(RandomizedRunner.java:970)
	at com.carrotsearch.randomizedtesting.RandomizedRunner$10.evaluate(RandomizedRunner.java:984)
	at com.carrotsearch.randomizedtesting.rules.SystemPropertiesRestoreRule$1.evaluate(SystemPropertiesRestoreRule.java:57)
	at org.apache.lucene.util.TestRuleSetupTeardownChained$1.evaluate(TestRuleSetupTeardownChained.java:49)
	at org.apache.lucene.util.AbstractBeforeAfterRule$1.evaluate(AbstractBeforeAfterRule.java:45)
	at org.apache.lucene.util.TestRuleThreadAndTestName$1.evaluate(TestRuleThreadAndTestName.java:48)
	at org.apache.lucene.util.TestRuleIgnoreAfterMaxFailures$1.evaluate(TestRuleIgnoreAfterMaxFailures.java:64)
	at org.apache.lucene.util.TestRuleMarkFailure$1.evaluate(TestRuleMarkFailure.java:47)
	at com.carrotsearch.randomizedtesting.rules.StatementAdapter.evaluate(StatementAdapter.java:36)
	at com.carrotsearch.randomizedtesting.ThreadLeakControl$StatementRunner.run(ThreadLeakControl.java:368)
	at com.carrotsearch.randomizedtesting.ThreadLeakControl.forkTimeoutingTask(ThreadLeakControl.java:817)
	at com.carrotsearch.randomizedtesting.ThreadLeakControl$3.evaluate(ThreadLeakControl.java:468)
	at com.carrotsearch.randomizedtesting.RandomizedRunner.runSingleTest(RandomizedRunner.java:943)
	at com.carrotsearch.randomizedtesting.RandomizedRunner$5.evaluate(RandomizedRunner.java:829)
	at com.carrotsearch.randomizedtesting.RandomizedRunner$6.evaluate(RandomizedRunner.java:879)
	at com.carrotsearch.randomizedtesting.RandomizedRunner$7.evaluate(RandomizedRunner.java:890)
	at com.carrotsearch.randomizedtesting.rules.StatementAdapter.evaluate(StatementAdapter.java:36)
	at com.carrotsearch.randomizedtesting.rules.SystemPropertiesRestoreRule$1.evaluate(SystemPropertiesRestoreRule.java:57)
	at org.apache.lucene.util.AbstractBeforeAfterRule$1.evaluate(AbstractBeforeAfterRule.java:45)
	at com.carrotsearch.randomizedtesting.rules.StatementAdapter.evaluate(StatementAdapter.java:36)
	at org.apache.lucene.util.TestRuleStoreClassName$1.evaluate(TestRuleStoreClassName.java:41)
	at com.carrotsearch.randomizedtesting.rules.NoShadowingOrOverridesOnMethodsRule$1.evaluate(NoShadowingOrOverridesOnMethodsRule.java:40)
	at com.carrotsearch.randomizedtesting.rules.NoShadowingOrOverridesOnMethodsRule$1.evaluate(NoShadowingOrOverridesOnMethodsRule.java:40)
	at com.carrotsearch.randomizedtesting.rules.StatementAdapter.evaluate(StatementAdapter.java:36)
	at com.carrotsearch.randomizedtesting.rules.StatementAdapter.evaluate(StatementAdapter.java:36)
	at com.carrotsearch.randomizedtesting.rules.StatementAdapter.evaluate(StatementAdapter.java:36)
	at org.apache.lucene.util.TestRuleAssertionsRequired$1.evaluate(TestRuleAssertionsRequired.java:53)
	at org.apache.lucene.util.TestRuleMarkFailure$1.evaluate(TestRuleMarkFailure.java:47)
	at org.apache.lucene.util.TestRuleIgnoreAfterMaxFailures$1.evaluate(TestRuleIgnoreAfterMaxFailures.java:64)
	at org.apache.lucene.util.TestRuleIgnoreTestSuites$1.evaluate(TestRuleIgnoreTestSuites.java:54)
	at com.carrotsearch.randomizedtesting.rules.StatementAdapter.evaluate(StatementAdapter.java:36)
	at com.carrotsearch.randomizedtesting.ThreadLeakControl$StatementRunner.run(ThreadLeakControl.java:368)
	at java.lang.Thread.run(Thread.java:748)
Caused by: java.lang.RuntimeException: Could not load collection from ZK: test_col
	at org.apache.solr.cloud.TestStressCloudBlindAtomicUpdates$Worker.run(TestStressCloudBlindAtomicUpdates.java:411)
	at java.util.concurrent.Executors$RunnableAdapter.call(Executors.java:511)
	at java.util.concurrent.FutureTask.run(FutureTask.java:266)
	at org.apache.solr.common.util.ExecutorUtil$MDCAwareThreadPoolExecutor.lambda$execute$0(ExecutorUtil.java:188)
	at java.util.concurrent.ThreadPoolExecutor.runWorker(ThreadPoolExecutor.java:1149)
	at java.util.concurrent.ThreadPoolExecutor$Worker.run(ThreadPoolExecutor.java:624)
	... 1 more
Caused by: org.apache.solr.common.SolrException: Could not load collection from ZK: test_col
	at org.apache.solr.common.cloud.ZkStateReader.getCollectionLive(ZkStateReader.java:1170)
	at org.apache.solr.common.cloud.ZkStateReader$LazyCollectionRef.get(ZkStateReader.java:690)
	at org.apache.solr.client.solrj.impl.CloudSolrClient.getDocCollection(CloudSolrClient.java:1227)
	at org.apache.solr.client.solrj.impl.CloudSolrClient.requestWithRetryOnStaleState(CloudSolrClient.java:827)
	at org.apache.solr.client.solrj.impl.CloudSolrClient.request(CloudSolrClient.java:793)
	at org.apache.solr.client.solrj.SolrRequest.process(SolrRequest.java:178)
	at org.apache.solr.client.solrj.SolrRequest.process(SolrRequest.java:195)
	at org.apache.solr.cloud.TestStressCloudBlindAtomicUpdates$Worker.doRandomAtomicUpdate(TestStressCloudBlindAtomicUpdates.java:370)
	at org.apache.solr.cloud.TestStressCloudBlindAtomicUpdates$Worker.run(TestStressCloudBlindAtomicUpdates.java:399)
	... 6 more
Caused by: org.apache.zookeeper.KeeperException$SessionExpiredException: KeeperErrorCode = Session expired for /collections/test_col/state.json
	at org.apache.zookeeper.KeeperException.create(KeeperException.java:127)
	at org.apache.zookeeper.KeeperException.create(KeeperException.java:51)
	at org.apache.zookeeper.ZooKeeper.getData(ZooKeeper.java:1212)
	at org.apache.solr.common.cloud.SolrZkClient$7.execute(SolrZkClient.java:357)
	at org.apache.solr.common.cloud.SolrZkClient$7.execute(SolrZkClient.java:354)
	at org.apache.solr.common.cloud.ZkCmdExecutor.retryOperation(ZkCmdExecutor.java:60)
	at org.apache.solr.common.cloud.SolrZkClient.getData(SolrZkClient.java:354)
	at org.apache.solr.common.cloud.ZkStateReader.fetchCollectionState(ZkStateReader.java:1182)
	at org.apache.solr.common.cloud.ZkStateReader.getCollectionLive(ZkStateReader.java:1168)
	... 14 more




Build Log:
[...truncated 867 lines...]
   [junit4] Suite: org.apache.lucene.index.TestIndexSorting
   [junit4]   2> Οκτ 16, 2017 10:52:47 ΜΜ com.carrotsearch.randomizedtesting.ThreadLeakControl$2 evaluate
   [junit4]   2> WARNING: Suite execution timed out: org.apache.lucene.index.TestIndexSorting
   [junit4]   2>    1) Thread[id=1, name=main, state=WAITING, group=main]
   [junit4]   2>         at java.lang.Object.wait(Native Method)
   [junit4]   2>         at java.lang.Thread.join(Thread.java:1252)
   [junit4]   2>         at java.lang.Thread.join(Thread.java:1326)
   [junit4]   2>         at com.carrotsearch.randomizedtesting.RandomizedRunner.runSuite(RandomizedRunner.java:636)
   [junit4]   2>         at com.carrotsearch.randomizedtesting.RandomizedRunner.run(RandomizedRunner.java:493)
   [junit4]   2>         at com.carrotsearch.ant.tasks.junit4.slave.SlaveMain.execute(SlaveMain.java:251)
   [junit4]   2>         at com.carrotsearch.ant.tasks.junit4.slave.SlaveMain.main(SlaveMain.java:368)
   [junit4]   2>         at com.carrotsearch.ant.tasks.junit4.slave.SlaveMainSafe.main(SlaveMainSafe.java:13)
   [junit4]   2>    2) Thread[id=155, name=SUITE-TestIndexSorting-seed#[4A73DD356EFE1222], state=RUNNABLE, group=TGRP-TestIndexSorting]
   [junit4]   2>         at java.lang.Thread.getStackTrace(Thread.java:1559)
   [junit4]   2>         at com.carrotsearch.randomizedtesting.ThreadLeakControl$4.run(ThreadLeakControl.java:696)
   [junit4]   2>         at com.carrotsearch.randomizedtesting.ThreadLeakControl$4.run(ThreadLeakControl.java:693)
   [junit4]   2>         at java.security.AccessController.doPrivileged(Native Method)
   [junit4]   2>         at com.carrotsearch.randomizedtesting.ThreadLeakControl.getStackTrace(ThreadLeakControl.java:693)
   [junit4]   2>         at com.carrotsearch.randomizedtesting.ThreadLeakControl.getThreadsWithTraces(ThreadLeakControl.java:709)
   [junit4]   2>         at com.carrotsearch.randomizedtesting.ThreadLeakControl.formatThreadStacksFull(ThreadLeakControl.java:689)
   [junit4]   2>         at com.carrotsearch.randomizedtesting.ThreadLeakControl.access$1000(ThreadLeakControl.java:65)
   [junit4]   2>         at com.carrotsearch.randomizedtesting.ThreadLeakControl$2.evaluate(ThreadLeakControl.java:415)
   [junit4]   2>         at com.carrotsearch.randomizedtesting.RandomizedRunner.runSuite(RandomizedRunner.java:705)
   [junit4]   2>         at com.carrotsearch.randomizedtesting.RandomizedRunner.access$200(RandomizedRunner.java:139)
   [junit4]   2>         at com.carrotsearch.randomizedtesting.RandomizedRunner$2.run(RandomizedRunner.java:626)
   [junit4]   2>    3) Thread[id=12288, name=Lucene Merge Thread #11372, state=RUNNABLE, group=TGRP-TestIndexSorting]
   [junit4]   2>         at java.lang.Thread.yield(Native Method)
   [junit4]   2>         at org.apache.lucene.store.MockIndexOutputWrapper.writeBytes(MockIndexOutputWrapper.java:138)
   [junit4]   2>         at org.apache.lucene.store.MockIndexOutputWrapper.writeByte(MockIndexOutputWrapper.java:126)
   [junit4]   2>         at org.apache.lucene.store.RateLimitedIndexOutput.writeByte(RateLimitedIndexOutput.java:66)
   [junit4]   2>         at org.apache.lucene.store.DataOutput.writeSignedVLong(DataOutput.java:233)
   [junit4]   2>         at org.apache.lucene.store.DataOutput.writeZLong(DataOutput.java:246)
   [junit4]   2>         at org.apache.lucene.util.packed.MonotonicBlockPackedWriter.flush(MonotonicBlockPackedWriter.java:92)
   [junit4]   2>         at org.apache.lucene.util.packed.AbstractBlockPackedWriter.add(AbstractBlockPackedWriter.java:80)
   [junit4]   2>         at org.apache.lucene.util.packed.MonotonicBlockPackedWriter.add(MonotonicBlockPackedWriter.java:69)
   [junit4]   2>         at org.apache.lucene.codecs.memory.MemoryDocValuesConsumer.addSortedNumericField(MemoryDocValuesConsumer.java:442)
   [junit4]   2>         at org.apache.lucene.codecs.DocValuesConsumer.mergeSortedNumericField(DocValuesConsumer.java:371)
   [junit4]   2>         at org.apache.lucene.codecs.DocValuesConsumer.merge(DocValuesConsumer.java:143)
   [junit4]   2>         at org.apache.lucene.codecs.perfield.PerFieldDocValuesFormat$FieldsWriter.merge(PerFieldDocValuesFormat.java:151)
   [junit4]   2>         at org.apache.lucene.index.SegmentMerger.mergeDocValues(SegmentMerger.java:181)
   [junit4]   2>         at org.apache.lucene.index.SegmentMerger.merge(SegmentMerger.java:125)
   [junit4]   2>         at org.apache.lucene.index.IndexWriter.mergeMiddle(IndexWriter.java:4390)
   [junit4]   2>         at org.apache.lucene.index.IndexWriter.merge(IndexWriter.java:4030)
   [junit4]   2>         at org.apache.lucene.index.ConcurrentMergeScheduler.doMerge(ConcurrentMergeScheduler.java:624)
   [junit4]   2>         at org.apache.lucene.index.ConcurrentMergeScheduler$MergeThread.run(ConcurrentMergeScheduler.java:661)
   [junit4]   2>    4) Thread[id=9, name=JUnit4-serializer-daemon, state=TIMED_WAITING, group=main]
   [junit4]   2>         at java.lang.Thread.sleep(Native Method)
   [junit4]   2>         at com.carrotsearch.ant.tasks.junit4.events.Serializer$1.run(Serializer.java:50)
   [junit4]   2>    5) Thread[id=156, name=TEST-TestIndexSorting.testRandom3-seed#[4A73DD356EFE1222], state=RUNNABLE, group=TGRP-TestIndexSorting]
   [junit4]   2>         at java.lang.Thread.start0(Native Method)
   [junit4]   2>         at java.lang.Thread.start(Thread.java:717)
   [junit4]   2>         at org.apache.lucene.index.ConcurrentMergeScheduler.merge(ConcurrentMergeScheduler.java:553)
   [junit4]   2>         at org.apache.lucene.index.IndexWriter.maybeMerge(IndexWriter.java:2233)
   [junit4]   2>         at org.apache.lucene.index.IndexWriter.processEvents(IndexWriter.java:5045)
   [junit4]   2>         at org.apache.lucene.index.IndexWriter.updateDocument(IndexWriter.java:1718)
   [junit4]   2>         at org.apache.lucene.index.IndexWriter.addDocument(IndexWriter.java:1460)
   [junit4]   2>         at org.apache.lucene.index.TestIndexSorting.testRandom3(TestIndexSorting.java:2301)
   [junit4]   2>         at sun.reflect.NativeMethodAccessorImpl.invoke0(Native Method)
   [junit4]   2>         at sun.reflect.NativeMethodAccessorImpl.invoke(NativeMethodAccessorImpl.java:62)
   [junit4]   2>         at sun.reflect.DelegatingMethodAccessorImpl.invoke(DelegatingMethodAccessorImpl.java:43)
   [junit4]   2>         at java.lang.reflect.Method.invoke(Method.java:498)
   [junit4]   2>         at com.carrotsearch.randomizedtesting.RandomizedRunner.invoke(RandomizedRunner.java:1737)
   [junit4]   2>         at com.carrotsearch.randomizedtesting.RandomizedRunner$8.evaluate(RandomizedRunner.java:934)
   [junit4]   2>         at com.carrotsearch.randomizedtesting.RandomizedRunner$9.evaluate(RandomizedRunner.java:970)
   [junit4]   2>         at com.carrotsearch.randomizedtesting.RandomizedRunner$10.evaluate(RandomizedRunner.java:984)
   [junit4]   2>         at org.apache.lucene.util.TestRuleSetupTeardownChained$1.evaluate(TestRuleSetupTeardownChained.java:49)
   [junit4]   2>         at org.apache.lucene.util.AbstractBeforeAfterRule$1.evaluate(AbstractBeforeAfterRule.java:45)
   [junit4]   2>         at org.apache.lucene.util.TestRuleThreadAndTestName$1.evaluate(TestRuleThreadAndTestName.java:48)
   [junit4]   2>         at org.apache.lucene.util.TestRuleIgnoreAfterMaxFailures$1.evaluate(TestRuleIgnoreAfterMaxFailures.java:64)
   [junit4]   2>         at org.apache.lucene.util.TestRuleMarkFailure$1.evaluate(TestRuleMarkFailure.java:47)
   [junit4]   2>         at com.carrotsearch.randomizedtesting.rules.StatementAdapter.evaluate(StatementAdapter.java:36)
   [junit4]   2>         at com.carrotsearch.randomizedtesting.ThreadLeakControl$StatementRunner.run(ThreadLeakControl.java:368)
   [junit4]   2>         at com.carrotsearch.randomizedtesting.ThreadLeakControl.forkTimeoutingTask(ThreadLeakControl.java:817)
   [junit4]   2>         at com.carrotsearch.randomizedtesting.ThreadLeakControl$3.evaluate(ThreadLeakControl.java:468)
   [junit4]   2>         at com.carrotsearch.randomizedtesting.RandomizedRunner.runSingleTest(RandomizedRunner.java:943)
   [junit4]   2>         at com.carrotsearch.randomizedtesting.RandomizedRunner$5.evaluate(RandomizedRunner.java:829)
   [junit4]   2>         at com.carrotsearch.randomizedtesting.RandomizedRunner$6.evaluate(RandomizedRunner.java:879)
   [junit4]   2>         at com.carrotsearch.randomizedtesting.RandomizedRunner$7.evaluate(RandomizedRunner.java:890)
   [junit4]   2>         at org.apache.lucene.util.AbstractBeforeAfterRule$1.evaluate(AbstractBeforeAfterRule.java:45)
   [junit4]   2>         at com.carrotsearch.randomizedtesting.rules.StatementAdapter.evaluate(StatementAdapter.java:36)
   [junit4]   2>         at org.apache.lucene.util.TestRuleStoreClassName$1.evaluate(TestRuleStoreClassName.java:41)
   [junit4]   2>         at com.carrotsearch.randomizedtesting.rules.NoShadowingOrOverridesOnMethodsRule$1.evaluate(NoShadowingOrOverridesOnMethodsRule.java:40)
   [junit4]   2>         at com.carrotsearch.randomizedtesting.rules.NoShadowingOrOverridesOnMethodsRule$1.evaluate(NoShadowingOrOverridesOnMethodsRule.java:40)
   [junit4]   2>         at com.carrotsearch.randomizedtesting.rules.StatementAdapter.evaluate(StatementAdapter.java:36)
   [junit4]   2>         at com.carrotsearch.randomizedtesting.rules.StatementAdapter.evaluate(StatementAdapter.java:36)
   [junit4]   2>         at com.carrotsearch.randomizedtesting.rules.StatementAdapter.evaluate(StatementAdapter.java:36)
   [junit4]   2>         at org.apache.lucene.util.TestRuleAssertionsRequired$1.evaluate(TestRuleAssertionsRequired.java:53)
   [junit4]   2>         at org.apache.lucene.util.TestRuleMarkFailure$1.evaluate(TestRuleMarkFailure.java:47)
   [junit4]   2>         at org.apache.lucene.util.TestRuleIgnoreAfterMaxFailures$1.evaluate(TestRuleIgnoreAfterMaxFailures.java:64)
   [junit4]   2>         at org.apache.lucene.util.TestRuleIgnoreTestSuites$1.evaluate(TestRuleIgnoreTestSuites.java:54)
   [junit4]   2>         at com.carrotsearch.randomizedtesting.rules.StatementAdapter.evaluate(StatementAdapter.java:36)
   [junit4]   2>         at com.carrotsearch.randomizedtesting.ThreadLeakControl$StatementRunner.run(ThreadLeakControl.java:368)
   [junit4]   2>         at java.lang.Thread.run(Thread.java:748)
   [junit4]   2> NOTE: download the large Jenkins line-docs file by running 'ant get-jenkins-line-docs' in the lucene directory.
   [junit4]   2> NOTE: reproduce with: ant test  -Dtestcase=TestIndexSorting -Dtests.method=testRandom3 -Dtests.seed=4A73DD356EFE1222 -Dtests.multiplier=2 -Dtests.nightly=true -Dtests.slow=true -Dtests.linedocsfile=/home/jenkins/jenkins-slave/workspace/Lucene-Solr-NightlyTests-master/test-data/enwiki.random.lines.txt -Dtests.locale=el-GR -Dtests.timezone=US/Indiana-Starke -Dtests.asserts=true -Dtests.file.encoding=UTF-8
   [junit4] ERROR   6944s J1 | TestIndexSorting.testRandom3 <<<
   [junit4]    > Throwable #1: java.lang.Exception: Test abandoned because suite timeout was reached.
   [junit4]    > 	at __randomizedtesting.SeedInfo.seed([4A73DD356EFE1222]:0)
   [junit4]   2> Οκτ 16, 2017 10:52:47 ΜΜ com.carrotsearch.randomizedtesting.ThreadLeakControl checkThreadLeaks
   [junit4]   2> WARNING: Will linger awaiting termination of 2 leaked thread(s).
   [junit4]   2> Οκτ 16, 2017 10:53:08 ΜΜ com.carrotsearch.randomizedtesting.ThreadLeakControl checkThreadLeaks
   [junit4]   2> SEVERE: 3 threads leaked from SUITE scope at org.apache.lucene.index.TestIndexSorting: 
   [junit4]   2>    1) Thread[id=12288, name=Lucene Merge Thread #11372, state=BLOCKED, group=TGRP-TestIndexSorting]
   [junit4]   2>         at org.apache.lucene.store.MockDirectoryWrapper.maybeThrowDeterministicException(MockDirectoryWrapper.java:1019)
   [junit4]   2>         at org.apache.lucene.store.MockIndexOutputWrapper.writeBytes(MockIndexOutputWrapper.java:144)
   [junit4]   2>         at org.apache.lucene.store.MockIndexOutputWrapper.writeByte(MockIndexOutputWrapper.java:126)
   [junit4]   2>         at org.apache.lucene.store.RateLimitedIndexOutput.writeByte(RateLimitedIndexOutput.java:66)
   [junit4]   2>         at org.apache.lucene.codecs.lucene70.Lucene70DocValuesConsumer.writeBlock(Lucene70DocValuesConsumer.java:326)
   [junit4]   2>         at org.apache.lucene.codecs.lucene70.Lucene70DocValuesConsumer.writeValuesMultipleBlocks(Lucene70DocValuesConsumer.java:294)
   [junit4]   2>         at org.apache.lucene.codecs.lucene70.Lucene70DocValuesConsumer.writeValues(Lucene70DocValuesConsumer.java:261)
   [junit4]   2>         at org.apache.lucene.codecs.lucene70.Lucene70DocValuesConsumer.addSortedNumericField(Lucene70DocValuesConsumer.java:530)
   [junit4]   2>         at org.apache.lucene.codecs.DocValuesConsumer.mergeSortedNumericField(DocValuesConsumer.java:371)
   [junit4]   2>         at org.apache.lucene.codecs.DocValuesConsumer.merge(DocValuesConsumer.java:143)
   [junit4]   2>         at org.apache.lucene.codecs.perfield.PerFieldDocValuesFormat$FieldsWriter.merge(PerFieldDocValuesFormat.java:151)
   [junit4]   2>         at org.apache.lucene.index.SegmentMerger.mergeDocValues(SegmentMerger.java:181)
   [junit4]   2>         at org.apache.lucene.index.SegmentMerger.merge(SegmentMerger.java:125)
   [junit4]   2>         at org.apache.lucene.index.IndexWriter.mergeMiddle(IndexWriter.java:4390)
   [junit4]   2>         at org.apache.lucene.index.IndexWriter.merge(IndexWriter.java:4030)
   [junit4]   2>         at org.apache.lucene.index.ConcurrentMergeScheduler.doMerge(ConcurrentMergeScheduler.java:624)
   [junit4]   2>         at org.apache.lucene.index.ConcurrentMergeScheduler$MergeThread.run(ConcurrentMergeScheduler.java:661)
   [junit4]   2>    2) Thread[id=12318, name=Lucene Merge Thread #11402, state=RUNNABLE, group=TGRP-TestIndexSorting]
   [junit4]   2>         at java.lang.Thread.yield(Native Method)
   [junit4]   2>         at org.apache.lucene.store.MockDirectoryWrapper.maybeYield(MockDirectoryWrapper.java:626)
   [junit4]   2>         at org.apache.lucene.store.MockDirectoryWrapper.openInput(MockDirectoryWrapper.java:745)
   [junit4]   2>         at org.apache.lucene.store.Directory.openChecksumInput(Directory.java:119)
   [junit4]   2>         at org.apache.lucene.store.MockDirectoryWrapper.openChecksumInput(MockDirectoryWrapper.java:1072)
   [junit4]   2>         at org.apache.lucene.codecs.lucene50.Lucene50CompoundReader.readEntries(Lucene50CompoundReader.java:105)
   [junit4]   2>         at org.apache.lucene.codecs.lucene50.Lucene50CompoundReader.<init>(Lucene50CompoundReader.java:69)
   [junit4]   2>         at org.apache.lucene.codecs.lucene50.Lucene50CompoundFormat.getCompoundReader(Lucene50CompoundFormat.java:71)
   [junit4]   2>         at org.apache.lucene.index.SegmentCoreReaders.<init>(SegmentCoreReaders.java:99)
   [junit4]   2>         at org.apache.lucene.index.SegmentReader.<init>(SegmentReader.java:78)
   [junit4]   2>         at org.apache.lucene.index.ReadersAndUpdates.getReader(ReadersAndUpdates.java:208)
   [junit4]   2>         at org.apache.lucene.index.ReadersAndUpdates.getReaderForMerge(ReadersAndUpdates.java:836)
   [junit4]   2>         at org.apache.lucene.index.IndexWriter.mergeMiddle(IndexWriter.java:4360)
   [junit4]   2>         at org.apache.lucene.index.IndexWriter.merge(IndexWriter.java:4030)
   [junit4]   2>         at org.apache.lucene.index.ConcurrentMergeScheduler.doMerge(ConcurrentMergeScheduler.java:624)
   [junit4]   2>         at org.apache.lucene.index.ConcurrentMergeScheduler$MergeThread.run(ConcurrentMergeScheduler.java:661)
   [junit4]   2>    3) Thread[id=156, name=TEST-TestIndexSorting.testRandom3-seed#[4A73DD356EFE1222], state=BLOCKED, group=TGRP-TestIndexSorting]
   [junit4]   2>         at org.apache.lucene.store.MockDirectoryWrapper.maybeThrowDeterministicException(MockDirectoryWrapper.java:1019)
   [junit4]   2>         at org.apache.lucene.store.MockIndexOutputWrapper.writeBytes(MockIndexOutputWrapper.java:144)
   [junit4]   2>         at org.apache.lucene.store.MockIndexOutputWrapper.writeByte(MockIndexOutputWrapper.java:126)
   [junit4]   2>         at org.apache.lucene.store.DataOutput.writeInt(DataOutput.java:70)
   [junit4]   2>         at org.apache.lucene.store.DataOutput.writeLong(DataOutput.java:212)
   [junit4]   2>         at org.apache.lucene.util.packed.DirectMonotonicWriter.flush(DirectMonotonicWriter.java:84)
   [junit4]   2>         at org.apache.lucene.util.packed.DirectMonotonicWriter.finish(DirectMonotonicWriter.java:127)
   [junit4]   2>         at org.apache.lucene.codecs.lucene70.Lucene70DocValuesConsumer.addSortedNumericField(Lucene70DocValuesConsumer.java:549)
   [junit4]   2>         at org.apache.lucene.codecs.perfield.PerFieldDocValuesFormat$FieldsWriter.addSortedNumericField(PerFieldDocValuesFormat.java:124)
   [junit4]   2>         at org.apache.lucene.index.SortedNumericDocValuesWriter.flush(SortedNumericDocValuesWriter.java:155)
   [junit4]   2>         at org.apache.lucene.index.DefaultIndexingChain.writeDocValues(DefaultIndexingChain.java:247)
   [junit4]   2>         at org.apache.lucene.index.DefaultIndexingChain.flush(DefaultIndexingChain.java:131)
   [junit4]   2>         at org.apache.lucene.index.DocumentsWriterPerThread.flush(DocumentsWriterPerThread.java:451)
   [junit4]   2>         at org.apache.lucene.index.DocumentsWriter.doFlush(DocumentsWriter.java:542)
   [junit4]   2>         at org.apache.lucene.index.DocumentsWriter.postUpdate(DocumentsWriter.java:399)
   [junit4]   2>         at org.apache.lucene.index.DocumentsWriter.updateDocument(DocumentsWriter.java:502)
   [junit4]   2>         at org.apache.lucene.index.IndexWriter.updateDocument(IndexWriter.java:1715)
   [junit4]   2>         at org.apache.lucene.index.IndexWriter.addDocument(IndexWriter.java:1460)
   [junit4]   2>         at org.apache.lucene.index.TestIndexSorting.testRandom3(TestIndexSorting.java:2301)
   [junit4]   2>         at sun.reflect.NativeMethodAccessorImpl.invoke0(Native Method)
   [junit4]   2>         at sun.reflect.NativeMethodAccessorImpl.invoke(NativeMethodAccessorImpl.java:62)
   [junit4]   2>         at sun.reflect.DelegatingMethodAccessorImpl.invoke(DelegatingMethodAccessorImpl.java:43)
   [junit4]   2>         at java.lang.reflect.Method.invoke(Method.java:498)
   [junit4]   2>         at com.carrotsearch.randomizedtesting.RandomizedRunner.invoke(RandomizedRunner.java:1737)
   [junit4]   2>         at com.carrotsearch.randomizedtesting.RandomizedRunner$8.evaluate(RandomizedRunner.java:934)
   [junit4]   2>         at com.carrotsearch.randomizedtesting.RandomizedRunner$9.evaluate(RandomizedRunner.java:970)
   [junit4]   2>         at com.carrotsearch.randomizedtesting.RandomizedRunner$10.evaluate(RandomizedRunner.java:984)
   [junit4]   2>         at org.apache.lucene.util.TestRuleSetupTeardownChained$1.evaluate(TestRuleSetupTeardownChained.java:49)
   [junit4]   2>         at org.apache.lucene.util.AbstractBeforeAfterRule$1.evaluate(AbstractBeforeAfterRule.java:45)
   [junit4]   2>         at org.apache.lucene.util.TestRuleThreadAndTestName$1.evaluate(TestRuleThreadAndTestName.java:48)
   [junit4]   2>         at org.apache.lucene.util.TestRuleIgnoreAfterMaxFailures$1.evaluate(TestRuleIgnoreAfterMaxFailures.java:64)
   [junit4]   2>         at org.apache.lucene.util.TestRuleMarkFailure$1.evaluate(TestRuleMarkFailure.java:47)
   [junit4]   2>         at com.carrotsearch.randomizedtesting.rules.StatementAdapter.evaluate(StatementAdapter.java:36)
   [junit4]   2>         at com.carrotsearch.randomizedtesting.ThreadLeakControl$StatementRunner.run(ThreadLeakControl.java:368)
   [junit4]   2>         at com.carrotsearch.randomizedtesting.ThreadLeakControl.forkTimeoutingTask(ThreadLeakControl.java:817)
   [junit4]   2>         at com.carrotsearch.randomizedtesting.ThreadLeakControl$3.evaluate(ThreadLeakControl.java:468)
   [junit4]   2>         at com.carrotsearch.randomizedtesting.RandomizedRunner.runSingleTest(RandomizedRunner.java:943)
   [junit4]   2>         at com.carrotsearch.randomizedtesting.RandomizedRunner$5.evaluate(RandomizedRunner.java:829)
   [junit4]   2>         at com.carrotsearch.randomizedtesting.RandomizedRunner$6.evaluate(RandomizedRunner.java:879)
   [junit4]   2>         at com.carrotsearch.randomizedtesting.RandomizedRunner$7.evaluate(RandomizedRunner.java:890)
   [junit4]   2>         at org.apache.lucene.util.AbstractBeforeAfterRule$1.evaluate(AbstractBeforeAfterRule.java:45)
   [junit4]   2>         at com.carrotsearch.randomizedtesting.rules.StatementAdapter.evaluate(StatementAdapter.java:36)
   [junit4]   2>         at org.apache.lucene.util.TestRuleStoreClassName$1.evaluate(TestRuleStoreClassName.java:41)
   [junit4]   2>         at com.carrotsearch.randomizedtesting.rules.NoShadowingOrOverridesOnMethodsRule$1.evaluate(NoShadowingOrOverridesOnMethodsRule.java:40)
   [junit4]   2>         at com.carrotsearch.randomizedtesting.rules.NoShadowingOrOverridesOnMethodsRule$1.evaluate(NoShadowingOrOverridesOnMethodsRule.java:40)
   [junit4]   2>         at com.carrotsearch.randomizedtesting.rules.StatementAdapter.evaluate(StatementAdapter.java:36)
   [junit4]   2>         at com.carrotsearch.randomizedtesting.rules.StatementAdapter.evaluate(StatementAdapter.java:36)
   [junit4]   2>         at com.carrotsearch.randomizedtesting.rules.StatementAdapter.evaluate(StatementAdapter.java:36)
   [junit4]   2>         at org.apache.lucene.util.TestRuleAssertionsRequired$1.evaluate(TestRuleAssertionsRequired.java:53)
   [junit4]   2>         at org.apache.lucene.util.TestRuleMarkFailure$1.evaluate(TestRuleMarkFailure.java:47)
   [junit4]   2>         at org.apache.lucene.util.TestRuleIgnoreAfterMaxFailures$1.evaluate(TestRuleIgnoreAfterMaxFailures.java:64)
   [junit4]   2>         at org.apache.lucene.util.TestRuleIgnoreTestSuites$1.evaluate(TestRuleIgnoreTestSuites.java:54)
   [junit4]   2>         at com.carrotsearch.randomizedtesting.rules.StatementAdapter.evaluate(StatementAdapter.java:36)
   [junit4]   2>         at com.carrotsearch.randomizedtesting.ThreadLeakControl$StatementRunner.run(ThreadLeakControl.java:368)
   [junit4]   2>         at java.lang.Thread.run(Thread.java:748)
   [junit4]   2> Οκτ 16, 2017 10:53:08 ΜΜ com.carrotsearch.randomizedtesting.ThreadLeakControl tryToInterruptAll
   [junit4]   2> INFO: Starting to interrupt leaked threads:
   [junit4]   2>    1) Thread[id=12288, name=Lucene Merge Thread #11372, state=RUNNABLE, group=TGRP-TestIndexSorting]
   [junit4]   2>    2) Thread[id=12318, name=Lucene Merge Thread #11402, state=RUNNABLE, group=TGRP-TestIndexSorting]
   [junit4]   2>    3) Thread[id=156, name=TEST-TestIndexSorting.testRandom3-seed#[4A73DD356EFE1222], state=RUNNABLE, group=TGRP-TestIndexSorting]
   [junit4]   2> NOTE: leaving temporary files on disk at: /x1/jenkins/jenkins-slave/workspace/Lucene-Solr-NightlyTests-master/checkout/lucene/build/core/test/J1/temp/lucene.index.TestIndexSorting_4A73DD356EFE1222-001
   [junit4]   2> Oct 17, 2017 3:53:08 AM com.carrotsearch.randomizedtesting.ThreadLeakControl tryToInterruptAll
   [junit4]   2> INFO: All leaked threads terminated.
   [junit4]   2> NOTE: test params are: codec=Asserting(Lucene70): {sparse_text=FSTOrd50, docs=PostingsFormat(name=LuceneFixedGap), norms=PostingsFormat(name=LuceneFixedGap), positions=FSTOrd50, id=PostingsFormat(name=LuceneFixedGap), term_vectors=FST50}, docValues:{multi_valued_long=DocValuesFormat(name=Asserting), foo=DocValuesFormat(name=Asserting), numeric=DocValuesFormat(name=Memory), multi_valued_numeric=DocValuesFormat(name=Lucene70), float=DocValuesFormat(name=Lucene70), long=DocValuesFormat(name=Lucene70), points=DocValuesFormat(name=Lucene70), sparse_int=DocValuesFormat(name=Lucene70), bar=DocValuesFormat(name=Lucene70), multi_valued_double=DocValuesFormat(name=Lucene70), docs=DocValuesFormat(name=Lucene70), id=DocValuesFormat(name=Lucene70), multi_valued_int=DocValuesFormat(name=Memory), multi_valued_bytes=DocValuesFormat(name=Memory), sparse_text=DocValuesFormat(name=Asserting), double=DocValuesFormat(name=Memory), sparse_binary=DocValuesFormat(name=Asserting), positions=DocValuesFormat(name=Asserting), int=DocValuesFormat(name=Lucene70), sorted=DocValuesFormat(name=Memory), sparse=DocValuesFormat(name=Asserting), multi_valued_string=DocValuesFormat(name=Lucene70), norms=DocValuesFormat(name=Lucene70), bytes=Doc

[...truncated too long message...]

ut/solr/core/test-lib/apacheds-interceptors-journal-2.0.0-M15.jar:/x1/jenkins/jenkins-slave/workspace/Lucene-Solr-NightlyTests-master/checkout/solr/core/test-lib/apacheds-interceptors-normalization-2.0.0-M15.jar:/x1/jenkins/jenkins-slave/workspace/Lucene-Solr-NightlyTests-master/checkout/solr/core/test-lib/apacheds-interceptors-operational-2.0.0-M15.jar:/x1/jenkins/jenkins-slave/workspace/Lucene-Solr-NightlyTests-master/checkout/solr/core/test-lib/apacheds-interceptors-referral-2.0.0-M15.jar:/x1/jenkins/jenkins-slave/workspace/Lucene-Solr-NightlyTests-master/checkout/solr/core/test-lib/apacheds-interceptors-schema-2.0.0-M15.jar:/x1/jenkins/jenkins-slave/workspace/Lucene-Solr-NightlyTests-master/checkout/solr/core/test-lib/apacheds-interceptors-subtree-2.0.0-M15.jar:/x1/jenkins/jenkins-slave/workspace/Lucene-Solr-NightlyTests-master/checkout/solr/core/test-lib/apacheds-interceptors-trigger-2.0.0-M15.jar:/x1/jenkins/jenkins-slave/workspace/Lucene-Solr-NightlyTests-master/checkout/solr/core/test-lib/apacheds-jdbm-partition-2.0.0-M15.jar:/x1/jenkins/jenkins-slave/workspace/Lucene-Solr-NightlyTests-master/checkout/solr/core/test-lib/apacheds-jdbm1-2.0.0-M2.jar:/x1/jenkins/jenkins-slave/workspace/Lucene-Solr-NightlyTests-master/checkout/solr/core/test-lib/apacheds-kerberos-codec-2.0.0-M15.jar:/x1/jenkins/jenkins-slave/workspace/Lucene-Solr-NightlyTests-master/checkout/solr/core/test-lib/apacheds-ldif-partition-2.0.0-M15.jar:/x1/jenkins/jenkins-slave/workspace/Lucene-Solr-NightlyTests-master/checkout/solr/core/test-lib/apacheds-mavibot-partition-2.0.0-M15.jar:/x1/jenkins/jenkins-slave/workspace/Lucene-Solr-NightlyTests-master/checkout/solr/core/test-lib/apacheds-protocol-kerberos-2.0.0-M15.jar:/x1/jenkins/jenkins-slave/workspace/Lucene-Solr-NightlyTests-master/checkout/solr/core/test-lib/apacheds-protocol-ldap-2.0.0-M15.jar:/x1/jenkins/jenkins-slave/workspace/Lucene-Solr-NightlyTests-master/checkout/solr/core/test-lib/apacheds-protocol-shared-2.0.0-M15.jar:/x1/jenkins/jenkins-slave/workspace/Lucene-Solr-NightlyTests-master/checkout/solr/core/test-lib/apacheds-xdbm-partition-2.0.0-M15.jar:/x1/jenkins/jenkins-slave/workspace/Lucene-Solr-NightlyTests-master/checkout/solr/core/test-lib/api-all-1.0.0-M20.jar:/x1/jenkins/jenkins-slave/workspace/Lucene-Solr-NightlyTests-master/checkout/solr/core/test-lib/bcprov-jdk15-1.45.jar:/x1/jenkins/jenkins-slave/workspace/Lucene-Solr-NightlyTests-master/checkout/solr/core/test-lib/byte-buddy-1.6.2.jar:/x1/jenkins/jenkins-slave/workspace/Lucene-Solr-NightlyTests-master/checkout/solr/core/test-lib/commons-collections-3.2.2.jar:/x1/jenkins/jenkins-slave/workspace/Lucene-Solr-NightlyTests-master/checkout/solr/core/test-lib/commons-math3-3.6.1.jar:/x1/jenkins/jenkins-slave/workspace/Lucene-Solr-NightlyTests-master/checkout/solr/core/test-lib/ehcache-core-2.4.4.jar:/x1/jenkins/jenkins-slave/workspace/Lucene-Solr-NightlyTests-master/checkout/solr/core/test-lib/hadoop-common-2.7.4-tests.jar:/x1/jenkins/jenkins-slave/workspace/Lucene-Solr-NightlyTests-master/checkout/solr/core/test-lib/hadoop-hdfs-2.7.4-tests.jar:/x1/jenkins/jenkins-slave/workspace/Lucene-Solr-NightlyTests-master/checkout/solr/core/test-lib/hadoop-minikdc-2.7.4.jar:/x1/jenkins/jenkins-slave/workspace/Lucene-Solr-NightlyTests-master/checkout/solr/core/test-lib/htrace-core-3.2.0-incubating.jar:/x1/jenkins/jenkins-slave/workspace/Lucene-Solr-NightlyTests-master/checkout/solr/core/test-lib/jersey-core-1.9.jar:/x1/jenkins/jenkins-slave/workspace/Lucene-Solr-NightlyTests-master/checkout/solr/core/test-lib/jersey-server-1.9.jar:/x1/jenkins/jenkins-slave/workspace/Lucene-Solr-NightlyTests-master/checkout/solr/core/test-lib/jetty-6.1.26.jar:/x1/jenkins/jenkins-slave/workspace/Lucene-Solr-NightlyTests-master/checkout/solr/core/test-lib/jetty-sslengine-6.1.26.jar:/x1/jenkins/jenkins-slave/workspace/Lucene-Solr-NightlyTests-master/checkout/solr/core/test-lib/jetty-util-6.1.26.jar:/x1/jenkins/jenkins-slave/workspace/Lucene-Solr-NightlyTests-master/checkout/solr/core/test-lib/mina-core-2.0.0-M5.jar:/x1/jenkins/jenkins-slave/workspace/Lucene-Solr-NightlyTests-master/checkout/solr/core/test-lib/mockito-core-2.6.2.jar:/x1/jenkins/jenkins-slave/workspace/Lucene-Solr-NightlyTests-master/checkout/solr/core/test-lib/netty-all-4.0.36.Final.jar:/x1/jenkins/jenkins-slave/workspace/Lucene-Solr-NightlyTests-master/checkout/solr/core/test-lib/objenesis-2.5.jar:/x1/jenkins/jenkins-slave/workspace/Lucene-Solr-NightlyTests-master/checkout/lucene/build/analysis/icu/lucene-analyzers-icu-8.0.0-SNAPSHOT.jar:/x1/jenkins/jenkins-slave/workspace/Lucene-Solr-NightlyTests-master/checkout/solr/build/contrib/solr-analysis-extras/classes/java:/x1/jenkins/jenkins-slave/workspace/Lucene-Solr-NightlyTests-master/checkout/lucene/build/queryparser/classes/test:/x1/jenkins/jenkins-slave/workspace/Lucene-Solr-NightlyTests-master/checkout/lucene/build/backward-codecs/classes/test:/x1/jenkins/jenkins-slave/workspace/Lucene-Solr-NightlyTests-master/checkout/solr/contrib/analysis-extras/lib/icu4j-59.1.jar:/home/jenkins/tools/ant/apache-ant-1.8.4/lib/ant-launcher.jar:/x1/jenkins/.ant/lib/ivy-2.3.0.jar:/home/jenkins/tools/ant/apache-ant-1.8.4/lib/ant-junit.jar:/home/jenkins/tools/ant/apache-ant-1.8.4/lib/ant-apache-log4j.jar:/home/jenkins/tools/ant/apache-ant-1.8.4/lib/ant-junit4.jar:/home/jenkins/tools/ant/apache-ant-1.8.4/lib/ant-jai.jar:/home/jenkins/tools/ant/apache-ant-1.8.4/lib/ant-javamail.jar:/home/jenkins/tools/ant/apache-ant-1.8.4/lib/ant-apache-bsf.jar:/home/jenkins/tools/ant/apache-ant-1.8.4/lib/ant-commons-net.jar:/home/jenkins/tools/ant/apache-ant-1.8.4/lib/ant-antlr.jar:/home/jenkins/tools/ant/apache-ant-1.8.4/lib/ant-jsch.jar:/home/jenkins/tools/ant/apache-ant-1.8.4/lib/ant-apache-oro.jar:/home/jenkins/tools/ant/apache-ant-1.8.4/lib/ant-commons-logging.jar:/home/jenkins/tools/ant/apache-ant-1.8.4/lib/ant.jar:/home/jenkins/tools/ant/apache-ant-1.8.4/lib/ant-netrexx.jar:/home/jenkins/tools/ant/apache-ant-1.8.4/lib/ant-testutil.jar:/home/jenkins/tools/ant/apache-ant-1.8.4/lib/ant-jdepend.jar:/home/jenkins/tools/ant/apache-ant-1.8.4/lib/ant-apache-bcel.jar:/home/jenkins/tools/ant/apache-ant-1.8.4/lib/ant-apache-xalan2.jar:/home/jenkins/tools/ant/apache-ant-1.8.4/lib/ant-apache-resolver.jar:/home/jenkins/tools/ant/apache-ant-1.8.4/lib/ant-jmf.jar:/home/jenkins/tools/ant/apache-ant-1.8.4/lib/ant-apache-regexp.jar:/home/jenkins/tools/ant/apache-ant-1.8.4/lib/ant-swing.jar:/usr/local/asfpackages/java/jdk1.8.0_144/lib/tools.jar:/x1/jenkins/.ivy2/cache/com.carrotsearch.randomizedtesting/junit4-ant/jars/junit4-ant-2.5.3.jar com.carrotsearch.ant.tasks.junit4.slave.SlaveMainSafe -eventsfile /x1/jenkins/jenkins-slave/workspace/Lucene-Solr-NightlyTests-master/checkout/solr/build/solr-core/test/temp/junit4-J1-20171017_130939_4662332864117658623401.events @/x1/jenkins/jenkins-slave/workspace/Lucene-Solr-NightlyTests-master/checkout/solr/build/solr-core/test/temp/junit4-J1-20171017_130939_4666627597082978853301.suites -stdin
   [junit4] ERROR: JVM J1 ended with an exception: Forked process returned with error code: 1. Very likely a JVM crash.  See process stdout at: /x1/jenkins/jenkins-slave/workspace/Lucene-Solr-NightlyTests-master/checkout/solr/build/solr-core/test/temp/junit4-J1-20171017_130939_4666797797990569194998.sysout See process stderr at: /x1/jenkins/jenkins-slave/workspace/Lucene-Solr-NightlyTests-master/checkout/solr/build/solr-core/test/temp/junit4-J1-20171017_130939_4666445489359992254434.syserr
   [junit4] 	at com.carrotsearch.ant.tasks.junit4.JUnit4.executeSlave(JUnit4.java:1519)
   [junit4] 	at com.carrotsearch.ant.tasks.junit4.JUnit4.access$000(JUnit4.java:126)
   [junit4] 	at com.carrotsearch.ant.tasks.junit4.JUnit4$2.call(JUnit4.java:982)
   [junit4] 	at com.carrotsearch.ant.tasks.junit4.JUnit4$2.call(JUnit4.java:979)
   [junit4] 	at java.util.concurrent.FutureTask.run(FutureTask.java:266)
   [junit4] 	at java.util.concurrent.ThreadPoolExecutor.runWorker(ThreadPoolExecutor.java:1149)
   [junit4] 	at java.util.concurrent.ThreadPoolExecutor$Worker.run(ThreadPoolExecutor.java:624)
   [junit4] 	at java.lang.Thread.run(Thread.java:748)

BUILD FAILED
/x1/jenkins/jenkins-slave/workspace/Lucene-Solr-NightlyTests-master/checkout/build.xml:834: The following error occurred while executing this line:
/x1/jenkins/jenkins-slave/workspace/Lucene-Solr-NightlyTests-master/checkout/build.xml:770: The following error occurred while executing this line:
/x1/jenkins/jenkins-slave/workspace/Lucene-Solr-NightlyTests-master/checkout/build.xml:59: The following error occurred while executing this line:
/x1/jenkins/jenkins-slave/workspace/Lucene-Solr-NightlyTests-master/checkout/solr/build.xml:262: The following error occurred while executing this line:
/x1/jenkins/jenkins-slave/workspace/Lucene-Solr-NightlyTests-master/checkout/solr/common-build.xml:556: The following error occurred while executing this line:
/x1/jenkins/jenkins-slave/workspace/Lucene-Solr-NightlyTests-master/checkout/lucene/common-build.xml:1494: The following error occurred while executing this line:
/x1/jenkins/jenkins-slave/workspace/Lucene-Solr-NightlyTests-master/checkout/lucene/common-build.xml:1021: At least one slave process threw an exception, first: Forked process returned with error code: 1. Very likely a JVM crash.  See process stdout at: /x1/jenkins/jenkins-slave/workspace/Lucene-Solr-NightlyTests-master/checkout/solr/build/solr-core/test/temp/junit4-J0-20171017_130939_4614007999479722110771.sysout See process stderr at: /x1/jenkins/jenkins-slave/workspace/Lucene-Solr-NightlyTests-master/checkout/solr/build/solr-core/test/temp/junit4-J0-20171017_130939_4612143799229928065402.syserr

Total time: 1094 minutes 38 seconds
Build step 'Invoke Ant' marked build as failure
Archiving artifacts
[Fast Archiver] No artifacts from Lucene-Solr-NightlyTests-master #1402 to compare, so performing full copy of artifacts
Recording test results
Email was triggered for: Failure - Any
Sending email for trigger: Failure - Any

Mime
View raw message