lucene-dev mailing list archives

Site index · List index
Message view « Date » · « Thread »
Top « Date » · « Thread »
From Apache Jenkins Server <jenk...@builds.apache.org>
Subject [JENKINS] Lucene-Solr-NightlyTests-7.0 - Build # 41 - Still Unstable
Date Sat, 09 Sep 2017 20:58:11 GMT
Build: https://builds.apache.org/job/Lucene-Solr-NightlyTests-7.0/41/

9 tests failed.
FAILED:  org.apache.solr.cloud.ChaosMonkeySafeLeaderTest.test

Error Message:
The Monkey ran for over 45 seconds and no jetties were stopped - this is worth investigating!

Stack Trace:
java.lang.AssertionError: The Monkey ran for over 45 seconds and no jetties were stopped - this is worth investigating!
	at __randomizedtesting.SeedInfo.seed([862E2454FBA12B3F:E7A1B8E555D46C7]:0)
	at org.junit.Assert.fail(Assert.java:93)
	at org.apache.solr.cloud.ChaosMonkey.stopTheMonkey(ChaosMonkey.java:587)
	at org.apache.solr.cloud.ChaosMonkeySafeLeaderTest.test(ChaosMonkeySafeLeaderTest.java:133)
	at sun.reflect.NativeMethodAccessorImpl.invoke0(Native Method)
	at sun.reflect.NativeMethodAccessorImpl.invoke(NativeMethodAccessorImpl.java:62)
	at sun.reflect.DelegatingMethodAccessorImpl.invoke(DelegatingMethodAccessorImpl.java:43)
	at java.lang.reflect.Method.invoke(Method.java:498)
	at com.carrotsearch.randomizedtesting.RandomizedRunner.invoke(RandomizedRunner.java:1713)
	at com.carrotsearch.randomizedtesting.RandomizedRunner$8.evaluate(RandomizedRunner.java:907)
	at com.carrotsearch.randomizedtesting.RandomizedRunner$9.evaluate(RandomizedRunner.java:943)
	at com.carrotsearch.randomizedtesting.RandomizedRunner$10.evaluate(RandomizedRunner.java:957)
	at org.apache.solr.BaseDistributedSearchTestCase$ShardsRepeatRule$ShardsFixedStatement.callStatement(BaseDistributedSearchTestCase.java:993)
	at org.apache.solr.BaseDistributedSearchTestCase$ShardsRepeatRule$ShardsStatement.evaluate(BaseDistributedSearchTestCase.java:968)
	at com.carrotsearch.randomizedtesting.rules.SystemPropertiesRestoreRule$1.evaluate(SystemPropertiesRestoreRule.java:57)
	at org.apache.lucene.util.TestRuleSetupTeardownChained$1.evaluate(TestRuleSetupTeardownChained.java:49)
	at org.apache.lucene.util.AbstractBeforeAfterRule$1.evaluate(AbstractBeforeAfterRule.java:45)
	at org.apache.lucene.util.TestRuleThreadAndTestName$1.evaluate(TestRuleThreadAndTestName.java:48)
	at org.apache.lucene.util.TestRuleIgnoreAfterMaxFailures$1.evaluate(TestRuleIgnoreAfterMaxFailures.java:64)
	at org.apache.lucene.util.TestRuleMarkFailure$1.evaluate(TestRuleMarkFailure.java:47)
	at com.carrotsearch.randomizedtesting.rules.StatementAdapter.evaluate(StatementAdapter.java:36)
	at com.carrotsearch.randomizedtesting.ThreadLeakControl$StatementRunner.run(ThreadLeakControl.java:368)
	at com.carrotsearch.randomizedtesting.ThreadLeakControl.forkTimeoutingTask(ThreadLeakControl.java:817)
	at com.carrotsearch.randomizedtesting.ThreadLeakControl$3.evaluate(ThreadLeakControl.java:468)
	at com.carrotsearch.randomizedtesting.RandomizedRunner.runSingleTest(RandomizedRunner.java:916)
	at com.carrotsearch.randomizedtesting.RandomizedRunner$5.evaluate(RandomizedRunner.java:802)
	at com.carrotsearch.randomizedtesting.RandomizedRunner$6.evaluate(RandomizedRunner.java:852)
	at com.carrotsearch.randomizedtesting.RandomizedRunner$7.evaluate(RandomizedRunner.java:863)
	at com.carrotsearch.randomizedtesting.rules.StatementAdapter.evaluate(StatementAdapter.java:36)
	at com.carrotsearch.randomizedtesting.rules.SystemPropertiesRestoreRule$1.evaluate(SystemPropertiesRestoreRule.java:57)
	at org.apache.lucene.util.AbstractBeforeAfterRule$1.evaluate(AbstractBeforeAfterRule.java:45)
	at com.carrotsearch.randomizedtesting.rules.StatementAdapter.evaluate(StatementAdapter.java:36)
	at org.apache.lucene.util.TestRuleStoreClassName$1.evaluate(TestRuleStoreClassName.java:41)
	at com.carrotsearch.randomizedtesting.rules.NoShadowingOrOverridesOnMethodsRule$1.evaluate(NoShadowingOrOverridesOnMethodsRule.java:40)
	at com.carrotsearch.randomizedtesting.rules.NoShadowingOrOverridesOnMethodsRule$1.evaluate(NoShadowingOrOverridesOnMethodsRule.java:40)
	at com.carrotsearch.randomizedtesting.rules.StatementAdapter.evaluate(StatementAdapter.java:36)
	at com.carrotsearch.randomizedtesting.rules.StatementAdapter.evaluate(StatementAdapter.java:36)
	at com.carrotsearch.randomizedtesting.rules.StatementAdapter.evaluate(StatementAdapter.java:36)
	at org.apache.lucene.util.TestRuleAssertionsRequired$1.evaluate(TestRuleAssertionsRequired.java:53)
	at org.apache.lucene.util.TestRuleMarkFailure$1.evaluate(TestRuleMarkFailure.java:47)
	at org.apache.lucene.util.TestRuleIgnoreAfterMaxFailures$1.evaluate(TestRuleIgnoreAfterMaxFailures.java:64)
	at org.apache.lucene.util.TestRuleIgnoreTestSuites$1.evaluate(TestRuleIgnoreTestSuites.java:54)
	at com.carrotsearch.randomizedtesting.rules.StatementAdapter.evaluate(StatementAdapter.java:36)
	at com.carrotsearch.randomizedtesting.ThreadLeakControl$StatementRunner.run(ThreadLeakControl.java:368)
	at java.lang.Thread.run(Thread.java:748)


FAILED:  junit.framework.TestSuite.org.apache.solr.cloud.ChaosMonkeySafeLeaderWithPullReplicasTest

Error Message:
9 threads leaked from SUITE scope at org.apache.solr.cloud.ChaosMonkeySafeLeaderWithPullReplicasTest:     1) Thread[id=64378, name=StoppableCommitThread-SendThread(127.0.0.1:32823), state=TIMED_WAITING, group=TGRP-ChaosMonkeySafeLeaderWithPullReplicasTest]         at java.lang.Thread.sleep(Native Method)         at org.apache.zookeeper.ClientCnxn$SendThread.run(ClientCnxn.java:1051)    2) Thread[id=64112, name=StoppableIndexingThread, state=TIMED_WAITING, group=TGRP-ChaosMonkeySafeLeaderWithPullReplicasTest]         at java.lang.Thread.sleep(Native Method)         at org.apache.solr.cloud.StoppableIndexingThread.run(StoppableIndexingThread.java:135)    3) Thread[id=64113, name=StoppableCommitThread, state=TIMED_WAITING, group=TGRP-ChaosMonkeySafeLeaderWithPullReplicasTest]         at java.lang.Thread.sleep(Native Method)         at org.apache.solr.cloud.StoppableCommitThread.run(StoppableCommitThread.java:55)    4) Thread[id=64495, name=zkCallback-1444-thread-2, state=TIMED_WAITING, group=TGRP-ChaosMonkeySafeLeaderWithPullReplicasTest]         at sun.misc.Unsafe.park(Native Method)         at java.util.concurrent.locks.LockSupport.parkNanos(LockSupport.java:215)         at java.util.concurrent.SynchronousQueue$TransferStack.awaitFulfill(SynchronousQueue.java:460)         at java.util.concurrent.SynchronousQueue$TransferStack.transfer(SynchronousQueue.java:362)         at java.util.concurrent.SynchronousQueue.poll(SynchronousQueue.java:941)         at java.util.concurrent.ThreadPoolExecutor.getTask(ThreadPoolExecutor.java:1073)         at java.util.concurrent.ThreadPoolExecutor.runWorker(ThreadPoolExecutor.java:1134)         at java.util.concurrent.ThreadPoolExecutor$Worker.run(ThreadPoolExecutor.java:624)         at java.lang.Thread.run(Thread.java:748)    5) Thread[id=64497, name=zkCallback-1444-thread-4, state=TIMED_WAITING, group=TGRP-ChaosMonkeySafeLeaderWithPullReplicasTest]         at sun.misc.Unsafe.park(Native Method)         at java.util.concurrent.locks.LockSupport.parkNanos(LockSupport.java:215)         at java.util.concurrent.SynchronousQueue$TransferStack.awaitFulfill(SynchronousQueue.java:460)         at java.util.concurrent.SynchronousQueue$TransferStack.transfer(SynchronousQueue.java:362)         at java.util.concurrent.SynchronousQueue.poll(SynchronousQueue.java:941)         at java.util.concurrent.ThreadPoolExecutor.getTask(ThreadPoolExecutor.java:1073)         at java.util.concurrent.ThreadPoolExecutor.runWorker(ThreadPoolExecutor.java:1134)         at java.util.concurrent.ThreadPoolExecutor$Worker.run(ThreadPoolExecutor.java:624)         at java.lang.Thread.run(Thread.java:748)    6) Thread[id=64496, name=zkCallback-1444-thread-3, state=TIMED_WAITING, group=TGRP-ChaosMonkeySafeLeaderWithPullReplicasTest]         at sun.misc.Unsafe.park(Native Method)         at java.util.concurrent.locks.LockSupport.parkNanos(LockSupport.java:215)         at java.util.concurrent.SynchronousQueue$TransferStack.awaitFulfill(SynchronousQueue.java:460)         at java.util.concurrent.SynchronousQueue$TransferStack.transfer(SynchronousQueue.java:362)         at java.util.concurrent.SynchronousQueue.poll(SynchronousQueue.java:941)         at java.util.concurrent.ThreadPoolExecutor.getTask(ThreadPoolExecutor.java:1073)         at java.util.concurrent.ThreadPoolExecutor.runWorker(ThreadPoolExecutor.java:1134)         at java.util.concurrent.ThreadPoolExecutor$Worker.run(ThreadPoolExecutor.java:624)         at java.lang.Thread.run(Thread.java:748)    7) Thread[id=64380, name=zkCallback-1444-thread-1, state=TIMED_WAITING, group=TGRP-ChaosMonkeySafeLeaderWithPullReplicasTest]         at sun.misc.Unsafe.park(Native Method)         at java.util.concurrent.locks.LockSupport.parkNanos(LockSupport.java:215)         at java.util.concurrent.SynchronousQueue$TransferStack.awaitFulfill(SynchronousQueue.java:460)         at java.util.concurrent.SynchronousQueue$TransferStack.transfer(SynchronousQueue.java:362)         at java.util.concurrent.SynchronousQueue.poll(SynchronousQueue.java:941)         at java.util.concurrent.ThreadPoolExecutor.getTask(ThreadPoolExecutor.java:1073)         at java.util.concurrent.ThreadPoolExecutor.runWorker(ThreadPoolExecutor.java:1134)         at java.util.concurrent.ThreadPoolExecutor$Worker.run(ThreadPoolExecutor.java:624)         at java.lang.Thread.run(Thread.java:748)    8) Thread[id=64111, name=StoppableIndexingThread, state=TIMED_WAITING, group=TGRP-ChaosMonkeySafeLeaderWithPullReplicasTest]         at java.lang.Thread.sleep(Native Method)         at org.apache.solr.cloud.StoppableIndexingThread.run(StoppableIndexingThread.java:135)    9) Thread[id=64379, name=StoppableCommitThread-EventThread, state=WAITING, group=TGRP-ChaosMonkeySafeLeaderWithPullReplicasTest]         at sun.misc.Unsafe.park(Native Method)         at java.util.concurrent.locks.LockSupport.park(LockSupport.java:175)         at java.util.concurrent.locks.AbstractQueuedSynchronizer$ConditionObject.await(AbstractQueuedSynchronizer.java:2039)         at java.util.concurrent.LinkedBlockingQueue.take(LinkedBlockingQueue.java:442)         at org.apache.zookeeper.ClientCnxn$EventThread.run(ClientCnxn.java:501)

Stack Trace:
com.carrotsearch.randomizedtesting.ThreadLeakError: 9 threads leaked from SUITE scope at org.apache.solr.cloud.ChaosMonkeySafeLeaderWithPullReplicasTest: 
   1) Thread[id=64378, name=StoppableCommitThread-SendThread(127.0.0.1:32823), state=TIMED_WAITING, group=TGRP-ChaosMonkeySafeLeaderWithPullReplicasTest]
        at java.lang.Thread.sleep(Native Method)
        at org.apache.zookeeper.ClientCnxn$SendThread.run(ClientCnxn.java:1051)
   2) Thread[id=64112, name=StoppableIndexingThread, state=TIMED_WAITING, group=TGRP-ChaosMonkeySafeLeaderWithPullReplicasTest]
        at java.lang.Thread.sleep(Native Method)
        at org.apache.solr.cloud.StoppableIndexingThread.run(StoppableIndexingThread.java:135)
   3) Thread[id=64113, name=StoppableCommitThread, state=TIMED_WAITING, group=TGRP-ChaosMonkeySafeLeaderWithPullReplicasTest]
        at java.lang.Thread.sleep(Native Method)
        at org.apache.solr.cloud.StoppableCommitThread.run(StoppableCommitThread.java:55)
   4) Thread[id=64495, name=zkCallback-1444-thread-2, state=TIMED_WAITING, group=TGRP-ChaosMonkeySafeLeaderWithPullReplicasTest]
        at sun.misc.Unsafe.park(Native Method)
        at java.util.concurrent.locks.LockSupport.parkNanos(LockSupport.java:215)
        at java.util.concurrent.SynchronousQueue$TransferStack.awaitFulfill(SynchronousQueue.java:460)
        at java.util.concurrent.SynchronousQueue$TransferStack.transfer(SynchronousQueue.java:362)
        at java.util.concurrent.SynchronousQueue.poll(SynchronousQueue.java:941)
        at java.util.concurrent.ThreadPoolExecutor.getTask(ThreadPoolExecutor.java:1073)
        at java.util.concurrent.ThreadPoolExecutor.runWorker(ThreadPoolExecutor.java:1134)
        at java.util.concurrent.ThreadPoolExecutor$Worker.run(ThreadPoolExecutor.java:624)
        at java.lang.Thread.run(Thread.java:748)
   5) Thread[id=64497, name=zkCallback-1444-thread-4, state=TIMED_WAITING, group=TGRP-ChaosMonkeySafeLeaderWithPullReplicasTest]
        at sun.misc.Unsafe.park(Native Method)
        at java.util.concurrent.locks.LockSupport.parkNanos(LockSupport.java:215)
        at java.util.concurrent.SynchronousQueue$TransferStack.awaitFulfill(SynchronousQueue.java:460)
        at java.util.concurrent.SynchronousQueue$TransferStack.transfer(SynchronousQueue.java:362)
        at java.util.concurrent.SynchronousQueue.poll(SynchronousQueue.java:941)
        at java.util.concurrent.ThreadPoolExecutor.getTask(ThreadPoolExecutor.java:1073)
        at java.util.concurrent.ThreadPoolExecutor.runWorker(ThreadPoolExecutor.java:1134)
        at java.util.concurrent.ThreadPoolExecutor$Worker.run(ThreadPoolExecutor.java:624)
        at java.lang.Thread.run(Thread.java:748)
   6) Thread[id=64496, name=zkCallback-1444-thread-3, state=TIMED_WAITING, group=TGRP-ChaosMonkeySafeLeaderWithPullReplicasTest]
        at sun.misc.Unsafe.park(Native Method)
        at java.util.concurrent.locks.LockSupport.parkNanos(LockSupport.java:215)
        at java.util.concurrent.SynchronousQueue$TransferStack.awaitFulfill(SynchronousQueue.java:460)
        at java.util.concurrent.SynchronousQueue$TransferStack.transfer(SynchronousQueue.java:362)
        at java.util.concurrent.SynchronousQueue.poll(SynchronousQueue.java:941)
        at java.util.concurrent.ThreadPoolExecutor.getTask(ThreadPoolExecutor.java:1073)
        at java.util.concurrent.ThreadPoolExecutor.runWorker(ThreadPoolExecutor.java:1134)
        at java.util.concurrent.ThreadPoolExecutor$Worker.run(ThreadPoolExecutor.java:624)
        at java.lang.Thread.run(Thread.java:748)
   7) Thread[id=64380, name=zkCallback-1444-thread-1, state=TIMED_WAITING, group=TGRP-ChaosMonkeySafeLeaderWithPullReplicasTest]
        at sun.misc.Unsafe.park(Native Method)
        at java.util.concurrent.locks.LockSupport.parkNanos(LockSupport.java:215)
        at java.util.concurrent.SynchronousQueue$TransferStack.awaitFulfill(SynchronousQueue.java:460)
        at java.util.concurrent.SynchronousQueue$TransferStack.transfer(SynchronousQueue.java:362)
        at java.util.concurrent.SynchronousQueue.poll(SynchronousQueue.java:941)
        at java.util.concurrent.ThreadPoolExecutor.getTask(ThreadPoolExecutor.java:1073)
        at java.util.concurrent.ThreadPoolExecutor.runWorker(ThreadPoolExecutor.java:1134)
        at java.util.concurrent.ThreadPoolExecutor$Worker.run(ThreadPoolExecutor.java:624)
        at java.lang.Thread.run(Thread.java:748)
   8) Thread[id=64111, name=StoppableIndexingThread, state=TIMED_WAITING, group=TGRP-ChaosMonkeySafeLeaderWithPullReplicasTest]
        at java.lang.Thread.sleep(Native Method)
        at org.apache.solr.cloud.StoppableIndexingThread.run(StoppableIndexingThread.java:135)
   9) Thread[id=64379, name=StoppableCommitThread-EventThread, state=WAITING, group=TGRP-ChaosMonkeySafeLeaderWithPullReplicasTest]
        at sun.misc.Unsafe.park(Native Method)
        at java.util.concurrent.locks.LockSupport.park(LockSupport.java:175)
        at java.util.concurrent.locks.AbstractQueuedSynchronizer$ConditionObject.await(AbstractQueuedSynchronizer.java:2039)
        at java.util.concurrent.LinkedBlockingQueue.take(LinkedBlockingQueue.java:442)
        at org.apache.zookeeper.ClientCnxn$EventThread.run(ClientCnxn.java:501)
	at __randomizedtesting.SeedInfo.seed([862E2454FBA12B3F]:0)


FAILED:  junit.framework.TestSuite.org.apache.solr.cloud.ChaosMonkeySafeLeaderWithPullReplicasTest

Error Message:
There are still zombie threads that couldn't be terminated:    1) Thread[id=64378, name=StoppableCommitThread-SendThread(127.0.0.1:32823), state=TIMED_WAITING, group=TGRP-ChaosMonkeySafeLeaderWithPullReplicasTest]         at java.lang.Thread.sleep(Native Method)         at org.apache.zookeeper.ClientCnxn$SendThread.run(ClientCnxn.java:1051)    2) Thread[id=64112, name=StoppableIndexingThread, state=RUNNABLE, group=TGRP-ChaosMonkeySafeLeaderWithPullReplicasTest]         at org.apache.solr.common.util.JavaBinCodec.writeKnownType(JavaBinCodec.java:328)         at org.apache.solr.common.util.JavaBinCodec.writeVal(JavaBinCodec.java:228)         at org.apache.solr.common.util.JavaBinCodec.writeMapEntry(JavaBinCodec.java:764)         at org.apache.solr.common.util.JavaBinCodec.writeKnownType(JavaBinCodec.java:383)         at org.apache.solr.common.util.JavaBinCodec.writeVal(JavaBinCodec.java:228)         at org.apache.solr.common.util.JavaBinCodec.writeIterator(JavaBinCodec.java:705)         at org.apache.solr.common.util.JavaBinCodec.writeKnownType(JavaBinCodec.java:367)         at org.apache.solr.common.util.JavaBinCodec.writeVal(JavaBinCodec.java:228)         at org.apache.solr.common.util.JavaBinCodec.writeNamedList(JavaBinCodec.java:223)         at org.apache.solr.common.util.JavaBinCodec.writeKnownType(JavaBinCodec.java:330)         at org.apache.solr.common.util.JavaBinCodec.writeVal(JavaBinCodec.java:228)         at org.apache.solr.common.util.JavaBinCodec.marshal(JavaBinCodec.java:155)         at org.apache.solr.client.solrj.request.JavaBinUpdateRequestCodec.marshal(JavaBinUpdateRequestCodec.java:91)         at org.apache.solr.client.solrj.impl.BinaryRequestWriter.getContentStream(BinaryRequestWriter.java:67)         at org.apache.solr.client.solrj.request.RequestWriter$LazyContentStream.getDelegate(RequestWriter.java:94)         at org.apache.solr.client.solrj.request.RequestWriter$LazyContentStream.getName(RequestWriter.java:104)         at org.apache.solr.client.solrj.impl.HttpSolrClient.createMethod(HttpSolrClient.java:382)         at org.apache.solr.client.solrj.impl.HttpSolrClient.request(HttpSolrClient.java:251)         at org.apache.solr.client.solrj.impl.HttpSolrClient.request(HttpSolrClient.java:242)         at org.apache.solr.client.solrj.SolrRequest.process(SolrRequest.java:178)         at org.apache.solr.client.solrj.SolrRequest.process(SolrRequest.java:195)         at org.apache.solr.cloud.StoppableIndexingThread.indexDocs(StoppableIndexingThread.java:176)         at org.apache.solr.cloud.StoppableIndexingThread.run(StoppableIndexingThread.java:115)    3) Thread[id=64495, name=zkCallback-1444-thread-2, state=TIMED_WAITING, group=TGRP-ChaosMonkeySafeLeaderWithPullReplicasTest]         at sun.misc.Unsafe.park(Native Method)         at java.util.concurrent.locks.LockSupport.parkNanos(LockSupport.java:215)         at java.util.concurrent.SynchronousQueue$TransferStack.awaitFulfill(SynchronousQueue.java:460)         at java.util.concurrent.SynchronousQueue$TransferStack.transfer(SynchronousQueue.java:362)         at java.util.concurrent.SynchronousQueue.poll(SynchronousQueue.java:941)         at java.util.concurrent.ThreadPoolExecutor.getTask(ThreadPoolExecutor.java:1073)         at java.util.concurrent.ThreadPoolExecutor.runWorker(ThreadPoolExecutor.java:1134)         at java.util.concurrent.ThreadPoolExecutor$Worker.run(ThreadPoolExecutor.java:624)         at java.lang.Thread.run(Thread.java:748)    4) Thread[id=64497, name=zkCallback-1444-thread-4, state=TIMED_WAITING, group=TGRP-ChaosMonkeySafeLeaderWithPullReplicasTest]         at sun.misc.Unsafe.park(Native Method)         at java.util.concurrent.locks.LockSupport.parkNanos(LockSupport.java:215)         at java.util.concurrent.SynchronousQueue$TransferStack.awaitFulfill(SynchronousQueue.java:460)         at java.util.concurrent.SynchronousQueue$TransferStack.transfer(SynchronousQueue.java:362)         at java.util.concurrent.SynchronousQueue.poll(SynchronousQueue.java:941)         at java.util.concurrent.ThreadPoolExecutor.getTask(ThreadPoolExecutor.java:1073)         at java.util.concurrent.ThreadPoolExecutor.runWorker(ThreadPoolExecutor.java:1134)         at java.util.concurrent.ThreadPoolExecutor$Worker.run(ThreadPoolExecutor.java:624)         at java.lang.Thread.run(Thread.java:748)    5) Thread[id=64496, name=zkCallback-1444-thread-3, state=TIMED_WAITING, group=TGRP-ChaosMonkeySafeLeaderWithPullReplicasTest]         at sun.misc.Unsafe.park(Native Method)         at java.util.concurrent.locks.LockSupport.parkNanos(LockSupport.java:215)         at java.util.concurrent.SynchronousQueue$TransferStack.awaitFulfill(SynchronousQueue.java:460)         at java.util.concurrent.SynchronousQueue$TransferStack.transfer(SynchronousQueue.java:362)         at java.util.concurrent.SynchronousQueue.poll(SynchronousQueue.java:941)         at java.util.concurrent.ThreadPoolExecutor.getTask(ThreadPoolExecutor.java:1073)         at java.util.concurrent.ThreadPoolExecutor.runWorker(ThreadPoolExecutor.java:1134)         at java.util.concurrent.ThreadPoolExecutor$Worker.run(ThreadPoolExecutor.java:624)         at java.lang.Thread.run(Thread.java:748)    6) Thread[id=64380, name=zkCallback-1444-thread-1, state=TIMED_WAITING, group=TGRP-ChaosMonkeySafeLeaderWithPullReplicasTest]         at sun.misc.Unsafe.park(Native Method)         at java.util.concurrent.locks.LockSupport.parkNanos(LockSupport.java:215)         at java.util.concurrent.SynchronousQueue$TransferStack.awaitFulfill(SynchronousQueue.java:460)         at java.util.concurrent.SynchronousQueue$TransferStack.transfer(SynchronousQueue.java:362)         at java.util.concurrent.SynchronousQueue.poll(SynchronousQueue.java:941)         at java.util.concurrent.ThreadPoolExecutor.getTask(ThreadPoolExecutor.java:1073)         at java.util.concurrent.ThreadPoolExecutor.runWorker(ThreadPoolExecutor.java:1134)         at java.util.concurrent.ThreadPoolExecutor$Worker.run(ThreadPoolExecutor.java:624)         at java.lang.Thread.run(Thread.java:748)    7) Thread[id=64111, name=StoppableIndexingThread, state=RUNNABLE, group=TGRP-ChaosMonkeySafeLeaderWithPullReplicasTest]         at org.apache.solr.common.util.JavaBinCodec.writeStr(JavaBinCodec.java:841)         at org.apache.solr.common.util.JavaBinCodec.writePrimitive(JavaBinCodec.java:932)         at org.apache.solr.common.util.JavaBinCodec.writeKnownType(JavaBinCodec.java:328)         at org.apache.solr.common.util.JavaBinCodec.writeVal(JavaBinCodec.java:228)         at org.apache.solr.common.util.JavaBinCodec.writeSolrInputDocument(JavaBinCodec.java:616)         at org.apache.solr.common.util.JavaBinCodec.writeKnownType(JavaBinCodec.java:355)         at org.apache.solr.common.util.JavaBinCodec.writeVal(JavaBinCodec.java:228)         at org.apache.solr.common.util.JavaBinCodec.writeMapEntry(JavaBinCodec.java:764)         at org.apache.solr.common.util.JavaBinCodec.writeKnownType(JavaBinCodec.java:383)         at org.apache.solr.common.util.JavaBinCodec.writeVal(JavaBinCodec.java:228)         at org.apache.solr.common.util.JavaBinCodec.writeIterator(JavaBinCodec.java:705)         at org.apache.solr.common.util.JavaBinCodec.writeKnownType(JavaBinCodec.java:367)         at org.apache.solr.common.util.JavaBinCodec.writeVal(JavaBinCodec.java:228)         at org.apache.solr.common.util.JavaBinCodec.writeNamedList(JavaBinCodec.java:223)         at org.apache.solr.common.util.JavaBinCodec.writeKnownType(JavaBinCodec.java:330)         at org.apache.solr.common.util.JavaBinCodec.writeVal(JavaBinCodec.java:228)         at org.apache.solr.common.util.JavaBinCodec.marshal(JavaBinCodec.java:155)         at org.apache.solr.client.solrj.request.JavaBinUpdateRequestCodec.marshal(JavaBinUpdateRequestCodec.java:91)         at org.apache.solr.client.solrj.impl.BinaryRequestWriter.getContentStream(BinaryRequestWriter.java:67)         at org.apache.solr.client.solrj.request.RequestWriter$LazyContentStream.getDelegate(RequestWriter.java:94)         at org.apache.solr.client.solrj.request.RequestWriter$LazyContentStream.getName(RequestWriter.java:104)         at org.apache.solr.client.solrj.impl.HttpSolrClient.createMethod(HttpSolrClient.java:382)         at org.apache.solr.client.solrj.impl.HttpSolrClient.request(HttpSolrClient.java:251)         at org.apache.solr.client.solrj.impl.HttpSolrClient.request(HttpSolrClient.java:242)         at org.apache.solr.client.solrj.SolrRequest.process(SolrRequest.java:178)         at org.apache.solr.client.solrj.SolrRequest.process(SolrRequest.java:195)         at org.apache.solr.cloud.StoppableIndexingThread.indexDocs(StoppableIndexingThread.java:176)         at org.apache.solr.cloud.StoppableIndexingThread.run(StoppableIndexingThread.java:115)

Stack Trace:
com.carrotsearch.randomizedtesting.ThreadLeakError: There are still zombie threads that couldn't be terminated:
   1) Thread[id=64378, name=StoppableCommitThread-SendThread(127.0.0.1:32823), state=TIMED_WAITING, group=TGRP-ChaosMonkeySafeLeaderWithPullReplicasTest]
        at java.lang.Thread.sleep(Native Method)
        at org.apache.zookeeper.ClientCnxn$SendThread.run(ClientCnxn.java:1051)
   2) Thread[id=64112, name=StoppableIndexingThread, state=RUNNABLE, group=TGRP-ChaosMonkeySafeLeaderWithPullReplicasTest]
        at org.apache.solr.common.util.JavaBinCodec.writeKnownType(JavaBinCodec.java:328)
        at org.apache.solr.common.util.JavaBinCodec.writeVal(JavaBinCodec.java:228)
        at org.apache.solr.common.util.JavaBinCodec.writeMapEntry(JavaBinCodec.java:764)
        at org.apache.solr.common.util.JavaBinCodec.writeKnownType(JavaBinCodec.java:383)
        at org.apache.solr.common.util.JavaBinCodec.writeVal(JavaBinCodec.java:228)
        at org.apache.solr.common.util.JavaBinCodec.writeIterator(JavaBinCodec.java:705)
        at org.apache.solr.common.util.JavaBinCodec.writeKnownType(JavaBinCodec.java:367)
        at org.apache.solr.common.util.JavaBinCodec.writeVal(JavaBinCodec.java:228)
        at org.apache.solr.common.util.JavaBinCodec.writeNamedList(JavaBinCodec.java:223)
        at org.apache.solr.common.util.JavaBinCodec.writeKnownType(JavaBinCodec.java:330)
        at org.apache.solr.common.util.JavaBinCodec.writeVal(JavaBinCodec.java:228)
        at org.apache.solr.common.util.JavaBinCodec.marshal(JavaBinCodec.java:155)
        at org.apache.solr.client.solrj.request.JavaBinUpdateRequestCodec.marshal(JavaBinUpdateRequestCodec.java:91)
        at org.apache.solr.client.solrj.impl.BinaryRequestWriter.getContentStream(BinaryRequestWriter.java:67)
        at org.apache.solr.client.solrj.request.RequestWriter$LazyContentStream.getDelegate(RequestWriter.java:94)
        at org.apache.solr.client.solrj.request.RequestWriter$LazyContentStream.getName(RequestWriter.java:104)
        at org.apache.solr.client.solrj.impl.HttpSolrClient.createMethod(HttpSolrClient.java:382)
        at org.apache.solr.client.solrj.impl.HttpSolrClient.request(HttpSolrClient.java:251)
        at org.apache.solr.client.solrj.impl.HttpSolrClient.request(HttpSolrClient.java:242)
        at org.apache.solr.client.solrj.SolrRequest.process(SolrRequest.java:178)
        at org.apache.solr.client.solrj.SolrRequest.process(SolrRequest.java:195)
        at org.apache.solr.cloud.StoppableIndexingThread.indexDocs(StoppableIndexingThread.java:176)
        at org.apache.solr.cloud.StoppableIndexingThread.run(StoppableIndexingThread.java:115)
   3) Thread[id=64495, name=zkCallback-1444-thread-2, state=TIMED_WAITING, group=TGRP-ChaosMonkeySafeLeaderWithPullReplicasTest]
        at sun.misc.Unsafe.park(Native Method)
        at java.util.concurrent.locks.LockSupport.parkNanos(LockSupport.java:215)
        at java.util.concurrent.SynchronousQueue$TransferStack.awaitFulfill(SynchronousQueue.java:460)
        at java.util.concurrent.SynchronousQueue$TransferStack.transfer(SynchronousQueue.java:362)
        at java.util.concurrent.SynchronousQueue.poll(SynchronousQueue.java:941)
        at java.util.concurrent.ThreadPoolExecutor.getTask(ThreadPoolExecutor.java:1073)
        at java.util.concurrent.ThreadPoolExecutor.runWorker(ThreadPoolExecutor.java:1134)
        at java.util.concurrent.ThreadPoolExecutor$Worker.run(ThreadPoolExecutor.java:624)
        at java.lang.Thread.run(Thread.java:748)
   4) Thread[id=64497, name=zkCallback-1444-thread-4, state=TIMED_WAITING, group=TGRP-ChaosMonkeySafeLeaderWithPullReplicasTest]
        at sun.misc.Unsafe.park(Native Method)
        at java.util.concurrent.locks.LockSupport.parkNanos(LockSupport.java:215)
        at java.util.concurrent.SynchronousQueue$TransferStack.awaitFulfill(SynchronousQueue.java:460)
        at java.util.concurrent.SynchronousQueue$TransferStack.transfer(SynchronousQueue.java:362)
        at java.util.concurrent.SynchronousQueue.poll(SynchronousQueue.java:941)
        at java.util.concurrent.ThreadPoolExecutor.getTask(ThreadPoolExecutor.java:1073)
        at java.util.concurrent.ThreadPoolExecutor.runWorker(ThreadPoolExecutor.java:1134)
        at java.util.concurrent.ThreadPoolExecutor$Worker.run(ThreadPoolExecutor.java:624)
        at java.lang.Thread.run(Thread.java:748)
   5) Thread[id=64496, name=zkCallback-1444-thread-3, state=TIMED_WAITING, group=TGRP-ChaosMonkeySafeLeaderWithPullReplicasTest]
        at sun.misc.Unsafe.park(Native Method)
        at java.util.concurrent.locks.LockSupport.parkNanos(LockSupport.java:215)
        at java.util.concurrent.SynchronousQueue$TransferStack.awaitFulfill(SynchronousQueue.java:460)
        at java.util.concurrent.SynchronousQueue$TransferStack.transfer(SynchronousQueue.java:362)
        at java.util.concurrent.SynchronousQueue.poll(SynchronousQueue.java:941)
        at java.util.concurrent.ThreadPoolExecutor.getTask(ThreadPoolExecutor.java:1073)
        at java.util.concurrent.ThreadPoolExecutor.runWorker(ThreadPoolExecutor.java:1134)
        at java.util.concurrent.ThreadPoolExecutor$Worker.run(ThreadPoolExecutor.java:624)
        at java.lang.Thread.run(Thread.java:748)
   6) Thread[id=64380, name=zkCallback-1444-thread-1, state=TIMED_WAITING, group=TGRP-ChaosMonkeySafeLeaderWithPullReplicasTest]
        at sun.misc.Unsafe.park(Native Method)
        at java.util.concurrent.locks.LockSupport.parkNanos(LockSupport.java:215)
        at java.util.concurrent.SynchronousQueue$TransferStack.awaitFulfill(SynchronousQueue.java:460)
        at java.util.concurrent.SynchronousQueue$TransferStack.transfer(SynchronousQueue.java:362)
        at java.util.concurrent.SynchronousQueue.poll(SynchronousQueue.java:941)
        at java.util.concurrent.ThreadPoolExecutor.getTask(ThreadPoolExecutor.java:1073)
        at java.util.concurrent.ThreadPoolExecutor.runWorker(ThreadPoolExecutor.java:1134)
        at java.util.concurrent.ThreadPoolExecutor$Worker.run(ThreadPoolExecutor.java:624)
        at java.lang.Thread.run(Thread.java:748)
   7) Thread[id=64111, name=StoppableIndexingThread, state=RUNNABLE, group=TGRP-ChaosMonkeySafeLeaderWithPullReplicasTest]
        at org.apache.solr.common.util.JavaBinCodec.writeStr(JavaBinCodec.java:841)
        at org.apache.solr.common.util.JavaBinCodec.writePrimitive(JavaBinCodec.java:932)
        at org.apache.solr.common.util.JavaBinCodec.writeKnownType(JavaBinCodec.java:328)
        at org.apache.solr.common.util.JavaBinCodec.writeVal(JavaBinCodec.java:228)
        at org.apache.solr.common.util.JavaBinCodec.writeSolrInputDocument(JavaBinCodec.java:616)
        at org.apache.solr.common.util.JavaBinCodec.writeKnownType(JavaBinCodec.java:355)
        at org.apache.solr.common.util.JavaBinCodec.writeVal(JavaBinCodec.java:228)
        at org.apache.solr.common.util.JavaBinCodec.writeMapEntry(JavaBinCodec.java:764)
        at org.apache.solr.common.util.JavaBinCodec.writeKnownType(JavaBinCodec.java:383)
        at org.apache.solr.common.util.JavaBinCodec.writeVal(JavaBinCodec.java:228)
        at org.apache.solr.common.util.JavaBinCodec.writeIterator(JavaBinCodec.java:705)
        at org.apache.solr.common.util.JavaBinCodec.writeKnownType(JavaBinCodec.java:367)
        at org.apache.solr.common.util.JavaBinCodec.writeVal(JavaBinCodec.java:228)
        at org.apache.solr.common.util.JavaBinCodec.writeNamedList(JavaBinCodec.java:223)
        at org.apache.solr.common.util.JavaBinCodec.writeKnownType(JavaBinCodec.java:330)
        at org.apache.solr.common.util.JavaBinCodec.writeVal(JavaBinCodec.java:228)
        at org.apache.solr.common.util.JavaBinCodec.marshal(JavaBinCodec.java:155)
        at org.apache.solr.client.solrj.request.JavaBinUpdateRequestCodec.marshal(JavaBinUpdateRequestCodec.java:91)
        at org.apache.solr.client.solrj.impl.BinaryRequestWriter.getContentStream(BinaryRequestWriter.java:67)
        at org.apache.solr.client.solrj.request.RequestWriter$LazyContentStream.getDelegate(RequestWriter.java:94)
        at org.apache.solr.client.solrj.request.RequestWriter$LazyContentStream.getName(RequestWriter.java:104)
        at org.apache.solr.client.solrj.impl.HttpSolrClient.createMethod(HttpSolrClient.java:382)
        at org.apache.solr.client.solrj.impl.HttpSolrClient.request(HttpSolrClient.java:251)
        at org.apache.solr.client.solrj.impl.HttpSolrClient.request(HttpSolrClient.java:242)
        at org.apache.solr.client.solrj.SolrRequest.process(SolrRequest.java:178)
        at org.apache.solr.client.solrj.SolrRequest.process(SolrRequest.java:195)
        at org.apache.solr.cloud.StoppableIndexingThread.indexDocs(StoppableIndexingThread.java:176)
        at org.apache.solr.cloud.StoppableIndexingThread.run(StoppableIndexingThread.java:115)
	at __randomizedtesting.SeedInfo.seed([862E2454FBA12B3F]:0)


FAILED:  org.apache.solr.cloud.HttpPartitionTest.test

Error Message:
org.apache.solr.client.solrj.SolrServerException: Timeout occured while waiting response from server at: http://127.0.0.1:60657/c8n_1x2_shard1_replica_n2

Stack Trace:
org.apache.solr.client.solrj.SolrServerException: org.apache.solr.client.solrj.SolrServerException: Timeout occured while waiting response from server at: http://127.0.0.1:60657/c8n_1x2_shard1_replica_n2
	at __randomizedtesting.SeedInfo.seed([862E2454FBA12B3F:E7A1B8E555D46C7]:0)
	at org.apache.solr.client.solrj.impl.CloudSolrClient.directUpdate(CloudSolrClient.java:555)
	at org.apache.solr.client.solrj.impl.CloudSolrClient.sendRequest(CloudSolrClient.java:993)
	at org.apache.solr.client.solrj.impl.CloudSolrClient.requestWithRetryOnStaleState(CloudSolrClient.java:862)
	at org.apache.solr.client.solrj.impl.CloudSolrClient.request(CloudSolrClient.java:793)
	at org.apache.solr.client.solrj.SolrClient.request(SolrClient.java:1219)
	at org.apache.solr.cloud.HttpPartitionTest.sendDoc(HttpPartitionTest.java:592)
	at org.apache.solr.cloud.HttpPartitionTest.sendDoc(HttpPartitionTest.java:578)
	at org.apache.solr.cloud.HttpPartitionTest.testRf2(HttpPartitionTest.java:360)
	at org.apache.solr.cloud.HttpPartitionTest.test(HttpPartitionTest.java:132)
	at sun.reflect.NativeMethodAccessorImpl.invoke0(Native Method)
	at sun.reflect.NativeMethodAccessorImpl.invoke(NativeMethodAccessorImpl.java:62)
	at sun.reflect.DelegatingMethodAccessorImpl.invoke(DelegatingMethodAccessorImpl.java:43)
	at java.lang.reflect.Method.invoke(Method.java:498)
	at com.carrotsearch.randomizedtesting.RandomizedRunner.invoke(RandomizedRunner.java:1713)
	at com.carrotsearch.randomizedtesting.RandomizedRunner$8.evaluate(RandomizedRunner.java:907)
	at com.carrotsearch.randomizedtesting.RandomizedRunner$9.evaluate(RandomizedRunner.java:943)
	at com.carrotsearch.randomizedtesting.RandomizedRunner$10.evaluate(RandomizedRunner.java:957)
	at org.apache.solr.BaseDistributedSearchTestCase$ShardsRepeatRule$ShardsFixedStatement.callStatement(BaseDistributedSearchTestCase.java:993)
	at org.apache.solr.BaseDistributedSearchTestCase$ShardsRepeatRule$ShardsStatement.evaluate(BaseDistributedSearchTestCase.java:968)
	at com.carrotsearch.randomizedtesting.rules.SystemPropertiesRestoreRule$1.evaluate(SystemPropertiesRestoreRule.java:57)
	at org.apache.lucene.util.TestRuleSetupTeardownChained$1.evaluate(TestRuleSetupTeardownChained.java:49)
	at org.apache.lucene.util.AbstractBeforeAfterRule$1.evaluate(AbstractBeforeAfterRule.java:45)
	at org.apache.lucene.util.TestRuleThreadAndTestName$1.evaluate(TestRuleThreadAndTestName.java:48)
	at org.apache.lucene.util.TestRuleIgnoreAfterMaxFailures$1.evaluate(TestRuleIgnoreAfterMaxFailures.java:64)
	at org.apache.lucene.util.TestRuleMarkFailure$1.evaluate(TestRuleMarkFailure.java:47)
	at com.carrotsearch.randomizedtesting.rules.StatementAdapter.evaluate(StatementAdapter.java:36)
	at com.carrotsearch.randomizedtesting.ThreadLeakControl$StatementRunner.run(ThreadLeakControl.java:368)
	at com.carrotsearch.randomizedtesting.ThreadLeakControl.forkTimeoutingTask(ThreadLeakControl.java:817)
	at com.carrotsearch.randomizedtesting.ThreadLeakControl$3.evaluate(ThreadLeakControl.java:468)
	at com.carrotsearch.randomizedtesting.RandomizedRunner.runSingleTest(RandomizedRunner.java:916)
	at com.carrotsearch.randomizedtesting.RandomizedRunner$5.evaluate(RandomizedRunner.java:802)
	at com.carrotsearch.randomizedtesting.RandomizedRunner$6.evaluate(RandomizedRunner.java:852)
	at com.carrotsearch.randomizedtesting.RandomizedRunner$7.evaluate(RandomizedRunner.java:863)
	at com.carrotsearch.randomizedtesting.rules.StatementAdapter.evaluate(StatementAdapter.java:36)
	at com.carrotsearch.randomizedtesting.rules.SystemPropertiesRestoreRule$1.evaluate(SystemPropertiesRestoreRule.java:57)
	at org.apache.lucene.util.AbstractBeforeAfterRule$1.evaluate(AbstractBeforeAfterRule.java:45)
	at com.carrotsearch.randomizedtesting.rules.StatementAdapter.evaluate(StatementAdapter.java:36)
	at org.apache.lucene.util.TestRuleStoreClassName$1.evaluate(TestRuleStoreClassName.java:41)
	at com.carrotsearch.randomizedtesting.rules.NoShadowingOrOverridesOnMethodsRule$1.evaluate(NoShadowingOrOverridesOnMethodsRule.java:40)
	at com.carrotsearch.randomizedtesting.rules.NoShadowingOrOverridesOnMethodsRule$1.evaluate(NoShadowingOrOverridesOnMethodsRule.java:40)
	at com.carrotsearch.randomizedtesting.rules.StatementAdapter.evaluate(StatementAdapter.java:36)
	at com.carrotsearch.randomizedtesting.rules.StatementAdapter.evaluate(StatementAdapter.java:36)
	at com.carrotsearch.randomizedtesting.rules.StatementAdapter.evaluate(StatementAdapter.java:36)
	at org.apache.lucene.util.TestRuleAssertionsRequired$1.evaluate(TestRuleAssertionsRequired.java:53)
	at org.apache.lucene.util.TestRuleMarkFailure$1.evaluate(TestRuleMarkFailure.java:47)
	at org.apache.lucene.util.TestRuleIgnoreAfterMaxFailures$1.evaluate(TestRuleIgnoreAfterMaxFailures.java:64)
	at org.apache.lucene.util.TestRuleIgnoreTestSuites$1.evaluate(TestRuleIgnoreTestSuites.java:54)
	at com.carrotsearch.randomizedtesting.rules.StatementAdapter.evaluate(StatementAdapter.java:36)
	at com.carrotsearch.randomizedtesting.ThreadLeakControl$StatementRunner.run(ThreadLeakControl.java:368)
	at java.lang.Thread.run(Thread.java:748)
Caused by: org.apache.solr.client.solrj.SolrServerException: Timeout occured while waiting response from server at: http://127.0.0.1:60657/c8n_1x2_shard1_replica_n2
	at org.apache.solr.client.solrj.impl.HttpSolrClient.executeMethod(HttpSolrClient.java:638)
	at org.apache.solr.client.solrj.impl.HttpSolrClient.request(HttpSolrClient.java:253)
	at org.apache.solr.client.solrj.impl.HttpSolrClient.request(HttpSolrClient.java:242)
	at org.apache.solr.client.solrj.impl.LBHttpSolrClient.doRequest(LBHttpSolrClient.java:483)
	at org.apache.solr.client.solrj.impl.LBHttpSolrClient.request(LBHttpSolrClient.java:413)
	at org.apache.solr.client.solrj.impl.CloudSolrClient.directUpdate(CloudSolrClient.java:549)
	... 49 more
Caused by: java.net.SocketTimeoutException: Read timed out
	at java.net.SocketInputStream.socketRead0(Native Method)
	at java.net.SocketInputStream.socketRead(SocketInputStream.java:116)
	at java.net.SocketInputStream.read(SocketInputStream.java:171)
	at java.net.SocketInputStream.read(SocketInputStream.java:141)
	at org.apache.http.impl.io.SessionInputBufferImpl.streamRead(SessionInputBufferImpl.java:139)
	at org.apache.http.impl.io.SessionInputBufferImpl.fillBuffer(SessionInputBufferImpl.java:155)
	at org.apache.http.impl.io.SessionInputBufferImpl.readLine(SessionInputBufferImpl.java:284)
	at org.apache.http.impl.conn.DefaultHttpResponseParser.parseHead(DefaultHttpResponseParser.java:140)
	at org.apache.http.impl.conn.DefaultHttpResponseParser.parseHead(DefaultHttpResponseParser.java:57)
	at org.apache.http.impl.io.AbstractMessageParser.parse(AbstractMessageParser.java:261)
	at org.apache.http.impl.DefaultBHttpClientConnection.receiveResponseHeader(DefaultBHttpClientConnection.java:165)
	at org.apache.http.impl.conn.CPoolProxy.receiveResponseHeader(CPoolProxy.java:167)
	at org.apache.http.protocol.HttpRequestExecutor.doReceiveResponse(HttpRequestExecutor.java:272)
	at org.apache.http.protocol.HttpRequestExecutor.execute(HttpRequestExecutor.java:124)
	at org.apache.http.impl.execchain.MainClientExec.execute(MainClientExec.java:271)
	at org.apache.http.impl.execchain.ProtocolExec.execute(ProtocolExec.java:184)
	at org.apache.http.impl.execchain.RetryExec.execute(RetryExec.java:88)
	at org.apache.http.impl.execchain.RedirectExec.execute(RedirectExec.java:110)
	at org.apache.http.impl.client.InternalHttpClient.doExecute(InternalHttpClient.java:184)
	at org.apache.http.impl.client.CloseableHttpClient.execute(CloseableHttpClient.java:82)
	at org.apache.http.impl.client.CloseableHttpClient.execute(CloseableHttpClient.java:55)
	at org.apache.solr.client.solrj.impl.HttpSolrClient.executeMethod(HttpSolrClient.java:526)
	... 54 more


FAILED:  junit.framework.TestSuite.org.apache.solr.cloud.hdfs.HdfsBasicDistributedZkTest

Error Message:
3 threads leaked from SUITE scope at org.apache.solr.cloud.hdfs.HdfsBasicDistributedZkTest:     1) Thread[id=28856, name=Connection evictor, state=TIMED_WAITING, group=TGRP-HdfsBasicDistributedZkTest]         at java.lang.Thread.sleep(Native Method)         at org.apache.http.impl.client.IdleConnectionEvictor$1.run(IdleConnectionEvictor.java:66)         at java.lang.Thread.run(Thread.java:748)    2) Thread[id=28875, name=Connection evictor, state=TIMED_WAITING, group=TGRP-HdfsBasicDistributedZkTest]         at java.lang.Thread.sleep(Native Method)         at org.apache.http.impl.client.IdleConnectionEvictor$1.run(IdleConnectionEvictor.java:66)         at java.lang.Thread.run(Thread.java:748)    3) Thread[id=28864, name=Connection evictor, state=TIMED_WAITING, group=TGRP-HdfsBasicDistributedZkTest]         at java.lang.Thread.sleep(Native Method)         at org.apache.http.impl.client.IdleConnectionEvictor$1.run(IdleConnectionEvictor.java:66)         at java.lang.Thread.run(Thread.java:748)

Stack Trace:
com.carrotsearch.randomizedtesting.ThreadLeakError: 3 threads leaked from SUITE scope at org.apache.solr.cloud.hdfs.HdfsBasicDistributedZkTest: 
   1) Thread[id=28856, name=Connection evictor, state=TIMED_WAITING, group=TGRP-HdfsBasicDistributedZkTest]
        at java.lang.Thread.sleep(Native Method)
        at org.apache.http.impl.client.IdleConnectionEvictor$1.run(IdleConnectionEvictor.java:66)
        at java.lang.Thread.run(Thread.java:748)
   2) Thread[id=28875, name=Connection evictor, state=TIMED_WAITING, group=TGRP-HdfsBasicDistributedZkTest]
        at java.lang.Thread.sleep(Native Method)
        at org.apache.http.impl.client.IdleConnectionEvictor$1.run(IdleConnectionEvictor.java:66)
        at java.lang.Thread.run(Thread.java:748)
   3) Thread[id=28864, name=Connection evictor, state=TIMED_WAITING, group=TGRP-HdfsBasicDistributedZkTest]
        at java.lang.Thread.sleep(Native Method)
        at org.apache.http.impl.client.IdleConnectionEvictor$1.run(IdleConnectionEvictor.java:66)
        at java.lang.Thread.run(Thread.java:748)
	at __randomizedtesting.SeedInfo.seed([862E2454FBA12B3F]:0)


FAILED:  org.apache.solr.cloud.hdfs.HdfsChaosMonkeySafeLeaderTest.test

Error Message:
The Monkey ran for over 45 seconds and no jetties were stopped - this is worth investigating!

Stack Trace:
java.lang.AssertionError: The Monkey ran for over 45 seconds and no jetties were stopped - this is worth investigating!
	at __randomizedtesting.SeedInfo.seed([862E2454FBA12B3F:E7A1B8E555D46C7]:0)
	at org.junit.Assert.fail(Assert.java:93)
	at org.apache.solr.cloud.ChaosMonkey.stopTheMonkey(ChaosMonkey.java:587)
	at org.apache.solr.cloud.ChaosMonkeySafeLeaderTest.test(ChaosMonkeySafeLeaderTest.java:133)
	at sun.reflect.NativeMethodAccessorImpl.invoke0(Native Method)
	at sun.reflect.NativeMethodAccessorImpl.invoke(NativeMethodAccessorImpl.java:62)
	at sun.reflect.DelegatingMethodAccessorImpl.invoke(DelegatingMethodAccessorImpl.java:43)
	at java.lang.reflect.Method.invoke(Method.java:498)
	at com.carrotsearch.randomizedtesting.RandomizedRunner.invoke(RandomizedRunner.java:1713)
	at com.carrotsearch.randomizedtesting.RandomizedRunner$8.evaluate(RandomizedRunner.java:907)
	at com.carrotsearch.randomizedtesting.RandomizedRunner$9.evaluate(RandomizedRunner.java:943)
	at com.carrotsearch.randomizedtesting.RandomizedRunner$10.evaluate(RandomizedRunner.java:957)
	at org.apache.solr.BaseDistributedSearchTestCase$ShardsRepeatRule$ShardsFixedStatement.callStatement(BaseDistributedSearchTestCase.java:993)
	at org.apache.solr.BaseDistributedSearchTestCase$ShardsRepeatRule$ShardsStatement.evaluate(BaseDistributedSearchTestCase.java:968)
	at com.carrotsearch.randomizedtesting.rules.SystemPropertiesRestoreRule$1.evaluate(SystemPropertiesRestoreRule.java:57)
	at org.apache.lucene.util.TestRuleSetupTeardownChained$1.evaluate(TestRuleSetupTeardownChained.java:49)
	at org.apache.lucene.util.AbstractBeforeAfterRule$1.evaluate(AbstractBeforeAfterRule.java:45)
	at org.apache.lucene.util.TestRuleThreadAndTestName$1.evaluate(TestRuleThreadAndTestName.java:48)
	at org.apache.lucene.util.TestRuleIgnoreAfterMaxFailures$1.evaluate(TestRuleIgnoreAfterMaxFailures.java:64)
	at org.apache.lucene.util.TestRuleMarkFailure$1.evaluate(TestRuleMarkFailure.java:47)
	at com.carrotsearch.randomizedtesting.rules.StatementAdapter.evaluate(StatementAdapter.java:36)
	at com.carrotsearch.randomizedtesting.ThreadLeakControl$StatementRunner.run(ThreadLeakControl.java:368)
	at com.carrotsearch.randomizedtesting.ThreadLeakControl.forkTimeoutingTask(ThreadLeakControl.java:817)
	at com.carrotsearch.randomizedtesting.ThreadLeakControl$3.evaluate(ThreadLeakControl.java:468)
	at com.carrotsearch.randomizedtesting.RandomizedRunner.runSingleTest(RandomizedRunner.java:916)
	at com.carrotsearch.randomizedtesting.RandomizedRunner$5.evaluate(RandomizedRunner.java:802)
	at com.carrotsearch.randomizedtesting.RandomizedRunner$6.evaluate(RandomizedRunner.java:852)
	at com.carrotsearch.randomizedtesting.RandomizedRunner$7.evaluate(RandomizedRunner.java:863)
	at com.carrotsearch.randomizedtesting.rules.StatementAdapter.evaluate(StatementAdapter.java:36)
	at com.carrotsearch.randomizedtesting.rules.SystemPropertiesRestoreRule$1.evaluate(SystemPropertiesRestoreRule.java:57)
	at org.apache.lucene.util.AbstractBeforeAfterRule$1.evaluate(AbstractBeforeAfterRule.java:45)
	at com.carrotsearch.randomizedtesting.rules.StatementAdapter.evaluate(StatementAdapter.java:36)
	at org.apache.lucene.util.TestRuleStoreClassName$1.evaluate(TestRuleStoreClassName.java:41)
	at com.carrotsearch.randomizedtesting.rules.NoShadowingOrOverridesOnMethodsRule$1.evaluate(NoShadowingOrOverridesOnMethodsRule.java:40)
	at com.carrotsearch.randomizedtesting.rules.NoShadowingOrOverridesOnMethodsRule$1.evaluate(NoShadowingOrOverridesOnMethodsRule.java:40)
	at com.carrotsearch.randomizedtesting.rules.StatementAdapter.evaluate(StatementAdapter.java:36)
	at com.carrotsearch.randomizedtesting.rules.StatementAdapter.evaluate(StatementAdapter.java:36)
	at com.carrotsearch.randomizedtesting.rules.StatementAdapter.evaluate(StatementAdapter.java:36)
	at org.apache.lucene.util.TestRuleAssertionsRequired$1.evaluate(TestRuleAssertionsRequired.java:53)
	at org.apache.lucene.util.TestRuleMarkFailure$1.evaluate(TestRuleMarkFailure.java:47)
	at org.apache.lucene.util.TestRuleIgnoreAfterMaxFailures$1.evaluate(TestRuleIgnoreAfterMaxFailures.java:64)
	at org.apache.lucene.util.TestRuleIgnoreTestSuites$1.evaluate(TestRuleIgnoreTestSuites.java:54)
	at com.carrotsearch.randomizedtesting.rules.StatementAdapter.evaluate(StatementAdapter.java:36)
	at com.carrotsearch.randomizedtesting.ThreadLeakControl$StatementRunner.run(ThreadLeakControl.java:368)
	at java.lang.Thread.run(Thread.java:748)


FAILED:  org.apache.solr.cloud.ChaosMonkeySafeLeaderWithPullReplicasTest.test

Error Message:
The Monkey ran for over 45 seconds and no jetties were stopped - this is worth investigating!

Stack Trace:
java.lang.AssertionError: The Monkey ran for over 45 seconds and no jetties were stopped - this is worth investigating!
	at __randomizedtesting.SeedInfo.seed([862E2454FBA12B3F:E7A1B8E555D46C7]:0)
	at org.junit.Assert.fail(Assert.java:93)
	at org.apache.solr.cloud.ChaosMonkey.stopTheMonkey(ChaosMonkey.java:587)
	at org.apache.solr.cloud.ChaosMonkeySafeLeaderWithPullReplicasTest.test(ChaosMonkeySafeLeaderWithPullReplicasTest.java:174)
	at sun.reflect.NativeMethodAccessorImpl.invoke0(Native Method)
	at sun.reflect.NativeMethodAccessorImpl.invoke(NativeMethodAccessorImpl.java:62)
	at sun.reflect.DelegatingMethodAccessorImpl.invoke(DelegatingMethodAccessorImpl.java:43)
	at java.lang.reflect.Method.invoke(Method.java:498)
	at com.carrotsearch.randomizedtesting.RandomizedRunner.invoke(RandomizedRunner.java:1713)
	at com.carrotsearch.randomizedtesting.RandomizedRunner$8.evaluate(RandomizedRunner.java:907)
	at com.carrotsearch.randomizedtesting.RandomizedRunner$9.evaluate(RandomizedRunner.java:943)
	at com.carrotsearch.randomizedtesting.RandomizedRunner$10.evaluate(RandomizedRunner.java:957)
	at org.apache.solr.BaseDistributedSearchTestCase$ShardsRepeatRule$ShardsFixedStatement.callStatement(BaseDistributedSearchTestCase.java:993)
	at org.apache.solr.BaseDistributedSearchTestCase$ShardsRepeatRule$ShardsStatement.evaluate(BaseDistributedSearchTestCase.java:968)
	at com.carrotsearch.randomizedtesting.rules.SystemPropertiesRestoreRule$1.evaluate(SystemPropertiesRestoreRule.java:57)
	at org.apache.lucene.util.TestRuleSetupTeardownChained$1.evaluate(TestRuleSetupTeardownChained.java:49)
	at org.apache.lucene.util.AbstractBeforeAfterRule$1.evaluate(AbstractBeforeAfterRule.java:45)
	at org.apache.lucene.util.TestRuleThreadAndTestName$1.evaluate(TestRuleThreadAndTestName.java:48)
	at org.apache.lucene.util.TestRuleIgnoreAfterMaxFailures$1.evaluate(TestRuleIgnoreAfterMaxFailures.java:64)
	at org.apache.lucene.util.TestRuleMarkFailure$1.evaluate(TestRuleMarkFailure.java:47)
	at com.carrotsearch.randomizedtesting.rules.StatementAdapter.evaluate(StatementAdapter.java:36)
	at com.carrotsearch.randomizedtesting.ThreadLeakControl$StatementRunner.run(ThreadLeakControl.java:368)
	at com.carrotsearch.randomizedtesting.ThreadLeakControl.forkTimeoutingTask(ThreadLeakControl.java:817)
	at com.carrotsearch.randomizedtesting.ThreadLeakControl$3.evaluate(ThreadLeakControl.java:468)
	at com.carrotsearch.randomizedtesting.RandomizedRunner.runSingleTest(RandomizedRunner.java:916)
	at com.carrotsearch.randomizedtesting.RandomizedRunner$5.evaluate(RandomizedRunner.java:802)
	at com.carrotsearch.randomizedtesting.RandomizedRunner$6.evaluate(RandomizedRunner.java:852)
	at com.carrotsearch.randomizedtesting.RandomizedRunner$7.evaluate(RandomizedRunner.java:863)
	at com.carrotsearch.randomizedtesting.rules.StatementAdapter.evaluate(StatementAdapter.java:36)
	at com.carrotsearch.randomizedtesting.rules.SystemPropertiesRestoreRule$1.evaluate(SystemPropertiesRestoreRule.java:57)
	at org.apache.lucene.util.AbstractBeforeAfterRule$1.evaluate(AbstractBeforeAfterRule.java:45)
	at com.carrotsearch.randomizedtesting.rules.StatementAdapter.evaluate(StatementAdapter.java:36)
	at org.apache.lucene.util.TestRuleStoreClassName$1.evaluate(TestRuleStoreClassName.java:41)
	at com.carrotsearch.randomizedtesting.rules.NoShadowingOrOverridesOnMethodsRule$1.evaluate(NoShadowingOrOverridesOnMethodsRule.java:40)
	at com.carrotsearch.randomizedtesting.rules.NoShadowingOrOverridesOnMethodsRule$1.evaluate(NoShadowingOrOverridesOnMethodsRule.java:40)
	at com.carrotsearch.randomizedtesting.rules.StatementAdapter.evaluate(StatementAdapter.java:36)
	at com.carrotsearch.randomizedtesting.rules.StatementAdapter.evaluate(StatementAdapter.java:36)
	at com.carrotsearch.randomizedtesting.rules.StatementAdapter.evaluate(StatementAdapter.java:36)
	at org.apache.lucene.util.TestRuleAssertionsRequired$1.evaluate(TestRuleAssertionsRequired.java:53)
	at org.apache.lucene.util.TestRuleMarkFailure$1.evaluate(TestRuleMarkFailure.java:47)
	at org.apache.lucene.util.TestRuleIgnoreAfterMaxFailures$1.evaluate(TestRuleIgnoreAfterMaxFailures.java:64)
	at org.apache.lucene.util.TestRuleIgnoreTestSuites$1.evaluate(TestRuleIgnoreTestSuites.java:54)
	at com.carrotsearch.randomizedtesting.rules.StatementAdapter.evaluate(StatementAdapter.java:36)
	at com.carrotsearch.randomizedtesting.ThreadLeakControl$StatementRunner.run(ThreadLeakControl.java:368)
	at java.lang.Thread.run(Thread.java:748)


FAILED:  org.apache.solr.cloud.hdfs.HdfsBasicDistributedZkTest.test

Error Message:
Error from server at http://127.0.0.1:57360/erz: ADDREPLICA failed to create replica

Stack Trace:
org.apache.solr.client.solrj.impl.HttpSolrClient$RemoteSolrException: Error from server at http://127.0.0.1:57360/erz: ADDREPLICA failed to create replica
	at __randomizedtesting.SeedInfo.seed([862E2454FBA12B3F:E7A1B8E555D46C7]:0)
	at org.apache.solr.client.solrj.impl.HttpSolrClient.executeMethod(HttpSolrClient.java:627)
	at org.apache.solr.client.solrj.impl.HttpSolrClient.request(HttpSolrClient.java:253)
	at org.apache.solr.client.solrj.impl.HttpSolrClient.request(HttpSolrClient.java:242)
	at org.apache.solr.client.solrj.impl.LBHttpSolrClient.doRequest(LBHttpSolrClient.java:483)
	at org.apache.solr.client.solrj.impl.LBHttpSolrClient.request(LBHttpSolrClient.java:413)
	at org.apache.solr.client.solrj.impl.CloudSolrClient.sendRequest(CloudSolrClient.java:1121)
	at org.apache.solr.client.solrj.impl.CloudSolrClient.requestWithRetryOnStaleState(CloudSolrClient.java:862)
	at org.apache.solr.client.solrj.impl.CloudSolrClient.request(CloudSolrClient.java:793)
	at org.apache.solr.client.solrj.SolrRequest.process(SolrRequest.java:178)
	at org.apache.solr.client.solrj.SolrRequest.process(SolrRequest.java:195)
	at org.apache.solr.cloud.BasicDistributedZkTest.testANewCollectionInOneInstanceWithManualShardAssignement(BasicDistributedZkTest.java:801)
	at org.apache.solr.cloud.BasicDistributedZkTest.test(BasicDistributedZkTest.java:374)
	at sun.reflect.NativeMethodAccessorImpl.invoke0(Native Method)
	at sun.reflect.NativeMethodAccessorImpl.invoke(NativeMethodAccessorImpl.java:62)
	at sun.reflect.DelegatingMethodAccessorImpl.invoke(DelegatingMethodAccessorImpl.java:43)
	at java.lang.reflect.Method.invoke(Method.java:498)
	at com.carrotsearch.randomizedtesting.RandomizedRunner.invoke(RandomizedRunner.java:1713)
	at com.carrotsearch.randomizedtesting.RandomizedRunner$8.evaluate(RandomizedRunner.java:907)
	at com.carrotsearch.randomizedtesting.RandomizedRunner$9.evaluate(RandomizedRunner.java:943)
	at com.carrotsearch.randomizedtesting.RandomizedRunner$10.evaluate(RandomizedRunner.java:957)
	at org.apache.solr.BaseDistributedSearchTestCase$ShardsRepeatRule$ShardsFixedStatement.callStatement(BaseDistributedSearchTestCase.java:993)
	at org.apache.solr.BaseDistributedSearchTestCase$ShardsRepeatRule$ShardsStatement.evaluate(BaseDistributedSearchTestCase.java:968)
	at com.carrotsearch.randomizedtesting.rules.SystemPropertiesRestoreRule$1.evaluate(SystemPropertiesRestoreRule.java:57)
	at org.apache.lucene.util.TestRuleSetupTeardownChained$1.evaluate(TestRuleSetupTeardownChained.java:49)
	at org.apache.lucene.util.AbstractBeforeAfterRule$1.evaluate(AbstractBeforeAfterRule.java:45)
	at org.apache.lucene.util.TestRuleThreadAndTestName$1.evaluate(TestRuleThreadAndTestName.java:48)
	at org.apache.lucene.util.TestRuleIgnoreAfterMaxFailures$1.evaluate(TestRuleIgnoreAfterMaxFailures.java:64)
	at org.apache.lucene.util.TestRuleMarkFailure$1.evaluate(TestRuleMarkFailure.java:47)
	at com.carrotsearch.randomizedtesting.rules.StatementAdapter.evaluate(StatementAdapter.java:36)
	at com.carrotsearch.randomizedtesting.ThreadLeakControl$StatementRunner.run(ThreadLeakControl.java:368)
	at com.carrotsearch.randomizedtesting.ThreadLeakControl.forkTimeoutingTask(ThreadLeakControl.java:817)
	at com.carrotsearch.randomizedtesting.ThreadLeakControl$3.evaluate(ThreadLeakControl.java:468)
	at com.carrotsearch.randomizedtesting.RandomizedRunner.runSingleTest(RandomizedRunner.java:916)
	at com.carrotsearch.randomizedtesting.RandomizedRunner$5.evaluate(RandomizedRunner.java:802)
	at com.carrotsearch.randomizedtesting.RandomizedRunner$6.evaluate(RandomizedRunner.java:852)
	at com.carrotsearch.randomizedtesting.RandomizedRunner$7.evaluate(RandomizedRunner.java:863)
	at com.carrotsearch.randomizedtesting.rules.StatementAdapter.evaluate(StatementAdapter.java:36)
	at com.carrotsearch.randomizedtesting.rules.SystemPropertiesRestoreRule$1.evaluate(SystemPropertiesRestoreRule.java:57)
	at org.apache.lucene.util.AbstractBeforeAfterRule$1.evaluate(AbstractBeforeAfterRule.java:45)
	at com.carrotsearch.randomizedtesting.rules.StatementAdapter.evaluate(StatementAdapter.java:36)
	at org.apache.lucene.util.TestRuleStoreClassName$1.evaluate(TestRuleStoreClassName.java:41)
	at com.carrotsearch.randomizedtesting.rules.NoShadowingOrOverridesOnMethodsRule$1.evaluate(NoShadowingOrOverridesOnMethodsRule.java:40)
	at com.carrotsearch.randomizedtesting.rules.NoShadowingOrOverridesOnMethodsRule$1.evaluate(NoShadowingOrOverridesOnMethodsRule.java:40)
	at com.carrotsearch.randomizedtesting.rules.StatementAdapter.evaluate(StatementAdapter.java:36)
	at com.carrotsearch.randomizedtesting.rules.StatementAdapter.evaluate(StatementAdapter.java:36)
	at com.carrotsearch.randomizedtesting.rules.StatementAdapter.evaluate(StatementAdapter.java:36)
	at org.apache.lucene.util.TestRuleAssertionsRequired$1.evaluate(TestRuleAssertionsRequired.java:53)
	at org.apache.lucene.util.TestRuleMarkFailure$1.evaluate(TestRuleMarkFailure.java:47)
	at org.apache.lucene.util.TestRuleIgnoreAfterMaxFailures$1.evaluate(TestRuleIgnoreAfterMaxFailures.java:64)
	at org.apache.lucene.util.TestRuleIgnoreTestSuites$1.evaluate(TestRuleIgnoreTestSuites.java:54)
	at com.carrotsearch.randomizedtesting.rules.StatementAdapter.evaluate(StatementAdapter.java:36)
	at com.carrotsearch.randomizedtesting.ThreadLeakControl$StatementRunner.run(ThreadLeakControl.java:368)
	at java.lang.Thread.run(Thread.java:748)


FAILED:  org.apache.solr.cloud.SharedFSAutoReplicaFailoverTest.test

Error Message:
Timeout waiting for all live and active

Stack Trace:
java.lang.AssertionError: Timeout waiting for all live and active
	at __randomizedtesting.SeedInfo.seed([862E2454FBA12B3F:E7A1B8E555D46C7]:0)
	at org.junit.Assert.fail(Assert.java:93)
	at org.junit.Assert.assertTrue(Assert.java:43)
	at org.apache.solr.cloud.SharedFSAutoReplicaFailoverTest.testBasics(SharedFSAutoReplicaFailoverTest.java:246)
	at org.apache.solr.cloud.SharedFSAutoReplicaFailoverTest.test(SharedFSAutoReplicaFailoverTest.java:136)
	at sun.reflect.NativeMethodAccessorImpl.invoke0(Native Method)
	at sun.reflect.NativeMethodAccessorImpl.invoke(NativeMethodAccessorImpl.java:62)
	at sun.reflect.DelegatingMethodAccessorImpl.invoke(DelegatingMethodAccessorImpl.java:43)
	at java.lang.reflect.Method.invoke(Method.java:498)
	at com.carrotsearch.randomizedtesting.RandomizedRunner.invoke(RandomizedRunner.java:1713)
	at com.carrotsearch.randomizedtesting.RandomizedRunner$8.evaluate(RandomizedRunner.java:907)
	at com.carrotsearch.randomizedtesting.RandomizedRunner$9.evaluate(RandomizedRunner.java:943)
	at com.carrotsearch.randomizedtesting.RandomizedRunner$10.evaluate(RandomizedRunner.java:957)
	at org.apache.solr.BaseDistributedSearchTestCase$ShardsRepeatRule$ShardsFixedStatement.callStatement(BaseDistributedSearchTestCase.java:993)
	at org.apache.solr.BaseDistributedSearchTestCase$ShardsRepeatRule$ShardsStatement.evaluate(BaseDistributedSearchTestCase.java:968)
	at com.carrotsearch.randomizedtesting.rules.SystemPropertiesRestoreRule$1.evaluate(SystemPropertiesRestoreRule.java:57)
	at org.apache.lucene.util.TestRuleSetupTeardownChained$1.evaluate(TestRuleSetupTeardownChained.java:49)
	at org.apache.lucene.util.AbstractBeforeAfterRule$1.evaluate(AbstractBeforeAfterRule.java:45)
	at org.apache.lucene.util.TestRuleThreadAndTestName$1.evaluate(TestRuleThreadAndTestName.java:48)
	at org.apache.lucene.util.TestRuleIgnoreAfterMaxFailures$1.evaluate(TestRuleIgnoreAfterMaxFailures.java:64)
	at org.apache.lucene.util.TestRuleMarkFailure$1.evaluate(TestRuleMarkFailure.java:47)
	at com.carrotsearch.randomizedtesting.rules.StatementAdapter.evaluate(StatementAdapter.java:36)
	at com.carrotsearch.randomizedtesting.ThreadLeakControl$StatementRunner.run(ThreadLeakControl.java:368)
	at com.carrotsearch.randomizedtesting.ThreadLeakControl.forkTimeoutingTask(ThreadLeakControl.java:817)
	at com.carrotsearch.randomizedtesting.ThreadLeakControl$3.evaluate(ThreadLeakControl.java:468)
	at com.carrotsearch.randomizedtesting.RandomizedRunner.runSingleTest(RandomizedRunner.java:916)
	at com.carrotsearch.randomizedtesting.RandomizedRunner$5.evaluate(RandomizedRunner.java:802)
	at com.carrotsearch.randomizedtesting.RandomizedRunner$6.evaluate(RandomizedRunner.java:852)
	at com.carrotsearch.randomizedtesting.RandomizedRunner$7.evaluate(RandomizedRunner.java:863)
	at com.carrotsearch.randomizedtesting.rules.StatementAdapter.evaluate(StatementAdapter.java:36)
	at com.carrotsearch.randomizedtesting.rules.SystemPropertiesRestoreRule$1.evaluate(SystemPropertiesRestoreRule.java:57)
	at org.apache.lucene.util.AbstractBeforeAfterRule$1.evaluate(AbstractBeforeAfterRule.java:45)
	at com.carrotsearch.randomizedtesting.rules.StatementAdapter.evaluate(StatementAdapter.java:36)
	at org.apache.lucene.util.TestRuleStoreClassName$1.evaluate(TestRuleStoreClassName.java:41)
	at com.carrotsearch.randomizedtesting.rules.NoShadowingOrOverridesOnMethodsRule$1.evaluate(NoShadowingOrOverridesOnMethodsRule.java:40)
	at com.carrotsearch.randomizedtesting.rules.NoShadowingOrOverridesOnMethodsRule$1.evaluate(NoShadowingOrOverridesOnMethodsRule.java:40)
	at com.carrotsearch.randomizedtesting.rules.StatementAdapter.evaluate(StatementAdapter.java:36)
	at com.carrotsearch.randomizedtesting.rules.StatementAdapter.evaluate(StatementAdapter.java:36)
	at com.carrotsearch.randomizedtesting.rules.StatementAdapter.evaluate(StatementAdapter.java:36)
	at org.apache.lucene.util.TestRuleAssertionsRequired$1.evaluate(TestRuleAssertionsRequired.java:53)
	at org.apache.lucene.util.TestRuleMarkFailure$1.evaluate(TestRuleMarkFailure.java:47)
	at org.apache.lucene.util.TestRuleIgnoreAfterMaxFailures$1.evaluate(TestRuleIgnoreAfterMaxFailures.java:64)
	at org.apache.lucene.util.TestRuleIgnoreTestSuites$1.evaluate(TestRuleIgnoreTestSuites.java:54)
	at com.carrotsearch.randomizedtesting.rules.StatementAdapter.evaluate(StatementAdapter.java:36)
	at com.carrotsearch.randomizedtesting.ThreadLeakControl$StatementRunner.run(ThreadLeakControl.java:368)
	at java.lang.Thread.run(Thread.java:748)




Build Log:
[...truncated 11677 lines...]
   [junit4] Suite: org.apache.solr.cloud.hdfs.HdfsChaosMonkeySafeLeaderTest
   [junit4]   2> Creating dataDir: /x1/jenkins/jenkins-slave/workspace/Lucene-Solr-NightlyTests-7.0/checkout/solr/build/solr-core/test/J0/temp/solr.cloud.hdfs.HdfsChaosMonkeySafeLeaderTest_862E2454FBA12B3F-001/init-core-data-001
   [junit4]   2> 278778 WARN  (SUITE-HdfsChaosMonkeySafeLeaderTest-seed#[862E2454FBA12B3F]-worker) [    ] o.a.s.SolrTestCaseJ4 startTrackingSearchers: numOpens=14 numCloses=14
   [junit4]   2> 278779 INFO  (SUITE-HdfsChaosMonkeySafeLeaderTest-seed#[862E2454FBA12B3F]-worker) [    ] o.a.s.SolrTestCaseJ4 Using PointFields (NUMERIC_POINTS_SYSPROP=true) w/NUMERIC_DOCVALUES_SYSPROP=false
   [junit4]   2> 278780 INFO  (SUITE-HdfsChaosMonkeySafeLeaderTest-seed#[862E2454FBA12B3F]-worker) [    ] o.a.s.SolrTestCaseJ4 Randomized ssl (false) and clientAuth (true) via: @org.apache.solr.util.RandomizeSSL(reason=, value=NaN, ssl=NaN, clientAuth=NaN)
   [junit4]   2> 278780 INFO  (SUITE-HdfsChaosMonkeySafeLeaderTest-seed#[862E2454FBA12B3F]-worker) [    ] o.a.s.BaseDistributedSearchTestCase Setting hostContext system property: /
   [junit4]   2> 282945 WARN  (SUITE-HdfsChaosMonkeySafeLeaderTest-seed#[862E2454FBA12B3F]-worker) [    ] o.a.h.u.NativeCodeLoader Unable to load native-hadoop library for your platform... using builtin-java classes where applicable
   [junit4]   1> Formatting using clusterid: testClusterID
   [junit4]   2> 285053 WARN  (SUITE-HdfsChaosMonkeySafeLeaderTest-seed#[862E2454FBA12B3F]-worker) [    ] o.a.h.m.i.MetricsConfig Cannot locate configuration: tried hadoop-metrics2-namenode.properties,hadoop-metrics2.properties
   [junit4]   2> 285477 INFO  (SUITE-HdfsChaosMonkeySafeLeaderTest-seed#[862E2454FBA12B3F]-worker) [    ] o.m.log Logging to org.slf4j.impl.Log4jLoggerAdapter(org.mortbay.log) via org.mortbay.log.Slf4jLog
   [junit4]   2> 285712 WARN  (SUITE-HdfsChaosMonkeySafeLeaderTest-seed#[862E2454FBA12B3F]-worker) [    ] o.a.h.h.HttpRequestLog Jetty request log can only be enabled using Log4j
   [junit4]   2> 286957 INFO  (SUITE-HdfsChaosMonkeySafeLeaderTest-seed#[862E2454FBA12B3F]-worker) [    ] o.m.log jetty-6.1.26
   [junit4]   2> 287145 INFO  (SUITE-HdfsChaosMonkeySafeLeaderTest-seed#[862E2454FBA12B3F]-worker) [    ] o.m.log Extract jar:file:/x1/jenkins/.ivy2/cache/org.apache.hadoop/hadoop-hdfs/tests/hadoop-hdfs-2.7.4-tests.jar!/webapps/hdfs to ./temp/Jetty_localhost_35358_hdfs____.c3yle/webapp
   [junit4]   2> 289128 INFO  (SUITE-HdfsChaosMonkeySafeLeaderTest-seed#[862E2454FBA12B3F]-worker) [    ] o.m.log Started HttpServer2$SelectChannelConnectorWithSafeStartup@localhost:35358
   [junit4]   2> 292911 WARN  (SUITE-HdfsChaosMonkeySafeLeaderTest-seed#[862E2454FBA12B3F]-worker) [    ] o.a.h.h.HttpRequestLog Jetty request log can only be enabled using Log4j
   [junit4]   2> 292918 INFO  (SUITE-HdfsChaosMonkeySafeLeaderTest-seed#[862E2454FBA12B3F]-worker) [    ] o.m.log jetty-6.1.26
   [junit4]   2> 292954 INFO  (SUITE-HdfsChaosMonkeySafeLeaderTest-seed#[862E2454FBA12B3F]-worker) [    ] o.m.log Extract jar:file:/x1/jenkins/.ivy2/cache/org.apache.hadoop/hadoop-hdfs/tests/hadoop-hdfs-2.7.4-tests.jar!/webapps/datanode to ./temp/Jetty_localhost_45006_datanode____cu8jng/webapp
   [junit4]   2> 293961 INFO  (SUITE-HdfsChaosMonkeySafeLeaderTest-seed#[862E2454FBA12B3F]-worker) [    ] o.m.log Started HttpServer2$SelectChannelConnectorWithSafeStartup@localhost:45006
   [junit4]   2> 295783 WARN  (SUITE-HdfsChaosMonkeySafeLeaderTest-seed#[862E2454FBA12B3F]-worker) [    ] o.a.h.h.HttpRequestLog Jetty request log can only be enabled using Log4j
   [junit4]   2> 295785 INFO  (SUITE-HdfsChaosMonkeySafeLeaderTest-seed#[862E2454FBA12B3F]-worker) [    ] o.m.log jetty-6.1.26
   [junit4]   2> 295811 INFO  (SUITE-HdfsChaosMonkeySafeLeaderTest-seed#[862E2454FBA12B3F]-worker) [    ] o.m.log Extract jar:file:/x1/jenkins/.ivy2/cache/org.apache.hadoop/hadoop-hdfs/tests/hadoop-hdfs-2.7.4-tests.jar!/webapps/datanode to ./temp/Jetty_localhost_56836_datanode____.bxv3r3/webapp
   [junit4]   2> 297255 INFO  (SUITE-HdfsChaosMonkeySafeLeaderTest-seed#[862E2454FBA12B3F]-worker) [    ] o.m.log Started HttpServer2$SelectChannelConnectorWithSafeStartup@localhost:56836
   [junit4]   2> 299236 ERROR (DataNode: [[[DISK]file:/x1/jenkins/jenkins-slave/workspace/Lucene-Solr-NightlyTests-7.0/checkout/solr/build/solr-core/test/J0/temp/solr.cloud.hdfs.HdfsChaosMonkeySafeLeaderTest_862E2454FBA12B3F-001/tempDir-001/hdfsBaseDir/data/data1/, [DISK]file:/x1/jenkins/jenkins-slave/workspace/Lucene-Solr-NightlyTests-7.0/checkout/solr/build/solr-core/test/J0/temp/solr.cloud.hdfs.HdfsChaosMonkeySafeLeaderTest_862E2454FBA12B3F-001/tempDir-001/hdfsBaseDir/data/data2/]]  heartbeating to localhost/127.0.0.1:36061) [    ] o.a.h.h.s.d.DirectoryScanner dfs.datanode.directoryscan.throttle.limit.ms.per.sec set to value below 1 ms/sec. Assuming default value of 1000
   [junit4]   2> 299236 ERROR (DataNode: [[[DISK]file:/x1/jenkins/jenkins-slave/workspace/Lucene-Solr-NightlyTests-7.0/checkout/solr/build/solr-core/test/J0/temp/solr.cloud.hdfs.HdfsChaosMonkeySafeLeaderTest_862E2454FBA12B3F-001/tempDir-001/hdfsBaseDir/data/data3/, [DISK]file:/x1/jenkins/jenkins-slave/workspace/Lucene-Solr-NightlyTests-7.0/checkout/solr/build/solr-core/test/J0/temp/solr.cloud.hdfs.HdfsChaosMonkeySafeLeaderTest_862E2454FBA12B3F-001/tempDir-001/hdfsBaseDir/data/data4/]]  heartbeating to localhost/127.0.0.1:36061) [    ] o.a.h.h.s.d.DirectoryScanner dfs.datanode.directoryscan.throttle.limit.ms.per.sec set to value below 1 ms/sec. Assuming default value of 1000
   [junit4]   2> 300725 INFO  (Block report processor) [    ] BlockStateChange BLOCK* processReport 0x129b15205b33e6: from storage DS-a5f036c9-ac3a-4d7a-bae0-cc65888c3be7 node DatanodeRegistration(127.0.0.1:44267, datanodeUuid=43e12899-51e7-4566-a3c4-5207297eaf8e, infoPort=39495, infoSecurePort=0, ipcPort=40214, storageInfo=lv=-56;cid=testClusterID;nsid=1993716019;c=0), blocks: 0, hasStaleStorage: true, processing time: 3 msecs
   [junit4]   2> 300725 INFO  (Block report processor) [    ] BlockStateChange BLOCK* processReport 0x129b151fc32661: from storage DS-0c652af4-3f9c-487c-af90-5716caeb4820 node DatanodeRegistration(127.0.0.1:58151, datanodeUuid=ca506d08-9b48-4be7-8df9-f3bf7aac6ec5, infoPort=52521, infoSecurePort=0, ipcPort=56541, storageInfo=lv=-56;cid=testClusterID;nsid=1993716019;c=0), blocks: 0, hasStaleStorage: true, processing time: 1 msecs
   [junit4]   2> 300725 INFO  (Block report processor) [    ] BlockStateChange BLOCK* processReport 0x129b15205b33e6: from storage DS-cb8d3287-1082-4ec4-8085-3910998ffc77 node DatanodeRegistration(127.0.0.1:44267, datanodeUuid=43e12899-51e7-4566-a3c4-5207297eaf8e, infoPort=39495, infoSecurePort=0, ipcPort=40214, storageInfo=lv=-56;cid=testClusterID;nsid=1993716019;c=0), blocks: 0, hasStaleStorage: false, processing time: 0 msecs
   [junit4]   2> 300727 INFO  (Block report processor) [    ] BlockStateChange BLOCK* processReport 0x129b151fc32661: from storage DS-ad9eb8ee-e2d4-4053-8852-68145deef7e5 node DatanodeRegistration(127.0.0.1:58151, datanodeUuid=ca506d08-9b48-4be7-8df9-f3bf7aac6ec5, infoPort=52521, infoSecurePort=0, ipcPort=56541, storageInfo=lv=-56;cid=testClusterID;nsid=1993716019;c=0), blocks: 0, hasStaleStorage: false, processing time: 0 msecs
   [junit4]   2> 302965 INFO  (TEST-HdfsChaosMonkeySafeLeaderTest.test-seed#[862E2454FBA12B3F]) [    ] o.a.s.c.ZkTestServer STARTING ZK TEST SERVER
   [junit4]   2> 302968 INFO  (Thread-435) [    ] o.a.s.c.ZkTestServer client port:0.0.0.0/0.0.0.0:0
   [junit4]   2> 302968 INFO  (Thread-435) [    ] o.a.s.c.ZkTestServer Starting server
   [junit4]   2> 302992 ERROR (Thread-435) [    ] o.a.z.s.ZooKeeperServer ZKShutdownHandler is not registered, so ZooKeeper server won't take any action on ERROR or SHUTDOWN server state changes
   [junit4]   2> 303068 INFO  (TEST-HdfsChaosMonkeySafeLeaderTest.test-seed#[862E2454FBA12B3F]) [    ] o.a.s.c.ZkTestServer start zk server on port:53537
   [junit4]   2> 303190 INFO  (TEST-HdfsChaosMonkeySafeLeaderTest.test-seed#[862E2454FBA12B3F]) [    ] o.a.s.c.AbstractZkTestCase put /x1/jenkins/jenkins-slave/workspace/Lucene-Solr-NightlyTests-7.0/checkout/solr/core/src/test-files/solr/collection1/conf/solrconfig-tlog.xml to /configs/conf1/solrconfig.xml
   [junit4]   2> 303192 INFO  (TEST-HdfsChaosMonkeySafeLeaderTest.test-seed#[862E2454FBA12B3F]) [    ] o.a.s.c.AbstractZkTestCase put /x1/jenkins/jenkins-slave/workspace/Lucene-Solr-NightlyTests-7.0/checkout/solr/core/src/test-files/solr/collection1/conf/schema15.xml to /configs/conf1/schema.xml
   [junit4]   2> 303195 INFO  (TEST-HdfsChaosMonkeySafeLeaderTest.test-seed#[862E2454FBA12B3F]) [    ] o.a.s.c.AbstractZkTestCase put /x1/jenkins/jenkins-slave/workspace/Lucene-Solr-NightlyTests-7.0/checkout/solr/core/src/test-files/solr/collection1/conf/solrconfig.snippet.randomindexconfig.xml to /configs/conf1/solrconfig.snippet.randomindexconfig.xml
   [junit4]   2> 303196 INFO  (TEST-HdfsChaosMonkeySafeLeaderTest.test-seed#[862E2454FBA12B3F]) [    ] o.a.s.c.AbstractZkTestCase put /x1/jenkins/jenkins-slave/workspace/Lucene-Solr-NightlyTests-7.0/checkout/solr/core/src/test-files/solr/collection1/conf/stopwords.txt to /configs/conf1/stopwords.txt
   [junit4]   2> 303197 INFO  (TEST-HdfsChaosMonkeySafeLeaderTest.test-seed#[862E2454FBA12B3F]) [    ] o.a.s.c.AbstractZkTestCase put /x1/jenkins/jenkins-slave/workspace/Lucene-Solr-NightlyTests-7.0/checkout/solr/core/src/test-files/solr/collection1/conf/protwords.txt to /configs/conf1/protwords.txt
   [junit4]   2> 303197 INFO  (TEST-HdfsChaosMonkeySafeLeaderTest.test-seed#[862E2454FBA12B3F]) [    ] o.a.s.c.AbstractZkTestCase put /x1/jenkins/jenkins-slave/workspace/Lucene-Solr-NightlyTests-7.0/checkout/solr/core/src/test-files/solr/collection1/conf/currency.xml to /configs/conf1/currency.xml
   [junit4]   2> 303198 INFO  (TEST-HdfsChaosMonkeySafeLeaderTest.test-seed#[862E2454FBA12B3F]) [    ] o.a.s.c.AbstractZkTestCase put /x1/jenkins/jenkins-slave/workspace/Lucene-Solr-NightlyTests-7.0/checkout/solr/core/src/test-files/solr/collection1/conf/enumsConfig.xml to /configs/conf1/enumsConfig.xml
   [junit4]   2> 303199 INFO  (TEST-HdfsChaosMonkeySafeLeaderTest.test-seed#[862E2454FBA12B3F]) [    ] o.a.s.c.AbstractZkTestCase put /x1/jenkins/jenkins-slave/workspace/Lucene-Solr-NightlyTests-7.0/checkout/solr/core/src/test-files/solr/collection1/conf/open-exchange-rates.json to /configs/conf1/open-exchange-rates.json
   [junit4]   2> 303200 INFO  (TEST-HdfsChaosMonkeySafeLeaderTest.test-seed#[862E2454FBA12B3F]) [    ] o.a.s.c.AbstractZkTestCase put /x1/jenkins/jenkins-slave/workspace/Lucene-Solr-NightlyTests-7.0/checkout/solr/core/src/test-files/solr/collection1/conf/mapping-ISOLatin1Accent.txt to /configs/conf1/mapping-ISOLatin1Accent.txt
   [junit4]   2> 303201 INFO  (TEST-HdfsChaosMonkeySafeLeaderTest.test-seed#[862E2454FBA12B3F]) [    ] o.a.s.c.AbstractZkTestCase put /x1/jenkins/jenkins-slave/workspace/Lucene-Solr-NightlyTests-7.0/checkout/solr/core/src/test-files/solr/collection1/conf/old_synonyms.txt to /configs/conf1/old_synonyms.txt
   [junit4]   2> 303207 INFO  (TEST-HdfsChaosMonkeySafeLeaderTest.test-seed#[862E2454FBA12B3F]) [    ] o.a.s.c.AbstractZkTestCase put /x1/jenkins/jenkins-slave/workspace/Lucene-Solr-NightlyTests-7.0/checkout/solr/core/src/test-files/solr/collection1/conf/synonyms.txt to /configs/conf1/synonyms.txt
   [junit4]   2> 303212 INFO  (TEST-HdfsChaosMonkeySafeLeaderTest.test-seed#[862E2454FBA12B3F]) [    ] o.a.s.c.AbstractFullDistribZkTestBase Will use NRT replicas unless explicitly asked otherwise
   [junit4]   2> 303429 INFO  (TEST-HdfsChaosMonkeySafeLeaderTest.test-seed#[862E2454FBA12B3F]) [    ] o.e.j.s.Server jetty-9.3.14.v20161028
   [junit4]   2> 303430 INFO  (TEST-HdfsChaosMonkeySafeLeaderTest.test-seed#[862E2454FBA12B3F]) [    ] o.e.j.s.h.ContextHandler Started o.e.j.s.ServletContextHandler@6634aaa6{/,null,AVAILABLE}
   [junit4]   2> 303430 INFO  (TEST-HdfsChaosMonkeySafeLeaderTest.test-seed#[862E2454FBA12B3F]) [    ] o.e.j.s.AbstractConnector Started ServerConnector@31449f52{HTTP/1.1,[http/1.1]}{127.0.0.1:37433}
   [junit4]   2> 303430 INFO  (TEST-HdfsChaosMonkeySafeLeaderTest.test-seed#[862E2454FBA12B3F]) [    ] o.e.j.s.Server Started @311485ms
   [junit4]   2> 303431 INFO  (TEST-HdfsChaosMonkeySafeLeaderTest.test-seed#[862E2454FBA12B3F]) [    ] o.a.s.c.s.e.JettySolrRunner Jetty properties: {solr.data.dir=hdfs://localhost:36061/hdfs__localhost_36061__x1_jenkins_jenkins-slave_workspace_Lucene-Solr-NightlyTests-7.0_checkout_solr_build_solr-core_test_J0_temp_solr.cloud.hdfs.HdfsChaosMonkeySafeLeaderTest_862E2454FBA12B3F-001_tempDir-002_control_data, hostContext=/, hostPort=37433, coreRootDirectory=/x1/jenkins/jenkins-slave/workspace/Lucene-Solr-NightlyTests-7.0/checkout/solr/build/solr-core/test/J0/temp/solr.cloud.hdfs.HdfsChaosMonkeySafeLeaderTest_862E2454FBA12B3F-001/control-001/cores}
   [junit4]   2> 303431 ERROR (TEST-HdfsChaosMonkeySafeLeaderTest.test-seed#[862E2454FBA12B3F]) [    ] o.a.s.s.StartupLoggingUtils Missing Java Option solr.log.dir. Logging may be missing or incomplete.
   [junit4]   2> 303437 INFO  (TEST-HdfsChaosMonkeySafeLeaderTest.test-seed#[862E2454FBA12B3F]) [    ] o.a.s.s.SolrDispatchFilter  ___      _       Welcome to Apache Solr™ version 7.0.0
   [junit4]   2> 303437 INFO  (TEST-HdfsChaosMonkeySafeLeaderTest.test-seed#[862E2454FBA12B3F]) [    ] o.a.s.s.SolrDispatchFilter / __| ___| |_ _   Starting in cloud mode on port null
   [junit4]   2> 303437 INFO  (TEST-HdfsChaosMonkeySafeLeaderTest.test-seed#[862E2454FBA12B3F]) [    ] o.a.s.s.SolrDispatchFilter \__ \/ _ \ | '_|  Install dir: null, Default config dir: null
   [junit4]   2> 303437 INFO  (TEST-HdfsChaosMonkeySafeLeaderTest.test-seed#[862E2454FBA12B3F]) [    ] o.a.s.s.SolrDispatchFilter |___/\___/_|_|    Start time: 2017-09-09T19:25:39.954Z
   [junit4]   2> 303480 INFO  (TEST-HdfsChaosMonkeySafeLeaderTest.test-seed#[862E2454FBA12B3F]) [    ] o.a.s.s.SolrDispatchFilter Loading solr.xml from SolrHome (not found in ZooKeeper)
   [junit4]   2> 303480 INFO  (TEST-HdfsChaosMonkeySafeLeaderTest.test-seed#[862E2454FBA12B3F]) [    ] o.a.s.c.SolrXmlConfig Loading container configuration from /x1/jenkins/jenkins-slave/workspace/Lucene-Solr-NightlyTests-7.0/checkout/solr/build/solr-core/test/J0/temp/solr.cloud.hdfs.HdfsChaosMonkeySafeLeaderTest_862E2454FBA12B3F-001/control-001/solr.xml
   [junit4]   2> 303486 INFO  (TEST-HdfsChaosMonkeySafeLeaderTest.test-seed#[862E2454FBA12B3F]) [    ] o.a.s.c.SolrXmlConfig MBean server found: com.sun.jmx.mbeanserver.JmxMBeanServer@cb84273, but no JMX reporters were configured - adding default JMX reporter.
   [junit4]   2> 303510 INFO  (TEST-HdfsChaosMonkeySafeLeaderTest.test-seed#[862E2454FBA12B3F]) [    ] o.a.s.c.ZkContainer Zookeeper client=127.0.0.1:53537/solr
   [junit4]   2> 304244 INFO  (TEST-HdfsChaosMonkeySafeLeaderTest.test-seed#[862E2454FBA12B3F]) [n:127.0.0.1:37433_    ] o.a.s.c.Overseer Overseer (id=null) closing
   [junit4]   2> 304249 INFO  (TEST-HdfsChaosMonkeySafeLeaderTest.test-seed#[862E2454FBA12B3F]) [n:127.0.0.1:37433_    ] o.a.s.c.OverseerElectionContext I am going to be the leader 127.0.0.1:37433_
   [junit4]   2> 304254 INFO  (TEST-HdfsChaosMonkeySafeLeaderTest.test-seed#[862E2454FBA12B3F]) [n:127.0.0.1:37433_    ] o.a.s.c.Overseer Overseer (id=98630706102009860-127.0.0.1:37433_-n_0000000000) starting
   [junit4]   2> 304331 INFO  (TEST-HdfsChaosMonkeySafeLeaderTest.test-seed#[862E2454FBA12B3F]) [n:127.0.0.1:37433_    ] o.a.s.c.ZkController Register node as live in ZooKeeper:/live_nodes/127.0.0.1:37433_
   [junit4]   2> 304332 INFO  (zkCallback-223-thread-1-processing-n:127.0.0.1:37433_) [n:127.0.0.1:37433_    ] o.a.s.c.c.ZkStateReader Updated live nodes from ZooKeeper... (0) -> (1)
   [junit4]   2> 304896 INFO  (TEST-HdfsChaosMonkeySafeLeaderTest.test-seed#[862E2454FBA12B3F]) [n:127.0.0.1:37433_    ] o.a.s.m.r.SolrJmxReporter JMX monitoring for 'solr.node' (registry 'solr.node') enabled at server: com.sun.jmx.mbeanserver.JmxMBeanServer@cb84273
   [junit4]   2> 304945 INFO  (TEST-HdfsChaosMonkeySafeLeaderTest.test-seed#[862E2454FBA12B3F]) [n:127.0.0.1:37433_    ] o.a.s.m.r.SolrJmxReporter JMX monitoring for 'solr.jvm' (registry 'solr.jvm') enabled at server: com.sun.jmx.mbeanserver.JmxMBeanServer@cb84273
   [junit4]   2> 304945 INFO  (TEST-HdfsChaosMonkeySafeLeaderTest.test-seed#[862E2454FBA12B3F]) [n:127.0.0.1:37433_    ] o.a.s.m.r.SolrJmxReporter JMX monitoring for 'solr.jetty' (registry 'solr.jetty') enabled at server: com.sun.jmx.mbeanserver.JmxMBeanServer@cb84273
   [junit4]   2> 304957 INFO  (TEST-HdfsChaosMonkeySafeLeaderTest.test-seed#[862E2454FBA12B3F]) [n:127.0.0.1:37433_    ] o.a.s.c.CorePropertiesLocator Found 0 core definitions underneath /x1/jenkins/jenkins-slave/workspace/Lucene-Solr-NightlyTests-7.0/checkout/solr/build/solr-core/test/J0/temp/solr.cloud.hdfs.HdfsChaosMonkeySafeLeaderTest_862E2454FBA12B3F-001/control-001/cores
   [junit4]   2> 305057 INFO  (TEST-HdfsChaosMonkeySafeLeaderTest.test-seed#[862E2454FBA12B3F]) [    ] o.a.s.c.c.ZkStateReader Updated live nodes from ZooKeeper... (0) -> (1)
   [junit4]   2> 305057 INFO  (TEST-HdfsChaosMonkeySafeLeaderTest.test-seed#[862E2454FBA12B3F]) [    ] o.a.s.c.s.i.ZkClientClusterStateProvider Cluster at 127.0.0.1:53537/solr ready
   [junit4]   2> 305078 INFO  (qtp453512589-1450) [n:127.0.0.1:37433_    ] o.a.s.h.a.CollectionsHandler Invoked Collection Action :create with params replicationFactor=1&collection.configName=conf1&name=control_collection&nrtReplicas=1&action=CREATE&numShards=1&createNodeSet=127.0.0.1:37433_&wt=javabin&version=2 and sendToOCPQueue=true
   [junit4]   2> 305095 INFO  (OverseerThreadFactory-636-thread-1-processing-n:127.0.0.1:37433_) [n:127.0.0.1:37433_    ] o.a.s.c.CreateCollectionCmd Create collection control_collection
   [junit4]   2> 305217 INFO  (qtp453512589-1448) [n:127.0.0.1:37433_    ] o.a.s.h.a.CoreAdminOperation core create command qt=/admin/cores&collection.configName=conf1&newCollection=true&name=control_collection_shard1_replica_n1&action=CREATE&numShards=1&collection=control_collection&shard=shard1&wt=javabin&version=2&replicaType=NRT
   [junit4]   2> 305219 INFO  (qtp453512589-1448) [n:127.0.0.1:37433_    ] o.a.s.c.TransientSolrCoreCacheDefault Allocating transient cache for 4 transient cores
   [junit4]   2> 305327 INFO  (zkCallback-223-thread-1-processing-n:127.0.0.1:37433_) [n:127.0.0.1:37433_    ] o.a.s.c.c.ZkStateReader A cluster state change: [WatchedEvent state:SyncConnected type:NodeDataChanged path:/collections/control_collection/state.json] for collection [control_collection] has occurred - updating... (live nodes size: [1])
   [junit4]   2> 306272 INFO  (qtp453512589-1448) [n:127.0.0.1:37433_ c:control_collection s:shard1  x:control_collection_shard1_replica_n1] o.a.s.c.SolrConfig Using Lucene MatchVersion: 7.0.0
   [junit4]   2> 306394 INFO  (qtp453512589-1448) [n:127.0.0.1:37433_ c:control_collection s:shard1  x:control_collection_shard1_replica_n1] o.a.s.s.IndexSchema [control_collection_shard1_replica_n1] Schema name=test
   [junit4]   2> 307410 INFO  (qtp453512589-1448) [n:127.0.0.1:37433_ c:control_collection s:shard1  x:control_collection_shard1_replica_n1] o.a.s.s.IndexSchema Loaded schema test/1.6 with uniqueid field id
   [junit4]   2> 307479 INFO  (qtp453512589-1448) [n:127.0.0.1:37433_ c:control_collection s:shard1  x:control_collection_shard1_replica_n1] o.a.s.c.CoreContainer Creating SolrCore 'control_collection_shard1_replica_n1' using configuration from collection control_collection, trusted=true
   [junit4]   2> 307480 INFO  (qtp453512589-1448) [n:127.0.0.1:37433_ c:control_collection s:shard1  x:control_collection_shard1_replica_n1] o.a.s.m.r.SolrJmxReporter JMX monitoring for 'solr.core.control_collection.shard1.replica_n1' (registry 'solr.core.control_collection.shard1.replica_n1') enabled at server: com.sun.jmx.mbeanserver.JmxMBeanServer@cb84273
   [junit4]   2> 308003 INFO  (qtp453512589-1448) [n:127.0.0.1:37433_ c:control_collection s:shard1  x:control_collection_shard1_replica_n1] o.a.s.c.HdfsDirectoryFactory solr.hdfs.home=hdfs://localhost:36061/solr_hdfs_home
   [junit4]   2> 308004 INFO  (qtp453512589-1448) [n:127.0.0.1:37433_ c:control_collection s:shard1  x:control_collection_shard1_replica_n1] o.a.s.c.HdfsDirectoryFactory Solr Kerberos Authentication disabled
   [junit4]   2> 308004 INFO  (qtp453512589-1448) [n:127.0.0.1:37433_ c:control_collection s:shard1  x:control_collection_shard1_replica_n1] o.a.s.c.SolrCore solr.RecoveryStrategy.Builder
   [junit4]   2> 308004 INFO  (qtp453512589-1448) [n:127.0.0.1:37433_ c:control_collection s:shard1  x:control_collection_shard1_replica_n1] o.a.s.c.SolrCore [[control_collection_shard1_replica_n1] ] Opening new SolrCore at [/x1/jenkins/jenkins-slave/workspace/Lucene-Solr-NightlyTests-7.0/checkout/solr/build/solr-core/test/J0/temp/solr.cloud.hdfs.HdfsChaosMonkeySafeLeaderTest_862E2454FBA12B3F-001/control-001/cores/control_collection_shard1_replica_n1], dataDir=[hdfs://localhost:36061/solr_hdfs_home/control_collection/core_node1/data/]
   [junit4]   2> 308005 INFO  (qtp453512589-1448) [n:127.0.0.1:37433_ c:control_collection s:shard1  x:control_collection_shard1_replica_n1] o.a.s.c.HdfsDirectoryFactory creating directory factory for path hdfs://localhost:36061/solr_hdfs_home/control_collection/core_node1/data/snapshot_metadata
   [junit4]   2> 308042 INFO  (qtp453512589-1448) [n:127.0.0.1:37433_ c:control_collection s:shard1  x:control_collection_shard1_replica_n1] o.a.s.c.HdfsDirectoryFactory Number of slabs of block cache [1] with direct memory allocation set to [true]
   [junit4]   2> 308042 INFO  (qtp453512589-1448) [n:127.0.0.1:37433_ c:control_collection s:shard1  x:control_collection_shard1_replica_n1] o.a.s.c.HdfsDirectoryFactory Block cache target memory usage, slab size of [8388608] will allocate [1] slabs and use ~[8388608] bytes
   [junit4]   2> 308043 INFO  (qtp453512589-1448) [n:127.0.0.1:37433_ c:control_collection s:shard1  x:control_collection_shard1_replica_n1] o.a.s.c.HdfsDirectoryFactory Creating new global HDFS BlockCache
   [junit4]   2> 309615 INFO  (qtp453512589-1448) [n:127.0.0.1:37433_ c:control_collection s:shard1  x:control_collection_shard1_replica_n1] o.a.s.s.b.BlockDirectory Block cache on write is disabled
   [junit4]   2> 309622 INFO  (qtp453512589-1448) [n:127.0.0.1:37433_ c:control_collection s:shard1  x:control_collection_shard1_replica_n1] o.a.s.c.HdfsDirectoryFactory creating directory factory for path hdfs://localhost:36061/solr_hdfs_home/control_collection/core_node1/data
   [junit4]   2> 309752 INFO  (qtp453512589-1448) [n:127.0.0.1:37433_ c:control_collection s:shard1  x:control_collection_shard1_replica_n1] o.a.s.c.HdfsDirectoryFactory creating directory factory for path hdfs://localhost:36061/solr_hdfs_home/control_collection/core_node1/data/index
   [junit4]   2> 309775 INFO  (qtp453512589-1448) [n:127.0.0.1:37433_ c:control_collection s:shard1  x:control_collection_shard1_replica_n1] o.a.s.c.HdfsDirectoryFactory Number of slabs of block cache [1] with direct memory allocation set to [true]
   [junit4]   2> 309775 INFO  (qtp453512589-1448) [n:127.0.0.1:37433_ c:control_collection s:shard1  x:control_collection_shard1_replica_n1] o.a.s.c.HdfsDirectoryFactory Block cache target memory usage, slab size of [8388608] will allocate [1] slabs and use ~[8388608] bytes
   [junit4]   2> 309794 INFO  (qtp453512589-1448) [n:127.0.0.1:37433_ c:control_collection s:shard1  x:control_collection_shard1_replica_n1] o.a.s.s.b.BlockDirectory Block cache on write is disabled
   [junit4]   2> 309795 INFO  (qtp453512589-1448) [n:127.0.0.1:37433_ c:control_collection s:shard1  x:control_collection_shard1_replica_n1] o.a.s.u.RandomMergePolicy RandomMergePolicy wrapping class org.apache.lucene.index.LogDocMergePolicy: [LogDocMergePolicy: minMergeSize=1000, mergeFactor=21, maxMergeSize=9223372036854775807, maxMergeSizeForForcedMerge=9223372036854775807, calibrateSizeByDeletes=true, maxMergeDocs=2147483647, maxCFSSegmentSizeMB=8.796093022207999E12, noCFSRatio=1.0]
   [junit4]   2> 310785 INFO  (Block report processor) [    ] BlockStateChange BLOCK* addStoredBlock: blockMap updated: 127.0.0.1:58151 is added to blk_1073741825_1001{UCState=COMMITTED, truncateBlock=null, primaryNodeIndex=-1, replicas=[ReplicaUC[[DISK]DS-cb8d3287-1082-4ec4-8085-3910998ffc77:NORMAL:127.0.0.1:44267|RBW], ReplicaUC[[DISK]DS-ad9eb8ee-e2d4-4053-8852-68145deef7e5:NORMAL:127.0.0.1:58151|RBW]]} size 72
   [junit4]   2> 310786 INFO  (Block report processor) [    ] BlockStateChange BLOCK* addStoredBlock: blockMap updated: 127.0.0.1:44267 is added to blk_1073741825_1001 size 72
   [junit4]   2> 310984 WARN  (qtp453512589-1448) [n:127.0.0.1:37433_ c:control_collection s:shard1  x:control_collection_shard1_replica_n1] o.a.s.c.RequestHandlers INVALID paramSet a in requestHandler {type = requestHandler,name = /dump,class = DumpRequestHandler,attributes = {initParams=a, name=/dump, class=DumpRequestHandler},args = {defaults={a=A,b=B}}}
   [junit4]   2> 311251 INFO  (qtp453512589-1448) [n:127.0.0.1:37433_ c:control_collection s:shard1  x:control_collection_shard1_replica_n1] o.a.s.u.UpdateHandler Using UpdateLog implementation: org.apache.solr.update.HdfsUpdateLog
   [junit4]   2> 311251 INFO  (qtp453512589-1448) [n:127.0.0.1:37433_ c:control_collection s:shard1  x:control_collection_shard1_replica_n1] o.a.s.u.UpdateLog Initializing UpdateLog: dataDir= defaultSyncLevel=FLUSH numRecordsToKeep=100 maxNumLogsToKeep=10 numVersionBuckets=65536
   [junit4]   2> 311251 INFO  (qtp453512589-1448) [n:127.0.0.1:37433_ c:control_collection s:shard1  x:control_collection_shard1_replica_n1] o.a.s.u.HdfsUpdateLog Initializing HdfsUpdateLog: tlogDfsReplication=2
   [junit4]   2> 311378 INFO  (qtp453512589-1448) [n:127.0.0.1:37433_ c:control_collection s:shard1  x:control_collection_shard1_replica_n1] o.a.s.u.CommitTracker Hard AutoCommit: if uncommited for 15000ms; 
   [junit4]   2> 311378 INFO  (qtp453512589-1448) [n:127.0.0.1:37433_ c:control_collection s:shard1  x:control_collection_shard1_replica_n1] o.a.s.u.CommitTracker Soft AutoCommit: disabled
   [junit4]   2> 311403 INFO  (qtp453512589-1448) [n:127.0.0.1:37433_ c:control_collection s:shard1  x:control_collection_shard1_replica_n1] o.a.s.u.RandomMergePolicy RandomMergePolicy wrapping class org.apache.lucene.index.TieredMergePolicy: [TieredMergePolicy: maxMergeAtOnce=28, maxMergeAtOnceExplicit=49, maxMergedSegmentMB=1.98828125, floorSegmentMB=1.3603515625, forceMergeDeletesPctAllowed=29.131923403397916, segmentsPerTier=23.0, maxCFSSegmentSizeMB=8.796093022207999E12, noCFSRatio=0.4718482052455625
   [junit4]   2> 312283 INFO  (qtp453512589-1448) [n:127.0.0.1:37433_ c:control_collection s:shard1  x:control_collection_shard1_replica_n1] o.a.s.s.SolrIndexSearcher Opening [Searcher@64212938[control_collection_shard1_replica_n1] main]
   [junit4]   2> 312284 INFO  (qtp453512589-1448) [n:127.0.0.1:37433_ c:control_colle

[...truncated too long message...]

eKnownType(JavaBinCodec.java:328)
   [junit4]    >         at org.apache.solr.common.util.JavaBinCodec.writeVal(JavaBinCodec.java:228)
   [junit4]    >         at org.apache.solr.common.util.JavaBinCodec.writeMapEntry(JavaBinCodec.java:764)
   [junit4]    >         at org.apache.solr.common.util.JavaBinCodec.writeKnownType(JavaBinCodec.java:383)
   [junit4]    >         at org.apache.solr.common.util.JavaBinCodec.writeVal(JavaBinCodec.java:228)
   [junit4]    >         at org.apache.solr.common.util.JavaBinCodec.writeIterator(JavaBinCodec.java:705)
   [junit4]    >         at org.apache.solr.common.util.JavaBinCodec.writeKnownType(JavaBinCodec.java:367)
   [junit4]    >         at org.apache.solr.common.util.JavaBinCodec.writeVal(JavaBinCodec.java:228)
   [junit4]    >         at org.apache.solr.common.util.JavaBinCodec.writeNamedList(JavaBinCodec.java:223)
   [junit4]    >         at org.apache.solr.common.util.JavaBinCodec.writeKnownType(JavaBinCodec.java:330)
   [junit4]    >         at org.apache.solr.common.util.JavaBinCodec.writeVal(JavaBinCodec.java:228)
   [junit4]    >         at org.apache.solr.common.util.JavaBinCodec.marshal(JavaBinCodec.java:155)
   [junit4]    >         at org.apache.solr.client.solrj.request.JavaBinUpdateRequestCodec.marshal(JavaBinUpdateRequestCodec.java:91)
   [junit4]    >         at org.apache.solr.client.solrj.impl.BinaryRequestWriter.getContentStream(BinaryRequestWriter.java:67)
   [junit4]    >         at org.apache.solr.client.solrj.request.RequestWriter$LazyContentStream.getDelegate(RequestWriter.java:94)
   [junit4]    >         at org.apache.solr.client.solrj.request.RequestWriter$LazyContentStream.getName(RequestWriter.java:104)
   [junit4]    >         at org.apache.solr.client.solrj.impl.HttpSolrClient.createMethod(HttpSolrClient.java:382)
   [junit4]    >         at org.apache.solr.client.solrj.impl.HttpSolrClient.request(HttpSolrClient.java:251)
   [junit4]    >         at org.apache.solr.client.solrj.impl.HttpSolrClient.request(HttpSolrClient.java:242)
   [junit4]    >         at org.apache.solr.client.solrj.SolrRequest.process(SolrRequest.java:178)
   [junit4]    >         at org.apache.solr.client.solrj.SolrRequest.process(SolrRequest.java:195)
   [junit4]    >         at org.apache.solr.cloud.StoppableIndexingThread.indexDocs(StoppableIndexingThread.java:176)
   [junit4]    >         at org.apache.solr.cloud.StoppableIndexingThread.run(StoppableIndexingThread.java:115)
   [junit4]    >    3) Thread[id=64495, name=zkCallback-1444-thread-2, state=TIMED_WAITING, group=TGRP-ChaosMonkeySafeLeaderWithPullReplicasTest]
   [junit4]    >         at sun.misc.Unsafe.park(Native Method)
   [junit4]    >         at java.util.concurrent.locks.LockSupport.parkNanos(LockSupport.java:215)
   [junit4]    >         at java.util.concurrent.SynchronousQueue$TransferStack.awaitFulfill(SynchronousQueue.java:460)
   [junit4]    >         at java.util.concurrent.SynchronousQueue$TransferStack.transfer(SynchronousQueue.java:362)
   [junit4]    >         at java.util.concurrent.SynchronousQueue.poll(SynchronousQueue.java:941)
   [junit4]    >         at java.util.concurrent.ThreadPoolExecutor.getTask(ThreadPoolExecutor.java:1073)
   [junit4]    >         at java.util.concurrent.ThreadPoolExecutor.runWorker(ThreadPoolExecutor.java:1134)
   [junit4]    >         at java.util.concurrent.ThreadPoolExecutor$Worker.run(ThreadPoolExecutor.java:624)
   [junit4]    >         at java.lang.Thread.run(Thread.java:748)
   [junit4]    >    4) Thread[id=64497, name=zkCallback-1444-thread-4, state=TIMED_WAITING, group=TGRP-ChaosMonkeySafeLeaderWithPullReplicasTest]
   [junit4]    >         at sun.misc.Unsafe.park(Native Method)
   [junit4]    >         at java.util.concurrent.locks.LockSupport.parkNanos(LockSupport.java:215)
   [junit4]    >         at java.util.concurrent.SynchronousQueue$TransferStack.awaitFulfill(SynchronousQueue.java:460)
   [junit4]    >         at java.util.concurrent.SynchronousQueue$TransferStack.transfer(SynchronousQueue.java:362)
   [junit4]    >         at java.util.concurrent.SynchronousQueue.poll(SynchronousQueue.java:941)
   [junit4]    >         at java.util.concurrent.ThreadPoolExecutor.getTask(ThreadPoolExecutor.java:1073)
   [junit4]    >         at java.util.concurrent.ThreadPoolExecutor.runWorker(ThreadPoolExecutor.java:1134)
   [junit4]    >         at java.util.concurrent.ThreadPoolExecutor$Worker.run(ThreadPoolExecutor.java:624)
   [junit4]    >         at java.lang.Thread.run(Thread.java:748)
   [junit4]    >    5) Thread[id=64496, name=zkCallback-1444-thread-3, state=TIMED_WAITING, group=TGRP-ChaosMonkeySafeLeaderWithPullReplicasTest]
   [junit4]    >         at sun.misc.Unsafe.park(Native Method)
   [junit4]    >         at java.util.concurrent.locks.LockSupport.parkNanos(LockSupport.java:215)
   [junit4]    >         at java.util.concurrent.SynchronousQueue$TransferStack.awaitFulfill(SynchronousQueue.java:460)
   [junit4]    >         at java.util.concurrent.SynchronousQueue$TransferStack.transfer(SynchronousQueue.java:362)
   [junit4]    >         at java.util.concurrent.SynchronousQueue.poll(SynchronousQueue.java:941)
   [junit4]    >         at java.util.concurrent.ThreadPoolExecutor.getTask(ThreadPoolExecutor.java:1073)
   [junit4]    >         at java.util.concurrent.ThreadPoolExecutor.runWorker(ThreadPoolExecutor.java:1134)
   [junit4]    >         at java.util.concurrent.ThreadPoolExecutor$Worker.run(ThreadPoolExecutor.java:624)
   [junit4]    >         at java.lang.Thread.run(Thread.java:748)
   [junit4]    >    6) Thread[id=64380, name=zkCallback-1444-thread-1, state=TIMED_WAITING, group=TGRP-ChaosMonkeySafeLeaderWithPullReplicasTest]
   [junit4]    >         at sun.misc.Unsafe.park(Native Method)
   [junit4]    >         at java.util.concurrent.locks.LockSupport.parkNanos(LockSupport.java:215)
   [junit4]    >         at java.util.concurrent.SynchronousQueue$TransferStack.awaitFulfill(SynchronousQueue.java:460)
   [junit4]    >         at java.util.concurrent.SynchronousQueue$TransferStack.transfer(SynchronousQueue.java:362)
   [junit4]    >         at java.util.concurrent.SynchronousQueue.poll(SynchronousQueue.java:941)
   [junit4]    >         at java.util.concurrent.ThreadPoolExecutor.getTask(ThreadPoolExecutor.java:1073)
   [junit4]    >         at java.util.concurrent.ThreadPoolExecutor.runWorker(ThreadPoolExecutor.java:1134)
   [junit4]    >         at java.util.concurrent.ThreadPoolExecutor$Worker.run(ThreadPoolExecutor.java:624)
   [junit4]    >         at java.lang.Thread.run(Thread.java:748)
   [junit4]    >    7) Thread[id=64111, name=StoppableIndexingThread, state=RUNNABLE, group=TGRP-ChaosMonkeySafeLeaderWithPullReplicasTest]
   [junit4]    >         at org.apache.solr.common.util.JavaBinCodec.writeStr(JavaBinCodec.java:841)
   [junit4]    >         at org.apache.solr.common.util.JavaBinCodec.writePrimitive(JavaBinCodec.java:932)
   [junit4]    >         at org.apache.solr.common.util.JavaBinCodec.writeKnownType(JavaBinCodec.java:328)
   [junit4]    >         at org.apache.solr.common.util.JavaBinCodec.writeVal(JavaBinCodec.java:228)
   [junit4]    >         at org.apache.solr.common.util.JavaBinCodec.writeSolrInputDocument(JavaBinCodec.java:616)
   [junit4]    >         at org.apache.solr.common.util.JavaBinCodec.writeKnownType(JavaBinCodec.java:355)
   [junit4]    >         at org.apache.solr.common.util.JavaBinCodec.writeVal(JavaBinCodec.java:228)
   [junit4]    >         at org.apache.solr.common.util.JavaBinCodec.writeMapEntry(JavaBinCodec.java:764)
   [junit4]    >         at org.apache.solr.common.util.JavaBinCodec.writeKnownType(JavaBinCodec.java:383)
   [junit4]    >         at org.apache.solr.common.util.JavaBinCodec.writeVal(JavaBinCodec.java:228)
   [junit4]    >         at org.apache.solr.common.util.JavaBinCodec.writeIterator(JavaBinCodec.java:705)
   [junit4]    >         at org.apache.solr.common.util.JavaBinCodec.writeKnownType(JavaBinCodec.java:367)
   [junit4]    >         at org.apache.solr.common.util.JavaBinCodec.writeVal(JavaBinCodec.java:228)
   [junit4]    >         at org.apache.solr.common.util.JavaBinCodec.writeNamedList(JavaBinCodec.java:223)
   [junit4]    >         at org.apache.solr.common.util.JavaBinCodec.writeKnownType(JavaBinCodec.java:330)
   [junit4]    >         at org.apache.solr.common.util.JavaBinCodec.writeVal(JavaBinCodec.java:228)
   [junit4]    >         at org.apache.solr.common.util.JavaBinCodec.marshal(JavaBinCodec.java:155)
   [junit4]    >         at org.apache.solr.client.solrj.request.JavaBinUpdateRequestCodec.marshal(JavaBinUpdateRequestCodec.java:91)
   [junit4]    >         at org.apache.solr.client.solrj.impl.BinaryRequestWriter.getContentStream(BinaryRequestWriter.java:67)
   [junit4]    >         at org.apache.solr.client.solrj.request.RequestWriter$LazyContentStream.getDelegate(RequestWriter.java:94)
   [junit4]    >         at org.apache.solr.client.solrj.request.RequestWriter$LazyContentStream.getName(RequestWriter.java:104)
   [junit4]    >         at org.apache.solr.client.solrj.impl.HttpSolrClient.createMethod(HttpSolrClient.java:382)
   [junit4]    >         at org.apache.solr.client.solrj.impl.HttpSolrClient.request(HttpSolrClient.java:251)
   [junit4]    >         at org.apache.solr.client.solrj.impl.HttpSolrClient.request(HttpSolrClient.java:242)
   [junit4]    >         at org.apache.solr.client.solrj.SolrRequest.process(SolrRequest.java:178)
   [junit4]    >         at org.apache.solr.client.solrj.SolrRequest.process(SolrRequest.java:195)
   [junit4]    >         at org.apache.solr.cloud.StoppableIndexingThread.indexDocs(StoppableIndexingThread.java:176)
   [junit4]    >         at org.apache.solr.cloud.StoppableIndexingThread.run(StoppableIndexingThread.java:115)
   [junit4]    > 	at __randomizedtesting.SeedInfo.seed([862E2454FBA12B3F]:0)
   [junit4] Completed [297/729 (6!)] on J0 in 142.75s, 1 test, 1 failure, 2 errors <<< FAILURES!

[...truncated 44660 lines...]

Mime
View raw message