lucene-dev mailing list archives

Site index · List index
Message view « Date » · « Thread »
Top « Date » · « Thread »
From Policeman Jenkins Server <jenk...@thetaphi.de>
Subject [JENKINS] Lucene-Solr-6.6-Linux (64bit/jdk1.8.0_144) - Build # 141 - Unstable!
Date Tue, 05 Sep 2017 11:31:54 GMT
Build: https://jenkins.thetaphi.de/job/Lucene-Solr-6.6-Linux/141/
Java: 64bit/jdk1.8.0_144 -XX:-UseCompressedOops -XX:+UseG1GC

1 tests failed.
FAILED:  junit.framework.TestSuite.org.apache.solr.cloud.TestSolrCloudWithSecureImpersonation

Error Message:
2 threads leaked from SUITE scope at org.apache.solr.cloud.TestSolrCloudWithSecureImpersonation:     1) Thread[id=7973, name=jetty-launcher-2012-thread-2-EventThread, state=TIMED_WAITING, group=TGRP-TestSolrCloudWithSecureImpersonation]         at sun.misc.Unsafe.park(Native Method)         at java.util.concurrent.locks.LockSupport.parkNanos(LockSupport.java:215)         at java.util.concurrent.locks.AbstractQueuedSynchronizer.doAcquireSharedNanos(AbstractQueuedSynchronizer.java:1037)         at java.util.concurrent.locks.AbstractQueuedSynchronizer.tryAcquireSharedNanos(AbstractQueuedSynchronizer.java:1328)         at java.util.concurrent.CountDownLatch.await(CountDownLatch.java:277)         at org.apache.curator.CuratorZookeeperClient.internalBlockUntilConnectedOrTimedOut(CuratorZookeeperClient.java:323)         at org.apache.curator.RetryLoop.callWithRetry(RetryLoop.java:105)         at org.apache.curator.framework.imps.GetDataBuilderImpl.pathInForeground(GetDataBuilderImpl.java:288)         at org.apache.curator.framework.imps.GetDataBuilderImpl.forPath(GetDataBuilderImpl.java:279)         at org.apache.curator.framework.imps.GetDataBuilderImpl.forPath(GetDataBuilderImpl.java:41)         at org.apache.curator.framework.recipes.shared.SharedValue.readValue(SharedValue.java:244)         at org.apache.curator.framework.recipes.shared.SharedValue.access$100(SharedValue.java:44)         at org.apache.curator.framework.recipes.shared.SharedValue$1.process(SharedValue.java:61)         at org.apache.curator.framework.imps.NamespaceWatcher.process(NamespaceWatcher.java:67)         at org.apache.zookeeper.ClientCnxn$EventThread.processEvent(ClientCnxn.java:530)         at org.apache.zookeeper.ClientCnxn$EventThread.run(ClientCnxn.java:505)    2) Thread[id=7975, name=jetty-launcher-2012-thread-1-EventThread, state=TIMED_WAITING, group=TGRP-TestSolrCloudWithSecureImpersonation]         at sun.misc.Unsafe.park(Native Method)         at java.util.concurrent.locks.LockSupport.parkNanos(LockSupport.java:215)         at java.util.concurrent.locks.AbstractQueuedSynchronizer.doAcquireSharedNanos(AbstractQueuedSynchronizer.java:1037)         at java.util.concurrent.locks.AbstractQueuedSynchronizer.tryAcquireSharedNanos(AbstractQueuedSynchronizer.java:1328)         at java.util.concurrent.CountDownLatch.await(CountDownLatch.java:277)         at org.apache.curator.CuratorZookeeperClient.internalBlockUntilConnectedOrTimedOut(CuratorZookeeperClient.java:323)         at org.apache.curator.RetryLoop.callWithRetry(RetryLoop.java:105)         at org.apache.curator.framework.imps.GetDataBuilderImpl.pathInForeground(GetDataBuilderImpl.java:288)         at org.apache.curator.framework.imps.GetDataBuilderImpl.forPath(GetDataBuilderImpl.java:279)         at org.apache.curator.framework.imps.GetDataBuilderImpl.forPath(GetDataBuilderImpl.java:41)         at org.apache.curator.framework.recipes.shared.SharedValue.readValue(SharedValue.java:244)         at org.apache.curator.framework.recipes.shared.SharedValue.access$100(SharedValue.java:44)         at org.apache.curator.framework.recipes.shared.SharedValue$1.process(SharedValue.java:61)         at org.apache.curator.framework.imps.NamespaceWatcher.process(NamespaceWatcher.java:67)         at org.apache.zookeeper.ClientCnxn$EventThread.processEvent(ClientCnxn.java:530)         at org.apache.zookeeper.ClientCnxn$EventThread.run(ClientCnxn.java:505)

Stack Trace:
com.carrotsearch.randomizedtesting.ThreadLeakError: 2 threads leaked from SUITE scope at org.apache.solr.cloud.TestSolrCloudWithSecureImpersonation: 
   1) Thread[id=7973, name=jetty-launcher-2012-thread-2-EventThread, state=TIMED_WAITING, group=TGRP-TestSolrCloudWithSecureImpersonation]
        at sun.misc.Unsafe.park(Native Method)
        at java.util.concurrent.locks.LockSupport.parkNanos(LockSupport.java:215)
        at java.util.concurrent.locks.AbstractQueuedSynchronizer.doAcquireSharedNanos(AbstractQueuedSynchronizer.java:1037)
        at java.util.concurrent.locks.AbstractQueuedSynchronizer.tryAcquireSharedNanos(AbstractQueuedSynchronizer.java:1328)
        at java.util.concurrent.CountDownLatch.await(CountDownLatch.java:277)
        at org.apache.curator.CuratorZookeeperClient.internalBlockUntilConnectedOrTimedOut(CuratorZookeeperClient.java:323)
        at org.apache.curator.RetryLoop.callWithRetry(RetryLoop.java:105)
        at org.apache.curator.framework.imps.GetDataBuilderImpl.pathInForeground(GetDataBuilderImpl.java:288)
        at org.apache.curator.framework.imps.GetDataBuilderImpl.forPath(GetDataBuilderImpl.java:279)
        at org.apache.curator.framework.imps.GetDataBuilderImpl.forPath(GetDataBuilderImpl.java:41)
        at org.apache.curator.framework.recipes.shared.SharedValue.readValue(SharedValue.java:244)
        at org.apache.curator.framework.recipes.shared.SharedValue.access$100(SharedValue.java:44)
        at org.apache.curator.framework.recipes.shared.SharedValue$1.process(SharedValue.java:61)
        at org.apache.curator.framework.imps.NamespaceWatcher.process(NamespaceWatcher.java:67)
        at org.apache.zookeeper.ClientCnxn$EventThread.processEvent(ClientCnxn.java:530)
        at org.apache.zookeeper.ClientCnxn$EventThread.run(ClientCnxn.java:505)
   2) Thread[id=7975, name=jetty-launcher-2012-thread-1-EventThread, state=TIMED_WAITING, group=TGRP-TestSolrCloudWithSecureImpersonation]
        at sun.misc.Unsafe.park(Native Method)
        at java.util.concurrent.locks.LockSupport.parkNanos(LockSupport.java:215)
        at java.util.concurrent.locks.AbstractQueuedSynchronizer.doAcquireSharedNanos(AbstractQueuedSynchronizer.java:1037)
        at java.util.concurrent.locks.AbstractQueuedSynchronizer.tryAcquireSharedNanos(AbstractQueuedSynchronizer.java:1328)
        at java.util.concurrent.CountDownLatch.await(CountDownLatch.java:277)
        at org.apache.curator.CuratorZookeeperClient.internalBlockUntilConnectedOrTimedOut(CuratorZookeeperClient.java:323)
        at org.apache.curator.RetryLoop.callWithRetry(RetryLoop.java:105)
        at org.apache.curator.framework.imps.GetDataBuilderImpl.pathInForeground(GetDataBuilderImpl.java:288)
        at org.apache.curator.framework.imps.GetDataBuilderImpl.forPath(GetDataBuilderImpl.java:279)
        at org.apache.curator.framework.imps.GetDataBuilderImpl.forPath(GetDataBuilderImpl.java:41)
        at org.apache.curator.framework.recipes.shared.SharedValue.readValue(SharedValue.java:244)
        at org.apache.curator.framework.recipes.shared.SharedValue.access$100(SharedValue.java:44)
        at org.apache.curator.framework.recipes.shared.SharedValue$1.process(SharedValue.java:61)
        at org.apache.curator.framework.imps.NamespaceWatcher.process(NamespaceWatcher.java:67)
        at org.apache.zookeeper.ClientCnxn$EventThread.processEvent(ClientCnxn.java:530)
        at org.apache.zookeeper.ClientCnxn$EventThread.run(ClientCnxn.java:505)
	at __randomizedtesting.SeedInfo.seed([CD6C11C21CB0D2D6]:0)




Build Log:
[...truncated 11252 lines...]
   [junit4] Suite: org.apache.solr.cloud.TestSolrCloudWithSecureImpersonation
   [junit4]   2> Creating dataDir: /home/jenkins/workspace/Lucene-Solr-6.6-Linux/solr/build/solr-core/test/J0/temp/solr.cloud.TestSolrCloudWithSecureImpersonation_CD6C11C21CB0D2D6-001/init-core-data-001
   [junit4]   2> 168827 WARN  (SUITE-TestSolrCloudWithSecureImpersonation-seed#[CD6C11C21CB0D2D6]-worker) [    ] o.a.s.SolrTestCaseJ4 startTrackingSearchers: numOpens=5 numCloses=5
   [junit4]   2> 168827 INFO  (SUITE-TestSolrCloudWithSecureImpersonation-seed#[CD6C11C21CB0D2D6]-worker) [    ] o.a.s.SolrTestCaseJ4 Using TrieFields
   [junit4]   2> 168828 INFO  (SUITE-TestSolrCloudWithSecureImpersonation-seed#[CD6C11C21CB0D2D6]-worker) [    ] o.a.s.SolrTestCaseJ4 Randomized ssl (false) and clientAuth (false) via: @org.apache.solr.util.RandomizeSSL(reason=, ssl=NaN, value=NaN, clientAuth=NaN)
   [junit4]   2> 168917 WARN  (SUITE-TestSolrCloudWithSecureImpersonation-seed#[CD6C11C21CB0D2D6]-worker) [    ] o.a.h.u.NativeCodeLoader Unable to load native-hadoop library for your platform... using builtin-java classes where applicable
   [junit4]   2> 169046 INFO  (SUITE-TestSolrCloudWithSecureImpersonation-seed#[CD6C11C21CB0D2D6]-worker) [    ] o.a.s.c.MiniSolrCloudCluster Starting cluster of 2 servers in /home/jenkins/workspace/Lucene-Solr-6.6-Linux/solr/build/solr-core/test/J0/temp/solr.cloud.TestSolrCloudWithSecureImpersonation_CD6C11C21CB0D2D6-001/tempDir-001
   [junit4]   2> 169046 INFO  (SUITE-TestSolrCloudWithSecureImpersonation-seed#[CD6C11C21CB0D2D6]-worker) [    ] o.a.s.c.ZkTestServer STARTING ZK TEST SERVER
   [junit4]   2> 169050 INFO  (Thread-298) [    ] o.a.s.c.ZkTestServer client port:0.0.0.0/0.0.0.0:0
   [junit4]   2> 169050 INFO  (Thread-298) [    ] o.a.s.c.ZkTestServer Starting server
   [junit4]   2> 169059 ERROR (Thread-298) [    ] o.a.z.s.ZooKeeperServer ZKShutdownHandler is not registered, so ZooKeeper server won't take any action on ERROR or SHUTDOWN server state changes
   [junit4]   2> 169150 INFO  (SUITE-TestSolrCloudWithSecureImpersonation-seed#[CD6C11C21CB0D2D6]-worker) [    ] o.a.s.c.ZkTestServer start zk server on port:39315
   [junit4]   2> 169158 INFO  (jetty-launcher-2012-thread-1) [    ] o.e.j.s.Server jetty-9.3.14.v20161028
   [junit4]   2> 169158 INFO  (jetty-launcher-2012-thread-2) [    ] o.e.j.s.Server jetty-9.3.14.v20161028
   [junit4]   2> 169185 INFO  (jetty-launcher-2012-thread-1) [    ] o.e.j.s.h.ContextHandler Started o.e.j.s.ServletContextHandler@7064faf1{/solr,null,AVAILABLE}
   [junit4]   2> 169199 INFO  (jetty-launcher-2012-thread-2) [    ] o.e.j.s.h.ContextHandler Started o.e.j.s.ServletContextHandler@32034801{/solr,null,AVAILABLE}
   [junit4]   2> 169206 INFO  (jetty-launcher-2012-thread-2) [    ] o.e.j.s.AbstractConnector Started ServerConnector@24758647{HTTP/1.1,[http/1.1]}{127.0.0.1:38703}
   [junit4]   2> 169206 INFO  (jetty-launcher-2012-thread-1) [    ] o.e.j.s.AbstractConnector Started ServerConnector@6b91bf11{HTTP/1.1,[http/1.1]}{127.0.0.1:40177}
   [junit4]   2> 169206 INFO  (jetty-launcher-2012-thread-2) [    ] o.e.j.s.Server Started @170883ms
   [junit4]   2> 169206 INFO  (jetty-launcher-2012-thread-1) [    ] o.e.j.s.Server Started @170883ms
   [junit4]   2> 169206 INFO  (jetty-launcher-2012-thread-2) [    ] o.a.s.c.s.e.JettySolrRunner Jetty properties: {hostContext=/solr, hostPort=38703}
   [junit4]   2> 169206 INFO  (jetty-launcher-2012-thread-1) [    ] o.a.s.c.s.e.JettySolrRunner Jetty properties: {hostContext=/solr, hostPort=40177}
   [junit4]   2> 169206 ERROR (jetty-launcher-2012-thread-1) [    ] o.a.s.s.StartupLoggingUtils Missing Java Option solr.log.dir. Logging may be missing or incomplete.
   [junit4]   2> 169206 INFO  (jetty-launcher-2012-thread-1) [    ] o.a.s.s.SolrDispatchFilter  ___      _       Welcome to Apache Solr™ version 6.6.1
   [junit4]   2> 169206 INFO  (jetty-launcher-2012-thread-1) [    ] o.a.s.s.SolrDispatchFilter / __| ___| |_ _   Starting in cloud mode on port null
   [junit4]   2> 169206 INFO  (jetty-launcher-2012-thread-1) [    ] o.a.s.s.SolrDispatchFilter \__ \/ _ \ | '_|  Install dir: null
   [junit4]   2> 169206 INFO  (jetty-launcher-2012-thread-1) [    ] o.a.s.s.SolrDispatchFilter |___/\___/_|_|    Start time: 2017-09-05T10:45:02.429Z
   [junit4]   2> 169214 ERROR (jetty-launcher-2012-thread-2) [    ] o.a.s.s.StartupLoggingUtils Missing Java Option solr.log.dir. Logging may be missing or incomplete.
   [junit4]   2> 169214 INFO  (jetty-launcher-2012-thread-2) [    ] o.a.s.s.SolrDispatchFilter  ___      _       Welcome to Apache Solr™ version 6.6.1
   [junit4]   2> 169214 INFO  (jetty-launcher-2012-thread-2) [    ] o.a.s.s.SolrDispatchFilter / __| ___| |_ _   Starting in cloud mode on port null
   [junit4]   2> 169214 INFO  (jetty-launcher-2012-thread-2) [    ] o.a.s.s.SolrDispatchFilter \__ \/ _ \ | '_|  Install dir: null
   [junit4]   2> 169214 INFO  (jetty-launcher-2012-thread-2) [    ] o.a.s.s.SolrDispatchFilter |___/\___/_|_|    Start time: 2017-09-05T10:45:02.437Z
   [junit4]   2> 169230 INFO  (jetty-launcher-2012-thread-1) [    ] o.a.s.s.SolrDispatchFilter solr.xml found in ZooKeeper. Loading...
   [junit4]   2> 169235 INFO  (jetty-launcher-2012-thread-2) [    ] o.a.s.s.SolrDispatchFilter solr.xml found in ZooKeeper. Loading...
   [junit4]   2> 169238 INFO  (jetty-launcher-2012-thread-1) [    ] o.a.s.u.UpdateShardHandler Creating UpdateShardHandler HTTP client with params: socketTimeout=340000&connTimeout=45000&retry=true
   [junit4]   2> 169239 INFO  (jetty-launcher-2012-thread-1) [    ] o.a.s.c.ZkContainer Zookeeper client=127.0.0.1:39315/solr
   [junit4]   2> 169239 INFO  (jetty-launcher-2012-thread-2) [    ] o.a.s.u.UpdateShardHandler Creating UpdateShardHandler HTTP client with params: socketTimeout=340000&connTimeout=45000&retry=true
   [junit4]   2> 169240 INFO  (jetty-launcher-2012-thread-2) [    ] o.a.s.c.ZkContainer Zookeeper client=127.0.0.1:39315/solr
   [junit4]   2> 169252 INFO  (jetty-launcher-2012-thread-2) [n:127.0.0.1:38703_solr    ] o.a.s.c.Overseer Overseer (id=null) closing
   [junit4]   2> 169252 INFO  (jetty-launcher-2012-thread-1) [n:127.0.0.1:40177_solr    ] o.a.s.c.Overseer Overseer (id=null) closing
   [junit4]   2> 169253 INFO  (jetty-launcher-2012-thread-1) [n:127.0.0.1:40177_solr    ] o.a.s.c.ZkController Register node as live in ZooKeeper:/live_nodes/127.0.0.1:40177_solr
   [junit4]   2> 169253 INFO  (jetty-launcher-2012-thread-2) [n:127.0.0.1:38703_solr    ] o.a.s.c.OverseerElectionContext I am going to be the leader 127.0.0.1:38703_solr
   [junit4]   2> 169258 INFO  (zkCallback-2023-thread-1-processing-n:127.0.0.1:40177_solr) [n:127.0.0.1:40177_solr    ] o.a.s.c.c.ZkStateReader Updated live nodes from ZooKeeper... (0) -> (1)
   [junit4]   2> 169258 INFO  (zkCallback-2024-thread-1-processing-n:127.0.0.1:38703_solr) [n:127.0.0.1:38703_solr    ] o.a.s.c.c.ZkStateReader Updated live nodes from ZooKeeper... (0) -> (1)
   [junit4]   2> 169258 INFO  (jetty-launcher-2012-thread-2) [n:127.0.0.1:38703_solr    ] o.a.s.c.Overseer Overseer (id=98606009698091014-127.0.0.1:38703_solr-n_0000000000) starting
   [junit4]   2> 169267 INFO  (jetty-launcher-2012-thread-2) [n:127.0.0.1:38703_solr    ] o.a.s.c.ZkController Register node as live in ZooKeeper:/live_nodes/127.0.0.1:38703_solr
   [junit4]   2> 169268 INFO  (zkCallback-2024-thread-1-processing-n:127.0.0.1:38703_solr) [n:127.0.0.1:38703_solr    ] o.a.s.c.c.ZkStateReader Updated live nodes from ZooKeeper... (1) -> (2)
   [junit4]   2> 169269 INFO  (zkCallback-2023-thread-1-processing-n:127.0.0.1:40177_solr) [n:127.0.0.1:40177_solr    ] o.a.s.c.c.ZkStateReader Updated live nodes from ZooKeeper... (1) -> (2)
   [junit4]   2> 169294 INFO  (jetty-launcher-2012-thread-2) [n:127.0.0.1:38703_solr    ] o.a.s.c.CoreContainer Initializing authentication plugin: org.apache.solr.security.HttpParamDelegationTokenPlugin
   [junit4]   2> 169298 WARN  (jetty-launcher-2012-thread-2) [n:127.0.0.1:38703_solr    ] o.a.s.c.s.i.Krb5HttpClientConfigurer org.apache.solr.client.solrj.impl.Krb5HttpClientConfigurer is configured without specifying system property 'java.security.auth.login.config'
   [junit4]   2> 169312 INFO  (jetty-launcher-2012-thread-2) [n:127.0.0.1:38703_solr    ] o.a.s.s.KerberosPlugin Params: {solr.kerberos.impersonator.user.noGroups.hosts=*, solr.kerberos.impersonator.user.bogusGroup.groups=__some_bogus_group, token.valid=30, cookie.domain=127.0.0.1, solr.kerberos.impersonator.user.anyHostAnyUser.groups=*, solr.kerberos.impersonator.user.bogusGroup.hosts=*, solr.kerberos.impersonator.user.anyHostAnyUser.hosts=*, token.validity=36000, solr.kerberos.impersonator.user.noHosts.groups=*, type=kerberos, solr.kerberos.impersonator.user.localHostAnyGroup.groups=*, delegation-token.token-kind=solr-dt, solr.kerberos.impersonator.user.wrongHost.hosts=1.1.1.1.1.1, cookie.path=/, zk-dt-secret-manager.znodeWorkingPath=solr/security/zkdtsm, solr.kerberos.impersonator.user.localHostAnyGroup.hosts=localhost.localdomain,localhost,127.0.0.1, signer.secret.provider.zookeeper.path=/token, solr.kerberos.impersonator.user.anyHostUsersGroup.groups=jenkins, zk-dt-secret-manager.enable=true, solr.kerberos.impersonator.user.wrongHost.groups=*, kerberos.name.rules=DEFAULT, signer.secret.provider=zookeeper, solr.kerberos.impersonator.user.anyHostUsersGroup.hosts=*}
   [junit4]   2> 169358 INFO  (jetty-launcher-2012-thread-1) [n:127.0.0.1:40177_solr    ] o.a.s.c.CoreContainer Initializing authentication plugin: org.apache.solr.security.HttpParamDelegationTokenPlugin
   [junit4]   2> 169358 WARN  (jetty-launcher-2012-thread-1) [n:127.0.0.1:40177_solr    ] o.a.s.c.s.i.Krb5HttpClientConfigurer org.apache.solr.client.solrj.impl.Krb5HttpClientConfigurer is configured without specifying system property 'java.security.auth.login.config'
   [junit4]   2> 169359 INFO  (jetty-launcher-2012-thread-1) [n:127.0.0.1:40177_solr    ] o.a.s.s.KerberosPlugin Params: {solr.kerberos.impersonator.user.noGroups.hosts=*, solr.kerberos.impersonator.user.bogusGroup.groups=__some_bogus_group, token.valid=30, cookie.domain=127.0.0.1, solr.kerberos.impersonator.user.anyHostAnyUser.groups=*, solr.kerberos.impersonator.user.bogusGroup.hosts=*, solr.kerberos.impersonator.user.anyHostAnyUser.hosts=*, token.validity=36000, solr.kerberos.impersonator.user.noHosts.groups=*, type=kerberos, solr.kerberos.impersonator.user.localHostAnyGroup.groups=*, delegation-token.token-kind=solr-dt, solr.kerberos.impersonator.user.wrongHost.hosts=1.1.1.1.1.1, cookie.path=/, zk-dt-secret-manager.znodeWorkingPath=solr/security/zkdtsm, solr.kerberos.impersonator.user.localHostAnyGroup.hosts=localhost.localdomain,localhost,127.0.0.1, signer.secret.provider.zookeeper.path=/token, solr.kerberos.impersonator.user.anyHostUsersGroup.groups=jenkins, zk-dt-secret-manager.enable=true, solr.kerberos.impersonator.user.wrongHost.groups=*, kerberos.name.rules=DEFAULT, signer.secret.provider=zookeeper, solr.kerberos.impersonator.user.anyHostUsersGroup.hosts=*}
   [junit4]   2> 169385 INFO  (jetty-launcher-2012-thread-2) [n:127.0.0.1:38703_solr    ] o.a.c.f.i.CuratorFrameworkImpl Starting
   [junit4]   2> 169385 INFO  (jetty-launcher-2012-thread-1) [n:127.0.0.1:40177_solr    ] o.a.c.f.i.CuratorFrameworkImpl Starting
   [junit4]   2> 169404 INFO  (jetty-launcher-2012-thread-1-EventThread) [n:127.0.0.1:40177_solr    ] o.a.c.f.s.ConnectionStateManager State change: CONNECTED
   [junit4]   2> 169404 INFO  (jetty-launcher-2012-thread-2-EventThread) [n:127.0.0.1:38703_solr    ] o.a.c.f.s.ConnectionStateManager State change: CONNECTED
   [junit4]   2> 169535 INFO  (jetty-launcher-2012-thread-2) [n:127.0.0.1:38703_solr    ] o.a.s.h.c.HttpShardHandlerFactory Reconfiguring the default client with: org.apache.solr.security.HttpParamDelegationTokenPlugin$2@4c147ec1
   [junit4]   2> 169535 INFO  (jetty-launcher-2012-thread-1) [n:127.0.0.1:40177_solr    ] o.a.s.h.c.HttpShardHandlerFactory Reconfiguring the default client with: org.apache.solr.security.HttpParamDelegationTokenPlugin$2@7098b48
   [junit4]   2> 169535 WARN  (jetty-launcher-2012-thread-2) [n:127.0.0.1:38703_solr    ] o.a.s.c.s.i.Krb5HttpClientConfigurer org.apache.solr.security.HttpParamDelegationTokenPlugin$2 is configured without specifying system property 'java.security.auth.login.config'
   [junit4]   2> 169535 WARN  (jetty-launcher-2012-thread-1) [n:127.0.0.1:40177_solr    ] o.a.s.c.s.i.Krb5HttpClientConfigurer org.apache.solr.security.HttpParamDelegationTokenPlugin$2 is configured without specifying system property 'java.security.auth.login.config'
   [junit4]   2> 169535 INFO  (jetty-launcher-2012-thread-2) [n:127.0.0.1:38703_solr    ] o.a.s.u.UpdateShardHandler Reconfiguring the default client with: org.apache.solr.security.HttpParamDelegationTokenPlugin$2@4c147ec1
   [junit4]   2> 169535 INFO  (jetty-launcher-2012-thread-1) [n:127.0.0.1:40177_solr    ] o.a.s.u.UpdateShardHandler Reconfiguring the default client with: org.apache.solr.security.HttpParamDelegationTokenPlugin$2@7098b48
   [junit4]   2> 169535 WARN  (jetty-launcher-2012-thread-2) [n:127.0.0.1:38703_solr    ] o.a.s.c.s.i.Krb5HttpClientConfigurer org.apache.solr.security.HttpParamDelegationTokenPlugin$2 is configured without specifying system property 'java.security.auth.login.config'
   [junit4]   2> 169535 WARN  (jetty-launcher-2012-thread-1) [n:127.0.0.1:40177_solr    ] o.a.s.c.s.i.Krb5HttpClientConfigurer org.apache.solr.security.HttpParamDelegationTokenPlugin$2 is configured without specifying system property 'java.security.auth.login.config'
   [junit4]   2> 169562 INFO  (jetty-launcher-2012-thread-2) [n:127.0.0.1:38703_solr    ] o.a.s.c.CorePropertiesLocator Found 0 core definitions underneath /home/jenkins/workspace/Lucene-Solr-6.6-Linux/solr/build/solr-core/test/J0/temp/solr.cloud.TestSolrCloudWithSecureImpersonation_CD6C11C21CB0D2D6-001/tempDir-001/node2/.
   [junit4]   2> 169568 INFO  (jetty-launcher-2012-thread-1) [n:127.0.0.1:40177_solr    ] o.a.s.c.CorePropertiesLocator Found 0 core definitions underneath /home/jenkins/workspace/Lucene-Solr-6.6-Linux/solr/build/solr-core/test/J0/temp/solr.cloud.TestSolrCloudWithSecureImpersonation_CD6C11C21CB0D2D6-001/tempDir-001/node1/.
   [junit4]   2> 169581 WARN  (SUITE-TestSolrCloudWithSecureImpersonation-seed#[CD6C11C21CB0D2D6]-worker) [    ] o.a.s.c.s.i.Krb5HttpClientConfigurer org.apache.solr.security.HttpParamDelegationTokenPlugin$2 is configured without specifying system property 'java.security.auth.login.config'
   [junit4]   2> 169581 WARN  (SUITE-TestSolrCloudWithSecureImpersonation-seed#[CD6C11C21CB0D2D6]-worker) [    ] o.a.s.c.s.i.Krb5HttpClientConfigurer org.apache.solr.security.HttpParamDelegationTokenPlugin$2 is configured without specifying system property 'java.security.auth.login.config'
   [junit4]   2> 169582 WARN  (SUITE-TestSolrCloudWithSecureImpersonation-seed#[CD6C11C21CB0D2D6]-worker) [    ] o.a.s.c.s.i.Krb5HttpClientConfigurer org.apache.solr.security.HttpParamDelegationTokenPlugin$2 is configured without specifying system property 'java.security.auth.login.config'
   [junit4]   2> 169582 WARN  (SUITE-TestSolrCloudWithSecureImpersonation-seed#[CD6C11C21CB0D2D6]-worker) [    ] o.a.s.c.s.i.Krb5HttpClientConfigurer org.apache.solr.security.HttpParamDelegationTokenPlugin$2 is configured without specifying system property 'java.security.auth.login.config'
   [junit4]   2> 169593 INFO  (TEST-TestSolrCloudWithSecureImpersonation.testForwarding-seed#[CD6C11C21CB0D2D6]) [    ] o.a.s.SolrTestCaseJ4 ###Starting testForwarding
   [junit4]   2> 169761 INFO  (TEST-TestSolrCloudWithSecureImpersonation.testForwarding-seed#[CD6C11C21CB0D2D6]) [    ] o.a.s.c.c.ZkStateReader Updated live nodes from ZooKeeper... (0) -> (2)
   [junit4]   2> 169761 INFO  (TEST-TestSolrCloudWithSecureImpersonation.testForwarding-seed#[CD6C11C21CB0D2D6]) [    ] o.a.s.c.s.i.ZkClientClusterStateProvider Cluster at 127.0.0.1:39315/solr ready
   [junit4]   2> 169786 INFO  (qtp52762699-7935) [n:127.0.0.1:38703_solr    ] o.a.s.h.a.CollectionsHandler Invoked Collection Action :create with params replicationFactor=1&collection.configName=conf1&maxShardsPerNode=1&name=forwardingCollection&action=CREATE&numShards=1&wt=javabin&version=2 and sendToOCPQueue=true
   [junit4]   2> 169787 INFO  (OverseerThreadFactory-1288-thread-1-processing-n:127.0.0.1:38703_solr) [n:127.0.0.1:38703_solr    ] o.a.s.c.CreateCollectionCmd Create collection forwardingCollection
   [junit4]   2> 169891 INFO  (qtp849470199-7936) [n:127.0.0.1:40177_solr    ] o.a.s.h.a.CoreAdminOperation core create command qt=/admin/cores&collection.configName=conf1&newCollection=true&name=forwardingCollection_shard1_replica1&action=CREATE&numShards=1&collection=forwardingCollection&shard=shard1&wt=javabin&version=2
   [junit4]   2> 169891 INFO  (qtp849470199-7936) [n:127.0.0.1:40177_solr    ] o.a.s.c.TransientSolrCoreCacheDefault Allocating transient cache for 2147483647 transient cores
   [junit4]   2> 169995 INFO  (zkCallback-2023-thread-1-processing-n:127.0.0.1:40177_solr) [n:127.0.0.1:40177_solr    ] o.a.s.c.c.ZkStateReader A cluster state change: [WatchedEvent state:SyncConnected type:NodeDataChanged path:/collections/forwardingCollection/state.json] for collection [forwardingCollection] has occurred - updating... (live nodes size: [2])
   [junit4]   2> 170914 INFO  (qtp849470199-7936) [n:127.0.0.1:40177_solr c:forwardingCollection s:shard1  x:forwardingCollection_shard1_replica1] o.a.s.c.SolrConfig Using Lucene MatchVersion: 6.6.1
   [junit4]   2> 170938 INFO  (qtp849470199-7936) [n:127.0.0.1:40177_solr c:forwardingCollection s:shard1  x:forwardingCollection_shard1_replica1] o.a.s.s.IndexSchema [forwardingCollection_shard1_replica1] Schema name=test
   [junit4]   2> 171000 INFO  (qtp849470199-7936) [n:127.0.0.1:40177_solr c:forwardingCollection s:shard1  x:forwardingCollection_shard1_replica1] o.a.s.s.IndexSchema Loaded schema test/1.0 with uniqueid field id
   [junit4]   2> 171005 INFO  (qtp849470199-7936) [n:127.0.0.1:40177_solr c:forwardingCollection s:shard1  x:forwardingCollection_shard1_replica1] o.a.s.c.CoreContainer Creating SolrCore 'forwardingCollection_shard1_replica1' using configuration from collection forwardingCollection, trusted=true
   [junit4]   2> 171005 INFO  (qtp849470199-7936) [n:127.0.0.1:40177_solr c:forwardingCollection s:shard1  x:forwardingCollection_shard1_replica1] o.a.s.c.SolrCore solr.RecoveryStrategy.Builder
   [junit4]   2> 171005 INFO  (qtp849470199-7936) [n:127.0.0.1:40177_solr c:forwardingCollection s:shard1  x:forwardingCollection_shard1_replica1] o.a.s.c.SolrCore [[forwardingCollection_shard1_replica1] ] Opening new SolrCore at [/home/jenkins/workspace/Lucene-Solr-6.6-Linux/solr/build/solr-core/test/J0/temp/solr.cloud.TestSolrCloudWithSecureImpersonation_CD6C11C21CB0D2D6-001/tempDir-001/node1/forwardingCollection_shard1_replica1], dataDir=[/home/jenkins/workspace/Lucene-Solr-6.6-Linux/solr/build/solr-core/test/J0/temp/solr.cloud.TestSolrCloudWithSecureImpersonation_CD6C11C21CB0D2D6-001/tempDir-001/node1/./forwardingCollection_shard1_replica1/data/]
   [junit4]   2> 171005 INFO  (qtp849470199-7936) [n:127.0.0.1:40177_solr c:forwardingCollection s:shard1  x:forwardingCollection_shard1_replica1] o.a.s.c.JmxMonitoredMap JMX monitoring is enabled. Adding Solr mbeans to JMX Server: com.sun.jmx.mbeanserver.JmxMBeanServer@647541fa
   [junit4]   2> 171006 INFO  (qtp849470199-7936) [n:127.0.0.1:40177_solr c:forwardingCollection s:shard1  x:forwardingCollection_shard1_replica1] o.a.s.u.RandomMergePolicy RandomMergePolicy wrapping class org.apache.lucene.index.LogByteSizeMergePolicy: [LogByteSizeMergePolicy: minMergeSize=1677721, mergeFactor=27, maxMergeSize=2147483648, maxMergeSizeForForcedMerge=9223372036854775807, calibrateSizeByDeletes=true, maxMergeDocs=2147483647, maxCFSSegmentSizeMB=8.796093022207999E12, noCFSRatio=1.0]
   [junit4]   2> 171032 INFO  (qtp849470199-7936) [n:127.0.0.1:40177_solr c:forwardingCollection s:shard1  x:forwardingCollection_shard1_replica1] o.a.s.u.UpdateHandler Using UpdateLog implementation: org.apache.solr.update.UpdateLog
   [junit4]   2> 171032 INFO  (qtp849470199-7936) [n:127.0.0.1:40177_solr c:forwardingCollection s:shard1  x:forwardingCollection_shard1_replica1] o.a.s.u.UpdateLog Initializing UpdateLog: dataDir= defaultSyncLevel=FLUSH numRecordsToKeep=100 maxNumLogsToKeep=10 numVersionBuckets=65536
   [junit4]   2> 171034 INFO  (qtp849470199-7936) [n:127.0.0.1:40177_solr c:forwardingCollection s:shard1  x:forwardingCollection_shard1_replica1] o.a.s.u.CommitTracker Hard AutoCommit: disabled
   [junit4]   2> 171034 INFO  (qtp849470199-7936) [n:127.0.0.1:40177_solr c:forwardingCollection s:shard1  x:forwardingCollection_shard1_replica1] o.a.s.u.CommitTracker Soft AutoCommit: disabled
   [junit4]   2> 171034 INFO  (qtp849470199-7936) [n:127.0.0.1:40177_solr c:forwardingCollection s:shard1  x:forwardingCollection_shard1_replica1] o.a.s.u.RandomMergePolicy RandomMergePolicy wrapping class org.apache.lucene.index.TieredMergePolicy: [TieredMergePolicy: maxMergeAtOnce=36, maxMergeAtOnceExplicit=10, maxMergedSegmentMB=59.751953125, floorSegmentMB=0.755859375, forceMergeDeletesPctAllowed=3.5051421973451125, segmentsPerTier=24.0, maxCFSSegmentSizeMB=8.796093022207999E12, noCFSRatio=0.3366577768865957
   [junit4]   2> 171034 INFO  (qtp849470199-7936) [n:127.0.0.1:40177_solr c:forwardingCollection s:shard1  x:forwardingCollection_shard1_replica1] o.a.s.s.SolrIndexSearcher Opening [Searcher@4fbc61c[forwardingCollection_shard1_replica1] main]
   [junit4]   2> 171035 INFO  (qtp849470199-7936) [n:127.0.0.1:40177_solr c:forwardingCollection s:shard1  x:forwardingCollection_shard1_replica1] o.a.s.h.c.SpellCheckComponent Initializing spell checkers
   [junit4]   2> 171054 INFO  (qtp849470199-7936) [n:127.0.0.1:40177_solr c:forwardingCollection s:shard1  x:forwardingCollection_shard1_replica1] o.a.s.s.DirectSolrSpellChecker init: {name=direct,classname=DirectSolrSpellChecker,field=lowerfilt,minQueryLength=3}
   [junit4]   2> 171107 INFO  (qtp849470199-7936) [n:127.0.0.1:40177_solr c:forwardingCollection s:shard1  x:forwardingCollection_shard1_replica1] o.a.s.h.ReplicationHandler Commits will be reserved for  10000
   [junit4]   2> 171107 INFO  (searcherExecutor-1293-thread-1-processing-n:127.0.0.1:40177_solr x:forwardingCollection_shard1_replica1 s:shard1 c:forwardingCollection) [n:127.0.0.1:40177_solr c:forwardingCollection s:shard1  x:forwardingCollection_shard1_replica1] o.a.s.h.c.SpellCheckComponent Loading spell index for spellchecker: default
   [junit4]   2> 171107 INFO  (searcherExecutor-1293-thread-1-processing-n:127.0.0.1:40177_solr x:forwardingCollection_shard1_replica1 s:shard1 c:forwardingCollection) [n:127.0.0.1:40177_solr c:forwardingCollection s:shard1  x:forwardingCollection_shard1_replica1] o.a.s.h.c.SpellCheckComponent Loading spell index for spellchecker: direct
   [junit4]   2> 171107 INFO  (searcherExecutor-1293-thread-1-processing-n:127.0.0.1:40177_solr x:forwardingCollection_shard1_replica1 s:shard1 c:forwardingCollection) [n:127.0.0.1:40177_solr c:forwardingCollection s:shard1  x:forwardingCollection_shard1_replica1] o.a.s.h.c.SpellCheckComponent Loading spell index for spellchecker: wordbreak
   [junit4]   2> 171107 INFO  (searcherExecutor-1293-thread-1-processing-n:127.0.0.1:40177_solr x:forwardingCollection_shard1_replica1 s:shard1 c:forwardingCollection) [n:127.0.0.1:40177_solr c:forwardingCollection s:shard1  x:forwardingCollection_shard1_replica1] o.a.s.h.c.SpellCheckComponent Loading spell index for spellchecker: multipleFields
   [junit4]   2> 171107 INFO  (searcherExecutor-1293-thread-1-processing-n:127.0.0.1:40177_solr x:forwardingCollection_shard1_replica1 s:shard1 c:forwardingCollection) [n:127.0.0.1:40177_solr c:forwardingCollection s:shard1  x:forwardingCollection_shard1_replica1] o.a.s.h.c.SpellCheckComponent Loading spell index for spellchecker: jarowinkler
   [junit4]   2> 171108 INFO  (searcherExecutor-1293-thread-1-processing-n:127.0.0.1:40177_solr x:forwardingCollection_shard1_replica1 s:shard1 c:forwardingCollection) [n:127.0.0.1:40177_solr c:forwardingCollection s:shard1  x:forwardingCollection_shard1_replica1] o.a.s.h.c.SpellCheckComponent Loading spell index for spellchecker: external
   [junit4]   2> 171108 INFO  (searcherExecutor-1293-thread-1-processing-n:127.0.0.1:40177_solr x:forwardingCollection_shard1_replica1 s:shard1 c:forwardingCollection) [n:127.0.0.1:40177_solr c:forwardingCollection s:shard1  x:forwardingCollection_shard1_replica1] o.a.s.h.c.SpellCheckComponent Loading spell index for spellchecker: freq
   [junit4]   2> 171108 INFO  (searcherExecutor-1293-thread-1-processing-n:127.0.0.1:40177_solr x:forwardingCollection_shard1_replica1 s:shard1 c:forwardingCollection) [n:127.0.0.1:40177_solr c:forwardingCollection s:shard1  x:forwardingCollection_shard1_replica1] o.a.s.h.c.SpellCheckComponent Loading spell index for spellchecker: fqcn
   [junit4]   2> 171108 INFO  (searcherExecutor-1293-thread-1-processing-n:127.0.0.1:40177_solr x:forwardingCollection_shard1_replica1 s:shard1 c:forwardingCollection) [n:127.0.0.1:40177_solr c:forwardingCollection s:shard1  x:forwardingCollection_shard1_replica1] o.a.s.h.c.SpellCheckComponent Loading spell index for spellchecker: perDict
   [junit4]   2> 171108 INFO  (qtp849470199-7936) [n:127.0.0.1:40177_solr c:forwardingCollection s:shard1  x:forwardingCollection_shard1_replica1] o.a.s.u.UpdateLog Could not find max version in index or recent updates, using new clock 1577696157322182656
   [junit4]   2> 171108 INFO  (searcherExecutor-1293-thread-1-processing-n:127.0.0.1:40177_solr x:forwardingCollection_shard1_replica1 s:shard1 c:forwardingCollection) [n:127.0.0.1:40177_solr c:forwardingCollection s:shard1  x:forwardingCollection_shard1_replica1] o.a.s.c.SolrCore [forwardingCollection_shard1_replica1] Registered new searcher Searcher@4fbc61c[forwardingCollection_shard1_replica1] main{ExitableDirectoryReader(UninvertingDirectoryReader())}
   [junit4]   2> 171111 INFO  (qtp849470199-7936) [n:127.0.0.1:40177_solr c:forwardingCollection s:shard1  x:forwardingCollection_shard1_replica1] o.a.s.c.ShardLeaderElectionContext Enough replicas found to continue.
   [junit4]   2> 171111 INFO  (qtp849470199-7936) [n:127.0.0.1:40177_solr c:forwardingCollection s:shard1  x:forwardingCollection_shard1_replica1] o.a.s.c.ShardLeaderElectionContext I may be the new leader - try and sync
   [junit4]   2> 171111 INFO  (qtp849470199-7936) [n:127.0.0.1:40177_solr c:forwardingCollection s:shard1  x:forwardingCollection_shard1_replica1] o.a.s.c.SyncStrategy Sync replicas to http://127.0.0.1:40177/solr/forwardingCollection_shard1_replica1/
   [junit4]   2> 171111 INFO  (qtp849470199-7936) [n:127.0.0.1:40177_solr c:forwardingCollection s:shard1  x:forwardingCollection_shard1_replica1] o.a.s.c.SyncStrategy Sync Success - now sync replicas to me
   [junit4]   2> 171111 INFO  (qtp849470199-7936) [n:127.0.0.1:40177_solr c:forwardingCollection s:shard1  x:forwardingCollection_shard1_replica1] o.a.s.c.SyncStrategy http://127.0.0.1:40177/solr/forwardingCollection_shard1_replica1/ has no replicas
   [junit4]   2> 171111 INFO  (qtp849470199-7936) [n:127.0.0.1:40177_solr c:forwardingCollection s:shard1  x:forwardingCollection_shard1_replica1] o.a.s.c.ShardLeaderElectionContext Found all replicas participating in election, clear LIR
   [junit4]   2> 171112 INFO  (qtp849470199-7936) [n:127.0.0.1:40177_solr c:forwardingCollection s:shard1  x:forwardingCollection_shard1_replica1] o.a.s.c.ShardLeaderElectionContext I am the new leader: http://127.0.0.1:40177/solr/forwardingCollection_shard1_replica1/ shard1
   [junit4]   2> 171214 INFO  (zkCallback-2023-thread-1-processing-n:127.0.0.1:40177_solr) [n:127.0.0.1:40177_solr    ] o.a.s.c.c.ZkStateReader A cluster state change: [WatchedEvent state:SyncConnected type:NodeDataChanged path:/collections/forwardingCollection/state.json] for collection [forwardingCollection] has occurred - updating... (live nodes size: [2])
   [junit4]   2> 171263 INFO  (qtp849470199-7936) [n:127.0.0.1:40177_solr c:forwardingCollection s:shard1  x:forwardingCollection_shard1_replica1] o.a.s.c.ZkController I am the leader, no recovery necessary
   [junit4]   2> 171274 INFO  (qtp849470199-7936) [n:127.0.0.1:40177_solr c:forwardingCollection s:shard1  x:forwardingCollection_shard1_replica1] o.a.s.s.HttpSolrCall [admin] webapp=null path=/admin/cores params={qt=/admin/cores&collection.configName=conf1&newCollection=true&name=forwardingCollection_shard1_replica1&action=CREATE&numShards=1&collection=forwardingCollection&shard=shard1&wt=javabin&version=2} status=0 QTime=1382
   [junit4]   2> 171281 WARN  (httpShardExecutor-1286-thread-1-processing-n:127.0.0.1:38703_solr [http:////127.0.0.1:40177//solr] http:////127.0.0.1:40177//solr) [n:127.0.0.1:38703_solr    ] o.a.h.c.p.ResponseProcessCookies Invalid cookie header: "Set-Cookie: hadoop.auth="u=$&p=$&t=test&e=1504644303114&s=/WmPxAXM4HABvGniwPSTpC7CCKM="; Path=/; Domain=127.0.0.1; Expires= , 05-   -2017 20:45:03 GMT; HttpOnly". Invalid 'expires' attribute: , 05- -2017 20:45:03 GMT
   [junit4]   2> 171286 INFO  (qtp52762699-7935) [n:127.0.0.1:38703_solr    ] o.a.s.h.a.CollectionsHandler Wait for new collection to be active for at most 30 seconds. Check all shard replicas
   [junit4]   2> 171366 INFO  (zkCallback-2023-thread-1-processing-n:127.0.0.1:40177_solr) [n:127.0.0.1:40177_solr    ] o.a.s.c.c.ZkStateReader A cluster state change: [WatchedEvent state:SyncConnected type:NodeDataChanged path:/collections/forwardingCollection/state.json] for collection [forwardingCollection] has occurred - updating... (live nodes size: [2])
   [junit4]   2> 171788 INFO  (OverseerCollectionConfigSetProcessor-98606009698091014-127.0.0.1:38703_solr-n_0000000000) [n:127.0.0.1:38703_solr    ] o.a.s.c.OverseerTaskQueue Response ZK path: /overseer/collection-queue-work/qnr-0000000000 doesn't exist.  Requestor may have disconnected from ZooKeeper
   [junit4]   2> 172287 INFO  (qtp52762699-7935) [n:127.0.0.1:38703_solr    ] o.a.s.s.HttpSolrCall [admin] webapp=null path=/admin/collections params={replicationFactor=1&collection.configName=conf1&maxShardsPerNode=1&name=forwardingCollection&action=CREATE&numShards=1&wt=javabin&version=2} status=0 QTime=2501
   [junit4]   2> 172288 WARN  (TEST-TestSolrCloudWithSecureImpersonation.testForwarding-seed#[CD6C11C21CB0D2D6]) [    ] o.a.h.c.p.ResponseProcessCookies Invalid cookie header: "Set-Cookie: hadoop.auth="u=user&p=user&t=test&e=1504644302995&s=ne89mEAoycY8wuyRUoFK54kjoek="; Path=/; Domain=127.0.0.1; Expires= , 05-   -2017 20:45:02 GMT; HttpOnly". Invalid 'expires' attribute: , 05- -2017 20:45:02 GMT
   [junit4]   2> 172288 INFO  (TEST-TestSolrCloudWithSecureImpersonation.testForwarding-seed#[CD6C11C21CB0D2D6]) [    ] o.a.s.c.AbstractDistribZkTestBase Wait for recoveries to finish - collection: forwardingCollection failOnTimeout:true timeout (sec):100
   [junit4]   2> 172289 INFO  (TEST-TestSolrCloudWithSecureImpersonation.testForwarding-seed#[CD6C11C21CB0D2D6]) [    ] o.a.s.c.AbstractDistribZkTestBase Recoveries finished - collection: forwardingCollection
   [junit4]   2> 172289 WARN  (TEST-TestSolrCloudWithSecureImpersonation.testForwarding-seed#[CD6C11C21CB0D2D6]) [    ] o.a.s.c.s.i.Krb5HttpClientConfigurer org.apache.solr.security.HttpParamDelegationTokenPlugin$2 is configured without specifying system property 'java.security.auth.login.config'
   [junit4]   2> 172289 WARN  (TEST-TestSolrCloudWithSecureImpersonation.testForwarding-seed#[CD6C11C21CB0D2D6]) [    ] o.a.s.c.s.i.Krb5HttpClientConfigurer org.apache.solr.security.HttpParamDelegationTokenPlugin$2 is configured without specifying system property 'java.security.auth.login.config'
   [junit4]   2> 172292 INFO  (qtp52762699-7940) [n:127.0.0.1:38703_solr    ] o.a.s.c.TransientSolrCoreCacheDefault Allocating transient cache for 2147483647 transient cores
   [junit4]   2> 172295 INFO  (qtp849470199-7939) [n:127.0.0.1:40177_solr c:forwardingCollection s:shard1 r:core_node1 x:forwardingCollection_shard1_replica1] o.a.s.c.S.Request [forwardingCollection_shard1_replica1]  webapp=/solr path=/select params={q=*:*&wt=javabin&version=2} hits=0 status=0 QTime=0
   [junit4]   2> 172295 WARN  (qtp52762699-7940) [n:127.0.0.1:38703_solr    ] o.a.h.c.p.ResponseProcessCookies Invalid cookie header: "Set-Cookie: hadoop.auth="u=$&p=$&t=test&e=1504644305517&s=Mt3YmUbGn0K67YgxBg9fryOuV+Q="; Path=/; Domain=127.0.0.1; Expires= , 05-   -2017 20:45:05 GMT; HttpOnly". Invalid 'expires' attribute: , 05- -2017 20:45:05 GMT
   [junit4]   2> 172299 WARN  (TEST-TestSolrCloudWithSecureImpersonation.testForwarding-seed#[CD6C11C21CB0D2D6]) [    ] o.a.h.c.p.ResponseProcessCookies Invalid cookie header: "Set-Cookie: hadoop.auth="u=user&p=user&t=test&e=1504644305514&s=s+el14uF8oB3Dxtqd5CLRyxPKGE="; Path=/; Domain=127.0.0.1; Expires= , 05-   -2017 20:45:05 GMT; HttpOnly". Invalid 'expires' attribute: , 05- -2017 20:45:05 GMT
   [junit4]   2> 172300 WARN  (TEST-TestSolrCloudWithSecureImpersonation.testForwarding-seed#[CD6C11C21CB0D2D6]) [    ] o.a.h.c.p.ResponseProcessCookies Invalid cookie header: "Set-Cookie: hadoop.auth="u=$&p=$&t=test&e=1504644305517&s=Mt3YmUbGn0K67YgxBg9fryOuV+Q="; Path=/; Domain=127.0.0.1; Expires= , 05-   -2017 20:45:05 GMT; HttpOnly". Invalid 'expires' attribute: , 05- -2017 20:45:05 GMT
   [junit4]   2> 172300 WARN  (TEST-TestSolrCloudWithSecureImpersonation.testForwarding-seed#[CD6C11C21CB0D2D6]) [    ] o.a.s.c.s.i.Krb5HttpClientConfigurer org.apache.solr.security.HttpParamDelegationTokenPlugin$2 is configured without specifying system property 'java.security.auth.login.config'
   [junit4]   2> 172300 WARN  (TEST-TestSolrCloudWithSecureImpersonation.testForwarding-seed#[CD6C11C21CB0D2D6]) [    ] o.a.s.c.s.i.Krb5HttpClientConfigurer org.apache.solr.security.HttpParamDelegationTokenPlugin$2 is configured without specifying system property 'java.security.auth.login.config'
   [junit4]   2> 172302 INFO  (qtp849470199-7936) [n:127.0.0.1:40177_solr c:forwardingCollection s:shard1 r:core_node1 x:forwardingCollection_shard1_replica1] o.a.s.c.S.Request [forwardingCollection_shard1_replica1]  webapp=/solr path=/select params={q=*:*&wt=javabin&version=2} hits=0 status=0 QTime=0
   [junit4]   2> 172303 WARN  (TEST-TestSolrCloudWithSecureImpersonation.testForwarding-seed#[CD6C11C21CB0D2D6]) [    ] o.a.h.c.p.ResponseProcessCookies Invalid cookie header: "Set-Cookie: hadoop.auth="u=user&p=user&t=test&e=1504644305524&s=mlE0A8f9vohRxC0vSuXQZlybU0g="; Path=/; Domain=127.0.0.1; Expires= , 05-   -2017 20:45:05 GMT; HttpOnly". Invalid 'expires' attribute: , 05- -2017 20:45:05 GMT
   [junit4]   2> 172303 INFO  (TEST-TestSolrCloudWithSecureImpersonation.testForwarding-seed#[CD6C11C21CB0D2D6]) [    ] o.a.s.SolrTestCaseJ4 ###Ending testForwarding
   [junit4]   2> 172317 INFO  (TEST-TestSolrCloudWithSecureImpersonation.testProxyNullProxyUser-seed#[CD6C11C21CB0D2D6]) [    ] o.a.s.SolrTestCaseJ4 ###Starting testProxyNullProxyUser
   [junit4]   2> 172319 INFO  (qtp52762699-7940) [n:127.0.0.1:38703_solr    ] o.a.s.s.SolrDispatchFilter Error authenticating
   [junit4]   2> java.lang.IllegalArgumentException: userName is NULL, empty or contains a '&'
   [junit4]   2> 	at org.apache.hadoop.security.authentication.util.AuthToken.checkForIllegalArgument(AuthToken.java:87)
   [junit4]   2> 	at org.apache.hadoop.security.authentication.util.AuthToken.<init>(AuthToken.java:70)
   [junit4]   2> 	at org.apache.hadoop.security.authentication.server.AuthenticationToken.<init>(AuthenticationToken.java:58)
   [junit4]   2> 	at org.apache.solr.security.HttpParamDelegationTokenPlugin$HttpParamDelegationTokenAuthenticationHandler$HttpParamAuthenticationHandler.authenticate(HttpParamDelegationTokenPlugin.java:220)
   [junit4]   2> 	at org.apache.hadoop.security.token.delegation.web.DelegationTokenAuthenticationHandler.authenticate(DelegationTokenAuthenticationHandler.java:348)
   [junit4]   2> 	at org.apache.solr.security.RequestContinuesRecorderAuthenticationHandler.authenticate(RequestContinuesRecorderAuthenticationHandler.java:69)
   [junit4]   2> 	at org.apache.hadoop.security.authentication.server.AuthenticationFilter.doFilter(AuthenticationFilter.java:518)
   [junit4]   2> 	at org.apache.solr.security.DelegationTokenKerberosFilter.doFilter(DelegationTokenKerberosFilter.java:134)
   [junit4]   2> 	at org.apache.solr.security.HttpParamDelegationTokenPlugin$HttpParamToRequestFilter.doFilter(HttpParamDelegationTokenPlugin.java:252)
   [junit4]   2> 	at org.apache.solr.security.KerberosPlugin.doAuthenticate(KerberosPlugin.java:248)
   [junit4]   2> 	at org.apache.solr.servlet.SolrDispatchFilter.authenticateRequest(SolrDispatchFilter.java:430)
   [junit4]   2> 	at org.apache.solr.servlet.SolrDispatchFilter.doFilter(SolrDispatchFilter.java:326)
   [junit4]   2> 	at org.apache.solr.servlet.SolrDispatchFilter.doFilter(SolrDispatchFilter.java:305)
   [junit4]   2> 	at org.eclipse.jetty.servlet.ServletHandler$CachedChain.doFilter(ServletHandler.java:1699)
   [junit4]   2> 	at org.apache.solr.client.solrj.embedded.JettySolrRunner$DebugFilter.doFilter(JettySolrRunner.java:136)
   [junit4]   2> 	at org.eclipse.jetty.servlet.ServletHandler$CachedChain.doFilter(ServletHandler.java:1699)
   [junit4]   2> 	at org.eclipse.jetty.servlet.ServletHandler.doHandle(ServletHandler.java:582)
   [junit4]   2> 	at org.eclipse.jetty.server.session.SessionHandler.doHandle(SessionHandler.java:224)
   [junit4]   2> 	at org.eclipse.jetty.server.handler.ContextHandler.doHandle(ContextHandler.java:1180)
   [junit4]   2> 	at org.eclipse.jetty.servlet.ServletHandler.doScope(ServletHandler.java:512)
   [junit4]   2> 	at org.eclipse.jetty.server.session.SessionHandler.doScope(SessionHandler.java:185)
   [junit4]   2> 	at org.eclipse.jetty.server.handler.ContextHandler.doScope(ContextHandler.java:1112)
   [junit4]   2> 	at org.eclipse.jetty.server.handler.ScopedHandler.handle(ScopedHandler.java:141)
   [junit4]   2> 	at org.eclipse.jetty.server.handler.gzip.GzipHandler.handle(GzipHandler.java:462)
   [junit4]   2> 	at org.eclipse.jetty.server.handler.HandlerWrapper.handle(HandlerWrapper.java:134)
   [junit4]   2> 	at org.eclipse.jetty.server.Server.handle(Server.java:534)
   [junit4]   2> 	at org.eclipse.jetty.server.HttpChannel.handle(HttpChannel.java:320)
   [junit4]   2> 	at org.eclipse.jetty.server.HttpConnection.onFillable(HttpConnection.java:251)
   [junit4]   2> 	at org.eclipse.jetty.io.AbstractConnection$ReadCallback.succeeded(AbstractConnection.java:273)
   [junit4]   2> 	at org.eclipse.jetty.io.FillInterest.fillable(FillInterest.java:95)
   [junit4]   2> 	at org.eclipse.jetty.io.SelectChannelEndPoint$2.run(SelectChannelEndPoint.java:93)
   [junit4]   2> 	at org.eclipse.jetty.util.thread.strategy.ExecuteProduceConsume.executeProduceConsume(ExecuteProduceConsume.java:303)
   [junit4]   2> 	at org.eclipse.jetty.util.thread.strategy.ExecuteProduceConsume.produceConsume(ExecuteProduceConsume.java:148)
   [junit4]   2> 	at org.eclipse.jetty.util.thread.strategy.ExecuteProduceConsume.run(ExecuteProduceConsume.java:136)
   [junit4]   2> 	at org.eclipse.jetty.util.thread.QueuedThreadPool.runJob(QueuedThreadPool.java:671)
   [junit4]   2> 	at org.eclipse.jetty.util.thread.QueuedThreadPool$2.run(QueuedThreadPool.java:589)
   [junit4]   2> 	at java.lang.Thread.run(Thread.java:748)
   [junit4]   2> 172319 WARN  (qtp52762699-7940) [n:127.0.0.1:38703_solr    ] o.e.j.s.ServletHandler /solr/admin/collections
   [junit4]   2> org.apache.solr.common.SolrException: Error during request authentication, 
   [junit4]   2> 	at org.apache.solr.servlet.SolrDispatchFilter.authenticateRequest(SolrDispatchFilter.java:436)
   [junit4]   2> 	at org.apache.solr.servlet.SolrDispatchFilter.doFilter(SolrDispatchFilter.java:326)
   [junit4]   2> 	at org.apache.solr.servlet.SolrDispatchFilter.doFilter(SolrDispatchFilter.java:305)
   [junit4]   2> 	at org.eclipse.jetty.servlet.ServletHandler$CachedChain.doFilter(ServletHandler.java:1699)
   [junit4]   2> 	at org.apache.solr.client.solrj.embedded.JettySolrRunner$DebugFilter.doFilter(JettySolrRunner.java:136)
   [junit4]   2> 	at org.eclipse.jetty.servlet.ServletHandler$CachedChain.doFilter(ServletHandler.java:1699)
   [junit4]   2> 	at org.eclipse.jetty.servlet.ServletHandler.doHandle(ServletHandler.java:582)
   [junit4]   2> 	at org.eclipse.jetty.server.session.SessionHandler.doHandle(SessionHandler.java:224)
   [junit4]   2> 	at org.eclipse.jetty.server.handler.ContextHandler.doHandle(ContextHandler.java:1180)
   [junit4]   2> 	at org.eclipse.jetty.servlet.ServletHandler.doScope(ServletHandler.java:512)
   [junit4]   2> 	at org.eclipse.jetty.server.session.SessionHandler.doScope(SessionHandler.java:185)
   [junit4]   2> 	at org.eclipse.jetty.server.handler.ContextHandler.doScope(ContextHandler.java:1112)
   [junit4]   2> 	at org.eclipse.jetty.server.handler.ScopedHandler.handle(ScopedHandler.java:141)
   [junit4]   2> 	at org.eclipse.jetty.server.handler.gzip.GzipHandler.handle(GzipHandler.java:462)
   [junit4]   2> 	at org.eclipse.jetty.server.handler.HandlerWrapper.handle(HandlerWrapper.java:134)
   [junit4]   2> 	at org.eclipse.jetty.server.Server.handle(Server.java:534)
   [junit4]   2> 	at org.eclipse.jetty.server.HttpChannel.handle(HttpChannel.java:320)
   [junit4]   2> 	at org.eclipse.jetty.server.HttpConnection.onFillable(HttpConnection.java:251)
   [junit4]   2> 	at org.eclipse.jetty.io.AbstractConnection$ReadCallback.succeeded(AbstractConnection.java:273)
   [junit4]   2> 	at org.eclipse.jetty.io.FillInterest.fillable(FillInterest.java:95)
   [junit4]   2> 	at org.eclipse.jetty.io.SelectChannelEndPoint$2.run(SelectChannelEndPoint.java:93)
   [junit4]   2> 	at org.eclipse.jetty.util.thread.strategy.ExecuteProduceConsume.executeProduceConsume(ExecuteProduceConsume.java:303)
   [junit4]   2> 	at org.eclipse.jetty.util.thread.strategy.ExecuteProduceConsume.produceConsume(ExecuteProduceConsume.java:148)
   [junit4]   2> 	at org.eclipse.jetty.util.thread.strategy.ExecuteProduceConsume.run(ExecuteProduceConsume.java:136)
   [junit4]   2> 	at org.eclipse.jetty.util.thread.QueuedThreadPool.runJob(QueuedThreadPool.java:671)
   [junit4]   2> 	at org.eclipse.jetty.util.thread.QueuedThreadPool$2.run(QueuedThreadPool.java:589)
   [junit4]   2> 	at java.lang.Thread.run(Thread.java:748)
   [junit4]   2> Caused by: java.lang.IllegalArgumentException: userName is NULL, empty or contains a '&'
   [junit4]   2> 	at org.apache.hadoop.security.authentication.util.AuthToken.checkForIllegalArgument(AuthToken.java:87)
   [junit4]   2> 	at org.apache.hadoop.security.authentication.util.AuthToken.<init>(AuthToken.java:70)
   [junit4]   2> 	at org.apache.hadoop.security.authentication.server.AuthenticationToken.<init>(AuthenticationToken.java:58)
   [junit4]   2> 	at org.apache.solr.security.HttpParamDelegationTokenPlugin$HttpParamDelegationTokenAuthenticationHandler$HttpParamAuthenticationHandler.authenticate(HttpParamDelegationTokenPlugin.java:220)
   [junit4]   2> 	at org.apache.hadoop.security.token.delegation.web.DelegationTokenAuthenticationHandler.authenticate(DelegationTokenAuthenticationHandler.java:348)
   [junit4]   2> 	at org.apache.solr.security.RequestContinuesRecorderAuthenticationHandler.authenticate(RequestContinuesRecorderAuthenticationHandler.java:69)
   [junit4]   2> 	at org.apache.hadoop.security.authentication.server.AuthenticationFilter.doFilter(AuthenticationFilter.java:518)
   [junit4]   2> 	at org.apache.solr.security.DelegationTokenKerberosFilter.doFilter(DelegationTokenKerberosFilter.java:134)
   [junit4]   2> 	at org.apache.solr.security.HttpParamDelegationTokenPlugin$HttpParamToRequestFilter.doFilter(HttpParamDelegationTokenPlugin.java:252)
   [junit4]   2> 	at org.apache.solr.security.KerberosPlugin.doAuthenticate(KerberosPlugin.java:248)
   [junit4]   2> 	at org.apache.solr.servlet.SolrDispatchFilter.authenticateRequest(SolrDispatchFilter.java:430)
   [junit4]   2> 	... 26 more
   [junit4]   2> 172325 INFO  (TEST-TestSolrCloudWithSecureImpersonation.testProxyNullProxyUser-seed#[CD6C11C21CB0D2D6]) [    ] o.a.s.SolrTestCaseJ4 ###Ending testProxyNullProxyUser
   [junit4]   2> 172340 INFO  (TEST-TestSolrCloudWithSecureImpersonation.testProxyNoConfigHosts-seed#[CD6C11C21CB0D2D6]) [    ] o.a.s.SolrTestCaseJ4 ###Starting testProxyNoConfigHosts
   [junit4]   2> 172573 WARN  (TEST-TestSolrCloudWithSecureImpersonation.testProxyNoConfigHosts-seed#[CD6C11C21CB0D2D6]) [    ] o.a.h.c.p.ResponseProcessCookies Invalid cookie header: "Set-Cookie: hadoop.auth="u=noHosts&p=noHosts&t=test&e=1504644305564&s=DMT45C9EWPFGcDw7U3As2INmKfQ="; Path=/; Domain=127.0.0.1; Expires= , 05-   -2017 20:45:05 GMT; HttpOnly". Invalid 'expires' attribute: , 05- -2017 20:45:05 GMT
   [junit4]   2> 172573 INFO  (TEST-TestSolrCloudWithSecureImpersonation.testProxyNoConfigHosts-seed#[CD6C11C21CB0D2D6]) [    ] o.a.s.SolrTestCaseJ4 ###Ending testProxyNoConfigHosts
   [junit4]   2> 172587 INFO  (TEST-TestSolrCloudWithSecureImpersonation.testProxyWrongHost-seed#[CD6C11C21CB0D2D6]) [    ] o.a.s.SolrTestCaseJ4 ###Starting testProxyWrongHost
   [junit4]   2> 187602 WARN  (jetty-launcher-2012-thread-1-SendThread(127.0.0.1:39315)) [n:127.0.0.1:40177_solr    ] o.a.z.ClientCnxn Client session timed out, have not heard from server in 18081ms for sessionid 0x15e51a4b4c60008
   [junit4]   2> 187603 WARN  (NIOServerCxn.Factory:0.0.0.0/0.0.0.0:0) [    ] o.a.z.s.NIOServerCnxn caught end of stream exception
   [junit4]   2> EndOfStreamException: Unable to read additional data from client sessionid 0x15e51a4b4c60008, likely client has closed socket
   [junit4]   2> 	at org.apache.zookeeper.server.NIOServerCnxn.doIO(NIOServerCnxn.java:239)
   [junit4]   2> 	at org.apache.zookeeper.server.NIOServerCnxnFactory.run(NIOServerCnxnFactory.java:203)
   [junit4]   2> 	at java.lang.Thread.run(Thread.java:748)
   [junit4]   2> 187603 WARN  (jetty-launcher-2012-thread-2-SendThread(127.0.0.1:39315)) [n:127.0.0.1:38703_solr    ] o.a.z.ClientCnxn Client session timed out, have not heard from server in 18082ms for sessionid 0x15e51a4b4c60007
   [junit4]   2> 187603 WARN  (jetty-launcher-2012-thread-2-SendThread(127.0.0.1:39315)) [n:127.0.0.1:38703_solr    ] o.a.z.ClientCnxn Client session timed out, have not heard from server in 15311ms for sessionid 0x15e51a4b4c60006
   [junit4]   2> 187604 WARN  (jetty-launcher-2012-thread-1-SendThread(127.0.0.1:39315)) [n:127.0.0.1:40177_solr    ] o.a.z.ClientCnxn Client session timed out, have not heard from server in 16237ms for sessionid 0x15e51a4b4c60005
   [junit4]   2> 187604 WARN  (NIOServerCxn.Factory:0.0.0.0/0.0.0.0:0) [    ] o.a.z.s.NIOServerCnxn caught end of stream exception
   [junit4]   2> EndOfStreamException: Unable to read additional data from client sessionid 0x15e51a4b4c60007, likely client has closed socket
   [junit4]   2> 	at org.apache.zookeeper.server.NIOServerCnxn.doIO(NIOServerCnxn.java:239)
   [junit4]   2> 	at org.apache.zookeeper.server.NIOServerCnxnFactory.run(NIOServerCnxnFactory.java:203)
   [junit4]   2> 	at java.lang.Thread.run(Thread.java:748)
   [junit4]   2> 187604 WARN  (NIOServerCxn.Factory:0.0.0.0/0.0.0.0:0) [    ] o.a.z.s.NIOServerCnxn caught end of stream exception
   [junit4]   2> EndOfStreamException: Unable to read additional data from client sessionid 0x15e51a4b4c60006, likely client has closed socket
   [junit4]   2> 	at org.apache.zookeeper.server.NIOServerCnxn.doIO(NIOServerCnxn.java:239)
   [junit4]   2> 	at org.apache.zookeeper.server.NIOServerCnxnFactory.run(NIOServerCnxnFactory.java:203)
   [junit4]   2> 	at java.lang.Thread.run(Thread.java:748)
   [junit4]   2> 187605 WARN  (NIOServerCxn.Factory:0.0.0.0/0.0.0.0:0) [    ] o.a.z.s.NIOServerCnxn caught end of stream exception
   [junit4]   2> EndOfStreamException: Unable to read additional data from client sessionid 0x15e51a4b4c60005, likely client has closed socket
   [junit4]   2> 	at org.apache.zookeeper.server.NIOServerCnxn.doIO(NIOServerCnxn.java:239)
   [junit4]   2> 	at org.apache.zookeeper.server.NIOServerCnxnFactory.run(NIOServerCnxnFactory.java:203)
   [junit4]   2> 	at java.lang.Thread.run(Thread.java:748)
   [junit4]   2> 187607 WARN  (TEST-TestSolrCloudWithSecureImpersonation.testProxyWrongHost-seed#[CD6C11C21CB0D2D6]) [    ] o.a.h.c.p.ResponseProcessCookies Invalid cookie header: "Set-Cookie: hadoop.auth="u=wrongHost&p=wrongHost&t=test&e=1504644305812&s=H9H3e+fC4FcZzhtwv0AknbkQLTk="; Path=/; Domain=127.0.0.1; Expires= , 05-   -2017 20:45:05 GMT; HttpOnly". Invalid 'expires' attribute: , 05- -2017 20:45:05 GMT
   [junit4]   2> 187607 INFO  (TEST-TestSolrCloudWithSecureImpersonation.testProxyWrongHost-seed#[CD6C11C21CB0D2D6]) [    ] o.a.s.SolrTestCaseJ4 ###Ending testProxyWrongHost
   [junit4]   2> 187616 INFO  (TEST-TestSolrCloudWithSecureImpersonation.testProxyUnknownRemote-seed#[CD6C11C21CB0D2D6]) [    ] o.a.s.SolrTestCaseJ4 ###Starting testProxyUnknownRemote
   [junit4]   2> 187704 INFO  (jetty-launcher-2012-thread-1-EventThread) [n:127.0.0.1:40177_solr    ] o.a.c.f.s.ConnectionStateManager State change: SUSPENDED
   [junit4]   2> 187704 INFO  (jetty-launcher-2012-thread-2-EventThread) [n:127.0.0.1:38703_solr    ] o.a.c.f.s.ConnectionStateManager State change: SUSPENDED
   [junit4]   2> 187704 WARN  (zkCallback-2031-thread-2) [    ] o.a.s.c.c.ConnectionManager Watcher org.apache.solr.common.cloud.ConnectionManager@67dad21a name: ZooKeeperConnection Watcher:127.0.0.1:39315/solr got event WatchedEvent state:Disconnected type:None path:null path: null type: None
   [junit4]   2> 187704 WARN  (zkCallback-2031-thread-2) [    ] o.a.s.c.c.ConnectionManager zkClient has disconnected
   [junit4]   2> 187705 WARN  (zkCallback-2023-thread-2-processing-n:127.0.0.1:40177_solr) [n:127.0.0.1:40177_solr    ] o.a.s.c.c.ConnectionManager Watcher org.apache.solr.common.cloud.ConnectionManager@114b7ae0 name: ZooKeeperConnection Watcher:127.0.0.1:39315/solr got event WatchedEvent state:Disconnected type:None path:null path: null type: None
   [junit4]   2> 187705 WARN  (zkCallback-2024-thread-1-processing-n:127.0.0.1:38703_solr) [n:127.0.0.1:38703_solr    ] o.a.s.c.c.ConnectionManager Watcher org.apache.solr.common.cloud.ConnectionManager@21d3be71 name: ZooKeeperConnection Watcher:127.0.0.1:39315/solr got event WatchedEvent state:Disconnected type:None path:null path: null type: None
   [junit4]   2> 187714 WARN  (zkCallback-2024-thread-1-processing-n:127.0.0.1:38703_solr) [n:127.0.0.1:38703_solr    ] o.a.s.c.c.ConnectionManager zkClient has disconnected
   [junit4]   2> 187714 WARN  (zkCallback-2023-thread-2-processing-n:127.0.0.1:40177_solr) [n:127.0.0.1:40177_solr    ] o.a.s.c.c.ConnectionManager zkClient has disconnected
   [junit4]   2> 189654 WARN  (TEST-TestSolrCloudWithSecureImpersonation.testProxyUnknownRemote-seed#[CD6C11C21CB0D2D6]) [    ] o.a.h.c.p.ResponseProcessCookies Invalid cookie header: "Set-Cookie: hadoop.auth="u=localHostAnyGroup&p=localHostAnyGroup&t=test&e=1504644320841&s=T2qqEfd8naNFhQ6TolfsWRsb5hw="; Path=/; Domain=127.0.0.1; Expires= , 05-   -2017 20:45:20 GMT; HttpOnly". Invalid 'expires' attribute: , 05- -2017 20:45:20 GMT
   [junit4]   2> 189654 INFO  (TEST-TestSolrCloudWithSecureImpersonation.testProxyUnknownRemote-seed#[CD6C11C21CB0D2D6]) [    ] o.a.s.SolrTestCaseJ4 ###Ending testProxyUnknownRemote
   [junit4]   2> 189654 WARN  (TEST-TestSolrCloudWithSecureImpersonation.testForwarding-seed#[CD6C11C21CB0D2D6]-SendThread(127.0.0.1:39315)) [    ] o.a.z.ClientCnxn Unable to reconnect to ZooKeeper service, session 0x15e51a4b4c6000b has expired
   [junit4]   2> 189656 WARN  (zkCallback-2031-thread-2) [    ] o.a.s.c.c.ConnectionManager Watcher org.apache.solr.common.cloud.ConnectionManager@67dad21a name: ZooKeeperConnection Watcher:127.0.0.1:39315/solr got event WatchedEvent state:Expired type:None path:null path: null type: None
   [junit4]   2> 189656 WARN  (zkCallback-2031-thread-2) [    ] o.a.s.c.c.ConnectionManager Our previous ZooKeeper session was expired. Attempting to reconnect to recover relationship with ZooKeeper...
   [junit4]   2> 189656 WARN  (zkCallback-2031-thread-2) [    ] o.a.s.c.c.DefaultConnectionStrategy Connection expired - starting a new one...
   [junit4]   2> 189657 INFO  (zkCallback-2031-thread-2) [    ] o.a.s.c.c.ConnectionManager Connection with ZooKeeper reestablished.
   [junit4]   2> 189658 INFO  (zkCallback-2031-thread-2) [    ] o.a.s.c.c.DefaultConnectionStrategy Reconnected to ZooKeeper
   [junit4]   2> 189658 INFO  (zkCallback-2031-thread-2) [    ] o.a.s.c.c.ConnectionManager Connected:true
   [junit4]   2> 189677 INFO  (TEST-TestSolrCloudWithSecureImpersonation.testProxyValidateAnyHostAnyUser-seed#[CD6C11C21CB0D2D6]) [    ] o.a.s.SolrTestCaseJ4 ###Starting testProxyValidateAnyHostAnyUser
   [junit4]   2> 189680 INFO  (qtp52762699-7932) [n:127.0.0.1:38703_solr    ] o.a.s.h.a.CollectionsHandler Invoked Collection Action :list with params doAs=bar&action=LIST&wt=javabin&version=2 and sendToOCPQueue=true
   [junit4]   2> 189680 INFO  (qtp52762699-7932) [n:127.0.0.1:38703_solr    ] o.a.s.s.HttpSolrCall [admin] webapp=null path=/admin/collections params={doAs=bar&action=LIST&wt=javabin&version=2} status=0 QTime=0
   [junit4]   2> 189681 WARN  (TEST-TestSolrCloudWithSecureImpersonation.testProxyValidateAnyHostAnyUser-seed#[CD6C11C21CB0D2D6]) [    ] o.a.h.c.p.ResponseProcessCookies Invalid cookie header: "Set-Cookie: hadoop.auth="u=anyHostAnyUser&p=anyHostAnyUser&t=test&e=1504644322902&s=1n7sqdFSInjooKAzpnJK9byrgHk="; Path=/; Domain=127.0.0.1; Expires= , 05-   -2017 20:45:22 GMT; HttpOnly". Invalid 'expires' attribute: , 05- -2017 20:45:22 GMT
   [junit4]   2> 189681 INFO  (TEST-TestSolrCloudWithSecureImpersonation.testProxyValidateAnyHostAnyUser-seed#[CD6C11C21CB0D2D6]) [    ] o.a.s.SolrTestCaseJ4 ###Ending testProxyValidateAnyHostAnyUser
   [junit4]   2> 189699 INFO  (TEST-TestSolrCloudWithSecureImpersonation.testProxyInvalidGroup-seed#[CD6C11C21CB0D2D6]) [    ] o.a.s.SolrTestCaseJ4 ###Starting testProxyInvalidGroup
   [junit4]   2> 189732 WARN  (qtp52762699-7930) [    ] o.a.h.s.ShellBasedUnixGroupsMapping got exception trying to get groups for user bar: id: ‘bar’: no such user
   [junit4]   2> id: ‘bar’: no such user
   [junit4]   2> 
   [junit4]   2> 189734 WARN  (TEST-TestSolrCloudWithSecureImpersonation.testProxyInvalidGroup-seed#[CD6C11C21CB0D2D6]) [    ] o.a.h.c.p.ResponseProcessCookies Invalid cookie header: "Set-Cookie: hadoop.auth="u=bogusGroup&p=bogusGroup&t=test&e=1504644322925&s=GmKxxkZhBANIbQ0C6CzhATdiJRI="; Path=/; Domain=127.0.0.1; Expires= , 05-   -2017 20:45:22 GMT; HttpOnly". Invalid 'expires' attribute: , 05- -2017 20:45:22 GMT
   [junit4]   2> 189734 INFO  (TEST-TestSolrCloudWithSecureImpersonation.testProxyInvalidGroup-seed#[CD6C11C21CB0D2D6]) [    ] o.a.s.SolrTestCaseJ4 ###Ending testProxyInvalidGroup
   [junit4]   2> 189761 INFO  (TEST-TestSolrCloudWithSecureImpersonation.testProxyValidateHost-seed#[CD6C11C21CB0D2D6]) [    ] o.a.s.SolrTestCaseJ4 ###Starting testProxyValidateHost
   [junit4]   2> 189763 INFO  (qtp52762699-7940) [n:127.0.0.1:38703_solr    ] o.a.s.h.a.CollectionsHandler Invoked Collection Action :list with params doAs=bar&action=LIST&wt=javabin&version=2 and sendToOCPQueue=true
   [junit4]   2> 189763 INFO  (qtp52762699-7940) [n:127.0.0.1:38703_solr    ] o.a.s.s.HttpSolrCall [admin] webapp=null path=/admin/collections params={doAs=bar&action=LIST&wt=javabin&version=2} status=0 QTime=0
   [junit4]   2> 189764 WARN  (TEST-TestSolrCloudWithSecureImpersonation.testProxyValidateHost-seed#[CD6C11C21CB0D2D6]) [    ] o.a.h.c.p.ResponseProcessCookies Invalid cookie header: "Set-Cookie: hadoop.auth="u=localHostAnyGroup&p=localHostAnyGroup&t=test&e=1504644322985&s=4mHIbl+5vzNTkjx6Z/fpMDFmYAc="; Path=/; Domain=127.0.0.1; Expires= , 05-   -2017 20:45:22 GMT; HttpOnly". Invalid 'expires' attribute: , 05- -2017 20:45:22 GMT
   [junit4]   2> 189764 INFO  (TEST-TestSolrCloudWithSecureImpersonation.testProxyValidateHost-seed#[CD6C11C21CB0D2D6]) [    ] o.a.s.SolrTestCaseJ4 ###Ending testProxyValidateHost
   [junit4]   2> 189789 INFO  (TEST-TestSolrCloudWithSecureImpersonation.testProxyInvalidProxyUser-seed#[CD6C11C21CB0D2D6]) [    ] o.a.s.SolrTestCaseJ4 ###Starting testProxyInvalidProxyUser
   [junit4]   2> 189794 WARN  (TEST-TestSolrCloudWithSecureImpersonation.testProxyInvalidProxyUser-seed#[CD6C11C21CB0D2D6]) [    ] o.a.h.c.p.ResponseProcessCookies Invalid cookie header: "Set-Cookie: hadoop.auth="u=bar&p=bar&t=test&e=1504644323014&s=gzJb0EQ3jwu2A0DRrM8gU9lTYdY="; Path=/; Domain=127.0.0.1; Expires= , 05-   -2017 20:45:23 GMT; HttpOnly". Invalid 'expires' attribute: , 05- -2017 20:45:23 GMT
   [junit4]   2> 189794 INFO  (TEST-TestSolrCloudWithSecureImpersonation.testProxyInvalidProxyUser-seed#[CD6C11C21CB0D2D6]) [    ] o.a.s.SolrTestCaseJ4 ###Ending testProxyInvalidProxyUser
   [junit4]   2> 189816 INFO  (TEST-TestSolrCloudWithSecureImpersonation.testProxyNoConfigGroups-seed#[CD6C11C21CB0D2D6]) [    ] o.a.s.SolrTestCaseJ4 ###Starting testProxyNoConfigGroups
   [junit4]   2> 189820 WARN  (TEST-TestSolrCloudWithSecureImpersonation.testProxyNoConfigGroups-seed#[CD6C11C21CB0D2D6]) [    ] o.a.h.c.p.ResponseProcessCookies Invalid cookie header: "Set-Cookie: hadoop.auth="u=noGroups&p=noGroups&t=test&e=1504644323040&s=ujftYCMDC6SBqO8no6aCJG9lkLU="; Path=/; Domain=127.0.0.1; Expires= , 05-   -2017 20:45:23 GMT; HttpOnly". Invalid 'expires' attribute: , 05- -2017 20:45:23 GMT
   [junit4]   2> 189821 INFO  (TEST-TestSolrCloudWithSecureImpersonation.testProxyNoConfigGroups-seed#[CD6C11C21CB0D2D6]) [    ] o.a.s.SolrTestCaseJ4 ###Ending testProxyNoConfigGroups
   [junit4]   2> 189839 INFO  (TEST-TestSolrCloudWithSecureImpersonation.testProxyValidateGroup-seed#[CD6C11C21CB0D2D6]) [    ] o.a.s.SolrTestCaseJ4 ###Starting testProxyValidateGroup
   [junit4]   2> 189847 INFO  (qtp52762699-7930) [n:127.0.0.1:38703_solr    ] o.a.s.h.a.CollectionsHandler Invoked Collection Action :list with params doAs=jenkins&action=LIST&wt=javabin&version=2 and sendToOCPQueue=true
   [junit4]   2> 189848 INFO  (qtp52762699-7930) [n:127.0.0.1:38703_solr    ] o.a.s.s.HttpSolrCall [admin] webapp=null path=/admin/collections params={doAs=jenkins&action=LIST&wt=javabin&version=2} status=0 QTime=0
   [junit4]   2> 189848 WARN  (TEST-TestSolrCloudWithSecureImpersonation.testProxyValidateGroup-seed#[CD6C11C21CB0D2D6]) [    ] o.a.h.c.p.ResponseProcessCookies Invalid cookie header: "Set-Cookie: hadoop.auth="u=anyHostUsersGroup&p=anyHostUsersGroup&t=test&e=1504644323064&s=u/dHQA6YGUku7+NNb50d6KsUT/4="; Path=/; Domain=127.0.0.1; Expires= , 05-   -2017 20:45:23 GMT; HttpOnly". Invalid 'expires' attribute: , 05- -2017 20:45:23 GMT
   [junit4]   2> 189848 INFO  (TEST-TestSolrCloudWithSecureImpersonation.testProxyValidateGroup-seed#[CD6C11C21CB0D2D6]) [    ] o.a.s.SolrTestCaseJ4 ###Ending testProxyValidateGroup
   [junit4]   2> 189867 INFO  (TEST-TestSolrCloudWithSecureImpersonation.testProxyInvalidRemote-seed#[CD6C11C21CB0D2D6]) [    ] o.a.s.SolrTestCaseJ4 ###Starting testProxyInvalidRemote
   [junit4]   2> 189875 WARN  (TEST-TestSolrCloudWithSecureImpersonation.testProxyInvalidRemote-seed#[CD6C11C21CB0D2D6]) [    ] o.a.h.c.p.ResponseProcessCookies Invalid cookie header: "Set-Cookie: hadoop.auth="u=localHostAnyGroup&p=localHostAnyGroup&t=test&e=1504644323093&s=4GbsjWe3DMKOJuy0kyGC0AXjLGI="; Path=/; Domain=127.0.0.1; Expires= , 05-   -2017 20:45:23 GMT; HttpOnly". Invalid 'expires' attribute: , 05- -2017 20:45:23 GMT
   [junit4]   2> 189876 INFO  (TEST-TestSolrCloudWithSecureImpersonation.testProxyInvalidRemote-seed#[CD6C11C21CB0D2D6]) [    ] o.a.s.SolrTestCaseJ4 ###Ending testProxyInvalidRemote
   [junit4]   2> 189897 INFO  (jetty-closer-2013-thread-2) [    ] o.e.j.s.AbstractConnector Stopped ServerConnector@6b91bf11{HTTP/1.1,[http/1.1]}{127.0.0.1:0}
   [junit4]   2> 189897 INFO  (jetty-closer-2013-thread-1) [    ] o.e.j.s.AbstractConnector Stopped ServerConnector@24758647{HTTP/1.1,[http/1.1]}{127.0.0.1:0}
   [junit4]   2> 189897 INFO  (jetty-closer-2013-thread-2) [    ] o.a.s.c.CoreContainer Shutting down CoreContainer instance=1990776032
   [junit4]   2> 189898 INFO  (jetty-closer-2013-thread-1) [    ] o.a.s.c.CoreContainer Shutting down CoreContainer instance=1961599832
   [junit4]   2> 189898 INFO  (jetty-closer-2013-thread-2) [    ] o.a.s.m.SolrMetricManager Closing metric reporters for: solr.node
   [junit4]   2> 189898 INFO  (jetty-closer-2013-thread-1) [    ] o.a.s.m.SolrMetricManager Closing metric reporters for: solr.node
   [junit4]   2> 189898 INFO  (jetty-closer-2013-thread-2) [    ] o.a.s.m.SolrMetricManager Closing metric reporters for: solr.jvm
   [junit4]   2> 189898 INFO  (jetty-closer-2013-thread-1) [    ] o.a.s.m.SolrMetricManager Closing metric reporters for: solr.jvm
   [junit4]   2> 189898 INFO  (jetty-closer-2013-thread-2) [    ] o.a.s.m.SolrMetricManager Closing metric reporters for: solr.jetty
   [junit4]   2> 189898 INFO  (jetty-closer-2013-thread-1) [    ] o.a.s.m.SolrMetricManager Closing metric reporters for: solr.jetty
   [junit4]   2> 189900 INFO  (zkCallback-2023-thread-2-processing-n:127.0.0.1:40177_solr) [n:127.0.0.1:40177_solr    ] o.a.s.c.c.ZkStateReader A cluster state change: [WatchedEvent state:SyncConnected type:NodeDataChanged path:/collections/forwardingCollection/state.json] for collection [forwardingCollection] has occurred - updating... (live nodes size: [2])
   [junit4]   2> 189918 INFO  (jetty-closer-2013-thread-1) [    ] o.a.s.c.Overseer Overseer (id=98606009698091014-127.0.0.1:38703_solr-n_0000000000) closing
   [junit4]   2> 189918 INFO  (coreCloseExecutor-1298-thread-1) [n:127.0.0.1:40177_solr c:forwardingCollection s:shard1 r:core_node1 x:forwardingCollection_shard1_replica1] o.a.s.c.SolrCore [forwardingCollection_shard1_replica1]  CLOSING SolrCore org.apache.solr.core.SolrCore@17f38e50
   [junit4]   2> 189918 INFO  (OverseerStateUpdate-98606009698091014-127.0.0.1:38703_solr-n_0000000000) [n:127.0.0.1:38703_solr    ] o.a.s.c.Overseer Overseer Loop exiting : 127.0.0.1:38703_solr
   [junit4]   2> 189920 WARN  (zkCallback-2024-thread-5-processing-n:127.0.0.1:38703_solr) [n:127.0.0.1:38703_solr    ] o.a.s.c.c.ZkStateReader ZooKeeper watch triggered, but Solr cannot talk to ZK: [KeeperErrorCode = Session expired for /live_nodes]
   [junit4]   2> 189920 INFO  (zkCallback-2023-thread-5-processing-n:127.0.0.1:40177_solr) [n:127.0.0.1:40177_solr    ] o.a.s.c.OverseerElectionContext I am going to be the leader 127.0.0.1:40177_solr
   [junit4]   2> 189920 INFO  (zkCallback-2023-thread-2-processing-n:127.0.0.1:40177_solr) [n:127.0.0.1:40177_solr    ] o.a.s.c.c.ZkStateReader Updated live nodes from ZooKeeper... (2) -> (1)
   [junit4]   2> 189921 ERROR (Thread[Thread-315,5,TGRP-TestSolrCloudWithSecureImpersonation]) [n:127.0.0.1:38703_solr    ] o.a.h.s.t.d.AbstractDelegationTokenSecretManager ExpiredTokenRemover received java.lang.InterruptedException: sleep interrupted
   [junit4]   2> 189930 INFO  (jetty-closer-2013-thread-1) [    ] o.e.j.s.h.ContextHandler Stopped o.e.j.s.ServletContextHandler@32034801{/solr,null,UNAVAILABLE}
   [junit4]   2> 189946 INFO  (coreCloseExecutor-1298-thread-1) [n:127.0.0.1:40177_solr c:forwardingCollection s:shard1 r:core_node1 x:forwardingCollection_shard1_replica1] o.a.s.m.SolrMetricManager Closing metric reporters for: solr.core.forwardingCollection.shard1.replica1
   [junit4]   2> 189947 WARN  (zkCallback-2023-thread-5-processing-n:127.0.0.1:40177_solr) [n:127.0.0.1:40177_solr    ] o.a.s.c.c.ZkStateReader ZooKeeper watch triggered, but Solr cannot talk to ZK: [KeeperErrorCode = Session expired for /live_nodes]
   [junit4]   2> 189947 WARN  (NIOServerCxn.Factory:0.0.0.0/0.0.0.0:0) [    ] o.a.z.s.NIOServerCnxn caught end of stream exception
   [junit4]   2> EndOfStreamException: Unable to read additional data from client sessionid 0x15e51a4b4c60005, likely client has closed socket
   [junit4]   2> 	at org.apache.zookeeper.server.NIOServerCnxn.doIO(NIOServerCnxn.java:239)
   [junit4]   2> 	at org.apache.zookeeper.server.NIOServerCnxnFactory.run(NIOServerCnxnFactory.java:203)
   [junit4]   2> 	at java.lang.Thread.run(Thread.java:748)
   [junit4]   2> 189949 ERROR (Thread[Thread-316,5,TGRP-TestSolrCloudWithSecureImpersonation]) [n:127.0.0.1:40177_solr    ] o.a.h.s.t.d.AbstractDelegationTokenSecretManager ExpiredTokenRemover received java.lang.InterruptedException: sleep interrupted
   [junit4]   2> 189951 INFO  (jetty-closer-2013-thread-2) [    ] o.e.j.s.h.ContextHandler Stopped o.e.j.s.ServletContextHandler@7064faf1{/solr,null,UNAVAILABLE}
   [junit4]   2> 189952 ERROR (SUITE-TestSolrCloudWithSecureImpersonation-seed#[CD6C11C21CB0D2D6]-worker) [    ] o.a.z.s.ZooKeeperServer ZKShutdownHandler is not registered, so ZooKeeper server won't take any action on ERROR or SHUTDOWN server state changes
   [junit4]   2> 189952 INFO  (SUITE-TestSolrCloudWithSecureImpersonation-seed#[CD6C11C21CB0D2D6]-worker) [    ] o.a.s.c.ZkTestServer connecting to 127.0.0.1:39315 39315
   [junit4]   2> 194619 INFO  (Thread-298) [    ] o.a.s.c.ZkTestServer connecting to 127.0.0.1:39315 39315
   [junit4]   2> 194620 WARN  (Thread-298) [    ] o.a.s.c.ZkTestServer Watch limit violations: 
   [junit4]   2> Maximum concurrent create/delete watches above limit:
   [junit4]   2> 
   [junit4]   2> 	4	/solr/aliases.json
   [junit4]   2> 	4	/solr/clusterprops.json
   [junit4]   2> 	2	/solr/security.json
   [junit4]   2> 
   [junit4]   2> Maximum concurrent data watches above limit:
   [junit4]   2> 
   [junit4]   2> 	4	/solr/clusterstate.json
   [junit4]   2> 	3	/solr/security/zkdtsm/ZKDTSMRoot/ZKDTSMKeyIdRoot
   [junit4]   2> 	2	/solr/security/zkdtsm/ZKDTSMRoot/ZKDTSMMasterKeyRoot/DK_1
   [junit4]   2> 	2	/solr/security/zkdtsm/ZKDTSMRoot/ZKDTSMMasterKeyRoot/DK_3
   [junit4]   2> 	2	/solr/security/zkdtsm/ZKDTSMRoot/ZKDTSMMasterKeyRoot/DK_2
   [junit4]   2> 	2	/solr/security/zkdtsm/ZKDTSMRoot/ZKDTSMMasterKeyRoot/DK_4
   [junit4]   2> 	2	/solr/security/zkdtsm/ZKDTSMRoot/ZKDTSMSeqNumRoot
   [junit4]   2> 
   [junit4]   2> Maximum concurrent children watches above limit:
   [junit4]   2> 
   [junit4]   2> 	4	/solr/live_nodes
   [junit4]   2> 	4	/solr/collections
   [junit4]   2> 	3	/solr/security/zkdtsm/ZKDTSMRoot/ZKDTSMTokensRoot
   [junit4]   2> 	2	/solr/security/zkdtsm/ZKDTSMRoot/ZKDTSMMasterKeyRoot
   [junit4]   2> 
   [junit4]   2> 194630 INFO  (SUITE-TestSolrCloudWithSecureImpersonation-seed#[CD6C11C21CB0D2D6]-worker) [    ] o.a.s.SolrTestCaseJ4 ###deleteCore
   [junit4]   2> 194630 INFO  (SUITE-TestSolrCloudWithSecureImpersonation-seed#[CD6C11C21CB0D2D6]-worker) [    ] o.a.s.SolrTestCaseJ4 ------------------------------------------------------- Done waiting for tracked resources to be released
   [junit4]   2> Sep 05, 2017 10:45:27 AM com.carrotsearch.randomizedtesting.ThreadLeakControl checkThreadLeaks
   [junit4]   2> WARNING: Will linger awaiting termination of 2 leaked thread(s).
   [junit4]   2> Sep 05, 2017 10:45:47 AM com.carrotsearch.randomizedtesting.ThreadLeakControl checkThreadLeaks
   [junit4]   2> SEVERE: 2 threads leaked from SUITE scope at org.apache.solr.cloud.TestSolrCloudWithSecureImpersonation: 
   [junit4]   2>    1) Thread[id=7973, name=jetty-launcher-2012-thread-2-EventThread, state=TIMED_WAITING, group=TGRP-TestSolrCloudWithSecureImpersonation]
   [junit4]   2>         at sun.misc.Unsafe.park(Native Method)
   [junit4]   2>         at java.util.concurrent.locks.LockSupport.parkNanos(LockSupport.java:215)
   [junit4]   2>         at java.util.concurrent.locks.AbstractQueuedSynchronizer.doAcquireSharedNanos(AbstractQueuedSynchronizer.java:1037)
   [junit4]   2>         at java.util.concurrent.locks.AbstractQueuedSynchronizer.tryAcquireSharedNanos(AbstractQueuedSynchronizer.java:1328)
   [junit4]   2>         at java.util.concurrent.CountDownLatch.await(CountDownLatch.java:277)
   [junit4]   2>         at org.apache.curator.CuratorZookeeperClient.internalBlockUntilConnectedOrTimedOut(CuratorZookeeperClient.java:323)
   [junit4]   2>         at org.apache.curator.RetryLoop.callWithRetry(RetryLoop.java:105)
   [junit4]   2>         at org.apache.curator.framework.imps.GetDataBuilderImpl.pathInForeground(GetDataBuilderImpl.java:288)
   [junit4]   2>         at org.apache.curator.framework.imps.GetDataBuilderImpl.forPath(GetDataBuilderImpl.java:279)
   [junit4]   2>         at org.apache.curator.framework.imps.GetDataBuilderImpl.forPath(GetDataBuilderImpl.java:41)
   [junit4]   2>         at org.apache.curator.framework.recipes.shared.SharedValue.readValue(SharedValue.java:244)
   [junit4]   2>         at org.apache.curator.framework.recipes.shared.SharedValue.access$100(SharedValue.java:44)
   [junit4]   2>         at org.apache.curator.framework.recipes.shared.SharedValue$1.process(SharedValue.java:61)
   [junit4]   2>         at org.apache.curator.framework.imps.NamespaceWatcher.process(NamespaceWatcher.java:67)
   [junit4]   2>         at org.apache.zookeeper.ClientCnxn$EventThread.processEvent(ClientCnxn.java:530)
   [junit4]   2>         at org.apache.zookeeper.ClientCnxn$EventThread.run(ClientCnxn.java:505)
   [junit4]   2>    2) Thread[id=7975, name=jetty-launcher-2012-thread-1-EventThread, state=TIMED_WAITING, group=TGRP-TestSolrCloudWithSecureImpersonation]
   [junit4]   2>         at sun.misc.Unsafe.park(Native Method)
   [junit4]   2>         at java.util.concurrent.locks.LockSupport.parkNanos(LockSupport.java:215)
   [junit4]   2>         at java.util.concurrent.locks.AbstractQueuedSynchronizer.doAcquireSharedNanos(AbstractQueuedSynchronizer.java:1037)
   [junit4]   2>         at java.util.concurrent.locks.AbstractQueuedSynchronizer.tryAcquireSharedNanos(AbstractQueuedSynchronizer.java:1328)
   [junit4]   2>         at java.util.concurrent.CountDownLatch.await(CountDownLatch.java:277)
   [junit4]   2>         at org.apache.curator.CuratorZookeeperClient.internalBlockUntilConnectedOrTimedOut(CuratorZookeeperClient.java:323)
   [junit4]   2>         at org.apache.curator.RetryLoop.callWithRetry(RetryLoop.java:105)
   [junit4]   2>         at org.apache.curator.framework.imps.GetDataBuilderImpl.pathInForeground(GetDataBuilderImpl.java:288)
   [junit4]   2>         at org.apache.curator.framework.imps.GetDataBuilderImpl.forPath(GetDataBuilderImpl.java:279)
   [junit4]   2>         at org.apache.curator.framework.imps.GetDataBuilderImpl.forPath(GetDataBuilderImpl.java:41)
   [junit4]   2>         at org.apache.curator.framework.recipes.shared.SharedValue.readValue(SharedValue.java:244)
   [junit4]   2>         at org.apache.curator.framework.recipes.shared.SharedValue.access$100(SharedValue.java:44)
   [junit4]   2>         at org.apache.curator.framework.recipes.shared.SharedValue$1.process(SharedValue.java:61)
   [junit4]   2>         at org.apache.curator.framework.imps.NamespaceWatcher.process(NamespaceWatcher.java:67)
   [junit4]   2>         at org.apache.zookeeper.ClientCnxn$EventThread.processEvent(ClientCnxn.java:530)
   [junit4]   2>         at org.apache.zookeeper.ClientCnxn$EventThread.run(ClientCnxn.java:505)
   [junit4]   2> Sep 05, 2017 10:45:47 AM com.carrotsearch.randomizedtesting.ThreadLeakControl tryToInterruptAll
   [junit4]   2> INFO: Starting to interrupt leaked threads:
   [junit4]   2>    1) Thread[id=7973, name=jetty-launcher-2012-thread-2-EventThread, state=TIMED_WAITING, group=TGRP-TestSolrCloudWithSecureImpersonation]
   [junit4]   2>    2) Thread[id=7975, name=jetty-launcher-2012-thread-1-EventThread, state=TIMED_WAITING, group=TGRP-TestSolrCloudWithSecureImpersonation]
   [junit4]   2> 214728 ERROR (jetty-launcher-2012-thread-1-EventThread) [n:127.0.0.1:40177_solr    ] o.a.c.f.i.CuratorFrameworkImpl Watcher exception
   [junit4]   2> java.lang.InterruptedException
   [junit4]   2> 	at java.util.concurrent.locks.AbstractQueuedSynchronizer.doAcquireSharedNanos(AbstractQueuedSynchronizer.java:1039)
   [junit4]   2> 	at java.util.concurrent.locks.AbstractQueuedSynchronizer.tryAcquireSharedNanos(AbstractQueuedSynchronizer.java:1328)
   [junit4]   2> 	at java.util.concurrent.CountDownLatch.await(CountDownLatch.java:277)
   [junit4]   2> 	at org.apache.curator.CuratorZookeeperClient.internalBlockUntilConnectedOrTimedOut(CuratorZookeeperClient.java:323)
   [junit4]   2> 	at org.apache.curator.RetryLoop.callWithRetry(RetryLoop.java:105)
   [junit4]   2> 	at org.apache.curator.framework.imps.GetDataBuilderImpl.pathInForeground(GetDataBuilderImpl.java:288)
   [junit4]   2> 	at org.apache.curator.framework.imps.GetDataBuilderImpl.forPath(GetDataBuilderImpl.java:279)
   [junit4]   2> 	at org.apache.curator.framework.imps.GetDataBuilderImpl.forPath(GetDataBuilderImpl.java:41)
   [junit4]   2> 	at org.apache.curator.framework.recipes.shared.SharedValue.readValue(SharedValue.java:244)
   [junit4]   2> 	at org.apache.curator.framework.recipes.shared.SharedValue.access$100(SharedValue.java:44)
   [junit4]   2> 	at org.apache.curator.framework.recipes.shared.SharedValue$1.process(SharedValue.java:61)
   [junit4]   2> 	at org.apache.curator.framework.imps.NamespaceWatcher.process(NamespaceWatcher.java:67)
   [junit4]   2> 	at org.apache.zookeeper.ClientCnxn$EventThread.processEvent(ClientCnxn.java:530)
   [junit4]   2> 	at org.apache.zookeeper.ClientCnxn$EventThread.run(ClientCnxn.java:505)
   [junit4]   2> 214731 ERROR (jetty-launcher-2012-thread-2-EventThread) [n:127.0.0.1:38703_solr    ] o.a.c.f.i.CuratorFrameworkImpl Watcher exception
   [junit4]   2> java.lang.InterruptedException
   [junit4]   2> 	at java.util.concurrent.locks.AbstractQueuedSynchronizer.doAcquireSharedNanos(AbstractQueuedSynchronizer.java:1039)
   [junit4]   2> 	at java.util.concurrent.locks.AbstractQueuedSynchronizer.tryAcquireSharedNanos(AbstractQueuedSynchronizer.java:1328)
   [junit4]   2> 	at java.util.concurrent.CountDownLatch.await(CountDownLatch.java:277)
   [junit4]   2> 	at org.apache.curator.CuratorZookeeperClient.internalBlockUntilConnectedOrTimedOut(CuratorZookeeperClient.java:323)
   [junit4]   2> 	at org.apache.curator.RetryLoop.callWithRetry(RetryLoop.java:105)
   [junit4]   2> 	at org.apache.curator.framework.imps.GetDataBuilderImpl.pathInForeground(GetDataBuilderImpl.java:288)
   [junit4]   2> 	at org.apache.curator.framework.imps.GetDataBuilderImpl.forPath(GetDataBuilderImpl.java:279)
   [junit4]   2> 	at org.apache.curator.framework.imps.GetDataBuilderImpl.forPath(GetDataBuilderImpl.java:41)
   [junit4]   2> 	at org.apache.curator.framework.recipes.shared.SharedValue.readValue(SharedValue.java:244)
   [junit4]   2> 	at org.apache.curator.framework.recipes.shared.SharedValue.access$100(SharedValue.java:44)
   [junit4]   2> 	at org.apache.curator.framework.recipes.shared.SharedValue$1.process(SharedValue.java:61)
   [junit4]   2> 	at org.apache.curator.framework.imps.NamespaceWatcher.process(NamespaceWatcher.java:67)
   [junit4]   2> 	at org.apache.zookeeper.ClientCnxn$EventThread.processEvent(ClientCnxn.java:530)
   [junit4]   2> 	at org.apache.zookeeper.ClientCnxn$EventThread.run(ClientCnxn.java:505)
   [junit4]   2> Sep 05, 2017 10:45:47 AM com.carrotsearch.randomizedtesting.ThreadLeakControl tryToInterruptAll
   [junit4]   2> INFO: All leaked threads terminated.
   [junit4]   2> NOTE: test params are: codec=Asserting(Lucene62): {}, docValues:{}, maxPointsInLeafNode=983, maxMBSortInHeap=5.70023978617354, sim=RandomSimilarity(queryNorm=true,coord=yes): {}, locale=he-IL, timezone=America/Caracas
   [junit4]   2> NOTE: Linux 4.10.0-33-generic amd64/Oracle Corporation 1.8.0_144 (64-bit)/cpus=8,threads=1,free=210478256,total=536870912
   [junit4]   2> NOTE: All tests run in this JVM: [RegexBoostProcessorTest, ReturnFieldsTest, TestBadConfig, SolrGraphiteReporterTest, TestStressRecovery, FileBasedSpellCheckerTest, BigEndianAscendingWordDeserializerTest, SynonymTokenizerTest, TestStressLiveNodes, TestBulkSchemaConcurrent, TestPseudoReturnFields, TestPKIAuthenticationPlugin, DistributedFacetPivotSmallAdvancedTest, TestIBSimilarityFactory, HLLUtilTest, ShufflingReplicaListTransformerTest, TestSSLRandomization, TestPushWriter, SolrSlf4jReporterTest, TestPointFields, AnalysisAfterCoreReloadTest, TestFastLRUCache, TestUniqueKeyFieldResource, TestLazyCores, TestNumericTerms32, LeaderElectionContextKeyTest, TestReloadAndDeleteDocs, TestMultiWordSynonyms, TestCoreAdminApis, SSLMigrationTest, TestRemoteStreaming, AtomicUpdatesTest, MissingSegmentRecoveryTest, BJQParserTest, HdfsBasicDistributedZk2Test, TestSolrCloudWithSecureImpersonation]
   [junit4]   2> NOTE: reproduce with: ant test  -Dtestcase=TestSolrCloudWithSecureImpersonation -Dtests.seed=CD6C11C21CB0D2D6 -Dtests.multiplier=3 -Dtests.slow=true -Dtests.locale=he-IL -Dtests.timezone=America/Caracas -Dtests.asserts=true -Dtests.file.encoding=UTF-8
   [junit4] ERROR   0.00s J0 | TestSolrCloudWithSecureImpersonation (suite) <<<
   [junit4]    > Throwable #1: com.carrotsearch.randomizedtesting.ThreadLeakError: 2 threads leaked from SUITE scope at org.apache.solr.cloud.TestSolrCloudWithSecureImpersonation: 
   [junit4]    >    1) Thread[id=7973, name=jetty-launcher-2012-thread-2-EventThread, state=TIMED_WAITING, group=TGRP-TestSolrCloudWithSecureImpersonation]
   [junit4]    >         at sun.misc.Unsafe.park(Native Method)
   [junit4]    >         at java.util.concurrent.locks.LockSupport.parkNanos(LockSupport.java:215)
   [junit4]    >         at java.util.concurrent.locks.AbstractQueuedSynchronizer.doAcquireSharedNanos(AbstractQueuedSynchronizer.java:1037)
   [junit4]    >         at java.util.concurrent.locks.AbstractQueuedSynchronizer.tryAcquireSharedNanos(AbstractQueuedSynchronizer.java:1328)
   [junit4]    >         at java.util.concurrent.CountDownLatch.await(CountDownLatch.java:277)
   [junit4]    >         at org.apache.curator.CuratorZookeeperClient.internalBlockUntilConnectedOrTimedOut(CuratorZookeeperClient.java:323)
   [junit4]    >         at org.apache.curator.RetryLoop.callWithRetry(RetryLoop.java:105)
   [junit4]    >         at org.apache.curator.framework.imps.GetDataBuilderImpl.pathInForeground(GetDataBuilderImpl.java:288)
   [junit4]    >         at org.apache.curator.framework.imps.GetDataBuilderImpl.forPath(GetDataBuilderImpl.java:279)
   [junit4]    >         at org.apache.curator.framework.imps.GetDataBuilderImpl.forPath(GetDataBuilderImpl.java:41)
   [junit4]    >         at org.apache.curator.framework.recipes.shared.SharedValue.readValue(SharedValue.java:244)
   [junit4]    >         at org.apache.curator.framework.recipes.shared.SharedValue.access$100(SharedValue.java:44)
   [junit4]    >         at org.apache.curator.framework.recipes.shared.SharedValue$1.process(SharedValue.java:61)
   [junit4]    >         at org.apache.curator.framework.imps.NamespaceWatcher.process(NamespaceWatcher.java:67)
   [junit4]    >         at org.apache.zookeeper.ClientCnxn$EventThread.processEvent(ClientCnxn.java:530)
   [junit4]    >         at org.apache.zookeeper.ClientCnxn$EventThread.run(ClientCnxn.java:505)
   [junit4]    >    2) Thread[id=7975, name=jetty-launcher-2012-thread-1-EventThread, state=TIMED_WAITING, group=TGRP-TestSolrCloudWithSecureImpersonation]
   [junit4]    >         at sun.misc.Unsafe.park(Native Method)
   [junit4]    >         at java.util.concurrent.locks.LockSupport.parkNanos(LockSupport.java:215)
   [junit4]    >         at java.util.concurrent.locks.AbstractQueuedSynchronizer.doAcquireSharedNanos(AbstractQueuedSynchronizer.java:1037)
   [junit4]    >         at java.util.concurrent.locks.AbstractQueuedSynchronizer.tryAcquireSharedNanos(AbstractQueuedSynchronizer.java:1328)
   [junit4]    >         at java.util.concurrent.CountDownLatch.await(CountDownLatch.java:277)
   [junit4]    >         at org.apache.curator.CuratorZookeeperClient.internalBlockUntilConnectedOrTimedOut(CuratorZookeeperClient.java:323)
   [junit4]    >         at org.apache.curator.RetryLoop.callWithRetry(RetryLoop.java:105)
   [junit4]    >         at org.apache.curator.framework.imps.GetDataBuilderImpl.pathInForeground(GetDataBuilderImpl.java:288)
   [junit4]    >         at org.apache.curator.framework.imps.GetDataBuilderImpl.forPath(GetDataBuilderImpl.java:279)
   [junit4]    >         at org.apache.curator.framework.imps.GetDataBuilderImpl.forPath(GetDataBuilderImpl.java:41)
   [junit4]    >         at org.apache.curator.framework.recipes.shared.SharedValue.readValue(SharedValue.java:244)
   [junit4]    >         at org.apache.curator.framework.recipes.shared.SharedValue.access$100(SharedValue.java:44)
   [junit4]    >         at org.apache.curator.framework.recipes.shared.SharedValue$1.process(SharedValue.java:61)
   [junit4]    >         at org.apache.curator.framework.imps.NamespaceWatcher.process(NamespaceWatcher.java:67)
   [junit4]    >         at org.apache.zookeeper.ClientCnxn$EventThread.processEvent(ClientCnxn.java:530)
   [junit4]    >         at org.apache.zookeeper.ClientCnxn$EventThread.run(ClientCnxn.java:505)
   [junit4]    > 	at __randomizedtesting.SeedInfo.seed([CD6C11C21CB0D2D6]:0)
   [junit4] Completed [90/713 (1!)] on J0 in 45.92s, 12 tests, 1 error <<< FAILURES!

[...truncated 45523 lines...]

Mime
View raw message