lucene-dev mailing list archives

Site index · List index
Message view « Date » · « Thread »
Top « Date » · « Thread »
From "Andrzej Bialecki (JIRA)" <j...@apache.org>
Subject [jira] [Commented] (SOLR-11281) SolrSlf4jReporterTest fails on jenkins
Date Fri, 25 Aug 2017 14:40:01 GMT

    [ https://issues.apache.org/jira/browse/SOLR-11281?page=com.atlassian.jira.plugin.system.issuetabpanels:comment-tabpanel&focusedCommentId=16141694#comment-16141694
] 

Andrzej Bialecki  commented on SOLR-11281:
------------------------------------------

Hmm, not sure what's going on here... it looks as if the LogWatcher was unable to collect
any logs:
{code}
1 tests failed.
FAILED:  org.apache.solr.metrics.reporters.SolrSlf4jReporterTest.testReporter

Error Message:
No 'solr.node' logs in: {numFound=0,start=0,docs=[]}

Stack Trace:
java.lang.AssertionError: No 'solr.node' logs in: {numFound=0,start=0,docs=[]}
	at __randomizedtesting.SeedInfo.seed([26DCC204D41B0BAC:7938EF33BF1798E9]:0)
	at org.junit.Assert.fail(Assert.java:93)
	at org.apache.solr.metrics.reporters.SolrSlf4jReporterTest.testReporter(SolrSlf4jReporterTest.java:85)
	at sun.reflect.NativeMethodAccessorImpl.invoke0(Native Method)
{code}

> SolrSlf4jReporterTest fails on jenkins
> --------------------------------------
>
>                 Key: SOLR-11281
>                 URL: https://issues.apache.org/jira/browse/SOLR-11281
>             Project: Solr
>          Issue Type: Bug
>      Security Level: Public(Default Security Level. Issues are Public) 
>          Components: metrics
>            Reporter: Andrzej Bialecki 
>            Assignee: Andrzej Bialecki 
>            Priority: Minor
>             Fix For: master (8.0), 7.1
>
>
> This test fails frequently on jenkins with a failed assertion:
> {code}
> FAILED:  org.apache.solr.metrics.reporters.SolrSlf4jReporterTest.testReporter
> Error Message:
> Stack Trace:
> java.lang.AssertionError
> 	at __randomizedtesting.SeedInfo.seed([7B977D6F04FCA50C:247350586FF03649]:0)
> 	at org.junit.Assert.fail(Assert.java:92)
> 	at org.junit.Assert.assertTrue(Assert.java:43)
> 	at org.junit.Assert.assertTrue(Assert.java:54)
> 	at org.apache.solr.metrics.reporters.SolrSlf4jReporterTest.testReporter(SolrSlf4jReporterTest.java:84)
> {code}
> A better failure message is needed first, then the test needs a fix to be more robust.



--
This message was sent by Atlassian JIRA
(v6.4.14#64029)

---------------------------------------------------------------------
To unsubscribe, e-mail: dev-unsubscribe@lucene.apache.org
For additional commands, e-mail: dev-help@lucene.apache.org


Mime
View raw message