lucene-dev mailing list archives

Site index · List index
Message view « Date » · « Thread »
Top « Date » · « Thread »
From Policeman Jenkins Server <jenk...@thetaphi.de>
Subject [JENKINS] Lucene-Solr-7.0-Linux (64bit/jdk1.8.0_144) - Build # 256 - Unstable!
Date Fri, 25 Aug 2017 08:15:24 GMT
Build: https://jenkins.thetaphi.de/job/Lucene-Solr-7.0-Linux/256/
Java: 64bit/jdk1.8.0_144 -XX:-UseCompressedOops -XX:+UseSerialGC

1 tests failed.
FAILED:  org.apache.solr.update.HardAutoCommitTest.testCommitWithin

Error Message:
Exception during query

Stack Trace:
java.lang.RuntimeException: Exception during query
	at __randomizedtesting.SeedInfo.seed([3DE0BC426C62F131:8732D33AEF4C1F24]:0)
	at org.apache.solr.SolrTestCaseJ4.assertQ(SolrTestCaseJ4.java:879)
	at org.apache.solr.update.HardAutoCommitTest.testCommitWithin(HardAutoCommitTest.java:100)
	at sun.reflect.NativeMethodAccessorImpl.invoke0(Native Method)
	at sun.reflect.NativeMethodAccessorImpl.invoke(NativeMethodAccessorImpl.java:62)
	at sun.reflect.DelegatingMethodAccessorImpl.invoke(DelegatingMethodAccessorImpl.java:43)
	at java.lang.reflect.Method.invoke(Method.java:498)
	at com.carrotsearch.randomizedtesting.RandomizedRunner.invoke(RandomizedRunner.java:1713)
	at com.carrotsearch.randomizedtesting.RandomizedRunner$8.evaluate(RandomizedRunner.java:907)
	at com.carrotsearch.randomizedtesting.RandomizedRunner$9.evaluate(RandomizedRunner.java:943)
	at com.carrotsearch.randomizedtesting.RandomizedRunner$10.evaluate(RandomizedRunner.java:957)
	at com.carrotsearch.randomizedtesting.rules.SystemPropertiesRestoreRule$1.evaluate(SystemPropertiesRestoreRule.java:57)
	at org.apache.lucene.util.TestRuleSetupTeardownChained$1.evaluate(TestRuleSetupTeardownChained.java:49)
	at org.apache.lucene.util.AbstractBeforeAfterRule$1.evaluate(AbstractBeforeAfterRule.java:45)
	at org.apache.lucene.util.TestRuleThreadAndTestName$1.evaluate(TestRuleThreadAndTestName.java:48)
	at org.apache.lucene.util.TestRuleIgnoreAfterMaxFailures$1.evaluate(TestRuleIgnoreAfterMaxFailures.java:64)
	at org.apache.lucene.util.TestRuleMarkFailure$1.evaluate(TestRuleMarkFailure.java:47)
	at com.carrotsearch.randomizedtesting.rules.StatementAdapter.evaluate(StatementAdapter.java:36)
	at com.carrotsearch.randomizedtesting.ThreadLeakControl$StatementRunner.run(ThreadLeakControl.java:368)
	at com.carrotsearch.randomizedtesting.ThreadLeakControl.forkTimeoutingTask(ThreadLeakControl.java:817)
	at com.carrotsearch.randomizedtesting.ThreadLeakControl$3.evaluate(ThreadLeakControl.java:468)
	at com.carrotsearch.randomizedtesting.RandomizedRunner.runSingleTest(RandomizedRunner.java:916)
	at com.carrotsearch.randomizedtesting.RandomizedRunner$5.evaluate(RandomizedRunner.java:802)
	at com.carrotsearch.randomizedtesting.RandomizedRunner$6.evaluate(RandomizedRunner.java:852)
	at com.carrotsearch.randomizedtesting.RandomizedRunner$7.evaluate(RandomizedRunner.java:863)
	at com.carrotsearch.randomizedtesting.rules.StatementAdapter.evaluate(StatementAdapter.java:36)
	at com.carrotsearch.randomizedtesting.rules.SystemPropertiesRestoreRule$1.evaluate(SystemPropertiesRestoreRule.java:57)
	at org.apache.lucene.util.AbstractBeforeAfterRule$1.evaluate(AbstractBeforeAfterRule.java:45)
	at com.carrotsearch.randomizedtesting.rules.StatementAdapter.evaluate(StatementAdapter.java:36)
	at org.apache.lucene.util.TestRuleStoreClassName$1.evaluate(TestRuleStoreClassName.java:41)
	at com.carrotsearch.randomizedtesting.rules.NoShadowingOrOverridesOnMethodsRule$1.evaluate(NoShadowingOrOverridesOnMethodsRule.java:40)
	at com.carrotsearch.randomizedtesting.rules.NoShadowingOrOverridesOnMethodsRule$1.evaluate(NoShadowingOrOverridesOnMethodsRule.java:40)
	at com.carrotsearch.randomizedtesting.rules.StatementAdapter.evaluate(StatementAdapter.java:36)
	at com.carrotsearch.randomizedtesting.rules.StatementAdapter.evaluate(StatementAdapter.java:36)
	at com.carrotsearch.randomizedtesting.rules.StatementAdapter.evaluate(StatementAdapter.java:36)
	at org.apache.lucene.util.TestRuleAssertionsRequired$1.evaluate(TestRuleAssertionsRequired.java:53)
	at org.apache.lucene.util.TestRuleMarkFailure$1.evaluate(TestRuleMarkFailure.java:47)
	at org.apache.lucene.util.TestRuleIgnoreAfterMaxFailures$1.evaluate(TestRuleIgnoreAfterMaxFailures.java:64)
	at org.apache.lucene.util.TestRuleIgnoreTestSuites$1.evaluate(TestRuleIgnoreTestSuites.java:54)
	at com.carrotsearch.randomizedtesting.rules.StatementAdapter.evaluate(StatementAdapter.java:36)
	at com.carrotsearch.randomizedtesting.ThreadLeakControl$StatementRunner.run(ThreadLeakControl.java:368)
	at java.lang.Thread.run(Thread.java:748)
Caused by: java.lang.RuntimeException: REQUEST FAILED: xpath=//result[@numFound=1]
	xml response was: <?xml version="1.0" encoding="UTF-8"?>
<response>
<lst name="responseHeader"><int name="status">0</int><int name="QTime">0</int></lst><result
name="response" numFound="0" start="0"></result>
</response>

	request was:q=id:529&qt=&start=0&rows=20&version=2.2
	at org.apache.solr.SolrTestCaseJ4.assertQ(SolrTestCaseJ4.java:872)
	... 40 more




Build Log:
[...truncated 10847 lines...]
   [junit4] Suite: org.apache.solr.update.HardAutoCommitTest
   [junit4]   2> Creating dataDir: /home/jenkins/workspace/Lucene-Solr-7.0-Linux/solr/build/solr-core/test/J2/temp/solr.update.HardAutoCommitTest_3DE0BC426C62F131-001/init-core-data-001
   [junit4]   2> 7136 WARN  (SUITE-HardAutoCommitTest-seed#[3DE0BC426C62F131]-worker) [
   ] o.a.s.SolrTestCaseJ4 startTrackingSearchers: numOpens=2 numCloses=2
   [junit4]   2> 7137 INFO  (SUITE-HardAutoCommitTest-seed#[3DE0BC426C62F131]-worker) [
   ] o.a.s.SolrTestCaseJ4 Using PointFields (NUMERIC_POINTS_SYSPROP=true) w/NUMERIC_DOCVALUES_SYSPROP=true
   [junit4]   2> 7138 INFO  (SUITE-HardAutoCommitTest-seed#[3DE0BC426C62F131]-worker) [
   ] o.a.s.SolrTestCaseJ4 Randomized ssl (true) and clientAuth (false) via: @org.apache.solr.util.RandomizeSSL(reason=,
ssl=NaN, value=NaN, clientAuth=NaN)
   [junit4]   2> 7139 INFO  (SUITE-HardAutoCommitTest-seed#[3DE0BC426C62F131]-worker) [
   ] o.a.s.SolrTestCaseJ4 ####initCore
   [junit4]   2> 7140 INFO  (SUITE-HardAutoCommitTest-seed#[3DE0BC426C62F131]-worker) [
   ] o.a.s.c.SolrResourceLoader [null] Added 2 libs to classloader, from paths: [/home/jenkins/workspace/Lucene-Solr-7.0-Linux/solr/core/src/test-files/solr/collection1/lib,
/home/jenkins/workspace/Lucene-Solr-7.0-Linux/solr/core/src/test-files/solr/collection1/lib/classes]
   [junit4]   2> 7214 INFO  (SUITE-HardAutoCommitTest-seed#[3DE0BC426C62F131]-worker) [
   ] o.a.s.c.SolrConfig Using Lucene MatchVersion: 7.0.0
   [junit4]   2> 7287 INFO  (SUITE-HardAutoCommitTest-seed#[3DE0BC426C62F131]-worker) [
   ] o.a.s.s.IndexSchema [null] Schema name=test
   [junit4]   2> 7395 WARN  (SUITE-HardAutoCommitTest-seed#[3DE0BC426C62F131]-worker) [
   ] o.a.s.c.SolrResourceLoader Solr loaded a deprecated plugin/analysis class [solr.WordDelimiterFilterFactory].
Please consult documentation how to replace it accordingly.
   [junit4]   2> 7655 INFO  (SUITE-HardAutoCommitTest-seed#[3DE0BC426C62F131]-worker) [
   ] o.a.s.s.IndexSchema Loaded schema test/1.0 with uniqueid field id
   [junit4]   2> 7767 WARN  (SUITE-HardAutoCommitTest-seed#[3DE0BC426C62F131]-worker) [
   ] o.a.s.m.r.SolrJmxReporter No JMX server found. Not exposing Solr metrics via JMX.
   [junit4]   2> 7767 WARN  (SUITE-HardAutoCommitTest-seed#[3DE0BC426C62F131]-worker) [
   ] o.a.s.m.r.SolrJmxReporter No JMX server found. Not exposing Solr metrics via JMX.
   [junit4]   2> 7767 WARN  (SUITE-HardAutoCommitTest-seed#[3DE0BC426C62F131]-worker) [
   ] o.a.s.m.r.SolrJmxReporter No JMX server found. Not exposing Solr metrics via JMX.
   [junit4]   2> 7794 INFO  (coreLoadExecutor-31-thread-1) [    x:collection1] o.a.s.c.SolrResourceLoader
[null] Added 2 libs to classloader, from paths: [/home/jenkins/workspace/Lucene-Solr-7.0-Linux/solr/core/src/test-files/solr/collection1/lib,
/home/jenkins/workspace/Lucene-Solr-7.0-Linux/solr/core/src/test-files/solr/collection1/lib/classes]
   [junit4]   2> 7833 INFO  (coreLoadExecutor-31-thread-1) [    x:collection1] o.a.s.c.SolrConfig
Using Lucene MatchVersion: 7.0.0
   [junit4]   2> 7876 INFO  (coreLoadExecutor-31-thread-1) [    x:collection1] o.a.s.s.IndexSchema
[collection1] Schema name=test
   [junit4]   2> 8034 INFO  (coreLoadExecutor-31-thread-1) [    x:collection1] o.a.s.s.IndexSchema
Loaded schema test/1.0 with uniqueid field id
   [junit4]   2> 8081 INFO  (coreLoadExecutor-31-thread-1) [    x:collection1] o.a.s.c.CoreContainer
Creating SolrCore 'collection1' using configuration from instancedir /home/jenkins/workspace/Lucene-Solr-7.0-Linux/solr/core/src/test-files/solr/collection1,
trusted=true
   [junit4]   2> 8082 WARN  (coreLoadExecutor-31-thread-1) [    x:collection1] o.a.s.m.r.SolrJmxReporter
No JMX server found. Not exposing Solr metrics via JMX.
   [junit4]   2> 8084 INFO  (coreLoadExecutor-31-thread-1) [    x:collection1] o.a.s.c.SolrCore
solr.RecoveryStrategy.Builder
   [junit4]   2> 8084 INFO  (coreLoadExecutor-31-thread-1) [    x:collection1] o.a.s.c.SolrCore
[[collection1] ] Opening new SolrCore at [/home/jenkins/workspace/Lucene-Solr-7.0-Linux/solr/core/src/test-files/solr/collection1],
dataDir=[/home/jenkins/workspace/Lucene-Solr-7.0-Linux/solr/build/solr-core/test/J2/temp/solr.update.HardAutoCommitTest_3DE0BC426C62F131-001/init-core-data-001/]
   [junit4]   2> 8088 INFO  (coreLoadExecutor-31-thread-1) [    x:collection1] o.a.s.u.RandomMergePolicy
RandomMergePolicy wrapping class org.apache.lucene.index.TieredMergePolicy: [TieredMergePolicy:
maxMergeAtOnce=16, maxMergeAtOnceExplicit=43, maxMergedSegmentMB=33.7626953125, floorSegmentMB=0.326171875,
forceMergeDeletesPctAllowed=10.843509162811687, segmentsPerTier=27.0, maxCFSSegmentSizeMB=8.796093022207999E12,
noCFSRatio=0.36616601026221396
   [junit4]   2> 8189 INFO  (coreLoadExecutor-31-thread-1) [    x:collection1] o.a.s.u.UpdateHandler
Using UpdateLog implementation: org.apache.solr.update.UpdateLog
   [junit4]   2> 8189 INFO  (coreLoadExecutor-31-thread-1) [    x:collection1] o.a.s.u.UpdateLog
Initializing UpdateLog: dataDir= defaultSyncLevel=FLUSH numRecordsToKeep=100 maxNumLogsToKeep=10
numVersionBuckets=65536
   [junit4]   2> 8193 INFO  (coreLoadExecutor-31-thread-1) [    x:collection1] o.a.s.u.CommitTracker
Hard AutoCommit: disabled
   [junit4]   2> 8193 INFO  (coreLoadExecutor-31-thread-1) [    x:collection1] o.a.s.u.CommitTracker
Soft AutoCommit: disabled
   [junit4]   2> 8212 INFO  (coreLoadExecutor-31-thread-1) [    x:collection1] o.a.s.u.RandomMergePolicy
RandomMergePolicy wrapping class org.apache.lucene.index.LogDocMergePolicy: [LogDocMergePolicy:
minMergeSize=1000, mergeFactor=14, maxMergeSize=9223372036854775807, maxMergeSizeForForcedMerge=9223372036854775807,
calibrateSizeByDeletes=false, maxMergeDocs=2147483647, maxCFSSegmentSizeMB=8.796093022207999E12,
noCFSRatio=0.0]
   [junit4]   2> 8241 INFO  (coreLoadExecutor-31-thread-1) [    x:collection1] o.a.s.s.SolrIndexSearcher
Opening [Searcher@782f42bd[collection1] main]
   [junit4]   2> 8242 INFO  (coreLoadExecutor-31-thread-1) [    x:collection1] o.a.s.h.c.SpellCheckComponent
Initializing spell checkers
   [junit4]   2> 8255 INFO  (coreLoadExecutor-31-thread-1) [    x:collection1] o.a.s.s.DirectSolrSpellChecker
init: {name=direct,classname=DirectSolrSpellChecker,field=lowerfilt,minQueryLength=3}
   [junit4]   2> 8335 INFO  (coreLoadExecutor-31-thread-1) [    x:collection1] o.a.s.h.ReplicationHandler
Commits will be reserved for  10000
   [junit4]   2> 8335 INFO  (searcherExecutor-32-thread-1-processing-x:collection1) [ 
  x:collection1] o.a.s.h.c.SpellCheckComponent Loading spell index for spellchecker: default
   [junit4]   2> 8336 INFO  (searcherExecutor-32-thread-1-processing-x:collection1) [ 
  x:collection1] o.a.s.h.c.SpellCheckComponent Loading spell index for spellchecker: direct
   [junit4]   2> 8336 INFO  (searcherExecutor-32-thread-1-processing-x:collection1) [ 
  x:collection1] o.a.s.h.c.SpellCheckComponent Loading spell index for spellchecker: wordbreak
   [junit4]   2> 8336 INFO  (searcherExecutor-32-thread-1-processing-x:collection1) [ 
  x:collection1] o.a.s.h.c.SpellCheckComponent Loading spell index for spellchecker: multipleFields
   [junit4]   2> 8336 INFO  (searcherExecutor-32-thread-1-processing-x:collection1) [ 
  x:collection1] o.a.s.h.c.SpellCheckComponent Loading spell index for spellchecker: jarowinkler
   [junit4]   2> 8337 INFO  (searcherExecutor-32-thread-1-processing-x:collection1) [ 
  x:collection1] o.a.s.h.c.SpellCheckComponent Loading spell index for spellchecker: external
   [junit4]   2> 8337 INFO  (coreLoadExecutor-31-thread-1) [    x:collection1] o.a.s.u.UpdateLog
Could not find max version in index or recent updates, using new clock 1576686354141544448
   [junit4]   2> 8337 INFO  (searcherExecutor-32-thread-1-processing-x:collection1) [ 
  x:collection1] o.a.s.h.c.SpellCheckComponent Loading spell index for spellchecker: freq
   [junit4]   2> 8337 INFO  (searcherExecutor-32-thread-1-processing-x:collection1) [ 
  x:collection1] o.a.s.h.c.SpellCheckComponent Loading spell index for spellchecker: fqcn
   [junit4]   2> 8338 INFO  (searcherExecutor-32-thread-1-processing-x:collection1) [ 
  x:collection1] o.a.s.h.c.SpellCheckComponent Loading spell index for spellchecker: perDict
   [junit4]   2> 8342 INFO  (searcherExecutor-32-thread-1-processing-x:collection1) [ 
  x:collection1] o.a.s.c.SolrCore [collection1] Registered new searcher Searcher@782f42bd[collection1]
main{ExitableDirectoryReader(UninvertingDirectoryReader())}
   [junit4]   2> 8349 INFO  (SUITE-HardAutoCommitTest-seed#[3DE0BC426C62F131]-worker) [
   ] o.a.s.SolrTestCaseJ4 ####initCore end
   [junit4]   2> 8363 INFO  (TEST-HardAutoCommitTest.testCommitWithin-seed#[3DE0BC426C62F131])
[    ] o.a.s.SolrTestCaseJ4 ###Starting testCommitWithin
   [junit4]   2> 8370 INFO  (TEST-HardAutoCommitTest.testCommitWithin-seed#[3DE0BC426C62F131])
[    ] o.a.s.u.DirectUpdateHandler2 [collection1] REMOVING ALL DOCUMENTS FROM INDEX
   [junit4]   2> 8372 INFO  (TEST-HardAutoCommitTest.testCommitWithin-seed#[3DE0BC426C62F131])
[    ] o.a.s.s.SolrIndexSearcher Opening [Searcher@5a209c47[collection1] realtime]
   [junit4]   2> 8373 INFO  (TEST-HardAutoCommitTest.testCommitWithin-seed#[3DE0BC426C62F131])
[    ] o.a.s.u.p.LogUpdateProcessorFactory [collection1]  webapp=null path=null params={_version_=-9223372036854775807&update.distrib=FROMLEADER&versions=true&wt=json&indent=true}{deleteByQuery=*:*
(-9223372036854775807)} 0 8
   [junit4]   2> 8377 ERROR (TEST-HardAutoCommitTest.testCommitWithin-seed#[3DE0BC426C62F131])
[    ] o.a.s.c.CorePropertiesLocator Couldn't load core descriptor from /home/jenkins/workspace/Lucene-Solr-7.0-Linux/solr/core/src/test-files/solr/collection1/core.properties:java.nio.file.NoSuchFileException:
/home/jenkins/workspace/Lucene-Solr-7.0-Linux/solr/core/src/test-files/solr/collection1/core.properties
   [junit4]   2> 8379 INFO  (TEST-HardAutoCommitTest.testCommitWithin-seed#[3DE0BC426C62F131])
[    ] o.a.s.c.SolrResourceLoader [null] Added 2 libs to classloader, from paths: [/home/jenkins/workspace/Lucene-Solr-7.0-Linux/solr/core/src/test-files/solr/collection1/lib,
/home/jenkins/workspace/Lucene-Solr-7.0-Linux/solr/core/src/test-files/solr/collection1/lib/classes]
   [junit4]   2> 8441 INFO  (TEST-HardAutoCommitTest.testCommitWithin-seed#[3DE0BC426C62F131])
[    ] o.a.s.c.SolrConfig Using Lucene MatchVersion: 7.0.0
   [junit4]   2> 8475 INFO  (TEST-HardAutoCommitTest.testCommitWithin-seed#[3DE0BC426C62F131])
[    ] o.a.s.s.IndexSchema [collection1] Schema name=test
   [junit4]   2> 8626 INFO  (TEST-HardAutoCommitTest.testCommitWithin-seed#[3DE0BC426C62F131])
[    ] o.a.s.s.IndexSchema Loaded schema test/1.0 with uniqueid field id
   [junit4]   2> 8641 INFO  (TEST-HardAutoCommitTest.testCommitWithin-seed#[3DE0BC426C62F131])
[    ] o.a.s.c.CoreContainer Reloading SolrCore 'collection1' using configuration from instancedir
/home/jenkins/workspace/Lucene-Solr-7.0-Linux/solr/core/src/test-files/solr/collection1
   [junit4]   2> 8642 WARN  (TEST-HardAutoCommitTest.testCommitWithin-seed#[3DE0BC426C62F131])
[    x:collection1] o.a.s.m.r.SolrJmxReporter No JMX server found. Not exposing Solr metrics
via JMX.
   [junit4]   2> 8642 INFO  (TEST-HardAutoCommitTest.testCommitWithin-seed#[3DE0BC426C62F131])
[    x:collection1] o.a.s.c.SolrCore [[collection1] ] Opening new SolrCore at [/home/jenkins/workspace/Lucene-Solr-7.0-Linux/solr/core/src/test-files/solr/collection1],
dataDir=[/home/jenkins/workspace/Lucene-Solr-7.0-Linux/solr/build/solr-core/test/J2/temp/solr.update.HardAutoCommitTest_3DE0BC426C62F131-001/init-core-data-001/]
   [junit4]   2> 8690 INFO  (TEST-HardAutoCommitTest.testCommitWithin-seed#[3DE0BC426C62F131])
[    x:collection1] o.a.s.u.CommitTracker Hard AutoCommit: disabled
   [junit4]   2> 8691 INFO  (TEST-HardAutoCommitTest.testCommitWithin-seed#[3DE0BC426C62F131])
[    x:collection1] o.a.s.u.CommitTracker Soft AutoCommit: disabled
   [junit4]   2> 8692 INFO  (TEST-HardAutoCommitTest.testCommitWithin-seed#[3DE0BC426C62F131])
[    x:collection1] o.a.s.s.SolrIndexSearcher Opening [Searcher@5580a115[collection1] main]
   [junit4]   2> 8693 INFO  (TEST-HardAutoCommitTest.testCommitWithin-seed#[3DE0BC426C62F131])
[    x:collection1] o.a.s.h.c.SpellCheckComponent Initializing spell checkers
   [junit4]   2> 8694 INFO  (TEST-HardAutoCommitTest.testCommitWithin-seed#[3DE0BC426C62F131])
[    x:collection1] o.a.s.s.DirectSolrSpellChecker init: {name=direct,classname=DirectSolrSpellChecker,field=lowerfilt,minQueryLength=3}
   [junit4]   2> 8697 INFO  (TEST-HardAutoCommitTest.testCommitWithin-seed#[3DE0BC426C62F131])
[    x:collection1] o.a.s.h.ReplicationHandler Commits will be reserved for  10000
   [junit4]   2> 8698 INFO  (searcherExecutor-37-thread-1-processing-x:collection1) [ 
  x:collection1] o.a.s.h.c.SpellCheckComponent Loading spell index for spellchecker: default
   [junit4]   2> 8698 INFO  (TEST-HardAutoCommitTest.testCommitWithin-seed#[3DE0BC426C62F131])
[    x:collection1] o.a.s.u.UpdateLog Could not find max version in index or recent updates,
using new clock 1576686354520080384
   [junit4]   2> 8700 INFO  (searcherExecutor-37-thread-1-processing-x:collection1) [ 
  x:collection1] o.a.s.h.c.SpellCheckComponent Loading spell index for spellchecker: direct
   [junit4]   2> 8700 INFO  (searcherExecutor-37-thread-1-processing-x:collection1) [ 
  x:collection1] o.a.s.h.c.SpellCheckComponent Loading spell index for spellchecker: wordbreak
   [junit4]   2> 8700 INFO  (searcherExecutor-37-thread-1-processing-x:collection1) [ 
  x:collection1] o.a.s.h.c.SpellCheckComponent Loading spell index for spellchecker: multipleFields
   [junit4]   2> 8701 INFO  (searcherExecutor-37-thread-1-processing-x:collection1) [ 
  x:collection1] o.a.s.h.c.SpellCheckComponent Loading spell index for spellchecker: jarowinkler
   [junit4]   2> 8701 INFO  (searcherExecutor-37-thread-1-processing-x:collection1) [ 
  x:collection1] o.a.s.h.c.SpellCheckComponent Loading spell index for spellchecker: external
   [junit4]   2> 8701 INFO  (searcherExecutor-37-thread-1-processing-x:collection1) [ 
  x:collection1] o.a.s.h.c.SpellCheckComponent Loading spell index for spellchecker: freq
   [junit4]   2> 8702 INFO  (searcherExecutor-37-thread-1-processing-x:collection1) [ 
  x:collection1] o.a.s.h.c.SpellCheckComponent Loading spell index for spellchecker: fqcn
   [junit4]   2> 8707 INFO  (searcherExecutor-37-thread-1-processing-x:collection1) [ 
  x:collection1] o.a.s.h.c.SpellCheckComponent Loading spell index for spellchecker: perDict
   [junit4]   2> 8707 INFO  (searcherExecutor-37-thread-1-processing-x:collection1) [ 
  x:collection1] o.a.s.c.SolrCore [collection1] Registered new searcher Searcher@5580a115[collection1]
main{ExitableDirectoryReader(UninvertingDirectoryReader())}
   [junit4]   2> 8708 INFO  (TEST-HardAutoCommitTest.testCommitWithin-seed#[3DE0BC426C62F131])
[    x:collection1] o.a.s.u.RandomMergePolicy RandomMergePolicy wrapping class org.apache.lucene.index.TieredMergePolicy:
[TieredMergePolicy: maxMergeAtOnce=28, maxMergeAtOnceExplicit=34, maxMergedSegmentMB=2.3564453125,
floorSegmentMB=0.62890625, forceMergeDeletesPctAllowed=18.582266860756675, segmentsPerTier=33.0,
maxCFSSegmentSizeMB=8.796093022207999E12, noCFSRatio=0.0
   [junit4]   2> 8709 INFO  (TEST-HardAutoCommitTest.testCommitWithin-seed#[3DE0BC426C62F131])
[    x:collection1] o.a.s.u.DefaultSolrCoreState New IndexWriter is ready to be used.
   [junit4]   2> 8709 INFO  (TEST-HardAutoCommitTest.testCommitWithin-seed#[3DE0BC426C62F131])
[    x:collection1] o.a.s.s.SolrIndexSearcher Opening [Searcher@4ca82aa3[collection1] main]
   [junit4]   2> 8710 INFO  (TEST-HardAutoCommitTest.testCommitWithin-seed#[3DE0BC426C62F131])
[    x:collection1] o.a.s.c.SolrCore [collection1]  CLOSING SolrCore org.apache.solr.core.SolrCore@43188e06
   [junit4]   2> 8710 INFO  (TEST-HardAutoCommitTest.testCommitWithin-seed#[3DE0BC426C62F131])
[    x:collection1] o.a.s.m.SolrMetricManager Closing metric reporters for registry=solr.core.collection1,
tag=1125682694
   [junit4]   2> 8710 INFO  (TEST-HardAutoCommitTest.testCommitWithin-seed#[3DE0BC426C62F131])
[    x:collection1] o.a.s.m.r.SolrJmxReporter Closing reporter [org.apache.solr.metrics.reporters.SolrJmxReporter@3c8bce2:
rootName = null, domain = solr.core.collection1, service url = null, agent id = null] for
registry solr.core.collection1 / null
   [junit4]   2> 8713 INFO  (searcherExecutor-37-thread-1-processing-x:collection1) [ 
  x:collection1] o.a.s.c.SolrCore [collection1] Registered new searcher Searcher@4ca82aa3[collection1]
main{ExitableDirectoryReader(UninvertingDirectoryReader())}
   [junit4]   2> 8760 INFO  (TEST-HardAutoCommitTest.testCommitWithin-seed#[3DE0BC426C62F131])
[    x:collection1] o.a.s.u.p.LogUpdateProcessorFactory [collection1] {add=[529 (1576686354535809024)]}
0 48
   [junit4]   2> 8761 INFO  (TEST-HardAutoCommitTest.testCommitWithin-seed#[3DE0BC426C62F131])
[    x:collection1] o.a.s.c.S.Request [collection1]  webapp=null path=null params={q=id:529&qt=&start=0&rows=20&version=2.2}
hits=0 status=0 QTime=0
   [junit4]   2> 8765 INFO  (TEST-HardAutoCommitTest.testCommitWithin-seed#[3DE0BC426C62F131])
[    x:collection1] o.a.s.u.p.LogUpdateProcessorFactory [collection1] {add=[530 (1576686354589286400)]}
0 53
   [junit4]   2> 8765 INFO  (TEST-HardAutoCommitTest.testCommitWithin-seed#[3DE0BC426C62F131])
[    x:collection1] o.a.s.c.S.Request [collection1]  webapp=null path=null params={q=id:530&qt=&start=0&rows=20&version=2.2}
hits=0 status=0 QTime=0
   [junit4]   2> 8767 INFO  (TEST-HardAutoCommitTest.testCommitWithin-seed#[3DE0BC426C62F131])
[    x:collection1] o.a.s.u.p.LogUpdateProcessorFactory [collection1] {delete=[529 (-1576686354591383552)]}
0 54
   [junit4]   2> 8767 INFO  (TEST-HardAutoCommitTest.testCommitWithin-seed#[3DE0BC426C62F131])
[    x:collection1] o.a.s.c.S.Request [collection1]  webapp=null path=null params={q=id:529&qt=&start=0&rows=20&version=2.2}
hits=0 status=0 QTime=0
   [junit4]   2> 8768 ERROR (TEST-HardAutoCommitTest.testCommitWithin-seed#[3DE0BC426C62F131])
[    x:collection1] o.a.s.SolrTestCaseJ4 REQUEST FAILED: xpath=//result[@numFound=1]
   [junit4]   2> 	xml response was: <?xml version="1.0" encoding="UTF-8"?>
   [junit4]   2> <response>
   [junit4]   2> <lst name="responseHeader"><int name="status">0</int><int
name="QTime">0</int></lst><result name="response" numFound="0" start="0"></result>
   [junit4]   2> </response>
   [junit4]   2> 
   [junit4]   2> 	request was:q=id:529&qt=&start=0&rows=20&version=2.2
   [junit4]   2> 8768 ERROR (TEST-HardAutoCommitTest.testCommitWithin-seed#[3DE0BC426C62F131])
[    x:collection1] o.a.s.SolrTestCaseJ4 REQUEST FAILED: q=id:529&qt=&start=0&rows=20&version=2.2:java.lang.RuntimeException:
REQUEST FAILED: xpath=//result[@numFound=1]
   [junit4]   2> 	xml response was: <?xml version="1.0" encoding="UTF-8"?>
   [junit4]   2> <response>
   [junit4]   2> <lst name="responseHeader"><int name="status">0</int><int
name="QTime">0</int></lst><result name="response" numFound="0" start="0"></result>
   [junit4]   2> </response>
   [junit4]   2> 
   [junit4]   2> 	request was:q=id:529&qt=&start=0&rows=20&version=2.2
   [junit4]   2> 	at org.apache.solr.SolrTestCaseJ4.assertQ(SolrTestCaseJ4.java:872)
   [junit4]   2> 	at org.apache.solr.update.HardAutoCommitTest.testCommitWithin(HardAutoCommitTest.java:100)
   [junit4]   2> 	at sun.reflect.NativeMethodAccessorImpl.invoke0(Native Method)
   [junit4]   2> 	at sun.reflect.NativeMethodAccessorImpl.invoke(NativeMethodAccessorImpl.java:62)
   [junit4]   2> 	at sun.reflect.DelegatingMethodAccessorImpl.invoke(DelegatingMethodAccessorImpl.java:43)
   [junit4]   2> 	at java.lang.reflect.Method.invoke(Method.java:498)
   [junit4]   2> 	at com.carrotsearch.randomizedtesting.RandomizedRunner.invoke(RandomizedRunner.java:1713)
   [junit4]   2> 	at com.carrotsearch.randomizedtesting.RandomizedRunner$8.evaluate(RandomizedRunner.java:907)
   [junit4]   2> 	at com.carrotsearch.randomizedtesting.RandomizedRunner$9.evaluate(RandomizedRunner.java:943)
   [junit4]   2> 	at com.carrotsearch.randomizedtesting.RandomizedRunner$10.evaluate(RandomizedRunner.java:957)
   [junit4]   2> 	at com.carrotsearch.randomizedtesting.rules.SystemPropertiesRestoreRule$1.evaluate(SystemPropertiesRestoreRule.java:57)
   [junit4]   2> 	at org.apache.lucene.util.TestRuleSetupTeardownChained$1.evaluate(TestRuleSetupTeardownChained.java:49)
   [junit4]   2> 	at org.apache.lucene.util.AbstractBeforeAfterRule$1.evaluate(AbstractBeforeAfterRule.java:45)
   [junit4]   2> 	at org.apache.lucene.util.TestRuleThreadAndTestName$1.evaluate(TestRuleThreadAndTestName.java:48)
   [junit4]   2> 	at org.apache.lucene.util.TestRuleIgnoreAfterMaxFailures$1.evaluate(TestRuleIgnoreAfterMaxFailures.java:64)
   [junit4]   2> 	at org.apache.lucene.util.TestRuleMarkFailure$1.evaluate(TestRuleMarkFailure.java:47)
   [junit4]   2> 	at com.carrotsearch.randomizedtesting.rules.StatementAdapter.evaluate(StatementAdapter.java:36)
   [junit4]   2> 	at com.carrotsearch.randomizedtesting.ThreadLeakControl$StatementRunner.run(ThreadLeakControl.java:368)
   [junit4]   2> 	at com.carrotsearch.randomizedtesting.ThreadLeakControl.forkTimeoutingTask(ThreadLeakControl.java:817)
   [junit4]   2> 	at com.carrotsearch.randomizedtesting.ThreadLeakControl$3.evaluate(ThreadLeakControl.java:468)
   [junit4]   2> 	at com.carrotsearch.randomizedtesting.RandomizedRunner.runSingleTest(RandomizedRunner.java:916)
   [junit4]   2> 	at com.carrotsearch.randomizedtesting.RandomizedRunner$5.evaluate(RandomizedRunner.java:802)
   [junit4]   2> 	at com.carrotsearch.randomizedtesting.RandomizedRunner$6.evaluate(RandomizedRunner.java:852)
   [junit4]   2> 	at com.carrotsearch.randomizedtesting.RandomizedRunner$7.evaluate(RandomizedRunner.java:863)
   [junit4]   2> 	at com.carrotsearch.randomizedtesting.rules.StatementAdapter.evaluate(StatementAdapter.java:36)
   [junit4]   2> 	at com.carrotsearch.randomizedtesting.rules.SystemPropertiesRestoreRule$1.evaluate(SystemPropertiesRestoreRule.java:57)
   [junit4]   2> 	at org.apache.lucene.util.AbstractBeforeAfterRule$1.evaluate(AbstractBeforeAfterRule.java:45)
   [junit4]   2> 	at com.carrotsearch.randomizedtesting.rules.StatementAdapter.evaluate(StatementAdapter.java:36)
   [junit4]   2> 	at org.apache.lucene.util.TestRuleStoreClassName$1.evaluate(TestRuleStoreClassName.java:41)
   [junit4]   2> 	at com.carrotsearch.randomizedtesting.rules.NoShadowingOrOverridesOnMethodsRule$1.evaluate(NoShadowingOrOverridesOnMethodsRule.java:40)
   [junit4]   2> 	at com.carrotsearch.randomizedtesting.rules.NoShadowingOrOverridesOnMethodsRule$1.evaluate(NoShadowingOrOverridesOnMethodsRule.java:40)
   [junit4]   2> 	at com.carrotsearch.randomizedtesting.rules.StatementAdapter.evaluate(StatementAdapter.java:36)
   [junit4]   2> 	at com.carrotsearch.randomizedtesting.rules.StatementAdapter.evaluate(StatementAdapter.java:36)
   [junit4]   2> 	at com.carrotsearch.randomizedtesting.rules.StatementAdapter.evaluate(StatementAdapter.java:36)
   [junit4]   2> 	at org.apache.lucene.util.TestRuleAssertionsRequired$1.evaluate(TestRuleAssertionsRequired.java:53)
   [junit4]   2> 	at org.apache.lucene.util.TestRuleMarkFailure$1.evaluate(TestRuleMarkFailure.java:47)
   [junit4]   2> 	at org.apache.lucene.util.TestRuleIgnoreAfterMaxFailures$1.evaluate(TestRuleIgnoreAfterMaxFailures.java:64)
   [junit4]   2> 	at org.apache.lucene.util.TestRuleIgnoreTestSuites$1.evaluate(TestRuleIgnoreTestSuites.java:54)
   [junit4]   2> 	at com.carrotsearch.randomizedtesting.rules.StatementAdapter.evaluate(StatementAdapter.java:36)
   [junit4]   2> 	at com.carrotsearch.randomizedtesting.ThreadLeakControl$StatementRunner.run(ThreadLeakControl.java:368)
   [junit4]   2> 	at java.lang.Thread.run(Thread.java:748)
   [junit4]   2> 
   [junit4]   2> 8769 INFO  (TEST-HardAutoCommitTest.testCommitWithin-seed#[3DE0BC426C62F131])
[    x:collection1] o.a.s.SolrTestCaseJ4 ###Ending testCommitWithin
   [junit4]   2> NOTE: reproduce with: ant test  -Dtestcase=HardAutoCommitTest -Dtests.method=testCommitWithin
-Dtests.seed=3DE0BC426C62F131 -Dtests.multiplier=3 -Dtests.slow=true -Dtests.locale=ja-JP
-Dtests.timezone=Atlantic/Bermuda -Dtests.asserts=true -Dtests.file.encoding=UTF-8
   [junit4] ERROR   0.42s J2 | HardAutoCommitTest.testCommitWithin <<<
   [junit4]    > Throwable #1: java.lang.RuntimeException: Exception during query
   [junit4]    > 	at __randomizedtesting.SeedInfo.seed([3DE0BC426C62F131:8732D33AEF4C1F24]:0)
   [junit4]    > 	at org.apache.solr.SolrTestCaseJ4.assertQ(SolrTestCaseJ4.java:879)
   [junit4]    > 	at org.apache.solr.update.HardAutoCommitTest.testCommitWithin(HardAutoCommitTest.java:100)
   [junit4]    > 	at java.lang.Thread.run(Thread.java:748)
   [junit4]    > Caused by: java.lang.RuntimeException: REQUEST FAILED: xpath=//result[@numFound=1]
   [junit4]    > 	xml response was: <?xml version="1.0" encoding="UTF-8"?>
   [junit4]    > <response>
   [junit4]    > <lst name="responseHeader"><int name="status">0</int><int
name="QTime">0</int></lst><result name="response" numFound="0" start="0"></result>
   [junit4]    > </response>
   [junit4]    > 	request was:q=id:529&qt=&start=0&rows=20&version=2.2
   [junit4]    > 	at org.apache.solr.SolrTestCaseJ4.assertQ(SolrTestCaseJ4.java:872)
   [junit4]    > 	... 40 more
   [junit4]   2> 8772 INFO  (SUITE-HardAutoCommitTest-seed#[3DE0BC426C62F131]-worker) [
   x:collection1] o.a.s.SolrTestCaseJ4 ###deleteCore
   [junit4]   2> 8772 INFO  (SUITE-HardAutoCommitTest-seed#[3DE0BC426C62F131]-worker) [
   x:collection1] o.a.s.c.CoreContainer Shutting down CoreContainer instance=1598297529
   [junit4]   2> 8772 INFO  (SUITE-HardAutoCommitTest-seed#[3DE0BC426C62F131]-worker) [
   x:collection1] o.a.s.m.SolrMetricManager Closing metric reporters for registry=solr.node,
tag=null
   [junit4]   2> 8772 INFO  (SUITE-HardAutoCommitTest-seed#[3DE0BC426C62F131]-worker) [
   x:collection1] o.a.s.m.r.SolrJmxReporter Closing reporter [org.apache.solr.metrics.reporters.SolrJmxReporter@49e40e5d:
rootName = null, domain = solr.node, service url = null, agent id = null] for registry solr.node
/ null
   [junit4]   2> 8772 INFO  (SUITE-HardAutoCommitTest-seed#[3DE0BC426C62F131]-worker) [
   x:collection1] o.a.s.m.SolrMetricManager Closing metric reporters for registry=solr.jvm,
tag=null
   [junit4]   2> 8772 INFO  (SUITE-HardAutoCommitTest-seed#[3DE0BC426C62F131]-worker) [
   x:collection1] o.a.s.m.r.SolrJmxReporter Closing reporter [org.apache.solr.metrics.reporters.SolrJmxReporter@44fb1918:
rootName = null, domain = solr.jvm, service url = null, agent id = null] for registry solr.jvm
/ null
   [junit4]   2> 8772 INFO  (SUITE-HardAutoCommitTest-seed#[3DE0BC426C62F131]-worker) [
   x:collection1] o.a.s.m.SolrMetricManager Closing metric reporters for registry=solr.jetty,
tag=null
   [junit4]   2> 8773 INFO  (SUITE-HardAutoCommitTest-seed#[3DE0BC426C62F131]-worker) [
   x:collection1] o.a.s.m.r.SolrJmxReporter Closing reporter [org.apache.solr.metrics.reporters.SolrJmxReporter@70bc6564:
rootName = null, domain = solr.jetty, service url = null, agent id = null] for registry solr.jetty
/ null
   [junit4]   2> 8773 INFO  (SUITE-HardAutoCommitTest-seed#[3DE0BC426C62F131]-worker) [
   x:collection1] o.a.s.c.TransientSolrCoreCacheDefault Allocating transient cache for 2147483647
transient cores
   [junit4]   2> 8776 INFO  (coreCloseExecutor-41-thread-1-processing-x:collection1) [
   x:collection1] o.a.s.c.SolrCore [collection1]  CLOSING SolrCore org.apache.solr.core.SolrCore@6538b4ff
   [junit4]   2> 8776 INFO  (coreCloseExecutor-41-thread-1-processing-x:collection1) [
   x:collection1] o.a.s.m.SolrMetricManager Closing metric reporters for registry=solr.core.collection1,
tag=1698215167
   [junit4]   2> 8776 INFO  (coreCloseExecutor-41-thread-1-processing-x:collection1) [
   x:collection1] o.a.s.m.r.SolrJmxReporter Closing reporter [org.apache.solr.metrics.reporters.SolrJmxReporter@540cbd00:
rootName = null, domain = solr.core.collection1, service url = null, agent id = null] for
registry solr.core.collection1 / null
   [junit4]   2> 8777 INFO  (coreCloseExecutor-41-thread-1-processing-x:collection1) [
   x:collection1] o.a.s.u.DirectUpdateHandler2 Committing on IndexWriter close.
   [junit4]   2> 8777 INFO  (coreCloseExecutor-41-thread-1-processing-x:collection1) [
   x:collection1] o.a.s.u.SolrIndexWriter Calling setCommitData with IW:org.apache.solr.update.SolrIndexWriter@5ef4d670
commitCommandVersion:0
   [junit4]   2> NOTE: leaving temporary files on disk at: /home/jenkins/workspace/Lucene-Solr-7.0-Linux/solr/build/solr-core/test/J2/temp/solr.update.HardAutoCommitTest_3DE0BC426C62F131-001
   [junit4]   2> NOTE: test params are: codec=Lucene70, sim=RandomSimilarity(queryNorm=true):
{}, locale=ja-JP, timezone=Atlantic/Bermuda
   [junit4]   2> NOTE: Linux 4.10.0-27-generic amd64/Oracle Corporation 1.8.0_144 (64-bit)/cpus=8,threads=1,free=428658552,total=518979584
   [junit4]   2> NOTE: All tests run in this JVM: [ReturnFieldsTest, TestSurroundQueryParser,
TestQueryWrapperFilter, HardAutoCommitTest]
   [junit4] Completed [11/729 (1!)] on J2 in 1.71s, 1 test, 1 error <<< FAILURES!

[...truncated 45780 lines...]

Mime
View raw message