lucene-dev mailing list archives

Site index · List index
Message view « Date » · « Thread »
Top « Date » · « Thread »
From Policeman Jenkins Server <jenk...@thetaphi.de>
Subject [JENKINS-EA] Lucene-Solr-6.6-Linux (64bit/jdk-9-ea+181) - Build # 119 - Still Unstable!
Date Thu, 31 Aug 2017 09:01:03 GMT
Build: https://jenkins.thetaphi.de/job/Lucene-Solr-6.6-Linux/119/
Java: 64bit/jdk-9-ea+181 -XX:-UseCompressedOops -XX:+UseG1GC --illegal-access=deny

1 tests failed.
FAILED:  org.apache.solr.cloud.ChaosMonkeyNothingIsSafeTest.test

Error Message:
document count mismatch.  control=691 sum(shards)=685 cloudClient=685

Stack Trace:
java.lang.AssertionError: document count mismatch.  control=691 sum(shards)=685 cloudClient=685
	at __randomizedtesting.SeedInfo.seed([8CAE2226992DF5FD:4FA1DFC37D19805]:0)
	at org.junit.Assert.fail(Assert.java:93)
	at org.apache.solr.cloud.AbstractFullDistribZkTestBase.checkShardConsistency(AbstractFullDistribZkTestBase.java:1323)
	at org.apache.solr.cloud.ChaosMonkeyNothingIsSafeTest.test(ChaosMonkeyNothingIsSafeTest.java:226)
	at java.base/jdk.internal.reflect.NativeMethodAccessorImpl.invoke0(Native Method)
	at java.base/jdk.internal.reflect.NativeMethodAccessorImpl.invoke(NativeMethodAccessorImpl.java:62)
	at java.base/jdk.internal.reflect.DelegatingMethodAccessorImpl.invoke(DelegatingMethodAccessorImpl.java:43)
	at java.base/java.lang.reflect.Method.invoke(Method.java:564)
	at com.carrotsearch.randomizedtesting.RandomizedRunner.invoke(RandomizedRunner.java:1713)
	at com.carrotsearch.randomizedtesting.RandomizedRunner$8.evaluate(RandomizedRunner.java:907)
	at com.carrotsearch.randomizedtesting.RandomizedRunner$9.evaluate(RandomizedRunner.java:943)
	at com.carrotsearch.randomizedtesting.RandomizedRunner$10.evaluate(RandomizedRunner.java:957)
	at org.apache.solr.BaseDistributedSearchTestCase$ShardsRepeatRule$ShardsFixedStatement.callStatement(BaseDistributedSearchTestCase.java:992)
	at org.apache.solr.BaseDistributedSearchTestCase$ShardsRepeatRule$ShardsStatement.evaluate(BaseDistributedSearchTestCase.java:967)
	at com.carrotsearch.randomizedtesting.rules.SystemPropertiesRestoreRule$1.evaluate(SystemPropertiesRestoreRule.java:57)
	at org.apache.lucene.util.TestRuleSetupTeardownChained$1.evaluate(TestRuleSetupTeardownChained.java:49)
	at org.apache.lucene.util.AbstractBeforeAfterRule$1.evaluate(AbstractBeforeAfterRule.java:45)
	at org.apache.lucene.util.TestRuleThreadAndTestName$1.evaluate(TestRuleThreadAndTestName.java:48)
	at org.apache.lucene.util.TestRuleIgnoreAfterMaxFailures$1.evaluate(TestRuleIgnoreAfterMaxFailures.java:64)
	at org.apache.lucene.util.TestRuleMarkFailure$1.evaluate(TestRuleMarkFailure.java:47)
	at com.carrotsearch.randomizedtesting.rules.StatementAdapter.evaluate(StatementAdapter.java:36)
	at com.carrotsearch.randomizedtesting.ThreadLeakControl$StatementRunner.run(ThreadLeakControl.java:368)
	at com.carrotsearch.randomizedtesting.ThreadLeakControl.forkTimeoutingTask(ThreadLeakControl.java:817)
	at com.carrotsearch.randomizedtesting.ThreadLeakControl$3.evaluate(ThreadLeakControl.java:468)
	at com.carrotsearch.randomizedtesting.RandomizedRunner.runSingleTest(RandomizedRunner.java:916)
	at com.carrotsearch.randomizedtesting.RandomizedRunner$5.evaluate(RandomizedRunner.java:802)
	at com.carrotsearch.randomizedtesting.RandomizedRunner$6.evaluate(RandomizedRunner.java:852)
	at com.carrotsearch.randomizedtesting.RandomizedRunner$7.evaluate(RandomizedRunner.java:863)
	at com.carrotsearch.randomizedtesting.rules.StatementAdapter.evaluate(StatementAdapter.java:36)
	at com.carrotsearch.randomizedtesting.rules.SystemPropertiesRestoreRule$1.evaluate(SystemPropertiesRestoreRule.java:57)
	at org.apache.lucene.util.AbstractBeforeAfterRule$1.evaluate(AbstractBeforeAfterRule.java:45)
	at com.carrotsearch.randomizedtesting.rules.StatementAdapter.evaluate(StatementAdapter.java:36)
	at org.apache.lucene.util.TestRuleStoreClassName$1.evaluate(TestRuleStoreClassName.java:41)
	at com.carrotsearch.randomizedtesting.rules.NoShadowingOrOverridesOnMethodsRule$1.evaluate(NoShadowingOrOverridesOnMethodsRule.java:40)
	at com.carrotsearch.randomizedtesting.rules.NoShadowingOrOverridesOnMethodsRule$1.evaluate(NoShadowingOrOverridesOnMethodsRule.java:40)
	at com.carrotsearch.randomizedtesting.rules.StatementAdapter.evaluate(StatementAdapter.java:36)
	at com.carrotsearch.randomizedtesting.rules.StatementAdapter.evaluate(StatementAdapter.java:36)
	at org.apache.lucene.util.TestRuleAssertionsRequired$1.evaluate(TestRuleAssertionsRequired.java:53)
	at org.apache.lucene.util.TestRuleMarkFailure$1.evaluate(TestRuleMarkFailure.java:47)
	at org.apache.lucene.util.TestRuleIgnoreAfterMaxFailures$1.evaluate(TestRuleIgnoreAfterMaxFailures.java:64)
	at org.apache.lucene.util.TestRuleIgnoreTestSuites$1.evaluate(TestRuleIgnoreTestSuites.java:54)
	at com.carrotsearch.randomizedtesting.rules.StatementAdapter.evaluate(StatementAdapter.java:36)
	at com.carrotsearch.randomizedtesting.ThreadLeakControl$StatementRunner.run(ThreadLeakControl.java:368)
	at java.base/java.lang.Thread.run(Thread.java:844)




Build Log:
[...truncated 12544 lines...]
   [junit4] Suite: org.apache.solr.cloud.ChaosMonkeyNothingIsSafeTest
   [junit4]   2> Creating dataDir: /home/jenkins/workspace/Lucene-Solr-6.6-Linux/solr/build/solr-core/test/J2/temp/solr.cloud.ChaosMonkeyNothingIsSafeTest_8CAE2226992DF5FD-001/init-core-data-001
   [junit4]   2> 1284002 INFO  (SUITE-ChaosMonkeyNothingIsSafeTest-seed#[8CAE2226992DF5FD]-worker) [    ] o.a.s.SolrTestCaseJ4 Using PointFields
   [junit4]   2> 1284002 INFO  (SUITE-ChaosMonkeyNothingIsSafeTest-seed#[8CAE2226992DF5FD]-worker) [    ] o.a.s.SolrTestCaseJ4 Randomized ssl (false) and clientAuth (false) via: @org.apache.solr.SolrTestCaseJ4$SuppressSSL(bugUrl="https://issues.apache.org/jira/browse/SOLR-5776")
   [junit4]   2> 1284002 INFO  (SUITE-ChaosMonkeyNothingIsSafeTest-seed#[8CAE2226992DF5FD]-worker) [    ] o.a.s.BaseDistributedSearchTestCase Setting hostContext system property: /
   [junit4]   2> 1284004 INFO  (TEST-ChaosMonkeyNothingIsSafeTest.test-seed#[8CAE2226992DF5FD]) [    ] o.a.s.c.ZkTestServer STARTING ZK TEST SERVER
   [junit4]   2> 1284006 INFO  (Thread-3543) [    ] o.a.s.c.ZkTestServer client port:0.0.0.0/0.0.0.0:0
   [junit4]   2> 1284006 INFO  (Thread-3543) [    ] o.a.s.c.ZkTestServer Starting server
   [junit4]   2> 1284011 ERROR (Thread-3543) [    ] o.a.z.s.ZooKeeperServer ZKShutdownHandler is not registered, so ZooKeeper server won't take any action on ERROR or SHUTDOWN server state changes
   [junit4]   2> 1284106 INFO  (TEST-ChaosMonkeyNothingIsSafeTest.test-seed#[8CAE2226992DF5FD]) [    ] o.a.s.c.ZkTestServer start zk server on port:46749
   [junit4]   2> 1284110 INFO  (TEST-ChaosMonkeyNothingIsSafeTest.test-seed#[8CAE2226992DF5FD]) [    ] o.a.s.c.AbstractZkTestCase put /home/jenkins/workspace/Lucene-Solr-6.6-Linux/solr/core/src/test-files/solr/collection1/conf/solrconfig-tlog.xml to /configs/conf1/solrconfig.xml
   [junit4]   2> 1284111 INFO  (TEST-ChaosMonkeyNothingIsSafeTest.test-seed#[8CAE2226992DF5FD]) [    ] o.a.s.c.AbstractZkTestCase put /home/jenkins/workspace/Lucene-Solr-6.6-Linux/solr/core/src/test-files/solr/collection1/conf/schema15.xml to /configs/conf1/schema.xml
   [junit4]   2> 1284111 INFO  (TEST-ChaosMonkeyNothingIsSafeTest.test-seed#[8CAE2226992DF5FD]) [    ] o.a.s.c.AbstractZkTestCase put /home/jenkins/workspace/Lucene-Solr-6.6-Linux/solr/core/src/test-files/solr/collection1/conf/solrconfig.snippet.randomindexconfig.xml to /configs/conf1/solrconfig.snippet.randomindexconfig.xml
   [junit4]   2> 1284112 INFO  (TEST-ChaosMonkeyNothingIsSafeTest.test-seed#[8CAE2226992DF5FD]) [    ] o.a.s.c.AbstractZkTestCase put /home/jenkins/workspace/Lucene-Solr-6.6-Linux/solr/core/src/test-files/solr/collection1/conf/stopwords.txt to /configs/conf1/stopwords.txt
   [junit4]   2> 1284112 INFO  (TEST-ChaosMonkeyNothingIsSafeTest.test-seed#[8CAE2226992DF5FD]) [    ] o.a.s.c.AbstractZkTestCase put /home/jenkins/workspace/Lucene-Solr-6.6-Linux/solr/core/src/test-files/solr/collection1/conf/protwords.txt to /configs/conf1/protwords.txt
   [junit4]   2> 1284112 INFO  (TEST-ChaosMonkeyNothingIsSafeTest.test-seed#[8CAE2226992DF5FD]) [    ] o.a.s.c.AbstractZkTestCase put /home/jenkins/workspace/Lucene-Solr-6.6-Linux/solr/core/src/test-files/solr/collection1/conf/currency.xml to /configs/conf1/currency.xml
   [junit4]   2> 1284113 INFO  (TEST-ChaosMonkeyNothingIsSafeTest.test-seed#[8CAE2226992DF5FD]) [    ] o.a.s.c.AbstractZkTestCase put /home/jenkins/workspace/Lucene-Solr-6.6-Linux/solr/core/src/test-files/solr/collection1/conf/enumsConfig.xml to /configs/conf1/enumsConfig.xml
   [junit4]   2> 1284113 INFO  (TEST-ChaosMonkeyNothingIsSafeTest.test-seed#[8CAE2226992DF5FD]) [    ] o.a.s.c.AbstractZkTestCase put /home/jenkins/workspace/Lucene-Solr-6.6-Linux/solr/core/src/test-files/solr/collection1/conf/open-exchange-rates.json to /configs/conf1/open-exchange-rates.json
   [junit4]   2> 1284114 INFO  (TEST-ChaosMonkeyNothingIsSafeTest.test-seed#[8CAE2226992DF5FD]) [    ] o.a.s.c.AbstractZkTestCase put /home/jenkins/workspace/Lucene-Solr-6.6-Linux/solr/core/src/test-files/solr/collection1/conf/mapping-ISOLatin1Accent.txt to /configs/conf1/mapping-ISOLatin1Accent.txt
   [junit4]   2> 1284115 INFO  (TEST-ChaosMonkeyNothingIsSafeTest.test-seed#[8CAE2226992DF5FD]) [    ] o.a.s.c.AbstractZkTestCase put /home/jenkins/workspace/Lucene-Solr-6.6-Linux/solr/core/src/test-files/solr/collection1/conf/old_synonyms.txt to /configs/conf1/old_synonyms.txt
   [junit4]   2> 1284115 INFO  (TEST-ChaosMonkeyNothingIsSafeTest.test-seed#[8CAE2226992DF5FD]) [    ] o.a.s.c.AbstractZkTestCase put /home/jenkins/workspace/Lucene-Solr-6.6-Linux/solr/core/src/test-files/solr/collection1/conf/synonyms.txt to /configs/conf1/synonyms.txt
   [junit4]   2> 1284191 INFO  (TEST-ChaosMonkeyNothingIsSafeTest.test-seed#[8CAE2226992DF5FD]) [    ] o.a.s.SolrTestCaseJ4 Writing core.properties file to /home/jenkins/workspace/Lucene-Solr-6.6-Linux/solr/build/solr-core/test/J2/temp/solr.cloud.ChaosMonkeyNothingIsSafeTest_8CAE2226992DF5FD-001/control-001/cores/collection1
   [junit4]   2> 1284192 INFO  (TEST-ChaosMonkeyNothingIsSafeTest.test-seed#[8CAE2226992DF5FD]) [    ] o.e.j.s.Server jetty-9.3.14.v20161028
   [junit4]   2> 1284193 INFO  (TEST-ChaosMonkeyNothingIsSafeTest.test-seed#[8CAE2226992DF5FD]) [    ] o.e.j.s.h.ContextHandler Started o.e.j.s.ServletContextHandler@2f6d6b29{/,null,AVAILABLE}
   [junit4]   2> 1284194 INFO  (TEST-ChaosMonkeyNothingIsSafeTest.test-seed#[8CAE2226992DF5FD]) [    ] o.e.j.s.AbstractConnector Started ServerConnector@54b4044{HTTP/1.1,[http/1.1]}{127.0.0.1:၃၅၆၇၁}
   [junit4]   2> 1284194 INFO  (TEST-ChaosMonkeyNothingIsSafeTest.test-seed#[8CAE2226992DF5FD]) [    ] o.e.j.s.Server Started @၁၂၈၆၅၇၁ms
   [junit4]   2> 1284194 INFO  (TEST-ChaosMonkeyNothingIsSafeTest.test-seed#[8CAE2226992DF5FD]) [    ] o.a.s.c.s.e.JettySolrRunner Jetty properties: {hostContext=/, solr.data.dir=/home/jenkins/workspace/Lucene-Solr-6.6-Linux/solr/build/solr-core/test/J2/temp/solr.cloud.ChaosMonkeyNothingIsSafeTest_8CAE2226992DF5FD-001/tempDir-001/control/data, hostPort=35671, coreRootDirectory=/home/jenkins/workspace/Lucene-Solr-6.6-Linux/solr/build/solr-core/test/J2/../../../../../../../../../home/jenkins/workspace/Lucene-Solr-6.6-Linux/solr/build/solr-core/test/J2/temp/solr.cloud.ChaosMonkeyNothingIsSafeTest_8CAE2226992DF5FD-001/control-001/cores}
   [junit4]   2> 1284194 ERROR (TEST-ChaosMonkeyNothingIsSafeTest.test-seed#[8CAE2226992DF5FD]) [    ] o.a.s.s.StartupLoggingUtils Missing Java Option solr.log.dir. Logging may be missing or incomplete.
   [junit4]   2> 1284194 INFO  (TEST-ChaosMonkeyNothingIsSafeTest.test-seed#[8CAE2226992DF5FD]) [    ] o.a.s.s.SolrDispatchFilter  ___      _       Welcome to Apache Solr™ version 6.6.1
   [junit4]   2> 1284195 INFO  (TEST-ChaosMonkeyNothingIsSafeTest.test-seed#[8CAE2226992DF5FD]) [    ] o.a.s.s.SolrDispatchFilter / __| ___| |_ _   Starting in cloud mode on port null
   [junit4]   2> 1284195 INFO  (TEST-ChaosMonkeyNothingIsSafeTest.test-seed#[8CAE2226992DF5FD]) [    ] o.a.s.s.SolrDispatchFilter \__ \/ _ \ | '_|  Install dir: null
   [junit4]   2> 1284195 INFO  (TEST-ChaosMonkeyNothingIsSafeTest.test-seed#[8CAE2226992DF5FD]) [    ] o.a.s.s.SolrDispatchFilter |___/\___/_|_|    Start time: 2017-08-31T08:38:29.550044Z
   [junit4]   2> 1284198 INFO  (TEST-ChaosMonkeyNothingIsSafeTest.test-seed#[8CAE2226992DF5FD]) [    ] o.a.s.s.SolrDispatchFilter Loading solr.xml from SolrHome (not found in ZooKeeper)
   [junit4]   2> 1284198 INFO  (TEST-ChaosMonkeyNothingIsSafeTest.test-seed#[8CAE2226992DF5FD]) [    ] o.a.s.c.SolrXmlConfig Loading container configuration from /home/jenkins/workspace/Lucene-Solr-6.6-Linux/solr/build/solr-core/test/J2/temp/solr.cloud.ChaosMonkeyNothingIsSafeTest_8CAE2226992DF5FD-001/control-001/solr.xml
   [junit4]   2> 1284202 INFO  (TEST-ChaosMonkeyNothingIsSafeTest.test-seed#[8CAE2226992DF5FD]) [    ] o.a.s.u.UpdateShardHandler Creating UpdateShardHandler HTTP client with params: socketTimeout=340000&connTimeout=45000&retry=true
   [junit4]   2> 1284202 INFO  (TEST-ChaosMonkeyNothingIsSafeTest.test-seed#[8CAE2226992DF5FD]) [    ] o.a.s.c.ZkContainer Zookeeper client=127.0.0.1:46749/solr
   [junit4]   2> 1284208 INFO  (TEST-ChaosMonkeyNothingIsSafeTest.test-seed#[8CAE2226992DF5FD]) [    ] o.a.s.c.Overseer Overseer (id=null) closing
   [junit4]   2> 1284209 INFO  (TEST-ChaosMonkeyNothingIsSafeTest.test-seed#[8CAE2226992DF5FD]) [    ] o.a.s.c.OverseerElectionContext I am going to be the leader 127.0.0.1:35671_
   [junit4]   2> 1284209 INFO  (TEST-ChaosMonkeyNothingIsSafeTest.test-seed#[8CAE2226992DF5FD]) [    ] o.a.s.c.Overseer Overseer (id=98577200536748036-127.0.0.1:35671_-n_0000000000) starting
   [junit4]   2> 1284211 INFO  (TEST-ChaosMonkeyNothingIsSafeTest.test-seed#[8CAE2226992DF5FD]) [    ] o.a.s.c.ZkController Register node as live in ZooKeeper:/live_nodes/127.0.0.1:35671_
   [junit4]   2> 1284214 INFO  (zkCallback-2074-thread-1) [    ] o.a.s.c.c.ZkStateReader Updated live nodes from ZooKeeper... (0) -> (1)
   [junit4]   2> 1284232 INFO  (TEST-ChaosMonkeyNothingIsSafeTest.test-seed#[8CAE2226992DF5FD]) [    ] o.a.s.c.CorePropertiesLocator Found 1 core definitions underneath /home/jenkins/workspace/Lucene-Solr-6.6-Linux/solr/build/solr-core/test/J2/../../../../../../../../../home/jenkins/workspace/Lucene-Solr-6.6-Linux/solr/build/solr-core/test/J2/temp/solr.cloud.ChaosMonkeyNothingIsSafeTest_8CAE2226992DF5FD-001/control-001/cores
   [junit4]   2> 1284232 INFO  (TEST-ChaosMonkeyNothingIsSafeTest.test-seed#[8CAE2226992DF5FD]) [    ] o.a.s.c.CorePropertiesLocator Cores are: [collection1]
   [junit4]   2> 1284233 INFO  (coreLoadExecutor-5045-thread-1) [    ] o.a.s.c.TransientSolrCoreCacheDefault Allocating transient cache for 4 transient cores
   [junit4]   2> 1284234 INFO  (OverseerStateUpdate-98577200536748036-127.0.0.1:35671_-n_0000000000) [    ] o.a.s.c.o.ReplicaMutator Assigning new node to shard shard=shard1
   [junit4]   2> 1285241 WARN  (coreLoadExecutor-5045-thread-1) [    ] o.a.s.c.Config Beginning with Solr 5.5, <mergePolicy> is deprecated, use <mergePolicyFactory> instead.
   [junit4]   2> 1285241 INFO  (coreLoadExecutor-5045-thread-1) [    ] o.a.s.c.SolrConfig Using Lucene MatchVersion: 6.6.1
   [junit4]   2> 1285254 INFO  (coreLoadExecutor-5045-thread-1) [    ] o.a.s.s.IndexSchema [collection1] Schema name=test
   [junit4]   2> 1285364 INFO  (coreLoadExecutor-5045-thread-1) [    ] o.a.s.s.IndexSchema Loaded schema test/1.6 with uniqueid field id
   [junit4]   2> 1285413 INFO  (coreLoadExecutor-5045-thread-1) [    ] o.a.s.c.CoreContainer Creating SolrCore 'collection1' using configuration from collection control_collection, trusted=true
   [junit4]   2> 1285413 INFO  (coreLoadExecutor-5045-thread-1) [    ] o.a.s.c.SolrCore solr.RecoveryStrategy.Builder
   [junit4]   2> 1285414 INFO  (coreLoadExecutor-5045-thread-1) [    ] o.a.s.c.SolrCore [[collection1] ] Opening new SolrCore at [/home/jenkins/workspace/Lucene-Solr-6.6-Linux/solr/build/solr-core/test/J2/temp/solr.cloud.ChaosMonkeyNothingIsSafeTest_8CAE2226992DF5FD-001/control-001/cores/collection1], dataDir=[/home/jenkins/workspace/Lucene-Solr-6.6-Linux/solr/build/solr-core/test/J2/../../../../../../../../../home/jenkins/workspace/Lucene-Solr-6.6-Linux/solr/build/solr-core/test/J2/temp/solr.cloud.ChaosMonkeyNothingIsSafeTest_8CAE2226992DF5FD-001/control-001/cores/collection1/data/]
   [junit4]   2> 1285414 INFO  (coreLoadExecutor-5045-thread-1) [    ] o.a.s.c.JmxMonitoredMap JMX monitoring is enabled. Adding Solr mbeans to JMX Server: com.sun.jmx.mbeanserver.JmxMBeanServer@61c3f420
   [junit4]   2> 1285416 INFO  (coreLoadExecutor-5045-thread-1) [    ] o.a.s.u.RandomMergePolicy RandomMergePolicy wrapping class org.apache.lucene.index.LogDocMergePolicy: [LogDocMergePolicy: minMergeSize=1000, mergeFactor=48, maxMergeSize=9223372036854775807, maxMergeSizeForForcedMerge=9223372036854775807, calibrateSizeByDeletes=true, maxMergeDocs=2147483647, maxCFSSegmentSizeMB=8.796093022207999E12, noCFSRatio=1.0]
   [junit4]   2> 1285521 WARN  (coreLoadExecutor-5045-thread-1) [    ] o.a.s.c.RequestHandlers INVALID paramSet a in requestHandler {type = requestHandler,name = /dump,class = DumpRequestHandler,attributes = {initParams=a, name=/dump, class=DumpRequestHandler},args = {defaults={a=A,b=B}}}
   [junit4]   2> 1285547 INFO  (coreLoadExecutor-5045-thread-1) [    ] o.a.s.u.UpdateHandler Using UpdateLog implementation: org.apache.solr.update.UpdateLog
   [junit4]   2> 1285547 INFO  (coreLoadExecutor-5045-thread-1) [    ] o.a.s.u.UpdateLog Initializing UpdateLog: dataDir= defaultSyncLevel=FLUSH numRecordsToKeep=100 maxNumLogsToKeep=10 numVersionBuckets=65536
   [junit4]   2> 1285548 INFO  (coreLoadExecutor-5045-thread-1) [    ] o.a.s.u.CommitTracker Hard AutoCommit: if uncommited for 15000ms; 
   [junit4]   2> 1285548 INFO  (coreLoadExecutor-5045-thread-1) [    ] o.a.s.u.CommitTracker Soft AutoCommit: disabled
   [junit4]   2> 1285548 INFO  (coreLoadExecutor-5045-thread-1) [    ] o.a.s.u.RandomMergePolicy RandomMergePolicy wrapping class org.apache.lucene.index.LogDocMergePolicy: [LogDocMergePolicy: minMergeSize=1000, mergeFactor=11, maxMergeSize=9223372036854775807, maxMergeSizeForForcedMerge=9223372036854775807, calibrateSizeByDeletes=true, maxMergeDocs=2147483647, maxCFSSegmentSizeMB=8.796093022207999E12, noCFSRatio=0.0]
   [junit4]   2> 1285549 INFO  (coreLoadExecutor-5045-thread-1) [    ] o.a.s.s.SolrIndexSearcher Opening [Searcher@34e0f71c[collection1] main]
   [junit4]   2> 1285549 INFO  (coreLoadExecutor-5045-thread-1) [    ] o.a.s.r.ManagedResourceStorage Configured ZooKeeperStorageIO with znodeBase: /configs/conf1
   [junit4]   2> 1285549 INFO  (coreLoadExecutor-5045-thread-1) [    ] o.a.s.r.ManagedResourceStorage Loaded null at path _rest_managed.json using ZooKeeperStorageIO:path=/configs/conf1
   [junit4]   2> 1285550 INFO  (coreLoadExecutor-5045-thread-1) [    ] o.a.s.h.ReplicationHandler Commits will be reserved for  10000
   [junit4]   2> 1285550 INFO  (searcherExecutor-5046-thread-1) [    ] o.a.s.c.SolrCore [collection1] Registered new searcher Searcher@34e0f71c[collection1] main{ExitableDirectoryReader(UninvertingDirectoryReader())}
   [junit4]   2> 1285550 INFO  (coreLoadExecutor-5045-thread-1) [    ] o.a.s.u.UpdateLog Could not find max version in index or recent updates, using new clock 1577235210205921280
   [junit4]   2> 1285553 INFO  (coreZkRegister-5038-thread-1) [    ] o.a.s.c.ShardLeaderElectionContext Enough replicas found to continue.
   [junit4]   2> 1285553 INFO  (coreZkRegister-5038-thread-1) [    ] o.a.s.c.ShardLeaderElectionContext I may be the new leader - try and sync
   [junit4]   2> 1285553 INFO  (coreZkRegister-5038-thread-1) [    ] o.a.s.c.SyncStrategy Sync replicas to http://127.0.0.1:35671/collection1/
   [junit4]   2> 1285553 INFO  (coreZkRegister-5038-thread-1) [    ] o.a.s.c.SyncStrategy Sync Success - now sync replicas to me
   [junit4]   2> 1285553 INFO  (coreZkRegister-5038-thread-1) [    ] o.a.s.c.SyncStrategy http://127.0.0.1:35671/collection1/ has no replicas
   [junit4]   2> 1285553 INFO  (coreZkRegister-5038-thread-1) [    ] o.a.s.c.ShardLeaderElectionContext Found all replicas participating in election, clear LIR
   [junit4]   2> 1285554 INFO  (coreZkRegister-5038-thread-1) [    ] o.a.s.c.ShardLeaderElectionContext I am the new leader: http://127.0.0.1:35671/collection1/ shard1
   [junit4]   2> 1285705 INFO  (coreZkRegister-5038-thread-1) [    ] o.a.s.c.ZkController I am the leader, no recovery necessary
   [junit4]   2> 1285740 INFO  (TEST-ChaosMonkeyNothingIsSafeTest.test-seed#[8CAE2226992DF5FD]) [    ] o.a.s.c.c.ZkStateReader Updated live nodes from ZooKeeper... (0) -> (1)
   [junit4]   2> 1285740 INFO  (TEST-ChaosMonkeyNothingIsSafeTest.test-seed#[8CAE2226992DF5FD]) [    ] o.a.s.c.s.i.ZkClientClusterStateProvider Cluster at 127.0.0.1:46749/solr ready
   [junit4]   2> 1285740 INFO  (TEST-ChaosMonkeyNothingIsSafeTest.test-seed#[8CAE2226992DF5FD]) [    ] o.a.s.c.ChaosMonkey monkey: init - expire sessions:false cause connection loss:false
   [junit4]   2> 1285740 INFO  (TEST-ChaosMonkeyNothingIsSafeTest.test-seed#[8CAE2226992DF5FD]) [    ] o.a.s.c.AbstractFullDistribZkTestBase Creating collection1 with stateFormat=2
   [junit4]   2> 1285810 INFO  (TEST-ChaosMonkeyNothingIsSafeTest.test-seed#[8CAE2226992DF5FD]) [    ] o.a.s.SolrTestCaseJ4 Writing core.properties file to /home/jenkins/workspace/Lucene-Solr-6.6-Linux/solr/build/solr-core/test/J2/temp/solr.cloud.ChaosMonkeyNothingIsSafeTest_8CAE2226992DF5FD-001/shard-1-001/cores/collection1
   [junit4]   2> 1285810 INFO  (TEST-ChaosMonkeyNothingIsSafeTest.test-seed#[8CAE2226992DF5FD]) [    ] o.a.s.c.AbstractFullDistribZkTestBase create jetty 1 in directory /home/jenkins/workspace/Lucene-Solr-6.6-Linux/solr/build/solr-core/test/J2/temp/solr.cloud.ChaosMonkeyNothingIsSafeTest_8CAE2226992DF5FD-001/shard-1-001
   [junit4]   2> 1285810 INFO  (TEST-ChaosMonkeyNothingIsSafeTest.test-seed#[8CAE2226992DF5FD]) [    ] o.e.j.s.Server jetty-9.3.14.v20161028
   [junit4]   2> 1285811 INFO  (TEST-ChaosMonkeyNothingIsSafeTest.test-seed#[8CAE2226992DF5FD]) [    ] o.e.j.s.h.ContextHandler Started o.e.j.s.ServletContextHandler@61856d9c{/,null,AVAILABLE}
   [junit4]   2> 1285812 INFO  (TEST-ChaosMonkeyNothingIsSafeTest.test-seed#[8CAE2226992DF5FD]) [    ] o.e.j.s.AbstractConnector Started ServerConnector@511abcbe{HTTP/1.1,[http/1.1]}{127.0.0.1:၃၆၈၇၅}
   [junit4]   2> 1285812 INFO  (TEST-ChaosMonkeyNothingIsSafeTest.test-seed#[8CAE2226992DF5FD]) [    ] o.e.j.s.Server Started @၁၂၈၈၁၈၉ms
   [junit4]   2> 1285812 INFO  (TEST-ChaosMonkeyNothingIsSafeTest.test-seed#[8CAE2226992DF5FD]) [    ] o.a.s.c.s.e.JettySolrRunner Jetty properties: {hostContext=/, solrconfig=solrconfig.xml, solr.data.dir=/home/jenkins/workspace/Lucene-Solr-6.6-Linux/solr/build/solr-core/test/J2/temp/solr.cloud.ChaosMonkeyNothingIsSafeTest_8CAE2226992DF5FD-001/tempDir-001/jetty1, hostPort=36875, coreRootDirectory=/home/jenkins/workspace/Lucene-Solr-6.6-Linux/solr/build/solr-core/test/J2/../../../../../../../../../home/jenkins/workspace/Lucene-Solr-6.6-Linux/solr/build/solr-core/test/J2/temp/solr.cloud.ChaosMonkeyNothingIsSafeTest_8CAE2226992DF5FD-001/shard-1-001/cores}
   [junit4]   2> 1285812 ERROR (TEST-ChaosMonkeyNothingIsSafeTest.test-seed#[8CAE2226992DF5FD]) [    ] o.a.s.s.StartupLoggingUtils Missing Java Option solr.log.dir. Logging may be missing or incomplete.
   [junit4]   2> 1285812 INFO  (TEST-ChaosMonkeyNothingIsSafeTest.test-seed#[8CAE2226992DF5FD]) [    ] o.a.s.s.SolrDispatchFilter  ___      _       Welcome to Apache Solr™ version 6.6.1
   [junit4]   2> 1285812 INFO  (TEST-ChaosMonkeyNothingIsSafeTest.test-seed#[8CAE2226992DF5FD]) [    ] o.a.s.s.SolrDispatchFilter / __| ___| |_ _   Starting in cloud mode on port null
   [junit4]   2> 1285812 INFO  (TEST-ChaosMonkeyNothingIsSafeTest.test-seed#[8CAE2226992DF5FD]) [    ] o.a.s.s.SolrDispatchFilter \__ \/ _ \ | '_|  Install dir: null
   [junit4]   2> 1285812 INFO  (TEST-ChaosMonkeyNothingIsSafeTest.test-seed#[8CAE2226992DF5FD]) [    ] o.a.s.s.SolrDispatchFilter |___/\___/_|_|    Start time: 2017-08-31T08:38:31.167769Z
   [junit4]   2> 1285814 INFO  (TEST-ChaosMonkeyNothingIsSafeTest.test-seed#[8CAE2226992DF5FD]) [    ] o.a.s.s.SolrDispatchFilter Loading solr.xml from SolrHome (not found in ZooKeeper)
   [junit4]   2> 1285814 INFO  (TEST-ChaosMonkeyNothingIsSafeTest.test-seed#[8CAE2226992DF5FD]) [    ] o.a.s.c.SolrXmlConfig Loading container configuration from /home/jenkins/workspace/Lucene-Solr-6.6-Linux/solr/build/solr-core/test/J2/temp/solr.cloud.ChaosMonkeyNothingIsSafeTest_8CAE2226992DF5FD-001/shard-1-001/solr.xml
   [junit4]   2> 1285817 INFO  (TEST-ChaosMonkeyNothingIsSafeTest.test-seed#[8CAE2226992DF5FD]) [    ] o.a.s.u.UpdateShardHandler Creating UpdateShardHandler HTTP client with params: socketTimeout=340000&connTimeout=45000&retry=true
   [junit4]   2> 1285817 INFO  (TEST-ChaosMonkeyNothingIsSafeTest.test-seed#[8CAE2226992DF5FD]) [    ] o.a.s.c.ZkContainer Zookeeper client=127.0.0.1:46749/solr
   [junit4]   2> 1285821 INFO  (TEST-ChaosMonkeyNothingIsSafeTest.test-seed#[8CAE2226992DF5FD]) [    ] o.a.s.c.c.ZkStateReader Updated live nodes from ZooKeeper... (0) -> (1)
   [junit4]   2> 1285821 INFO  (TEST-ChaosMonkeyNothingIsSafeTest.test-seed#[8CAE2226992DF5FD]) [    ] o.a.s.c.Overseer Overseer (id=null) closing
   [junit4]   2> 1285822 INFO  (TEST-ChaosMonkeyNothingIsSafeTest.test-seed#[8CAE2226992DF5FD]) [    ] o.a.s.c.ZkController Register node as live in ZooKeeper:/live_nodes/127.0.0.1:36875_
   [junit4]   2> 1285823 INFO  (zkCallback-2074-thread-2) [    ] o.a.s.c.c.ZkStateReader Updated live nodes from ZooKeeper... (1) -> (2)
   [junit4]   2> 1285825 INFO  (zkCallback-2078-thread-1) [    ] o.a.s.c.c.ZkStateReader Updated live nodes from ZooKeeper... (1) -> (2)
   [junit4]   2> 1285826 INFO  (zkCallback-2084-thread-1) [    ] o.a.s.c.c.ZkStateReader Updated live nodes from ZooKeeper... (1) -> (2)
   [junit4]   2> 1285851 INFO  (TEST-ChaosMonkeyNothingIsSafeTest.test-seed#[8CAE2226992DF5FD]) [    ] o.a.s.c.CorePropertiesLocator Found 1 core definitions underneath /home/jenkins/workspace/Lucene-Solr-6.6-Linux/solr/build/solr-core/test/J2/../../../../../../../../../home/jenkins/workspace/Lucene-Solr-6.6-Linux/solr/build/solr-core/test/J2/temp/solr.cloud.ChaosMonkeyNothingIsSafeTest_8CAE2226992DF5FD-001/shard-1-001/cores
   [junit4]   2> 1285851 INFO  (TEST-ChaosMonkeyNothingIsSafeTest.test-seed#[8CAE2226992DF5FD]) [    ] o.a.s.c.CorePropertiesLocator Cores are: [collection1]
   [junit4]   2> 1285851 INFO  (coreLoadExecutor-5056-thread-1) [    ] o.a.s.c.TransientSolrCoreCacheDefault Allocating transient cache for 4 transient cores
   [junit4]   2> 1285854 INFO  (OverseerStateUpdate-98577200536748036-127.0.0.1:35671_-n_0000000000) [    ] o.a.s.c.o.ReplicaMutator Assigning new node to shard shard=shard2
   [junit4]   2> 1285955 INFO  (zkCallback-2084-thread-1) [    ] o.a.s.c.c.ZkStateReader A cluster state change: [WatchedEvent state:SyncConnected type:NodeCreated path:/collections/collection1/state.json] for collection [collection1] has occurred - updating... (live nodes size: [2])
   [junit4]   2> 1286864 WARN  (coreLoadExecutor-5056-thread-1) [    ] o.a.s.c.Config Beginning with Solr 5.5, <mergePolicy> is deprecated, use <mergePolicyFactory> instead.
   [junit4]   2> 1286865 INFO  (coreLoadExecutor-5056-thread-1) [    ] o.a.s.c.SolrConfig Using Lucene MatchVersion: 6.6.1
   [junit4]   2> 1286875 INFO  (coreLoadExecutor-5056-thread-1) [    ] o.a.s.s.IndexSchema [collection1] Schema name=test
   [junit4]   2> 1286954 INFO  (coreLoadExecutor-5056-thread-1) [    ] o.a.s.s.IndexSchema Loaded schema test/1.6 with uniqueid field id
   [junit4]   2> 1286968 INFO  (coreLoadExecutor-5056-thread-1) [    ] o.a.s.c.CoreContainer Creating SolrCore 'collection1' using configuration from collection collection1, trusted=true
   [junit4]   2> 1286969 INFO  (coreLoadExecutor-5056-thread-1) [    ] o.a.s.c.SolrCore solr.RecoveryStrategy.Builder
   [junit4]   2> 1286969 INFO  (coreLoadExecutor-5056-thread-1) [    ] o.a.s.c.SolrCore [[collection1] ] Opening new SolrCore at [/home/jenkins/workspace/Lucene-Solr-6.6-Linux/solr/build/solr-core/test/J2/temp/solr.cloud.ChaosMonkeyNothingIsSafeTest_8CAE2226992DF5FD-001/shard-1-001/cores/collection1], dataDir=[/home/jenkins/workspace/Lucene-Solr-6.6-Linux/solr/build/solr-core/test/J2/../../../../../../../../../home/jenkins/workspace/Lucene-Solr-6.6-Linux/solr/build/solr-core/test/J2/temp/solr.cloud.ChaosMonkeyNothingIsSafeTest_8CAE2226992DF5FD-001/shard-1-001/cores/collection1/data/]
   [junit4]   2> 1286969 INFO  (coreLoadExecutor-5056-thread-1) [    ] o.a.s.c.JmxMonitoredMap JMX monitoring is enabled. Adding Solr mbeans to JMX Server: com.sun.jmx.mbeanserver.JmxMBeanServer@61c3f420
   [junit4]   2> 1286970 INFO  (coreLoadExecutor-5056-thread-1) [    ] o.a.s.u.RandomMergePolicy RandomMergePolicy wrapping class org.apache.lucene.index.LogDocMergePolicy: [LogDocMergePolicy: minMergeSize=1000, mergeFactor=48, maxMergeSize=9223372036854775807, maxMergeSizeForForcedMerge=9223372036854775807, calibrateSizeByDeletes=true, maxMergeDocs=2147483647, maxCFSSegmentSizeMB=8.796093022207999E12, noCFSRatio=1.0]
   [junit4]   2> 1287069 WARN  (coreLoadExecutor-5056-thread-1) [    ] o.a.s.c.RequestHandlers INVALID paramSet a in requestHandler {type = requestHandler,name = /dump,class = DumpRequestHandler,attributes = {initParams=a, name=/dump, class=DumpRequestHandler},args = {defaults={a=A,b=B}}}
   [junit4]   2> 1287087 INFO  (coreLoadExecutor-5056-thread-1) [    ] o.a.s.u.UpdateHandler Using UpdateLog implementation: org.apache.solr.update.UpdateLog
   [junit4]   2> 1287088 INFO  (coreLoadExecutor-5056-thread-1) [    ] o.a.s.u.UpdateLog Initializing UpdateLog: dataDir= defaultSyncLevel=FLUSH numRecordsToKeep=100 maxNumLogsToKeep=10 numVersionBuckets=65536
   [junit4]   2> 1287088 INFO  (coreLoadExecutor-5056-thread-1) [    ] o.a.s.u.CommitTracker Hard AutoCommit: if uncommited for 15000ms; 
   [junit4]   2> 1287088 INFO  (coreLoadExecutor-5056-thread-1) [    ] o.a.s.u.CommitTracker Soft AutoCommit: disabled
   [junit4]   2> 1287089 INFO  (coreLoadExecutor-5056-thread-1) [    ] o.a.s.u.RandomMergePolicy RandomMergePolicy wrapping class org.apache.lucene.index.LogDocMergePolicy: [LogDocMergePolicy: minMergeSize=1000, mergeFactor=11, maxMergeSize=9223372036854775807, maxMergeSizeForForcedMerge=9223372036854775807, calibrateSizeByDeletes=true, maxMergeDocs=2147483647, maxCFSSegmentSizeMB=8.796093022207999E12, noCFSRatio=0.0]
   [junit4]   2> 1287089 INFO  (coreLoadExecutor-5056-thread-1) [    ] o.a.s.s.SolrIndexSearcher Opening [Searcher@38707c64[collection1] main]
   [junit4]   2> 1287090 INFO  (coreLoadExecutor-5056-thread-1) [    ] o.a.s.r.ManagedResourceStorage Configured ZooKeeperStorageIO with znodeBase: /configs/conf1
   [junit4]   2> 1287090 INFO  (coreLoadExecutor-5056-thread-1) [    ] o.a.s.r.ManagedResourceStorage Loaded null at path _rest_managed.json using ZooKeeperStorageIO:path=/configs/conf1
   [junit4]   2> 1287090 INFO  (coreLoadExecutor-5056-thread-1) [    ] o.a.s.h.ReplicationHandler Commits will be reserved for  10000
   [junit4]   2> 1287090 INFO  (searcherExecutor-5057-thread-1) [    ] o.a.s.c.SolrCore [collection1] Registered new searcher Searcher@38707c64[collection1] main{ExitableDirectoryReader(UninvertingDirectoryReader())}
   [junit4]   2> 1287091 INFO  (coreLoadExecutor-5056-thread-1) [    ] o.a.s.u.UpdateLog Could not find max version in index or recent updates, using new clock 1577235211821776896
   [junit4]   2> 1287094 INFO  (coreZkRegister-5051-thread-1) [    ] o.a.s.c.ShardLeaderElectionContext Enough replicas found to continue.
   [junit4]   2> 1287094 INFO  (coreZkRegister-5051-thread-1) [    ] o.a.s.c.ShardLeaderElectionContext I may be the new leader - try and sync
   [junit4]   2> 1287094 INFO  (coreZkRegister-5051-thread-1) [    ] o.a.s.c.SyncStrategy Sync replicas to http://127.0.0.1:36875/collection1/
   [junit4]   2> 1287094 INFO  (coreZkRegister-5051-thread-1) [    ] o.a.s.c.SyncStrategy Sync Success - now sync replicas to me
   [junit4]   2> 1287094 INFO  (coreZkRegister-5051-thread-1) [    ] o.a.s.c.SyncStrategy http://127.0.0.1:36875/collection1/ has no replicas
   [junit4]   2> 1287094 INFO  (coreZkRegister-5051-thread-1) [    ] o.a.s.c.ShardLeaderElectionContext Found all replicas participating in election, clear LIR
   [junit4]   2> 1287095 INFO  (coreZkRegister-5051-thread-1) [    ] o.a.s.c.ShardLeaderElectionContext I am the new leader: http://127.0.0.1:36875/collection1/ shard2
   [junit4]   2> 1287196 INFO  (zkCallback-2084-thread-1) [    ] o.a.s.c.c.ZkStateReader A cluster state change: [WatchedEvent state:SyncConnected type:NodeDataChanged path:/collections/collection1/state.json] for collection [collection1] has occurred - updating... (live nodes size: [2])
   [junit4]   2> 1287245 INFO  (coreZkRegister-5051-thread-1) [    ] o.a.s.c.ZkController I am the leader, no recovery necessary
   [junit4]   2> 1287350 INFO  (zkCallback-2084-thread-1) [    ] o.a.s.c.c.ZkStateReader A cluster state change: [WatchedEvent state:SyncConnected type:NodeDataChanged path:/collections/collection1/state.json] for collection [collection1] has occurred - updating... (live nodes size: [2])
   [junit4]   2> 1287432 INFO  (TEST-ChaosMonkeyNothingIsSafeTest.test-seed#[8CAE2226992DF5FD]) [    ] o.a.s.SolrTestCaseJ4 Writing core.properties file to /home/jenkins/workspace/Lucene-Solr-6.6-Linux/solr/build/solr-core/test/J2/temp/solr.cloud.ChaosMonkeyNothingIsSafeTest_8CAE2226992DF5FD-001/shard-2-001/cores/collection1
   [junit4]   2> 1287432 INFO  (TEST-ChaosMonkeyNothingIsSafeTest.test-seed#[8CAE2226992DF5FD]) [    ] o.a.s.c.AbstractFullDistribZkTestBase create jetty 2 in directory /home/jenkins/workspace/Lucene-Solr-6.6-Linux/solr/build/solr-core/test/J2/temp/solr.cloud.ChaosMonkeyNothingIsSafeTest_8CAE2226992DF5FD-001/shard-2-001
   [junit4]   2> 1287433 INFO  (TEST-ChaosMonkeyNothingIsSafeTest.test-seed#[8CAE2226992DF5FD]) [    ] o.e.j.s.Server jetty-9.3.14.v20161028
   [junit4]   2> 1287434 INFO  (TEST-ChaosMonkeyNothingIsSafeTest.test-seed#[8CAE2226992DF5FD]) [    ] o.e.j.s.h.ContextHandler Started o.e.j.s.ServletContextHandler@18c5422e{/,null,AVAILABLE}
   [junit4]   2> 1287434 INFO  (TEST-ChaosMonkeyNothingIsSafeTest.test-seed#[8CAE2226992DF5FD]) [    ] o.e.j.s.AbstractConnector Started ServerConnector@419e10e3{HTTP/1.1,[http/1.1]}{127.0.0.1:၄၁၉၉၅}
   [junit4]   2> 1287434 INFO  (TEST-ChaosMonkeyNothingIsSafeTest.test-seed#[8CAE2226992DF5FD]) [    ] o.e.j.s.Server Started @၁၂၈၉၈၁၁ms
   [junit4]   2> 1287434 INFO  (TEST-ChaosMonkeyNothingIsSafeTest.test-seed#[8CAE2226992DF5FD]) [    ] o.a.s.c.s.e.JettySolrRunner Jetty properties: {hostContext=/, solrconfig=solrconfig.xml, solr.data.dir=/home/jenkins/workspace/Lucene-Solr-6.6-Linux/solr/build/solr-core/test/J2/temp/solr.cloud.ChaosMonkeyNothingIsSafeTest_8CAE2226992DF5FD-001/tempDir-001/jetty2, hostPort=41995, coreRootDirectory=/home/jenkins/workspace/Lucene-Solr-6.6-Linux/solr/build/solr-core/test/J2/temp/solr.cloud.ChaosMonkeyNothingIsSafeTest_8CAE2226992DF5FD-001/shard-2-001/cores}
   [junit4]   2> 1287434 ERROR (TEST-ChaosMonkeyNothingIsSafeTest.test-seed#[8CAE2226992DF5FD]) [    ] o.a.s.s.StartupLoggingUtils Missing Java Option solr.log.dir. Logging may be missing or incomplete.
   [junit4]   2> 1287435 INFO  (TEST-ChaosMonkeyNothingIsSafeTest.test-seed#[8CAE2226992DF5FD]) [    ] o.a.s.s.SolrDispatchFilter  ___      _       Welcome to Apache Solr™ version 6.6.1
   [junit4]   2> 1287435 INFO  (TEST-ChaosMonkeyNothingIsSafeTest.test-seed#[8CAE2226992DF5FD]) [    ] o.a.s.s.SolrDispatchFilter / __| ___| |_ _   Starting in cloud mode on port null
   [junit4]   2> 1287435 INFO  (TEST-ChaosMonkeyNothingIsSafeTest.test-seed#[8CAE2226992DF5FD]) [    ] o.a.s.s.SolrDispatchFilter \__ \/ _ \ | '_|  Install dir: null
   [junit4]   2> 1287435 INFO  (TEST-ChaosMonkeyNothingIsSafeTest.test-seed#[8CAE2226992DF5FD]) [    ] o.a.s.s.SolrDispatchFilter |___/\___/_|_|    Start time: 2017-08-31T08:38:32.790209Z
   [junit4]   2> 1287441 INFO  (TEST-ChaosMonkeyNothingIsSafeTest.test-seed#[8CAE2226992DF5FD]) [    ] o.a.s.s.SolrDispatchFilter Loading solr.xml from SolrHome (not found in ZooKeeper)
   [junit4]   2> 1287441 INFO  (TEST-ChaosMonkeyNothingIsSafeTest.test-seed#[8CAE2226992DF5FD]) [    ] o.a.s.c.SolrXmlConfig Loading container configuration from /home/jenkins/workspace/Lucene-Solr-6.6-Linux/solr/build/solr-core/test/J2/temp/solr.cloud.ChaosMonkeyNothingIsSafeTest_8CAE2226992DF5FD-001/shard-2-001/solr.xml
   [junit4]   2> 1287445 INFO  (TEST-ChaosMonkeyNothingIsSafeTest.test-seed#[8CAE2226992DF5FD]) [    ] o.a.s.u.UpdateShardHandler Creating UpdateShardHandler HTTP client with params: socketTimeout=340000&connTimeout=45000&retry=true
   [junit4]   2> 1287445 INFO  (TEST-ChaosMonkeyNothingIsSafeTest.test-seed#[8CAE2226992DF5FD]) [    ] o.a.s.c.ZkContainer Zookeeper client=127.0.0.1:46749/solr
   [junit4]   2> 1287449 INFO  (TEST-ChaosMonkeyNothingIsSafeTest.test-seed#[8CAE2226992DF5FD]) [    ] o.a.s.c.c.ZkStateReader Updated live nodes from ZooKeeper... (0) -> (2)
   [junit4]   2> 1287450 INFO  (TEST-ChaosMonkeyNothingIsSafeTest.test-seed#[8CAE2226992DF5FD]) [    ] o.a.s.c.Overseer Overseer (id=null) closing
   [junit4]   2> 1287450 INFO  (TEST-ChaosMonkeyNothingIsSafeTest.test-seed#[8CAE2226992DF5FD]) [    ] o.a.s.c.ZkController Register node as live in ZooKeeper:/live_nodes/127.0.0.1:41995_
   [junit4]   2> 1287453 INFO  (zkCallback-2078-thread-1) [    ] o.a.s.c.c.ZkStateReader Updated live nodes from ZooKeeper... (2) -> (3)
   [junit4]   2> 1287453 INFO  (zkCallback-2074-thread-1) [    ] o.a.s.c.c.ZkStateReader Updated live nodes from ZooKeeper... (2) -> (3)
   [junit4]   2> 1287453 INFO  (zkCallback-2084-thread-1) [    ] o.a.s.c.c.ZkStateReader Updated live nodes from ZooKeeper... (2) -> (3)
   [junit4]   2> 1287453 INFO  (zkCallback-2090-thread-1) [    ] o.a.s.c.c.ZkStateReader Updated live nodes from ZooKeeper... (2) -> (3)
   [junit4]   2> 1287470 INFO  (TEST-ChaosMonkeyNothingIsSafeTest.test-seed#[8CAE2226992DF5FD]) [    ] o.a.s.c.CorePropertiesLocator Found 1 core definitions underneath /home/jenkins/workspace/Lucene-Solr-6.6-Linux/solr/build/solr-core/test/J2/temp/solr.cloud.ChaosMonkeyNothingIsSafeTest_8CAE2226992DF5FD-001/shard-2-001/cores
   [junit4]   2> 1287470 INFO  (TEST-ChaosMonkeyNothingIsSafeTest.test-seed#[8CAE2226992DF5FD]) [    ] o.a.s.c.CorePropertiesLocator Cores are: [collection1]
   [junit4]   2> 1287471 INFO  (coreLoadExecutor-5067-thread-1) [    ] o.a.s.c.TransientSolrCoreCacheDefault Allocating transient cache for 4 transient cores
   [junit4]   2> 1287471 INFO  (OverseerStateUpdate-98577200536748036-127.0.0.1:35671_-n_0000000000) [    ] o.a.s.c.o.ReplicaMutator Assigning new node to shard shard=shard1
   [junit4]   2> 1287572 INFO  (zkCallback-2084-thread-1) [    ] o.a.s.c.c.ZkStateReader A cluster state change: [WatchedEvent state:SyncConnected type:NodeDataChanged path:/collections/collection1/state.json] for collection [collection1] has occurred - updating... (live nodes size: [3])
   [junit4]   2> 1287573 INFO  (zkCallback-2090-thread-1) [    ] o.a.s.c.c.ZkStateReader A cluster state change: [WatchedEvent state:SyncConnected type:NodeDataChanged path:/collections/collection1/state.json] for collection [collection1] has occurred - updating... (live nodes size: [3])
   [junit4]   2> 1288476 WARN  (coreLoadExecutor-5067-thread-1) [    ] o.a.s.c.Config Beginning with Solr 5.5, <mergePolicy> is deprecated, use <mergePolicyFactory> instead.
   [junit4]   2> 1288476 INFO  (coreLoadExecutor-5067-thread-1) [    ] o.a.s.c.SolrConfig Using Lucene MatchVersion: 6.6.1
   [junit4]   2> 1288492 INFO  (coreLoadExecutor-5067-thread-1) [    ] o.a.s.s.IndexSchema [collection1] Schema name=test
   [junit4]   2> 1288536 INFO  (coreLoadExecutor-5067-thread-1) [    ] o.a.s.s.IndexSchema Loaded schema test/1.6 with uniqueid field id
   [junit4]   2> 1288550 INFO  (coreLoadExecutor-5067-thread-1) [    ] o.a.s.c.CoreContainer Creating SolrCore 'collection1' using configuration from collection collection1, trusted=true
   [junit4]   2> 1288550 INFO  (coreLoadExecutor-5067-thread-1) [    ] o.a.s.c.SolrCore solr.RecoveryStrategy.Builder
   [junit4]   2> 1288550 INFO  (coreLoadExecutor-5067-thread-1) [    ] o.a.s.c.SolrCore [[collection1] ] Opening new SolrCore at [/home/jenkins/workspace/Lucene-Solr-6.6-Linux/solr/build/solr-core/test/J2/temp/solr.cloud.ChaosMonkeyNothingIsSafeTest_8CAE2226992DF5FD-001/shard-2-001/cores/collection1], dataDir=[/home/jenkins/workspace/Lucene-Solr-6.6-Linux/solr/build/solr-core/test/J2/temp/solr.cloud.ChaosMonkeyNothingIsSafeTest_8CAE2226992DF5FD-001/shard-2-001/cores/collection1/data/]
   [junit4]   2> 1288550 INFO  (coreLoadExecutor-5067-thread-1) [    ] o.a.s.c.JmxMonitoredMap JMX monitoring is enabled. Adding Solr mbeans to JMX Server: com.sun.jmx.mbeanserver.JmxMBeanServer@61c3f420
   [junit4]   2> 1288551 INFO  (coreLoadExecutor-5067-thread-1) [    ] o.a.s.u.RandomMergePolicy RandomMergePolicy wrapping class org.apache.lucene.index.LogDocMergePolicy: [LogDocMergePolicy: minMergeSize=1000, mergeFactor=48, maxMergeSize=9223372036854775807, maxMergeSizeForForcedMerge=9223372036854775807, calibrateSizeByDeletes=true, maxMergeDocs=2147483647, maxCFSSegmentSizeMB=8.796093022207999E12, noCFSRatio=1.0]
   [junit4]   2> 1288575 WARN  (coreLoadExecutor-5067-thread-1) [    ] o.a.s.c.RequestHandlers INVALID paramSet a in requestHandler {type = requestHandler,name = /dump,class = DumpRequestHandler,attributes = {initParams=a, name=/dump, class=DumpRequestHandler},args = {defaults={a=A,b=B}}}
   [junit4]   2> 1288595 INFO  (coreLoadExecutor-5067-thread-1) [    ] o.a.s.u.UpdateHandler Using UpdateLog implementation: org.apache.solr.update.UpdateLog
   [junit4]   2> 1288595 INFO  (coreLoadExecutor-5067-thread-1) [    ] o.a.s.u.UpdateLog Initializing UpdateLog: dataDir= defaultSyncLevel=FLUSH numRecordsToKeep=100 maxNumLogsToKeep=10 numVersionBuckets=65536
   [junit4]   2> 1288603 INFO  (coreLoadExecutor-5067-thread-1) [    ] o.a.s.u.CommitTracker Hard AutoCommit: if uncommited for 15000ms; 
   [junit4]   2> 1288603 INFO  (coreLoadExecutor-5067-thread-1) [    ] o.a.s.u.CommitTracker Soft AutoCommit: disabled
   [junit4]   2> 1288604 INFO  (coreLoadExecutor-5067-thread-1) [    ] o.a.s.u.RandomMergePolicy RandomMergePolicy wrapping class org.apache.lucene.index.LogDocMergePolicy: [LogDocMergePolicy: minMergeSize=1000, mergeFactor=11, maxMergeSize=9223372036854775807, maxMergeSizeForForcedMerge=9223372036854775807, calibrateSizeByDeletes=true, maxMergeDocs=2147483647, maxCFSSegmentSizeMB=8.796093022207999E12, noCFSRatio=0.0]
   [junit4]   2> 1288604 INFO  (coreLoadExecutor-5067-thread-1) [    ] o.a.s.s.SolrIndexSearcher Opening [Searcher@3b9aba89[collection1] main]
   [junit4]   2> 1288604 INFO  (coreLoadExecutor-5067-thread-1) [    ] o.a.s.r.ManagedResourceStorage Configured ZooKeeperStorageIO with znodeBase: /configs/conf1
   [junit4]   2> 1288605 INFO  (coreLoadExecutor-5067-thread-1) [    ] o.a.s.r.ManagedResourceStorage Loaded null at path _rest_managed.json using ZooKeeperStorageIO:path=/configs/conf1
   [junit4]   2> 1288605 INFO  (coreLoadExecutor-5067-thread-1) [    ] o.a.s.h.ReplicationHandler Commits will be reserved for  10000
   [junit4]   2> 1288605 INFO  (searcherExecutor-5068-thread-1) [    ] o.a.s.c.SolrCore [collection1] Registered new searcher Searcher@3b9aba89[collection1] main{ExitableDirectoryReader(UninvertingDirectoryReader())}
   [junit4]   2> 1288606 INFO  (coreLoadExecutor-5067-thread-1) [    ] o.a.s.u.UpdateLog Could not find max version in index or recent updates, using new clock 1577235213410369536
   [junit4]   2> 1288608 INFO  (coreZkRegister-5062-thread-1) [    ] o.a.s.c.ShardLeaderElectionContext Enough replicas found to continue.
   [junit4]   2> 1288608 INFO  (coreZkRegister-5062-thread-1) [    ] o.a.s.c.ShardLeaderElectionContext I may be the new leader - try and sync
   [junit4]   2> 1288608 INFO  (coreZkRegister-5062-thread-1) [    ] o.a.s.c.SyncStrategy Sync replicas to http://127.0.0.1:41995/collection1/
   [junit4]   2> 1288608 INFO  (coreZkRegister-5062-thread-1) [    ] o.a.s.c.SyncStrategy Sync Success - now sync replicas to me
   [junit4]   2> 1288608 INFO  (coreZkRegister-5062-thread-1) [    ] o.a.s.c.SyncStrategy http://127.0.0.1:41995/collection1/ has no replicas
   [junit4]   2> 1288608 INFO  (coreZkRegister-5062-thread-1) [    ] o.a.s.c.ShardLeaderElectionContext Found all replicas participating in election, clear LIR
   [junit4]   2> 1288609 INFO  (coreZkRegister-5062-thread-1) [    ] o.a.s.c.ShardLeaderElectionContext I am the new leader: http://127.0.0.1:41995/collection1/ shard1
   [junit4]   2> 1288710 INFO  (zkCallback-2084-thread-1) [    ] o.a.s.c.c.ZkStateReader A cluster state change: [WatchedEvent state:SyncConnected type:NodeDataChanged path:/collections/collection1/state.json] for collection [collection1] has occurred - updating... (live nodes size: [3])
   [junit4]   2> 1288710 INFO  (zkCallback-2090-thread-1) [    ] o.a.s.c.c.ZkStateReader A cluster state change: [WatchedEvent state:SyncConnected type:NodeDataChanged path:/collections/collection1/state.json] for collection [collection1] has occurred - updating... (live nodes size: [3])
   [junit4]   2> 1288714 INFO  (coreZkRegister-5062-thread-1) [    ] o.a.s.c.ZkController I am the leader, no recovery necessary
   [junit4]   2> 1288815 INFO  (zkCallback-2084-thread-1) [    ] o.a.s.c.c.ZkStateReader A cluster state change: [WatchedEvent state:SyncConnected type:NodeDataChanged path:/collections/collection1/state.json] for collection [collection1] has occurred - updating... (live nodes size: [3])
   [junit4]   2> 1288815 INFO  (zkCallback-2090-thread-1) [    ] o.a.s.c.c.ZkStateReader A cluster state change: [WatchedEvent state:SyncConnected type:NodeDataChanged path:/collections/collection1/state.json] for collection [collection1] has occurred - updating... (live nodes size: [3])
   [junit4]   2> 1289025 INFO  (TEST-ChaosMonkeyNothingIsSafeTest.test-seed#[8CAE2226992DF5FD]) [    ] o.a.s.SolrTestCaseJ4 Writing core.properties file to /home/jenkins/workspace/Lucene-Solr-6.6-Linux/solr/build/solr-core/test/J2/temp/solr.cloud.ChaosMonkeyNothingIsSafeTest_8CAE2226992DF5FD-001/shard-3-001/cores/collection1
   [junit4]   2> 1289026 INFO  (TEST-ChaosMonkeyNothingIsSafeTest.test-seed#[8CAE2226992DF5FD]) [    ] o.a.s.c.AbstractFullDistribZkTestBase create jetty 3 in directory /home/jenkins/workspace/Lucene-Solr-6.6-Linux/solr/build/solr-core/test/J2/temp/solr.cloud.ChaosMonkeyNothingIsSafeTest_8CAE2226992DF5FD-001/shard-3-001
   [junit4]   2> 1289026 INFO  (TEST-ChaosMonkeyNothingIsSafeTest.test-seed#[8CAE2226992DF5FD]) [    ] o.e.j.s.Server jetty-9.3.14.v20161028
   [junit4]   2> 1289027 INFO  (TEST-ChaosMonkeyNothingIsSafeTest.test-seed#[8CAE2226992DF5FD]) [    ] o.e.j.s.h.ContextHandler Started o.e.j.s.ServletContextHandler@e005ad4{/,null,AVAILABLE}
   [junit4]   2> 1289027 INFO  (TEST-ChaosMonkeyNothingIsSafeTest.test-seed#[8CAE2226992DF5FD]) [    ] o.e.j.s.AbstractConnector Started ServerConnector@36ade7e7{HTTP/1.1,[http/1.1]}{127.0.0.1:၄၅၀၂၃}
   [junit4]   2> 1289028 INFO  (TEST-ChaosMonkeyNothingIsSafeTest.test-seed#[8CAE2226992DF5FD]) [    ] o.e.j.s.Server Started @၁၂၉၁၄၀၅ms
   [junit4]   2> 1289028 INFO  (TEST-ChaosMonkeyNothingIsSafeTest.test-seed#[8CAE2226992DF5FD]) [    ] o.a.s.c.s.e.JettySolrRunner Jetty properties: {hostContext=/, solrconfig=solrconfig.xml, solr.data.dir=/home/jenkins/workspace/Lucene-Solr-6.6-Linux/solr/build/solr-core/test/J2/temp/solr.cloud.ChaosMonkeyNothingIsSafeTest_8CAE2226992DF5FD-001/tempDir-001/jetty3, hostPort=45023, coreRootDirectory=/home/jenkins/workspace/Lucene-Solr-6.6-Linux/solr/build/solr-core/test/J2/../../../../../../../../../home/jenkins/workspace/Lucene-Solr-6.6-Linux/solr/build/solr-core/test/J2/temp/solr.cloud.ChaosMonkeyNothingIsSafeTest_8CAE2226992DF5FD-001/shard-3-001/cores}
   [junit4]   2> 1289028 ERROR (TEST-ChaosMonkeyNothingIsSafeTest.test-seed#[8CAE2226992DF5FD]) [    ] o.a.s.s.StartupLoggingUtils Missing Java Option solr.log.dir. Logging may be missing or incomplete.
   [junit4]   2> 1289028 INFO  (TEST-ChaosMonkeyNothingIsSafeTest.test-seed#[8CAE2226992DF5FD]) [    ] o.a.s.s.SolrDispatchFilter  ___      _       Welcome to Apache Solr™ version 6.6.1
   [junit4]   2> 1289028 INFO  (TEST-ChaosMonkeyNothingIsSafeTest.test-seed#[8CAE2226992DF5FD]) [    ] o.a.s.s.SolrDispatchFilter / __| ___| |_ _   Starting in cloud mode on port null
   [junit4]   2> 1289028 INFO  (TEST-ChaosMonkeyNothingIsSafeTest.test-seed#[8CAE2226992DF5FD]) [    ] o.a.s.s.SolrDispatchFilter \__ \/ _ \ | '_|  Install dir: null
   [junit4]   2> 1289028 INFO  (TEST-ChaosMonkeyNothingIsSafeTest.test-seed#[8CAE2226992DF5FD]) [    ] o.a.s.s.SolrDispatchFilter |___/\___/_|_|    Start time: 2017-08-31T08:38:34.383605Z
   [junit4]   2> 1289029 INFO  (TEST-ChaosMonkeyNothingIsSafeTest.test-seed#[8CAE2226992DF5FD]) [    ] o.a.s.s.SolrDispatchFilter Loading solr.xml from SolrHome (not found in ZooKeeper)
   [junit4]   2> 1289029 INFO  (TEST-ChaosMonkeyNothingIsSafeTest.test-seed#[8CAE2226992DF5FD]) [    ] o.a.s.c.SolrXmlConfig Loading container configuration from /home/jenkins/workspace/Lucene-Solr-6.6-Linux/solr/build/solr-core/test/J2/temp/solr.cloud.ChaosMonkeyNothingIsSafeTest_8CAE2226992DF5FD-001/shard-3-001/solr.xml
   [junit4]   2> 1289033 INFO  (TEST-ChaosMonkeyNothingIsSafeTest.test-seed#[8CAE2226992DF5FD]) [    ] o.a.s.u.UpdateShardHandler Creating UpdateShardHandler HTTP client with params: socketTimeout=340000&connTimeout=45000&retry=true
   [junit4]   2> 1289034 INFO  (TEST-ChaosMonkeyNothingIsSafeTest.test-seed#[8CAE2226992DF5FD]) [    ] o.a.s.c.ZkContainer Zookeeper client=127.0.0.1:46749/solr
   [junit4]   2> 1289037 INFO  (TEST-ChaosMonkeyNothingIsSafeTest.test-seed#[8CAE2226992DF5FD]) [    ] o.a.s.c.c.ZkStateReader Updated live nodes from ZooKeeper... (0) -> (3)
   [junit4]   2> 1289038 INFO  (TEST-ChaosMonkeyNothingIsSafeTest.test-seed#[8CAE2226992DF5FD]) [    ] o.a.s.c.Overseer Overseer (id=null) closing
   [junit4]   2> 1289039 INFO  (TEST-ChaosMonkeyNothingIsSafeTest.test-seed#[8CAE2226992DF5FD]) [    ] o.a.s.c.ZkController Register node as live in ZooKeeper:/live_nodes/127.0.0.1:45023_
   [junit4]   2> 1289039 INFO  (zkCallback-2084-thread-1) [    ] o.a.s.c.c.ZkStateReader Updated live nodes from ZooKeeper... (3) -> (4)
   [junit4]   2> 1289039 INFO  (zkCallback-2074-thread-1) [    ] o.a.s.c.c.ZkStateReader Updated live nodes from ZooKeeper... (3) -> (4)
   [junit4]   2> 1289039 INFO  (zkCallback-2090-thread-1) [    ] o.a.s.c.c.ZkStateReader Updated live nodes from ZooKeeper... (3) -> (4)
   [junit4]   2> 1289039 INFO  (zkCallback-2078-thread-1) [    ] o.a.s.c.c.ZkStateReader Updated live nodes from ZooKeeper... (3) -> (4)
   [junit4]   2> 1289039 INFO  (zkCallback-2096-thread-1) [    ] o.a.s.c.c.ZkStateReader Updated live nodes from ZooKeeper... (3) -> (4)
   [junit4]   2> 1289061 INFO  (TEST-ChaosMonkeyNothingIsSafeTest.test-seed#[8CAE2226992DF5FD]) [    ] o.a.s.c.CorePropertiesLocator Found 1 core definitions underneath /home/jenkins/workspace/Lucene-Solr-6.6-Linux/solr/build/solr-core/test/J2/../../../../../../../../../home/jenkins/workspace/Lucene-Solr-6.6-Linux/solr/build/solr-core/test/J2/temp/solr.cloud.ChaosMonkeyNothingIsSafeTest_8CAE2226992DF5FD-001/shard-3-001/cores
   [junit4]   2> 1289061 INFO  (TEST-ChaosMonkeyNothingIsSafeTest.test-seed#[8CAE2226992DF5FD]) [    ] o.a.s.c.CorePropertiesLocator Cores are: [collection1]
   [junit4]   2> 1289062 INFO  (coreLoadExecutor-5078-thread-1) [    ] o.a.s.c.TransientSolrCoreCacheDefault Allocating transient cache for 4 transient cores
   [junit4]   2> 1289063 INFO  (OverseerStateUpdate-98577200536748036-127.0.0.1:35671_-n_0000000000) [    ] o.a.s.c.o.ReplicaMutator Assigning new node to shard shard=shard2
   [junit4]   2> 1289164 INFO  (zkCallback-2084-thread-1) [    ] o.a.s.c.c.ZkStateReader A cluster state change: [WatchedEvent state:SyncConnected type:NodeDataChanged path:/collections/collection1/state.json] for collection [collection1] has occurred - updating... (live nodes size: [4])
   [junit4]   2> 1289164 INFO  (zkCallback-2090-thread-1) [    ] o.a.s.c.c.ZkStateReader A cluster state change: [WatchedEvent state:SyncConnected type:NodeDataChanged path:/collections/collection1/state.json] for collection [collection1] has occurred - updating... (live nodes size: [4])
   [junit4]   2> 1289164 INFO  (zkCallback-2096-thread-1) [    ] o.a.s.c.c.ZkStateReader A cluster state change: [WatchedEvent state:SyncConnected type:NodeDataChanged path:/collections/collection1/state.json] for collection [collection1] has occurred - updating... (live nodes size: [4])
   [junit4]   2> 1290069 WARN  (coreLoadExecutor-5078-thread-1) [    ] o.a.s.c.Config Beginning with Solr 5.5, <mergePolicy> is deprecated, use <mergePolicyFactory> instead.
   [junit4]   2> 1290069 INFO  (coreLoadExecutor-5078-thread-1) [    ] o.a.s.c.SolrConfig Using Lucene MatchVersion: 6.6.1
   [junit4]   2> 1290085 INFO  (coreLoadExecutor-5078-thread-1) [    ] o.a.s.s.IndexSchema [collection1] Schema name=test
   [junit4]   2> 1290152 INFO  (coreLoadExecutor-5078-thread-1) [    ] o.a.s.s.IndexSchema Loaded schema test/1.6 with uniqueid field id
   [junit4]   2> 1290158 INFO  (coreLoadExecutor-5078-thread-1) [    ] o.a.s.c.CoreContainer Creating SolrCore 'collection1' using configuration from collection collection1, trusted=true
   [junit4]   2> 1290158 INFO  (coreLoadExecutor-5078-thread-1) [    ] o.a.s.c.SolrCore solr.RecoveryStrategy.Builder
   [junit4]   2> 1290158 INFO  (coreLoadExecutor-5078-thread-1) [    ] o.a.s.c.SolrCore [[collection1] ] Opening new SolrCore at [/home/jenkins/workspace/Lucene-Solr-6.6-Linux/solr/build/solr-core/test/J2/temp/solr.cloud.ChaosMonkeyNothingIsSafeTest_8CAE2226992DF5FD-001/shard-3-001/cores/collection1], dataDir=[/home/jenkins/workspace/Lucene-Solr-6.6-Linux/solr/build/solr-core/test/J2/../../../../../../../../../home/jenkins/workspace/Lucene-Solr-6.6-Linux/solr/build/solr-core/test/J2/temp/solr.cloud.ChaosMonkeyNothingIsSafeTest_8CAE2226992DF5FD-001/shard-3-001/cores/collection1/data/]
   [junit4]   2> 1290159 INFO  (coreLoadExecutor-5078-thread-1) [    ] o.a.s.c.JmxMonitoredMap JMX monitoring is enabled. Adding Solr mbeans to JMX Server: com.sun.jmx.mbeanserver.JmxMBeanServer@61c3f420
   [junit4]   2> 1290160 INFO  (coreLoadExecutor-5078-thread-1) [    ] o.a.s.u.RandomMergePolicy RandomMergePolicy wrapping class org.apache.lucene.index.LogDocMergePolicy: [LogDocMergePolicy: minMergeSize=1000, mergeFactor=48, maxMergeSize=9223372036854775807, maxMergeSizeForForcedMerge=9223372036854775807, calibrateSizeByDeletes=true, maxMergeDocs=2147483647, maxCFSSegmentSizeMB=8.796093022207999E12, noCFSRatio=1.0]
   [junit4]   2> 1290179 WARN  (coreLoadExecutor-5078-thread-1) [    ] o.a.s.c.RequestHandlers INVALID paramSet a in requestHandler {type = requestHandler,name = /dump,class = DumpRequestHandler,attributes = {initParams=a, name=/dump, class=DumpRequestHandler},args = {defaults={a=A,b=B}}}
   [junit4]   2> 1290199 INFO  (coreLoadExecutor-5078-thread-1) [    ] o.a.s.u.UpdateHandler Using UpdateLog implementation: org.apache.solr.update.UpdateLog
   [junit4]   2> 1290199 INFO  (coreLoadExecutor-5078-thread-1) [    ] o.a.s.u.UpdateLog Initializing UpdateLog: dataDir= defaultSyncLevel=FLUSH numRecordsToKeep=100 maxNumLogsToKeep=10 numVersionBuckets=65536
   [junit4]   2> 1290200 INFO  (coreLoadExecutor-5078-thread-1) [    ] o.a.s.u.CommitTracker Hard AutoCommit: if uncommited for 15000ms; 
   [junit4]   2> 1290200 INFO  (coreLoadExecutor-5078-thread-1) [    ] o.a.s.u.CommitTracker Soft AutoCommit: disabled
   [junit4]   2> 1290200 INFO  (coreLoadExecutor-5078-thread-1) [    ] o.a.s.u.RandomMergePolicy RandomMergePolicy wrapping class org.apache.lucene.index.LogDocMergePolicy: [LogDocMergePolicy: minMergeSize=1000, mergeFactor=11, maxMergeSize=9223372036854775807, maxMergeSizeForForcedMerge=9223372036854775807, calibrateSizeByDeletes=true, maxMergeDocs=2147483647, maxCFSSegmentSizeMB=8.796093022207999E12, noCFSRatio=0.0]
   [junit4]   2> 1290200 INFO  (coreLoadExecutor-5078-thread-1) [    ] o.a.s.s.SolrIndexSearcher Opening [Searcher@175e64d5[collection1] main]
   [junit4]   2> 1290201 INFO  (coreLoadExecutor-5078-thread-1) [    ] o.a.s.r.ManagedResourceStorage Configured ZooKeeperStorageIO with znodeBase: /configs/conf1
   [junit4]   2> 1290201 INFO  (coreLoadExecutor-5078-thread-1) [    ] o.a.s.r.ManagedResourceStorage Loaded null at path _rest_managed.json using ZooKeeperStorageIO:path=/configs/conf1
   [junit4]   2> 1290201 INFO  (coreLoadExecutor-5078-thread-1) [    ] o.a.s.h.ReplicationHandler Commits will be reserved for  10000
   [junit4]   2> 1290202 INFO  (searcherExecutor-5079-thread-1) [    ] o.a.s.c.SolrCore [collection1] Registered new searcher Searcher@175e64d5[collection1] main{ExitableDirectoryReader(UninvertingDirectoryReader())}
   [junit4]   2> 1290202 INFO  (coreLoadExecutor-5078-thread-1) [    ] o.a.s.u.UpdateLog Could not find max version in index or recent updates, using new clock 1577235215083896832
   [junit4]   2> 1290204 INFO  (coreZkRegister-5073-thread-1) [    ] o.a.s.c.ZkController Core needs to recover:collection1
   [junit4]   2> 1290204 INFO  (updateExecutor-2093-thread-1) [    ] o.a.s.u.DefaultSolrCoreState Running recovery
   [junit4]   2> 1290204 INFO  (recoveryExecutor-2094-thread-1) [    ] o.a.s.c.RecoveryStrategy Starting recovery process. recoveringAfterStartup=true
   [junit4]   2> 1290204 INFO  (recoveryExecutor-2094-thread-1) [    ] o.a.s.c.RecoveryStrategy ###### startupVersions=[[]]
   [junit4]   2> 1290204 INFO  (recoveryExecutor-2094-thread-1) [    ] o.a.s.c.RecoveryStrategy Begin buffering updates. core=[collection1]
   [junit4]   2> 1290204 INFO  (recoveryExecutor-2094-thread-1) [    ] o.a.s.u.UpdateLog Starting to buffer updates. FSUpdateLog{state=ACTIVE, tlog=null}
   [junit4]   2> 1290204 INFO  (recoveryExecutor-2094-thread-1) [    ] o.a.s.c.RecoveryStrategy Publishing state of core [collection1] as recovering, leader is [http://127.0.0.1:36875/collection1/] and I am [http://127.0.0.1:45023/collection1/]
   [junit4]   2> 1290205 INFO  (recoveryExecutor-2094-thread-1) [    ] o.a.s.c.RecoveryStrategy Sending prep recovery command to [http://127.0.0.1:36875]; [WaitForState: action=PREPRECOVERY&core=collection1&nodeName=127.0.0.1:45023_&coreNodeName=core_node3&state=recovering&checkLive=true&onlyIfLeader=true&onlyIfLeaderActive=true]
   [junit4]   2> 1290206 INFO  (qtp1986792501-12293) [    ] o.a.s.h.a.PrepRecoveryOp Going to wait for coreNodeName: core_node3, state: recovering, checkLive: true, onlyIfLeader: true, onlyIfLeaderActive: true
   [junit4]   2> 1290207 INFO  (qtp1986792501-12293) [    ] o.a.s.h.a.PrepRecoveryOp Will wait a max of 183 seconds to see collection1 (shard2 of collection1) have state: recovering
   [junit4]   2> 1290207 INFO  (qtp1986792501-12293) [    ] o.a.s.h.a.PrepRecoveryOp In WaitForState(recovering): collection=collection1, shard=shard2, thisCore=collection1, leaderDoesNotNeedRecovery=false, isLeader? true, live=true, checkLive=true, currentState=down, localState=active, nodeName=127.0.0.1:45023_, coreNodeName=core_node3, onlyIfActiveCheckResult=false, nodeProps: core_node3:{"core":"collection1","base_url":"http://127.0.0.1:45023","node_name":"127.0.0.1:45023_","state":"down"}
   [junit4]   2> 1290306 INFO  (zkCallback-2096-thread-1) [    ] o.a.s.c.c.ZkStateReader A cluster state change: [WatchedEvent state:SyncConnected type:NodeDataChanged path:/collections/collection1/state.json] for collection [collection1] has occurred - updating... (live nodes size: [4])
   [junit4]   2> 1290306 INFO  (zkCallback-2090-thread-1) [    ] o.a.s.c.c.ZkStateReader A cluster state change: [WatchedEvent state:SyncConnected type:NodeDataChanged path:/collections/collection1/state.json] for collection [collection1] has occurred - updating... (live nodes size: [4])
   [junit4]   2> 1290306 INFO  (zkCallback-2084-thread-1) [    ] o.a.s.c.c.ZkStateReader A cluster state change: [WatchedEvent state:SyncConnected type:NodeDataChanged path:/collections/collection1/state.json] for collection [collection1] has occurred - updating... (live nodes size: [4])
   [junit4]   2> 1290625 INFO  (TEST-ChaosMonkeyNothingIsSafeTest.test-seed#[8CAE2226992DF5FD]) [    ] o.a.s.SolrTestCaseJ4 Writing core.properties file to /home/jenkins/workspace/Lucene-Solr-6.6-Linux/solr/build/solr-core/test/J2/temp/solr.cloud.ChaosMonkeyNothingIsSafeTest_8CAE2226992DF5FD-001/shard-4-001/cores/collection1
   [junit4]   2> 1290626 INFO  (TEST-ChaosMonkeyNothingIsSafeTest.test-seed#[8CAE2226992DF5FD]) [    ] o.a.s.c.AbstractFullDistribZkTestBase create jetty 4 in directory /home/jenkins/workspace/Lucene-Solr-6.6-Linux/solr/build/solr-core/test/J2/temp/solr.cloud.ChaosMonkeyNothingIsSafeTest_8CAE2226992DF5FD-001/shard-4-001
   [junit4]   2> 1290626 INFO  (TEST-ChaosMonkeyNothingIsSafeTest.test-seed#[8CAE2226992DF5FD]) [    ] o.e.j.s.Server jetty-9.3.14.v20161028
   [junit4]   2> 1290627 INFO  (TEST-ChaosMonkeyNothingIsSafeTest.test-seed#[8CAE2226992DF5FD]) [    ] o.e.j.s.h.ContextHandler Started o.e.j.s.ServletContextHandler@562cc620{/,null,AVAILABLE}
   [junit4]   2> 1290627 INFO  (TEST-ChaosMonkeyNothingIsSafeTest.test-seed#[8CAE2226992DF5FD]) [    ] o.e.j.s.AbstractConnector Started ServerConnector@2e363e3f{HTTP/1.1,[http/1.1]}{127.0.0.1:၃၈၆၂၇}
   [junit4]   2> 1290627 INFO  (TEST-ChaosMonkeyNothingIsSafeTest.test-seed#[8CAE2226992DF5FD]) [    ] o.e.j.s.Server Started @၁၂၉၃၀၀၄ms
   [junit4]   2> 1290627 INFO  (TEST-ChaosMonkeyNothingIsSafeTest.test-seed#[8CAE2226992DF5FD]) [    ] o.a.s.c.s.e.JettySolrRunner Jetty properties: {hostContext=/, solrconfig=solrconfig.xml, solr.data.dir=/home/jenkins/workspace/Lucene-Solr-6.6-Linux/solr/build/solr-core/test/J2/temp/solr.cloud.ChaosMonkeyNothingIsSafeTest_8CAE2226992DF5FD-001/tempDir-001/jetty4, hostPort=38627, coreRootDirectory=/home/jenkins/workspace/Lucene-Solr-6.6-Linux/solr/build/solr-core/test/J2/temp/solr.cloud.ChaosMonkeyNothingIsSafeTest_8CAE2226992DF5FD-001/shard-4-001/cores}
   [junit4]   2> 1290627 ERROR (TEST-ChaosMonkeyNothingIsSafeTest.test-seed#[8CAE2226992DF5FD]) [    ] o.a.s.s.StartupLoggingUtils Missing Java Option solr.log.dir. Logging may be missing or incomplete.
   [junit4]   2> 1290627 INFO  (TEST-ChaosMonkeyNothingIsSafeTest.test-seed#[8CAE2226992DF5FD]) [    ] o.a.s.s.SolrDispatchFilter  ___      _       Welcome to Apache Solr™ version 6.6.1
   [junit4]   2> 1290627 INFO  (TEST-ChaosMonkeyNothingIsSafeTest.test-seed#[8CAE2226992DF5FD]) [    ] o.a.s.s.SolrDispatchFilter / __| ___| |_ _   Starting in cloud mode on port null
   [junit4]   2> 1290627 INFO  (TEST-ChaosMonkeyNothingIsSafeTest.test-seed#[8CAE2226992DF5FD]) [    ] o.a.s.s.SolrDispatchFilter \__ \/ _ \ | '_|  Install dir: null
   [junit4]   2> 1290627 INFO  (TEST-ChaosMonkeyNothingIsSafeTest.test-seed#[8CAE2226992DF5FD]) [    ] o.a.s.s.SolrDispatchFilter |___/\___/_|_|    Start time: 2017-08-31T08:38:35.982982Z
   [junit4]   2> 1290629 INFO  (TEST-ChaosMonkeyNothingIsSafeTest.test-seed#[8CAE2226992DF5FD]) [    ] o.a.s.s.SolrDispatchFilter Loading solr.xml from SolrHome (not found in ZooKeeper)
   [junit4]   2> 1290629 INFO  (TEST-ChaosMonkeyNothingIsSafeTest.test-seed#[8CAE2226992DF5FD]) [    ] o.a.s.c.SolrXmlConfig Loading container configuration from /home/jenkins/workspace/Lucene-Solr-6.6-Linux/solr/build/solr-core/test/J2/temp/solr.cloud.ChaosMonkeyNothingIsSafeTest_8CAE2226992DF5FD-001/shard-4-001/solr.xml
   [junit4]   2> 1290632 INFO  (TEST-ChaosMonkeyNothingIsSafeTest.test-seed#[8CAE2226992DF5FD]) [    ] o.a.s.u.UpdateShardHandler Creating UpdateShardHandler HTTP client with params: socketTimeout=340000&connTimeout=45000&retry=true
   [junit4]   2> 1290632 INFO  (TEST-ChaosMonkeyNothingIsSafeTest.test-seed#[8CAE2226992DF5FD]) [    ] o.a.s.c.ZkContainer Zookeeper client=127.0.0.1:46749/solr
   [junit4]   2> 1290644 INFO  (TEST-ChaosMonkeyNothingIsSafeTest.test-seed#[8CAE2226992DF5FD]) [    ] o.a.s.c.c.ZkStateReader Updated live nodes from ZooKeeper... (0) -> (4)
   [junit4]   2> 1290645 INFO  (TEST-ChaosMonkeyNothingIsSafeTest.test-seed#[8CAE2226992DF5FD]) [    ] o.a.s.c.Overseer Overseer (id=null) closing
   [junit4]   2> 1290645 INFO  (TEST-ChaosMonkeyNothingIsSafeTest.test-seed#[8CAE2226992DF5FD]) [    ] o.a.s.c.ZkController Register node as live in ZooKeeper:/live_nodes/127.0.0.1:38627_
   [junit4]   2> 1290646 INFO  (zkCallback-2096-thread-1) [    ] o.a.s.c.c.ZkStateReader Updated live nodes from ZooKeeper... (4) -> (5)
   [junit4]   2> 1290646 INFO  (zkCallback-2084-thread-1) [    ] o.a.s.c.c.ZkStateReader Updated live nodes from ZooKeeper... (4) -> (5)
   [junit4]   2> 1290646 INFO  (zkCallback-2078-thread-1) [    ] o.a.s.c.c.ZkStateReader Updated live nodes from ZooKeeper... (4) -> (5)
   [junit4]   2> 1290646 INFO  (zkCallback-2074-thread-1) [    ] o.a.s.c.c.ZkStateReader Updated live nodes from ZooKeeper... (4) -> (5)
   [junit4]   2> 1290646 INFO  (zkCallback-2090-thread-1) [    ] o.a.s.c.c.ZkStateReader Updated live nodes from ZooKeeper... (4) -> (5)
   [junit4]   2> 1290646 INFO  (zkCallback-2103-thread-1) [    ] o.a.s.c.c.ZkStateReader Updated live nodes from ZooKeeper... (4) -> (5)
   [junit4]   2> 1290665 INFO  (TEST-ChaosMonkeyNothingIsSafeTest.test-seed#[8CAE2226992DF5FD]) [    ] o.a.s.c.CorePropertiesLocator Found 1 core definitions underneath /home/jenkins/workspace/Lucene-Solr-6.6-Linux/solr/build/solr-core/test/J2/temp/solr.cloud.ChaosMonkeyNothingIsSafeTest_8CAE2226992DF5FD-001/shard-4-001/cores
   [junit4]   2> 1290665 INFO  (TEST-ChaosMonkeyNothingIsSafeTest.test-seed#[8CAE2226992DF5FD]) [    ] o.a.s.c.CorePropertiesLocator Cores are: [collection1]
   [junit4]   2> 1290667 INFO  (coreLoadExecutor-5089-thread-1) [    ] o.a.s.c.TransientSolrCoreCacheDefault Allocating transient cache for 4 transient cores
   [junit4]   2> 1290668 INFO  (OverseerStateUpdate-98577200536748036-127.0.0.1:35671_-n_0000000000) [    ] o.a.s.c.o.ReplicaMutator Assigning new node to shard shard=shard1
   [junit4]   2> 1290771 INFO  (zkCallback-2090-thread-1) [    ] o.a.s.c.c.ZkStateReader A cluster state change: [WatchedEvent state:SyncConnected type:NodeDataChanged path:/collections/collection1/state.json] for collection [collection1] has occurred - updating... (live nodes size: [5])
   [junit4]   2> 1290771 INFO  (zkCallback-2103-thread-1) [    ] o.a.s.c.c.ZkStateReader A cluster state change: [WatchedEvent state:SyncConnected type:NodeDataChanged path:/collections/collection1/state.json] for collection [collection1] has occurred - updating... (live nodes size: [5])
   [junit4]   2> 1290771 INFO  (zkCallback-2096-thread-1) [    ] o.a.s.c.c.ZkStateReader A cluster state change: [WatchedEvent state:SyncConnected type:NodeDataChanged path:/collections/collection1/state.json] for collection [collection1] has occurred - updating... (live nodes size: [5])
   [junit4]   2> 1290771 INFO  (zkCallback-2084-thread-1) [    ] o.a.s.c.c.ZkStateReader A cluster state change: [WatchedEvent state:SyncConnected type:NodeDataChanged path:/collections/collection1/state.json] for collection [collection1] has occurred - updating... (live nodes size: [5])
   [junit4]   2> 1291207 INFO  (qtp1986792501-12293) [    ] o.a.s.h.a.PrepRecoveryOp In WaitForState(recovering): collection=collection1, shard=shard2, thisCore=collection1, leaderDoesNotNeedRecovery=false, isLeader? true, live=true, checkLive=true, currentState=recovering, localState=active, nodeName=127.0.0.1:45023_, coreNodeName=core_node3, onlyIfActiveCheckResult=false, nodeProps: core_node3:{"core":"collection1","base_url":"http://127.0.0.1:45023","node_name":"127.0.0.1:45023_","state":"recovering"}
   [junit4]   2> 1291207 INFO  (qtp1986792501-12293) [    ] o.a.s.h.a.PrepRecoveryOp Waited coreNodeName: core_node3, state: recovering, checkLive: true, onlyIfLeader: true for: 1 seconds.
   [junit4]   2> 1291207 INFO  (qtp1986792501-12293) [    ] o.a.s.s.HttpSolrCall [admin] webapp=null path=/admin/cores params={nodeName=127.0.0.1:45023_&onlyIfLeaderActive=true&core=collection1&coreNodeName=core_node3&action=PREPRECOVERY&checkLive=true&state=recovering&onlyIfLeader=true&wt=javabin&version=2} status=0 QTime=1000
   [junit4]   2> 1291686 WARN  (coreLoadExecutor-5089-thread-1) [    ] o.a.s.c.Config Beginning with Solr 5.5, <mergePolicy> is deprecated, use <mergePolicyFactory> instead.
   [junit4]   2> 1291686 INFO  (coreLoadExecutor-5089-thread-1) [    ] o.a.s.c.SolrConfig Using Lucene MatchVersion: 6.6.1
   [junit4]   2> 1291693 INFO  (coreLoadExecutor-5089-thread-1) [    ] o.a.s.s.IndexSchema [collection1] Schema name=test
   [junit4]   2> 1291707 INFO  (recoveryExecutor-2094-thread-1) [    ] o.a.s.c.RecoveryStrategy Attempting to PeerSync from [http://127.0.0.1:36875/collection1/] - recoveringAfterStartup=[true]
   [junit4]   2> 1291707 INFO  (recoveryExecutor-2094-thread-1) [    ] o.a.s.u.PeerSync PeerSync: core=collection1 url=http://127.0.0.1:45023 START replicas=[http://127.0.0.1:36875/collection1/] nUpdates=100
   [junit4]   2> 1291710 INFO  (qtp1986792501-12293) [    ] o.a.s.u.IndexFingerprint IndexFingerprint millis:0.0 result:{maxVersionSpecified=9223372036854775807, maxVersionEncountered=0, maxInHash=0, versionsHash=0, numVersions=0, numDocs=0, maxDoc=0}
   [junit4]   2> 1291710 INFO  (qtp1986792501-12293) [    ] o.a.s.c.S.Request [collection1]  webapp= path=/get params={distrib=false&qt=/get&getFingerprint=9223372036854775807&wt=javabin&version=2} status=0 QTime=0
   [junit4]   2> 1291711 INFO  (recoveryExecutor-2094-thread-1) [    ] o.a.s.u.IndexFingerprint IndexFingerprint millis:0.0 result:{maxVersionSpecified=9223372036854775807, maxVersionEncountered=0, maxInHash=0, versionsHash=0, numVersions=0, numDocs=0, maxDoc=0}
   [junit4]   2> 1291711 INFO  (recoveryExecutor-2094-thread-1) [    ] o.a.s.u.PeerSync We are already in sync. No need to do a PeerSync 
   [junit4]   2> 1291711 INFO  (recoveryExecutor-2094-thread-1) [    ] o.a.s.u.DirectUpdateHandler2 start commit{,optimize=false,openSearcher=true,waitSearcher=true,expungeDeletes=false,softCommit=false,prepareCommit=false}
   [junit4]   2> 1291711 INFO  (recoveryExecutor-2094-thread-1) [    ] o.a.s.u.DirectUpdateHandler2 No uncommitted changes. Skipping IW.commit.
   [junit4]   2> 1291711 INFO  (recoveryExecutor-2094-thread-1) [    ] o.a.s.u.DirectUpdateHandler2 end_commit_flush
   [junit4]   2> 1291711 INFO  (recoveryExecutor-2094-thread-1) [    ] o.a.s.c.RecoveryStrategy PeerSync stage of recovery was successful.
   [junit4]   2> 1291711 INFO  (recoveryExecutor-2094-thread-1) [    ] o.a.s.c.RecoveryStrategy Replaying updates buffered during PeerSync.
   [junit4]   2> 1291711 INFO  (recoveryExecutor-2094-thread-1) [    ] o.a.s.c.RecoveryStrategy No replay needed.
   [junit4]   2> 1291711 INFO  (recoveryExecutor-2094-thread-1) [    ] o.a.s.c.RecoveryStrategy Registering as Active after recovery.
   [junit4]   2> 1291746 INFO  (coreLoadExecutor-5089-thread-1) [    ] o.a.s.s.IndexSchema Loaded schema test/1.6 with uniqueid field id
   [junit4]   2> 1291752 INFO  (coreLoadExecutor-5089-thread-1) [    ] o.a.s.c.CoreContainer Creating SolrCore 'collection1' using configuration from collection collection1, trusted=true
   [junit4]   2> 1291752 INFO  (coreLoadExecutor-5089-thread-1) [    ] o.a.s.c.SolrCore solr.RecoveryStrategy.Builder
   [junit4]   2> 1291752 INFO  (coreLoadExecutor-5089-thread-1) [    ] o.a.s.c.SolrCore [[collection1] ] Opening new SolrCore at [/home/jenkins/workspace/Lucene-Solr-6.6-Linux/solr/build/solr-core/test/J2/temp/solr.cloud.ChaosMonkeyNothingIsSafeTest_8CAE2226992DF5FD-001/shard-4-001/cores/collection1], dataDir=[/home/jenkins/workspace/Lucene-Solr-6.6-Linux/solr/build/solr-core/test/J2/temp/solr.cloud.ChaosMonkeyNothingIsSafeTest_8CAE2226992DF5FD-001/shard-4-001/cores/collection1/data/]
   [junit4]   2> 1291752 INFO  (coreLoadExecutor-5089-thread-1) [    ] o.a.s.c.JmxMonitoredMap JMX monitoring is enabled. Adding Solr mbeans to JMX Server: com.sun.jmx.mbeanserver.JmxMBeanServer@61c3f420
   [junit4]   2> 1291753 INFO  (coreLoadExecutor-5089-thread-1) [    ] o.a.s.u.RandomMergePolicy RandomMergePolicy wrapping class org.apache.lucene.index.LogDocMergePolicy: [LogDocMergePolicy: minMergeSize=1000, mergeFactor=48, maxMergeSize=9223372036854775807, maxMergeSizeForForcedMerge=9223372036854775807, calibrateSizeByDeletes=true, maxMergeDocs=2147483647, maxCFSSegmentSizeMB=8.796093022207999E12, noCFSRatio=1.0]
   [junit4]   2> 1291772 WARN  (coreLoadExecutor-5089-thread-1) [    ] o.a.s.c.RequestHandlers INVALID paramSet a in requestHandler {type = requestHandler,name = /dump,class = DumpRequestHandler,attributes = {initParams=a, name=/dump, class=DumpRequestHandler},args = {defaults={a=A,b=B}}}
   [junit4]   2> 1291790 INFO  (coreLoadExecutor-5089-thread-1) [    ] o.a.s.u.UpdateHandler Using UpdateLog implementation: org.apache.solr.update.UpdateLog
   [junit4]   2> 1291790 INFO  (coreLoadExecutor-5089-thread-1) [    ] o.a.s.u.UpdateLog Initializing UpdateLog: dataDir= defaultSyncLevel=FLUSH numRecordsToKeep=100 maxNumLogsToKeep=10 numVersionBuckets=65536
   [junit4]   2> 1291796 INFO  (coreLoadExecutor-5089-thread-1) [    ] o.a.s.u.CommitTracker Hard AutoCommit: if uncommited for 15000ms; 
   [junit4]   2> 1291796 INFO  (coreLoadExecutor-5089-thread-1) [    ] o.a.s.u.CommitTracker Soft AutoCommit: disabled
   [junit4]   2> 1291796 INFO  (coreLoadExecutor-5089-thread-1) [    ] o.a.s.u.RandomMergePolicy RandomMergePolicy wrapping class org.apache.lucene.index.LogDocMergePolicy: [LogDocMergePolicy: minMergeSize=1000, mergeFactor=11, maxMergeSize=9223372036854775807, maxMergeSizeForForcedMerge=9223372036854775807, calibrateSizeByDeletes=true, maxMergeDocs=2147483647, maxCFSSegmentSizeMB=8.796093022207999E12, noCFSRatio=0.0]
   [junit4]   2> 1291797 INFO  (coreLoadExecutor-5089-thread-1) [    ] o.a.s.s.SolrIndexSearcher Opening [Searcher@630699e2[collection1] main]
   [junit4]   2> 1291797 INFO  (coreLoadExecutor-5089-thread-1) [    ] o.a.s.r.ManagedResourceStorage Configured ZooKeeperStorageIO with znodeBase: /configs/conf1
   [junit4]   2> 1291797 INFO  (coreLoadExecutor-5089-thread-1) [    ] o.a.s.r.ManagedResourceStorage Loaded null at path _rest_managed.json using ZooKeeperStorageIO:path=/configs/conf1
   [junit4]   2> 1291797 INFO  (coreLoadExecutor-5089-thread-1) [    ] o.a.s.h.ReplicationHandler Commits will be reserved for  10000
   [junit4]   2> 1291798 INFO  (searcherExecutor-5090-thread-1) [    ] o.a.s.c.SolrCore [collection1] Registered new searcher Searcher@630699e2[collection1] main{ExitableDirectoryReader(UninvertingDirectoryReader())}
   [junit4]   2> 1291798 INFO  (coreLoadExecutor-5089-thread-1) [    ] o.a.s.u.UpdateLog Could not find max version in index or recent updates, using new clock 1577235216757424128
   [junit4]   2> 1291800 INFO  (coreZkRegister-5084-thread-1) [    ] o.a.s.c.ZkController Core needs to recover:collection1
   [junit4]   2> 1291800 INFO  (updateExecutor-2100-thread-1) [    ] o.a.s.u.DefaultSolrCoreState Running recovery
   [junit4]   2> 1291800 INFO  (recoveryExecutor-2101-thread-1) [    ] o.a.s.c.RecoveryStrategy Starting recovery process. recoveringAfterStartup=true
   [junit4]   2> 1291800 INFO  (recoveryExecutor-2101-thread-1) [    ] o.a.s.c.RecoveryStrategy ###### startupVersions=[[]]
   [junit4]   2> 1291800 INFO  (recoveryExecutor-2101-thread-1) [    ] o.a.s.c.RecoveryStrategy Begin buffering updates. core=[collection1]
   [junit4]   2> 1291800 INFO  (recoveryExecutor-2101-thread-1) [    ] o.a.s.u.UpdateLog Starting to buffer updates. FSUpdateLog{state=ACTIVE, tlog=null}
   [junit4]   2> 1291800 INFO  (recoveryExecutor-2101-thread-1) [    ] o.a.s.c.RecoveryStrategy Publishing state of core [collection1] as recovering, leader is [http://127.0.0.1:41995/collection1/] and I am [http://127.0.0.1:38627/collection1/]
   [junit4]   2> 1291801 INFO  (recoveryExecutor-2101-thread-1) [    ] o.a.s.c.RecoveryStrategy Sending prep recovery command to [http://127.0.0.1:41995]; [WaitForState: action=PREPRECOVERY&core=collection1&nodeName=127.0.0.1:38627_&coreNodeName=core_node4&state=recovering&checkLive=true&onlyIfLeader=true&onlyIfLeaderActive=true]
   [junit4]   2> 1291802 INFO  (qtp15989041-12321) [    ] o.a.s.h.a.PrepRecoveryOp Going to wait for coreNodeName: core_node4, state: recovering, checkLive: true, onlyIfLeader: true, onlyIfLeaderActive: true
   [junit4]   2> 1291806 INFO  (qtp15989041-12321) [    ] o.a.s.h.a.PrepRecoveryOp Will wait a max of 183 seconds to see collection1 (shard1 of collection1) have state: recovering
   [junit4]   2> 1291806 INFO  (qtp15989041-12321) [    ] o.a.s.h.a.PrepRecoveryOp In WaitForState(recovering): collection=collection1, shard=shard1, thisCore=collection1, leaderDoesNotNeedRecovery=false, isLeader? true, live=true, checkLive=true, currentState=down, localState=active, nodeName=127.0.0.1:38627_, coreNodeName=core_node4, onlyIfActiveCheckResult=false, nodeProps: core_node4:{"core":"collection1","base_url":"http://127.0.0.1:38627","node_name":"127.0.0.1:38627_","state":"down"}
   [junit4]   2> 1291902 INFO  (zkCallback-2084-thread-1) [    ] o.a.s.c.c.ZkStateReader A cluster state change: [WatchedEvent state:SyncConnected type:NodeDataChanged path:/collections/collection1/state.json] for collection [collection1] has occurred - updating... (live nodes size: [5])
   [junit4]   2> 1291902 INFO  (zkCallback-2090-thread-1) [    ] o.a.s.c.c.ZkStateReader A cluster state change: [WatchedEvent state:SyncConnected type:NodeDataChanged path:/collections/collection1/state.json] for collection [collection1] has occurred - updating... (live nodes size: [5])
   [junit4]   2> 1291902 INFO  (zkCallback-2103-thread-1) [    ] o.a.s.c.c.ZkStateReader A cluster state change: [WatchedEvent state:SyncConnected type:NodeDataChanged path:/collections/collection1/state.json] for collection [collection1] has occurred - updating... (live nodes size: [5])
   [junit4]   2> 1291902 INFO  (zkCallback-2096-thread-1) [    ] o.a.s.c.c.ZkStateReader A cluster state change: [WatchedEvent state:SyncConnected type:NodeDataChanged path:/collections/collection1/state.json] for collection [collection1] has occurred - updating... (live nodes size: [5])
   [junit4]   2> 1292169 INFO  (TEST-ChaosMonkeyNothingIsSafeTest.test-seed#[8CAE2226992DF5FD]) [    ] o.a.s.SolrTestCaseJ4 ###Starting test
   [junit4]   2> 1292169 INFO  (TEST-ChaosMonkeyNothingIsSafeTest.test-seed#[8CAE2226992DF5FD]) [    ] o.a.s.c.AbstractDistribZkTestBase Wait for recoveries to finish - collection: collection1 failOnTimeout:true timeout (sec):330
   [junit4]   2> 1292807 INFO  (qtp15989041-12321) [    ] o.a.s.h.a.PrepRecoveryOp In WaitForState(recovering): collection=collection1, shard=shard1, thisCore=collection1, leaderDoesNotNeedRecovery=false, isLeader? true, live=true, checkLive=true, currentState=recovering, localState=active, nodeName=127.0.0.1:38627_, coreNodeName=core_node4, onlyIfActiveCheckResult=false, nodeProps: core_node4:{"core":"collection1","base_url":"http://127.0.0.1:38627","node_name":"127.0.0.1:38627_","state":"recovering"}
   [junit4]   2> 1292807 INFO  (qtp15989041-12321) [    ] o.a.s.h.a.PrepRecoveryOp Waited coreNodeName: core_node4, state: recovering, checkLive: true, onlyIfLeader: true for: 1 seconds.
   [junit4]   2> 1292807 INFO  (qtp15989041-12321) [    ] o.a.s.s.HttpSolrCall [admin] webapp=null path=/admin/cores params={nodeName=127.0.0.1:38627_&onlyIfLeaderActive=true&core=collection1&coreNodeName=core_node4&action=PREPRECOVERY&checkLive=true&state=recovering&onlyIfLeader=true&wt=javabin&version=2} status=0 QTime=1004
   [junit4]   2> 1293307 INFO  (recoveryExecutor-2101-thread-1) [    ] o.a.s.c.RecoveryStrategy Attempting to PeerSync from [http://127.0.0.1:41995/collection1/] - recoveringAfterStartup=[true]
   [junit4]   2> 1293307 INFO  (recoveryExecutor-2101-thread-1) [    ] o.a.s.u.PeerSync PeerSync: core=collection1 url=http://127.0.0.1:38627 START replicas=[http://127.0.0.1:41995/collection1/] nUpdates=100
   [junit4]   2> 1293308 INFO  (qtp15989041-12317) [    ] o.a.s.u.IndexFingerprint IndexFingerprint millis:0.0 result:{maxVersionSpecified=9223372036854775807, maxVersionEncountered=0, maxInHash=0, versionsHash=0, numVersions=0, numDocs=0, maxDoc=0}
   [junit4]   2> 1293308 INFO  (qtp15989041-12317) [    ] o.a.s.c.S.Request [collection1]  webapp= path=/get params={distrib=false&qt=/get&getFingerprint=9223372036854775807&wt=javabin&version=2} status=0 QTime=0
   [junit4]   2> 1293309 INFO  (recoveryExecutor-2101-thread-1) [    ] o.a.s.u.IndexFingerprint IndexFingerprint millis:0.0 result:{maxVersionSpecified=9223372036854775807, maxVersionEncountered=0, maxInHash=0, versionsHash=0, numVersions=0, numDocs=0, maxDoc=0}
   [junit4]   2> 1293309 INFO  (recoveryExecutor-2101-thread-1) [    ] o.a.s.u.PeerSync We are already in sync. No need to do a PeerSync 
   [junit4]   2> 1293309 INFO  (recoveryExecutor-2101-thread-1) [    ] o.a.s.u.DirectUpdateHandler2 start commit{,optimize=false,openSearcher=true,waitSearcher=true,expungeDeletes=false,softCommit=false,prepareCommit=false}
   [junit4]   2> 1293309 INFO  (recoveryExecutor-2101-thread-1) [    ] o.a.s.u.DirectUpdateHandler2 No uncommitted changes. Skipping IW.commit.
   [junit4]   2> 1293309 INFO  (recoveryExecutor-2101-thread-1) [    ] o.a.s.u.DirectUpdateHandler2 end_commit_flush
   [junit4]   2> 1293309 INFO  (recoveryExecutor-2101-thread-1) [    ] o.a.s.c.RecoveryStrategy PeerSync stage of recovery was successful.
   [junit4]   2> 1293309 INFO  (recoveryExecutor-2101-thread-1) [    ] o.a.s.c.RecoveryStrategy Replaying updates buffered during PeerSync.
   [junit4]   2> 1293309 INFO  (recoveryExecutor-2101-thread-1) [    ] o.a.s.c.RecoveryStrategy No replay needed.
   [junit4]   2> 1293309 INFO  (recoveryExecutor-2101-thread-1) [    ] o.a.s.c.RecoveryStrategy Registering as Active after recovery.
   [junit4]   2> 1293411 INFO  (zkCallback-2096-thread-1) [    ] o.a.s.c.c.ZkStateReader A cluster state change: [WatchedEvent state:SyncConnected type:NodeDataChanged path:/collections/collection1/state.json] for collection [collection1] has occurred - updating... (live nodes size: [5])
   [junit4]   2> 1293411 INFO  (zkCallback-2090-thread-1) [    ] o.a.s.c.c.ZkStateReader A cluster state change: [WatchedEvent state:SyncConnected type:NodeDataChanged path:/collections/collection1/state.json] for collection [collection1] has occurred - updating... (live nodes size: [5])
   [junit4]   2> 1293411 INFO  (zkCallback-2103-thread-1) [    ] o.a.s.c.c.ZkStateReader A cluster state change: [WatchedEvent state:SyncConnected type:NodeDataChanged path:/collections/collection1/state.json] for collection [collection1] has occurred - updating... (live nodes size: [5])
   [junit4]   2> 1293411 INFO  (zkCallback-2084-thread-1) [    ] o.a.s.c.c.ZkStateReader A cluster state change: [WatchedEvent state:SyncConnected type:NodeDataChanged path:/collections/collection1/state.json] for collection [collection1] has occurred - updating... (live nodes size: [5])
   [junit4]   2> 1294170 INFO  (TEST-ChaosMonkeyNothingIsSafeTest.test-seed#[8CAE2226992DF5FD]) [    ] o.a.s.c.AbstractDistribZkTestBase Recoveries finished - collection: collection1
   [junit4]   2> 1294177 INFO  (qtp1935364758-12255) [    ] o.a.s.u.p.LogUpdateProcessorFactory [collection1]  webapp= path=/update params={wt=javabin&version=2}{deleteByQuery=*:* (-1577235219245694976)} 0 6
   [junit4]   2> 1294221 INFO  (qtp678145122-12349) [    ] o.a.s.u.p.LogUpdateProcessorFactory [collection1]  webapp= path=/update params={update.distrib=FROMLEADER&_version_=-1577235219265617920&distrib.from=http://127.0.0.1:36875/collection1/&wt=javabin&version=2}{deleteByQuery=*:* (-1577235219265617920)} 0 25
   [junit4]   2> 1294222 INFO  (qtp1986792501-12291) [    ] o.a.s.u.p.LogUpdateProcessorFactory [collection1]  webapp= path=/update params={update.distrib=TOLEADER&distrib.from=http://127.0.0.1:41995/collection1/&wt=javabin&version=2}{deleteByQuery=*:* (-1577235219265617920)} 0 31
   [junit4]   2> 1294231 INFO  (qtp166102078-12383) [    ] o.a.s.u.p.LogUpdateProcessorFactory [collection1]  webapp= path=/update params={update.distrib=FROMLEADER&_version_=-1577235219253035008&distrib.from=http://127.0.0.1:41995/collection1/&wt=javabin&version=2}{deleteByQuery=*:* (-1577235219253035008)} 0 9
   [junit4]   2> 1294232 INFO  (qtp15989041-12316) [    ] o.a.s.u.p.LogUpdateProcessorFactory [collection1]  webapp= path=/update params={wt=javabin&version=2}{deleteByQuery=*:* (-1577235219253035008)} 0 53
   [junit4]   2> 1294240 INFO  (TEST-ChaosMonkeyNothingIsSafeTest.test-seed#[8CAE2226992DF5FD]) [    ] o.a.s.c.ChaosMonkey monkey: starting
   [junit4]   2> 1294241 INFO  (TEST-ChaosMonkeyNothingIsSafeTest.test-seed#[8CAE2226992DF5FD]) [    ] o.a.s.c.ChaosMonkey monkey: Jetty will not commit on close
   [junit4]   2> 1294252 INFO  (qtp1935364758-12256) [    ] o.a.s.u.p.LogUpdateProcessorFactory [collection1]  webapp= path=/update params={wt=javabin&version=2&CONTROL=TRUE}{add=[0-0 (1577235219328532480)]} 0 1
   [junit4]   2> 1294266 INFO  (qtp1986792501-12290) [    ] o.a.s.c.S.Request [collection1]  webapp= path=/select params={df=text&distrib=false&_stateVer_=collection1:10&fl=id&fl=score&shards.purpose=4&start=0&fsv=true&shard.url=http://127.0.0.1:36875/collection1/|http://127.0.0.1:45023/collection1/&rows=10&version=2&q=aid&NOW=1504168719610&isShard=true&wt=javabin} hits=0 status=0 QTime=0
   [junit4]   2> 1294268 INFO  (qtp166102078-12384) [    ] o.a.s.u.p.LogUpdateProcessorFactory [collection1]  webapp= path=/update params={update.distrib=FROMLEADER&distrib.from=http://127.0.0.1:41995/collection1/&wt=javabin&version=2}{add=[0-0 (1577235219332726784)]} 0 0
   [junit4]   2> 1294268 INFO  (qtp15989041-12321) [    ] o.a.s.u.p.LogUpdateProcessorFactory [collection1]  webapp= path=/update params={wt=javabin&version=2}{add=[0-0 (1577235219332726784)]} 0 14
   [junit4]   2> 1294270 INFO  (qtp1935364758-12250) [    ] o.a.s.u.p.LogUpdateProcessorFactory [collection1]  webapp= path=/update params={wt=javabin&version=2&CONTROL=TRUE}{add=[0-1 (1577235219349504000)]} 0 0
   [junit4]   2> 1294279 INFO  (qtp166102078-12384) [    ] o.a.s.u.p.LogUpdateProcessorFactory [collection1]  webapp= path=/update params={update.distrib=FROMLEADER&distrib.from=http://127.0.0.1:41995/collection1/&wt=javabin&version=2}{add=[0-1 (1577235219351601152)]} 0 0
   [junit4]   2> 1294279 INFO  (qtp15989041-12318) [    ] o.a.s.u.p.LogUpdateProcessorFactory [collection1]  webapp= path=/update params={wt=javabin&version=2}{add=[0-1 (1577235219351601152)]} 0 7
   [junit4]   2> 1294286 INFO  (qtp1935364758-12250) [    ] o.a.s.u.p.LogUpdateProcessorFactory [collection1]  webapp= path=/update params={wt=javabin&version=2&CONTROL=TRUE}{delete=[0-1 (-1577235219366281216)]} 0 0
   [junit4]   2> 1294289 INFO  (qtp166102078-12378) [    ] o.a.s.u.p.LogUpdateProcessorFactory [collection1]  webapp= path=/update params={update.distrib=FROMLEADER&distrib.from=http://127.0.0.1:41995/collection1/&wt=javabin&version=2}{delete=[0-1 (-1577235219368378368)]} 0 0
   [junit4]   2> 1294290 INFO  (qtp15989041-12319) [    ] o.a.s.u.p.LogUpdateProcessorFactory [collection1]  webapp= path=/update params={wt=javabin&version=2}{delete=[0-1 (-1577235219368378368)]} 0 2
   [junit4]   2> 1294292 INFO  (qtp1935364758-12250) [    ] o.a.s.u.p.LogUpdateProcessorFactory [collection1]  webapp= path=/update params={wt=javabin&version=2&CONTROL=TRUE}{add=[0-2 (1577235219372572672)]} 0 0
   [junit4]   2> 1294293 INFO  (qtp15989041-12322) [    ] o.a.s.c.S.Request [collection1]  webapp= path=/select params={df=text&distrib=false&_stateVer_=collection1:10&fl=id&fl=score&shards.purpose=4&start=0&fsv=true&shard.url=http://127.0.0.1:41995/collection1/|http://127.0.0.1:38627/collection1/&rows=10&version=2&q=aid&NOW=1504168719610&isShard=true&wt=javabin} hits=0 status=0 QTime=0
   [junit4]   2> 1294294 INFO  (qtp15989041-12323) [    ] o.a.s.c.S.Request [collection1]  webapp= path=/select params={q=aid&_stateVer_=collection1:10&wt=javabin&version=2} hits=0 status=0 QTime=38
   [junit4]   2> 1294296 INFO  (qtp166102078-12378) [    ] o.a.s.u.p.LogUpdateProcessorFactory [collection1]  webapp= path=/update params={update.distrib=FROMLEADER&distrib.from=http://127.0.0.1:41995/collection1/&wt=javabin&version=2}{add=[0-2 (1577235219374669824)]} 0 0
   [junit4]   2> 1294296 INFO  (qtp15989041-12321) [    ] o.a.s.u.p.LogUpdateProcessorFactory [collection1]  webapp= path=/update params={wt=javabin&version=2}{add=[0-2 (1577235219374669824)]} 0 2
   [junit4]   2> 1294298 INFO  (qtp1935364758-12250) [    ] o.a.s.u.p.LogUpdateProcessorFactory [collection1]  webapp= path=/update params={wt=javabin&version=2&CONTROL=TRUE}{add=[0-3 (1577235219378864128)]} 0 0
   [junit4]   2> 1294303 INFO  (qtp166102078-12378) [    ] o.a.s.u.p.LogUpdateProcessorFactory [collection1]  webapp= path=/update params={update.distrib=FROMLEADER&distrib.from=http://127.0.0.1:41995/collection1/&wt=javabin&version=2}{add=[0-3 (1577235219380961280)]} 0 0
   [junit4]   2> 1294303 INFO  (qtp15989041-12322) [    ] o.a.s.u.p.LogUpdateProcessorFactory [collection1]  webapp= path=/update params={wt=javabin&version=2}{add=[0-3 (1577235219380961280)]} 0 2
   [junit4]   2> 1294305 INFO  (qtp1935364758-12250) [    ] o.a.s.u.p.LogUpdateProcessorFactory [collection1]  webapp= path=/update params={wt=javabin&version=2&CONTROL=TRUE}{add=[0-4 (1577235219385155584)]} 0 0
   [junit4]   2> 1294310 INFO  (qtp166102078-12378) [    ] o.a.s.u.p.LogUpdateProcessorFactory [collection1]  webapp= path=/update params={update.distrib=FROMLEADER&distrib.from=http://127.0.0.1:41995/collection1/&wt=javabin&version=2}{add=[0-4 (1577235219388301312)]} 0 0
   [junit4]   2> 1294317

[...truncated too long message...]

O  (zkCallback-2096-thread-2) [    ] o.a.s.c.c.ZkStateReader A cluster state change: [WatchedEvent state:SyncConnected type:NodeDataChanged path:/collections/collection1/state.json] for collection [collection1] has occurred - updating... (live nodes size: [1])
   [junit4]   2> 1335304 INFO  (zkCallback-2096-thread-2) [    ] o.a.s.c.c.ZkStateReader A cluster state change: [WatchedEvent state:SyncConnected type:NodeDataChanged path:/collections/collection1/state.json] for collection [collection1] has occurred - updating... (live nodes size: [1])
   [junit4]   2> 1336685 WARN  (zkCallback-2110-thread-2) [    ] o.a.s.c.c.ZkStateReader ZooKeeper watch triggered, but Solr cannot talk to ZK: [KeeperErrorCode = Session expired for /live_nodes]
   [junit4]   2> 1336685 INFO  (TEST-ChaosMonkeyNothingIsSafeTest.test-seed#[8CAE2226992DF5FD]) [    ] o.e.j.s.AbstractConnector Stopped ServerConnector@d57c427{HTTP/1.1,[http/1.1]}{127.0.0.1:၄၁၉၉၅}
   [junit4]   2> 1336686 INFO  (TEST-ChaosMonkeyNothingIsSafeTest.test-seed#[8CAE2226992DF5FD]) [    ] o.e.j.s.h.ContextHandler Stopped o.e.j.s.ServletContextHandler@68ad453{/,null,UNAVAILABLE}
   [junit4]   2> 1336686 INFO  (TEST-ChaosMonkeyNothingIsSafeTest.test-seed#[8CAE2226992DF5FD]) [    ] o.a.s.c.ChaosMonkey monkey: stop shard! 45023
   [junit4]   2> 1336686 INFO  (TEST-ChaosMonkeyNothingIsSafeTest.test-seed#[8CAE2226992DF5FD]) [    ] o.a.s.c.CoreContainer Shutting down CoreContainer instance=688558845
   [junit4]   2> 1336686 INFO  (TEST-ChaosMonkeyNothingIsSafeTest.test-seed#[8CAE2226992DF5FD]) [    ] o.a.s.m.SolrMetricManager Closing metric reporters for: solr.node
   [junit4]   2> 1336686 INFO  (TEST-ChaosMonkeyNothingIsSafeTest.test-seed#[8CAE2226992DF5FD]) [    ] o.a.s.m.SolrMetricManager Closing metric reporters for: solr.jvm
   [junit4]   2> 1336686 INFO  (TEST-ChaosMonkeyNothingIsSafeTest.test-seed#[8CAE2226992DF5FD]) [    ] o.a.s.m.SolrMetricManager Closing metric reporters for: solr.jetty
   [junit4]   2> 1336697 INFO  (TEST-ChaosMonkeyNothingIsSafeTest.test-seed#[8CAE2226992DF5FD]) [    ] o.a.s.c.Overseer Overseer (id=98577200536748047-127.0.0.1:45023_-n_0000000003) closing
   [junit4]   2> 1336697 INFO  (OverseerStateUpdate-98577200536748047-127.0.0.1:45023_-n_0000000003) [    ] o.a.s.c.Overseer Overseer Loop exiting : 127.0.0.1:45023_
   [junit4]   2> 1337657 WARN  (zkCallback-2096-thread-6) [    ] o.a.s.c.SyncStrategy Closed, skipping sync up.
   [junit4]   2> 1337658 INFO  (zkCallback-2096-thread-6) [    ] o.a.s.c.SolrCore [collection1]  CLOSING SolrCore org.apache.solr.core.SolrCore@35094441
   [junit4]   2> 1337671 INFO  (zkCallback-2096-thread-6) [    ] o.a.s.m.SolrMetricManager Closing metric reporters for: solr.core.collection1
   [junit4]   2> 1337672 INFO  (TEST-ChaosMonkeyNothingIsSafeTest.test-seed#[8CAE2226992DF5FD]) [    ] o.e.j.s.AbstractConnector Stopped ServerConnector@36ade7e7{HTTP/1.1,[http/1.1]}{127.0.0.1:၀}
   [junit4]   2> 1337672 INFO  (TEST-ChaosMonkeyNothingIsSafeTest.test-seed#[8CAE2226992DF5FD]) [    ] o.e.j.s.h.ContextHandler Stopped o.e.j.s.ServletContextHandler@e005ad4{/,null,UNAVAILABLE}
   [junit4]   2> 1337672 INFO  (TEST-ChaosMonkeyNothingIsSafeTest.test-seed#[8CAE2226992DF5FD]) [    ] o.a.s.c.ChaosMonkey monkey: stop shard! 38627
   [junit4]   2> 1337672 ERROR (TEST-ChaosMonkeyNothingIsSafeTest.test-seed#[8CAE2226992DF5FD]) [    ] o.a.z.s.ZooKeeperServer ZKShutdownHandler is not registered, so ZooKeeper server won't take any action on ERROR or SHUTDOWN server state changes
   [junit4]   2> 1337673 INFO  (TEST-ChaosMonkeyNothingIsSafeTest.test-seed#[8CAE2226992DF5FD]) [    ] o.a.s.c.ZkTestServer connecting to 127.0.0.1:46749 46749
   [junit4]   2> 1342685 INFO  (Thread-3614) [    ] o.a.s.c.ZkTestServer connecting to 127.0.0.1:46749 46749
   [junit4]   2> 1342685 WARN  (Thread-3614) [    ] o.a.s.c.ZkTestServer Watch limit violations: 
   [junit4]   2> Maximum concurrent children watches above limit:
   [junit4]   2> 
   [junit4]   2> 	2	/solr/overseer/queue
   [junit4]   2> 	2	/solr/overseer/collection-queue-work
   [junit4]   2> 
   [junit4]   2> NOTE: reproduce with: ant test  -Dtestcase=ChaosMonkeyNothingIsSafeTest -Dtests.method=test -Dtests.seed=8CAE2226992DF5FD -Dtests.multiplier=3 -Dtests.slow=true -Dtests.locale=my -Dtests.timezone=Etc/Greenwich -Dtests.asserts=true -Dtests.file.encoding=UTF-8
   [junit4] FAILURE 58.7s J2 | ChaosMonkeyNothingIsSafeTest.test <<<
   [junit4]    > Throwable #1: java.lang.AssertionError: document count mismatch.  control=691 sum(shards)=685 cloudClient=685
   [junit4]    > 	at __randomizedtesting.SeedInfo.seed([8CAE2226992DF5FD:4FA1DFC37D19805]:0)
   [junit4]    > 	at org.apache.solr.cloud.AbstractFullDistribZkTestBase.checkShardConsistency(AbstractFullDistribZkTestBase.java:1323)
   [junit4]    > 	at org.apache.solr.cloud.ChaosMonkeyNothingIsSafeTest.test(ChaosMonkeyNothingIsSafeTest.java:226)
   [junit4]    > 	at java.base/jdk.internal.reflect.NativeMethodAccessorImpl.invoke0(Native Method)
   [junit4]    > 	at java.base/jdk.internal.reflect.NativeMethodAccessorImpl.invoke(NativeMethodAccessorImpl.java:62)
   [junit4]    > 	at java.base/jdk.internal.reflect.DelegatingMethodAccessorImpl.invoke(DelegatingMethodAccessorImpl.java:43)
   [junit4]    > 	at java.base/java.lang.reflect.Method.invoke(Method.java:564)
   [junit4]    > 	at org.apache.solr.BaseDistributedSearchTestCase$ShardsRepeatRule$ShardsFixedStatement.callStatement(BaseDistributedSearchTestCase.java:992)
   [junit4]    > 	at org.apache.solr.BaseDistributedSearchTestCase$ShardsRepeatRule$ShardsStatement.evaluate(BaseDistributedSearchTestCase.java:967)
   [junit4]    > 	at java.base/java.lang.Thread.run(Thread.java:844)
   [junit4]   2> 1342688 INFO  (SUITE-ChaosMonkeyNothingIsSafeTest-seed#[8CAE2226992DF5FD]-worker) [    ] o.a.s.SolrTestCaseJ4 ###deleteCore
   [junit4]   2> NOTE: leaving temporary files on disk at: /home/jenkins/workspace/Lucene-Solr-6.6-Linux/solr/build/solr-core/test/J2/temp/solr.cloud.ChaosMonkeyNothingIsSafeTest_8CAE2226992DF5FD-001
   [junit4]   2> NOTE: test params are: codec=Lucene62, sim=RandomSimilarity(queryNorm=false,coord=no): {}, locale=my, timezone=Etc/Greenwich
   [junit4]   2> NOTE: Linux 4.10.0-33-generic amd64/Oracle Corporation 9 (64-bit)/cpus=8,threads=1,free=168463480,total=520093696
   [junit4]   2> NOTE: All tests run in this JVM: [AsyncCallRequestStatusResponseTest, SubstringBytesRefFilterTest, LukeRequestHandlerTest, V2ApiIntegrationTest, TestSchemaNameResource, MultiThreadedOCPTest, TestSolrJ, SolrJmxReporterTest, DeleteLastCustomShardedReplicaTest, CloudExitableDirectoryReaderTest, AutoCommitTest, SortSpecParsingTest, TestConfigSetImmutable, CollectionTooManyReplicasTest, OverseerTest, TestFieldCacheSortRandom, TestRestoreCore, EnumFieldTest, SpellPossibilityIteratorTest, FieldMutatingUpdateProcessorTest, TestNamedUpdateProcessors, TestCorePropertiesReload, ReplicaListTransformerTest, HttpPartitionTest, SolrCoreCheckLockOnStartupTest, TestWriterPerf, TestStressReorder, SolrGangliaReporterTest, SolrTestCaseJ4Test, TestSolrConfigHandlerCloud, TestHashQParserPlugin, QueryResultKeyTest, TestCoreDiscovery, TestSearcherReuse, TestShortCircuitedRequests, DocExpirationUpdateProcessorFactoryTest, LargeFieldTest, UpdateLogTest, TestJsonFacets, TestExportWriter, OpenExchangeRatesOrgProviderTest, TestRawTransformer, TimeZoneUtilsTest, MinimalSchemaTest, TestIndexSearcher, TestPostingsSolrHighlighter, TestLegacyFieldCache, TestHalfAndHalfDocValues, TestUtils, HdfsTlogReplayBufferedWhileIndexingTest, StatsComponentTest, TestReload, PreAnalyzedFieldTest, SuggesterTSTTest, TestNRTOpen, DistribDocExpirationUpdateProcessorTest, DocValuesMultiTest, TestHdfsBackupRestoreCore, LeaderFailureAfterFreshStartTest, BinaryUpdateRequestHandlerTest, TestRTimerTree, ZkStateWriterTest, TestSimpleTextCodec, TestSolr4Spatial2, DistributedFacetPivotLongTailTest, CoreMergeIndexesAdminHandlerTest, CoreAdminHandlerTest, SimpleCollectionCreateDeleteTest, AtomicUpdateProcessorFactoryTest, TestSchemalessBufferedUpdates, PrimUtilsTest, TestCollationField, CdcrVersionReplicationTest, DirectUpdateHandlerOptimizeTest, BlockDirectoryTest, PluginInfoTest, TestManagedSchemaThreadSafety, TestCollectionAPI, TestSolrCloudWithKerberosAlt, AnalyticsMergeStrategyTest, TestTolerantUpdateProcessorRandomCloud, SuggesterTest, TestMergePolicyConfig, QueryParsingTest, TestStandardQParsers, TestIndexingPerformance, TestDFRSimilarityFactory, TestFreeTextSuggestions, ReplaceNodeTest, DeleteShardTest, TestBulkSchemaAPI, HardAutoCommitTest, HdfsNNFailoverTest, RecoveryZkTest, TestQueryWrapperFilter, ActionThrottleTest, OverriddenZkACLAndCredentialsProvidersTest, RequestLoggingTest, TestBinaryField, DistributedVersionInfoTest, ClassificationUpdateProcessorIntegrationTest, SolrIndexMetricsTest, TestOnReconnectListenerSupport, TestHdfsUpdateLog, CachingDirectoryFactoryTest, DistributedSuggestComponentTest, FieldAnalysisRequestHandlerTest, TestJavabinTupleStreamParser, PreAnalyzedUpdateProcessorTest, BasicDistributedZk2Test, TermVectorComponentDistributedTest, DOMUtilTest, XmlUpdateRequestHandlerTest, BadComponentTest, PeerSyncReplicationTest, TestFieldSortValues, ShardRoutingTest, ClusterStateUpdateTest, TestZkChroot, TestDistributedSearch, DisMaxRequestHandlerTest, TestReversedWildcardFilterFactory, PrimitiveFieldTypeTest, DocumentBuilderTest, TermVectorComponentTest, TestSolrQueryParser, LoggingHandlerTest, SolrPluginUtilsTest, UpdateRequestProcessorFactoryTest, MBeansHandlerTest, JsonLoaderTest, TestPartialUpdateDeduplication, CSVRequestHandlerTest, TestComponentsName, SearchHandlerTest, TestQuerySenderListener, AlternateDirectoryTest, ResponseLogComponentTest, SampleTest, TestDocSet, OutputWriterTest, ExternalFileFieldSortTest, TestPhraseSuggestions, TestLMJelinekMercerSimilarityFactory, ResourceLoaderTest, ChaosMonkeyNothingIsSafeTest]
   [junit4] Completed [490/713 (1!)] on J2 in 58.70s, 1 test, 1 failure <<< FAILURES!

[...truncated 37126 lines...]

Mime
View raw message