lucene-dev mailing list archives

Site index · List index
Message view « Date » · « Thread »
Top « Date » · « Thread »
From Policeman Jenkins Server <jenk...@thetaphi.de>
Subject [JENKINS] Lucene-Solr-7.0-Linux (64bit/jdk1.8.0_144) - Build # 240 - Still Unstable!
Date Mon, 21 Aug 2017 15:56:34 GMT
Build: https://jenkins.thetaphi.de/job/Lucene-Solr-7.0-Linux/240/
Java: 64bit/jdk1.8.0_144 -XX:+UseCompressedOops -XX:+UseG1GC

1 tests failed.
FAILED:  junit.framework.TestSuite.org.apache.solr.analytics.facet.FieldFacetCloudTest

Error Message:
Could not find collection:collection1

Stack Trace:
java.lang.AssertionError: Could not find collection:collection1
	at __randomizedtesting.SeedInfo.seed([78037E1024D95ED8]:0)
	at org.junit.Assert.fail(Assert.java:93)
	at org.junit.Assert.assertTrue(Assert.java:43)
	at org.junit.Assert.assertNotNull(Assert.java:526)
	at org.apache.solr.cloud.AbstractDistribZkTestBase.waitForRecoveriesToFinish(AbstractDistribZkTestBase.java:155)
	at org.apache.solr.analytics.facet.AbstractAnalyticsFacetCloudTest.setupCluster(AbstractAnalyticsFacetCloudTest.java:59)
	at org.apache.solr.analytics.facet.FieldFacetCloudTest.beforeClass(FieldFacetCloudTest.java:90)
	at sun.reflect.NativeMethodAccessorImpl.invoke0(Native Method)
	at sun.reflect.NativeMethodAccessorImpl.invoke(NativeMethodAccessorImpl.java:62)
	at sun.reflect.DelegatingMethodAccessorImpl.invoke(DelegatingMethodAccessorImpl.java:43)
	at java.lang.reflect.Method.invoke(Method.java:498)
	at com.carrotsearch.randomizedtesting.RandomizedRunner.invoke(RandomizedRunner.java:1713)
	at com.carrotsearch.randomizedtesting.RandomizedRunner$6.evaluate(RandomizedRunner.java:847)
	at com.carrotsearch.randomizedtesting.RandomizedRunner$7.evaluate(RandomizedRunner.java:863)
	at com.carrotsearch.randomizedtesting.rules.StatementAdapter.evaluate(StatementAdapter.java:36)
	at com.carrotsearch.randomizedtesting.rules.SystemPropertiesRestoreRule$1.evaluate(SystemPropertiesRestoreRule.java:57)
	at org.apache.lucene.util.AbstractBeforeAfterRule$1.evaluate(AbstractBeforeAfterRule.java:45)
	at com.carrotsearch.randomizedtesting.rules.StatementAdapter.evaluate(StatementAdapter.java:36)
	at org.apache.lucene.util.TestRuleStoreClassName$1.evaluate(TestRuleStoreClassName.java:41)
	at com.carrotsearch.randomizedtesting.rules.NoShadowingOrOverridesOnMethodsRule$1.evaluate(NoShadowingOrOverridesOnMethodsRule.java:40)
	at com.carrotsearch.randomizedtesting.rules.NoShadowingOrOverridesOnMethodsRule$1.evaluate(NoShadowingOrOverridesOnMethodsRule.java:40)
	at com.carrotsearch.randomizedtesting.rules.StatementAdapter.evaluate(StatementAdapter.java:36)
	at com.carrotsearch.randomizedtesting.rules.StatementAdapter.evaluate(StatementAdapter.java:36)
	at com.carrotsearch.randomizedtesting.rules.StatementAdapter.evaluate(StatementAdapter.java:36)
	at org.apache.lucene.util.TestRuleAssertionsRequired$1.evaluate(TestRuleAssertionsRequired.java:53)
	at org.apache.lucene.util.TestRuleMarkFailure$1.evaluate(TestRuleMarkFailure.java:47)
	at org.apache.lucene.util.TestRuleIgnoreAfterMaxFailures$1.evaluate(TestRuleIgnoreAfterMaxFailures.java:64)
	at org.apache.lucene.util.TestRuleIgnoreTestSuites$1.evaluate(TestRuleIgnoreTestSuites.java:54)
	at com.carrotsearch.randomizedtesting.rules.StatementAdapter.evaluate(StatementAdapter.java:36)
	at com.carrotsearch.randomizedtesting.ThreadLeakControl$StatementRunner.run(ThreadLeakControl.java:368)
	at java.lang.Thread.run(Thread.java:748)




Build Log:
[...truncated 15900 lines...]
   [junit4] Suite: org.apache.solr.analytics.facet.FieldFacetCloudTest
   [junit4]   2> Creating dataDir: /home/jenkins/workspace/Lucene-Solr-7.0-Linux/solr/build/contrib/solr-analytics/test/J0/temp/solr.analytics.facet.FieldFacetCloudTest_78037E1024D95ED8-001/init-core-data-001
   [junit4]   2> log4j:WARN No appenders could be found for logger (org.apache.solr.SolrTestCaseJ4).
   [junit4]   2> log4j:WARN Please initialize the log4j system properly.
   [junit4]   2> log4j:WARN See http://logging.apache.org/log4j/1.2/faq.html#noconfig for
more info.
   [junit4]   2> Aug 21, 2017 3:47:56 PM com.carrotsearch.randomizedtesting.ThreadLeakControl
checkThreadLeaks
   [junit4]   2> WARNING: Will linger awaiting termination of 4 leaked thread(s).
   [junit4]   2> NOTE: test params are: codec=Asserting(Lucene70), sim=RandomSimilarity(queryNorm=false):
{}, locale=sr-Latn-BA, timezone=SystemV/AST4ADT
   [junit4]   2> NOTE: Linux 4.10.0-27-generic amd64/Oracle Corporation 1.8.0_144 (64-bit)/cpus=8,threads=1,free=367001600,total=536870912
   [junit4]   2> NOTE: All tests run in this JVM: [FieldFacetCloudTest]
   [junit4]   2> NOTE: reproduce with: ant test  -Dtestcase=FieldFacetCloudTest -Dtests.seed=78037E1024D95ED8
-Dtests.multiplier=3 -Dtests.slow=true -Dtests.locale=sr-Latn-BA -Dtests.timezone=SystemV/AST4ADT
-Dtests.asserts=true -Dtests.file.encoding=ISO-8859-1
   [junit4] ERROR   0.00s J0 | FieldFacetCloudTest (suite) <<<
   [junit4]    > Throwable #1: java.lang.AssertionError: Could not find collection:collection1
   [junit4]    > 	at __randomizedtesting.SeedInfo.seed([78037E1024D95ED8]:0)
   [junit4]    > 	at org.apache.solr.cloud.AbstractDistribZkTestBase.waitForRecoveriesToFinish(AbstractDistribZkTestBase.java:155)
   [junit4]    > 	at org.apache.solr.analytics.facet.AbstractAnalyticsFacetCloudTest.setupCluster(AbstractAnalyticsFacetCloudTest.java:59)
   [junit4]    > 	at org.apache.solr.analytics.facet.FieldFacetCloudTest.beforeClass(FieldFacetCloudTest.java:90)
   [junit4]    > 	at java.lang.Thread.run(Thread.java:748)
   [junit4] Completed [15/17 (1!)] on J0 in 39.17s, 0 tests, 1 failure <<< FAILURES!

[...truncated 40705 lines...]

Mime
View raw message