lucene-dev mailing list archives

Site index · List index
Message view « Date » · « Thread »
Top « Date » · « Thread »
From Policeman Jenkins Server <jenk...@thetaphi.de>
Subject [JENKINS-EA] Lucene-Solr-master-Windows (64bit/jdk-9-ea+181) - Build # 6840 - Still Unstable!
Date Tue, 22 Aug 2017 23:41:47 GMT
Build: https://jenkins.thetaphi.de/job/Lucene-Solr-master-Windows/6840/
Java: 64bit/jdk-9-ea+181 -XX:+UseCompressedOops -XX:+UseSerialGC --illegal-access=deny

1 tests failed.
FAILED:  org.apache.solr.update.HardAutoCommitTest.testCommitWithin

Error Message:
Exception during query

Stack Trace:
java.lang.RuntimeException: Exception during query
	at __randomizedtesting.SeedInfo.seed([60811FA03187B828:DA5370D8B2A9563D]:0)
	at org.apache.solr.SolrTestCaseJ4.assertQ(SolrTestCaseJ4.java:880)
	at org.apache.solr.update.HardAutoCommitTest.testCommitWithin(HardAutoCommitTest.java:100)
	at java.base/jdk.internal.reflect.NativeMethodAccessorImpl.invoke0(Native Method)
	at java.base/jdk.internal.reflect.NativeMethodAccessorImpl.invoke(NativeMethodAccessorImpl.java:62)
	at java.base/jdk.internal.reflect.DelegatingMethodAccessorImpl.invoke(DelegatingMethodAccessorImpl.java:43)
	at java.base/java.lang.reflect.Method.invoke(Method.java:564)
	at com.carrotsearch.randomizedtesting.RandomizedRunner.invoke(RandomizedRunner.java:1713)
	at com.carrotsearch.randomizedtesting.RandomizedRunner$8.evaluate(RandomizedRunner.java:907)
	at com.carrotsearch.randomizedtesting.RandomizedRunner$9.evaluate(RandomizedRunner.java:943)
	at com.carrotsearch.randomizedtesting.RandomizedRunner$10.evaluate(RandomizedRunner.java:957)
	at com.carrotsearch.randomizedtesting.rules.SystemPropertiesRestoreRule$1.evaluate(SystemPropertiesRestoreRule.java:57)
	at org.apache.lucene.util.TestRuleSetupTeardownChained$1.evaluate(TestRuleSetupTeardownChained.java:49)
	at org.apache.lucene.util.AbstractBeforeAfterRule$1.evaluate(AbstractBeforeAfterRule.java:45)
	at org.apache.lucene.util.TestRuleThreadAndTestName$1.evaluate(TestRuleThreadAndTestName.java:48)
	at org.apache.lucene.util.TestRuleIgnoreAfterMaxFailures$1.evaluate(TestRuleIgnoreAfterMaxFailures.java:64)
	at org.apache.lucene.util.TestRuleMarkFailure$1.evaluate(TestRuleMarkFailure.java:47)
	at com.carrotsearch.randomizedtesting.rules.StatementAdapter.evaluate(StatementAdapter.java:36)
	at com.carrotsearch.randomizedtesting.ThreadLeakControl$StatementRunner.run(ThreadLeakControl.java:368)
	at com.carrotsearch.randomizedtesting.ThreadLeakControl.forkTimeoutingTask(ThreadLeakControl.java:817)
	at com.carrotsearch.randomizedtesting.ThreadLeakControl$3.evaluate(ThreadLeakControl.java:468)
	at com.carrotsearch.randomizedtesting.RandomizedRunner.runSingleTest(RandomizedRunner.java:916)
	at com.carrotsearch.randomizedtesting.RandomizedRunner$5.evaluate(RandomizedRunner.java:802)
	at com.carrotsearch.randomizedtesting.RandomizedRunner$6.evaluate(RandomizedRunner.java:852)
	at com.carrotsearch.randomizedtesting.RandomizedRunner$7.evaluate(RandomizedRunner.java:863)
	at com.carrotsearch.randomizedtesting.rules.StatementAdapter.evaluate(StatementAdapter.java:36)
	at com.carrotsearch.randomizedtesting.rules.SystemPropertiesRestoreRule$1.evaluate(SystemPropertiesRestoreRule.java:57)
	at org.apache.lucene.util.AbstractBeforeAfterRule$1.evaluate(AbstractBeforeAfterRule.java:45)
	at com.carrotsearch.randomizedtesting.rules.StatementAdapter.evaluate(StatementAdapter.java:36)
	at org.apache.lucene.util.TestRuleStoreClassName$1.evaluate(TestRuleStoreClassName.java:41)
	at com.carrotsearch.randomizedtesting.rules.NoShadowingOrOverridesOnMethodsRule$1.evaluate(NoShadowingOrOverridesOnMethodsRule.java:40)
	at com.carrotsearch.randomizedtesting.rules.NoShadowingOrOverridesOnMethodsRule$1.evaluate(NoShadowingOrOverridesOnMethodsRule.java:40)
	at com.carrotsearch.randomizedtesting.rules.StatementAdapter.evaluate(StatementAdapter.java:36)
	at com.carrotsearch.randomizedtesting.rules.StatementAdapter.evaluate(StatementAdapter.java:36)
	at org.apache.lucene.util.TestRuleAssertionsRequired$1.evaluate(TestRuleAssertionsRequired.java:53)
	at org.apache.lucene.util.TestRuleMarkFailure$1.evaluate(TestRuleMarkFailure.java:47)
	at org.apache.lucene.util.TestRuleIgnoreAfterMaxFailures$1.evaluate(TestRuleIgnoreAfterMaxFailures.java:64)
	at org.apache.lucene.util.TestRuleIgnoreTestSuites$1.evaluate(TestRuleIgnoreTestSuites.java:54)
	at com.carrotsearch.randomizedtesting.rules.StatementAdapter.evaluate(StatementAdapter.java:36)
	at com.carrotsearch.randomizedtesting.ThreadLeakControl$StatementRunner.run(ThreadLeakControl.java:368)
	at java.base/java.lang.Thread.run(Thread.java:844)
Caused by: java.lang.RuntimeException: REQUEST FAILED: xpath=//result[@numFound=1]
	xml response was: <?xml version="1.0" encoding="UTF-8"?>
<response>
<lst name="responseHeader"><int name="status">0</int><int name="QTime">0</int></lst><result
name="response" numFound="0" start="0"></result>
</response>

	request was:q=id:529&qt=&start=0&rows=20&version=2.2
	at org.apache.solr.SolrTestCaseJ4.assertQ(SolrTestCaseJ4.java:873)
	... 39 more




Build Log:
[...truncated 11936 lines...]
   [junit4] Suite: org.apache.solr.update.HardAutoCommitTest
   [junit4]   2> Creating dataDir: C:\Users\jenkins\workspace\Lucene-Solr-master-Windows\solr\build\solr-core\test\J1\temp\solr.update.HardAutoCommitTest_60811FA03187B828-001\init-core-data-001
   [junit4]   2> 1661084 WARN  (SUITE-HardAutoCommitTest-seed#[60811FA03187B828]-worker)
[    ] o.a.s.SolrTestCaseJ4 startTrackingSearchers: numOpens=66 numCloses=66
   [junit4]   2> 1661890 ERROR (TEST-HardAutoCommitTest.testCommitWithin-seed#[60811FA03187B828])
[    ] o.a.s.c.CorePropertiesLocator Couldn't load core descriptor from C:\Users\jenkins\workspace\Lucene-Solr-master-Windows\solr\core\src\test-files\solr\collection1\core.properties:java.nio.file.NoSuchFileException:
C:\Users\jenkins\workspace\Lucene-Solr-master-Windows\solr\core\src\test-files\solr\collection1\core.properties
   [junit4]   2> 1662513 ERROR (TEST-HardAutoCommitTest.testCommitWithin-seed#[60811FA03187B828])
[    ] o.a.s.SolrTestCaseJ4 REQUEST FAILED: xpath=//result[@numFound=1]
   [junit4]   2> 	xml response was: <?xml version="1.0" encoding="UTF-8"?>
   [junit4]   2> <response>
   [junit4]   2> <lst name="responseHeader"><int name="status">0</int><int
name="QTime">0</int></lst><result name="response" numFound="0" start="0"></result>
   [junit4]   2> </response>
   [junit4]   2> 
   [junit4]   2> 	request was:q=id:529&qt=&start=0&rows=20&version=2.2
   [junit4]   2> 1662514 ERROR (TEST-HardAutoCommitTest.testCommitWithin-seed#[60811FA03187B828])
[    ] o.a.s.SolrTestCaseJ4 REQUEST FAILED: q=id:529&qt=&start=0&rows=20&version=2.2:java.lang.RuntimeException:
REQUEST FAILED: xpath=//result[@numFound=1]
   [junit4]   2> 	xml response was: <?xml version="1.0" encoding="UTF-8"?>
   [junit4]   2> <response>
   [junit4]   2> <lst name="responseHeader"><int name="status">0</int><int
name="QTime">0</int></lst><result name="response" numFound="0" start="0"></result>
   [junit4]   2> </response>
   [junit4]   2> 
   [junit4]   2> 	request was:q=id:529&qt=&start=0&rows=20&version=2.2
   [junit4]   2> 	at org.apache.solr.SolrTestCaseJ4.assertQ(SolrTestCaseJ4.java:873)
   [junit4]   2> 	at org.apache.solr.update.HardAutoCommitTest.testCommitWithin(HardAutoCommitTest.java:100)
   [junit4]   2> 	at java.base/jdk.internal.reflect.NativeMethodAccessorImpl.invoke0(Native
Method)
   [junit4]   2> 	at java.base/jdk.internal.reflect.NativeMethodAccessorImpl.invoke(NativeMethodAccessorImpl.java:62)
   [junit4]   2> 	at java.base/jdk.internal.reflect.DelegatingMethodAccessorImpl.invoke(DelegatingMethodAccessorImpl.java:43)
   [junit4]   2> 	at java.base/java.lang.reflect.Method.invoke(Method.java:564)
   [junit4]   2> 	at com.carrotsearch.randomizedtesting.RandomizedRunner.invoke(RandomizedRunner.java:1713)
   [junit4]   2> 	at com.carrotsearch.randomizedtesting.RandomizedRunner$8.evaluate(RandomizedRunner.java:907)
   [junit4]   2> 	at com.carrotsearch.randomizedtesting.RandomizedRunner$9.evaluate(RandomizedRunner.java:943)
   [junit4]   2> 	at com.carrotsearch.randomizedtesting.RandomizedRunner$10.evaluate(RandomizedRunner.java:957)
   [junit4]   2> 	at com.carrotsearch.randomizedtesting.rules.SystemPropertiesRestoreRule$1.evaluate(SystemPropertiesRestoreRule.java:57)
   [junit4]   2> 	at org.apache.lucene.util.TestRuleSetupTeardownChained$1.evaluate(TestRuleSetupTeardownChained.java:49)
   [junit4]   2> 	at org.apache.lucene.util.AbstractBeforeAfterRule$1.evaluate(AbstractBeforeAfterRule.java:45)
   [junit4]   2> 	at org.apache.lucene.util.TestRuleThreadAndTestName$1.evaluate(TestRuleThreadAndTestName.java:48)
   [junit4]   2> 	at org.apache.lucene.util.TestRuleIgnoreAfterMaxFailures$1.evaluate(TestRuleIgnoreAfterMaxFailures.java:64)
   [junit4]   2> 	at org.apache.lucene.util.TestRuleMarkFailure$1.evaluate(TestRuleMarkFailure.java:47)
   [junit4]   2> 	at com.carrotsearch.randomizedtesting.rules.StatementAdapter.evaluate(StatementAdapter.java:36)
   [junit4]   2> 	at com.carrotsearch.randomizedtesting.ThreadLeakControl$StatementRunner.run(ThreadLeakControl.java:368)
   [junit4]   2> 	at com.carrotsearch.randomizedtesting.ThreadLeakControl.forkTimeoutingTask(ThreadLeakControl.java:817)
   [junit4]   2> 	at com.carrotsearch.randomizedtesting.ThreadLeakControl$3.evaluate(ThreadLeakControl.java:468)
   [junit4]   2> 	at com.carrotsearch.randomizedtesting.RandomizedRunner.runSingleTest(RandomizedRunner.java:916)
   [junit4]   2> 	at com.carrotsearch.randomizedtesting.RandomizedRunner$5.evaluate(RandomizedRunner.java:802)
   [junit4]   2> 	at com.carrotsearch.randomizedtesting.RandomizedRunner$6.evaluate(RandomizedRunner.java:852)
   [junit4]   2> 	at com.carrotsearch.randomizedtesting.RandomizedRunner$7.evaluate(RandomizedRunner.java:863)
   [junit4]   2> 	at com.carrotsearch.randomizedtesting.rules.StatementAdapter.evaluate(StatementAdapter.java:36)
   [junit4]   2> 	at com.carrotsearch.randomizedtesting.rules.SystemPropertiesRestoreRule$1.evaluate(SystemPropertiesRestoreRule.java:57)
   [junit4]   2> 	at org.apache.lucene.util.AbstractBeforeAfterRule$1.evaluate(AbstractBeforeAfterRule.java:45)
   [junit4]   2> 	at com.carrotsearch.randomizedtesting.rules.StatementAdapter.evaluate(StatementAdapter.java:36)
   [junit4]   2> 	at org.apache.lucene.util.TestRuleStoreClassName$1.evaluate(TestRuleStoreClassName.java:41)
   [junit4]   2> 	at com.carrotsearch.randomizedtesting.rules.NoShadowingOrOverridesOnMethodsRule$1.evaluate(NoShadowingOrOverridesOnMethodsRule.java:40)
   [junit4]   2> 	at com.carrotsearch.randomizedtesting.rules.NoShadowingOrOverridesOnMethodsRule$1.evaluate(NoShadowingOrOverridesOnMethodsRule.java:40)
   [junit4]   2> 	at com.carrotsearch.randomizedtesting.rules.StatementAdapter.evaluate(StatementAdapter.java:36)
   [junit4]   2> 	at com.carrotsearch.randomizedtesting.rules.StatementAdapter.evaluate(StatementAdapter.java:36)
   [junit4]   2> 	at org.apache.lucene.util.TestRuleAssertionsRequired$1.evaluate(TestRuleAssertionsRequired.java:53)
   [junit4]   2> 	at org.apache.lucene.util.TestRuleMarkFailure$1.evaluate(TestRuleMarkFailure.java:47)
   [junit4]   2> 	at org.apache.lucene.util.TestRuleIgnoreAfterMaxFailures$1.evaluate(TestRuleIgnoreAfterMaxFailures.java:64)
   [junit4]   2> 	at org.apache.lucene.util.TestRuleIgnoreTestSuites$1.evaluate(TestRuleIgnoreTestSuites.java:54)
   [junit4]   2> 	at com.carrotsearch.randomizedtesting.rules.StatementAdapter.evaluate(StatementAdapter.java:36)
   [junit4]   2> 	at com.carrotsearch.randomizedtesting.ThreadLeakControl$StatementRunner.run(ThreadLeakControl.java:368)
   [junit4]   2> 	at java.base/java.lang.Thread.run(Thread.java:844)
   [junit4]   2> 
   [junit4]   2> NOTE: reproduce with: ant test  -Dtestcase=HardAutoCommitTest -Dtests.method=testCommitWithin
-Dtests.seed=60811FA03187B828 -Dtests.slow=true -Dtests.locale=lrc -Dtests.timezone=Pacific/Midway
-Dtests.asserts=true -Dtests.file.encoding=ISO-8859-1
   [junit4] ERROR   0.64s J1 | HardAutoCommitTest.testCommitWithin <<<
   [junit4]    > Throwable #1: java.lang.RuntimeException: Exception during query
   [junit4]    > 	at __randomizedtesting.SeedInfo.seed([60811FA03187B828:DA5370D8B2A9563D]:0)
   [junit4]    > 	at org.apache.solr.SolrTestCaseJ4.assertQ(SolrTestCaseJ4.java:880)
   [junit4]    > 	at org.apache.solr.update.HardAutoCommitTest.testCommitWithin(HardAutoCommitTest.java:100)
   [junit4]    > 	at java.base/jdk.internal.reflect.NativeMethodAccessorImpl.invoke0(Native
Method)
   [junit4]    > 	at java.base/jdk.internal.reflect.NativeMethodAccessorImpl.invoke(NativeMethodAccessorImpl.java:62)
   [junit4]    > 	at java.base/jdk.internal.reflect.DelegatingMethodAccessorImpl.invoke(DelegatingMethodAccessorImpl.java:43)
   [junit4]    > 	at java.base/java.lang.reflect.Method.invoke(Method.java:564)
   [junit4]    > 	at java.base/java.lang.Thread.run(Thread.java:844)
   [junit4]    > Caused by: java.lang.RuntimeException: REQUEST FAILED: xpath=//result[@numFound=1]
   [junit4]    > 	xml response was: <?xml version="1.0" encoding="UTF-8"?>
   [junit4]    > <response>
   [junit4]    > <lst name="responseHeader"><int name="status">0</int><int
name="QTime">0</int></lst><result name="response" numFound="0" start="0"></result>
   [junit4]    > </response>
   [junit4]    > 	request was:q=id:529&qt=&start=0&rows=20&version=2.2
   [junit4]    > 	at org.apache.solr.SolrTestCaseJ4.assertQ(SolrTestCaseJ4.java:873)
   [junit4]    > 	... 39 more
   [junit4]   2> NOTE: leaving temporary files on disk at: C:\Users\jenkins\workspace\Lucene-Solr-master-Windows\solr\build\solr-core\test\J1\temp\solr.update.HardAutoCommitTest_60811FA03187B828-001
   [junit4]   2> NOTE: test params are: codec=Asserting(Lucene70): {field_t=Lucene50(blocksize=128),
multiDefault=PostingsFormat(name=MockRandom), subject=PostingsFormat(name=MockRandom), id=Lucene50(blocksize=128),
text=FST50}, docValues:{range_facet_l_dv=DocValuesFormat(name=Asserting), _version_=DocValuesFormat(name=Direct),
intDefault=DocValuesFormat(name=Direct), id_i1=DocValuesFormat(name=Direct), range_facet_i_dv=DocValuesFormat(name=Lucene70),
intDvoDefault=DocValuesFormat(name=Asserting), range_facet_l=DocValuesFormat(name=Lucene70),
timestamp=DocValuesFormat(name=Lucene70)}, maxPointsInLeafNode=715, maxMBSortInHeap=7.752136296760547,
sim=RandomSimilarity(queryNorm=true): {}, locale=lrc, timezone=Pacific/Midway
   [junit4]   2> NOTE: Windows 10 10.0 amd64/Oracle Corporation 9 (64-bit)/cpus=3,threads=1,free=39090624,total=518979584
   [junit4]   2> NOTE: All tests run in this JVM: [TestDFISimilarityFactory, HdfsBasicDistributedZkTest,
UpdateParamsTest, TestJoin, TestMultiWordSynonyms, OverseerModifyCollectionTest, ShowFileRequestHandlerTest,
TestCharFilters, TestUninvertingReader, HdfsNNFailoverTest, TestSolrIndexConfig, ForceLeaderTest,
RuleEngineTest, ShardRoutingCustomTest, RemoteQueryErrorTest, TestQueryUtils, ChaosMonkeySafeLeaderTest,
ExitableDirectoryReaderTest, TestOverriddenPrefixQueryForCustomFieldType, TestSolrCloudWithHadoopAuthPlugin,
TestHighFrequencyDictionaryFactory, TestMergePolicyConfig, TestShardHandlerFactory, TestRebalanceLeaders,
MoreLikeThisHandlerTest, HLLUtilTest, CacheHeaderTest, InfoHandlerTest, HighlighterMaxOffsetTest,
EchoParamsTest, SpatialRPTFieldTypeTest, TestExceedMaxTermLength, BasicZkTest, SpellCheckComponentTest,
SampleTest, CdcrVersionReplicationTest, TestGraphTermsQParserPlugin, TestSolrJ, CollectionsAPISolrJTest,
TestCollationFieldDocValues, SpellingQueryConverterTest, TestSystemIdResolver, SolrCoreCheckLockOnStartupTest,
SolrMetricsIntegrationTest, DistributedFacetExistsSmallTest, CollectionReloadTest, TestLRUCache,
TestRealTimeGet, TestSolrConfigHandler, OverseerStatusTest, TestFieldTypeResource, TestMaxScoreQueryParser,
TestFieldCacheSortRandom, TestSuggestSpellingConverter, MoveReplicaHDFSTest, TestManagedSchemaThreadSafety,
TestDistribDocBasedVersion, TestExactSharedStatsCache, UpdateRequestProcessorFactoryTest,
BigEndianAscendingWordDeserializerTest, TestFileDictionaryLookup, NodeMutatorTest, TestStressInPlaceUpdates,
FullHLLTest, TestReqParamsAPI, TestSubQueryTransformerCrossCore, MigrateRouteKeyTest, OverriddenZkACLAndCredentialsProvidersTest,
TestSolrFieldCacheBean, TestPerFieldSimilarityWithDefaultOverride, TestIntervalFaceting, SOLR749Test,
MetricUtilsTest, TestUniqueKeyFieldResource, SolrIndexConfigTest, DistanceUnitsTest, PeerSyncReplicationTest,
BlockJoinFacetSimpleTest, JsonLoaderTest, SynonymTokenizerTest, TestBadConfig, TestDistributedMissingSort,
TestStressUserVersions, ZkFailoverTest, SolrJmxReporterTest, TestSolrCloudWithSecureImpersonation,
TestDynamicFieldResource, AutoCommitTest, UpdateLogTest, DocumentAnalysisRequestHandlerTest,
TestLeaderInitiatedRecoveryThread, TestFiltering, SortSpecParsingTest, TestObjectReleaseTracker,
TestSSLRandomization, HdfsRecoveryZkTest, TestRandomCollapseQParserPlugin, TestScoreJoinQPNoScore,
TriLevelCompositeIdRoutingTest, TestConfigsApi, TestIndexSearcher, TestLeaderElectionWithEmptyReplica,
EnumFieldTest, TestSimpleQParserPlugin, PluginInfoTest, TestGraphMLResponseWriter, ChaosMonkeySafeLeaderWithPullReplicasTest,
TestDelegationWithHadoopAuth, FileBasedSpellCheckerTest, SimpleCollectionCreateDeleteTest,
TestCloudInspectUtil, TestConfigOverlay, TestRuleBasedAuthorizationPlugin, TestCorePropertiesReload,
TestSolrConfigHandlerCloud, TermsComponentTest, SolrCloudExampleTest, TestComplexPhraseQParserPlugin,
TestCryptoKeys, PreAnalyzedUpdateProcessorTest, MBeansHandlerTest, IgnoreCommitOptimizeUpdateProcessorFactoryTest,
DeleteInactiveReplicaTest, QueryResultKeyTest, TestTrackingShardHandlerFactory, PreAnalyzedFieldTest,
BasicDistributedZk2Test, DistributedQueryElevationComponentTest, TestManagedResource, BadIndexSchemaTest,
AsyncCallRequestStatusResponseTest, TestCSVLoader, TestRecovery, SimpleMLTQParserTest, ExternalFileFieldSortTest,
DistributedDebugComponentTest, TemplateUpdateProcessorTest, TestBinaryResponseWriter, TestLegacyField,
TestCollationField, SolrMetricManagerTest, TestTlogReplica, DataDrivenBlockJoinTest, TestRequestForwarding,
SolrPluginUtilsTest, TestCloudNestedDocsSort, TestLuceneMatchVersion, TestSearchPerf, ChangedSchemaMergeTest,
TestReload, CoreSorterTest, TestSQLHandler, AnalyticsMergeStrategyTest, CloneFieldUpdateProcessorFactoryTest,
TestApiFramework, ConjunctionSolrSpellCheckerTest, TestZkChroot, ClassificationUpdateProcessorIntegrationTest,
TestUseDocValuesAsStored, BadCopyFieldTest, TestFastWriter, DistributedFacetPivotLongTailTest,
TolerantUpdateProcessorTest, PolyFieldTest, TestSlowCompositeReaderWrapper, TestNumericTerms32,
TestComponentsName, TestFieldCacheWithThreads, DistribJoinFromCollectionTest, TestShortCircuitedRequests,
ReplicationFactorTest, TermVectorComponentDistributedTest, SegmentsInfoRequestHandlerTest,
CollectionTooManyReplicasTest, SignatureUpdateProcessorFactoryTest, TestInfoStreamLogging,
TestFieldResource, BasicFunctionalityTest, TestJsonRequest, DirectSolrSpellCheckerTest, UtilsToolTest,
TestAnalyzedSuggestions, CollectionsAPIDistributedZkTest, OpenCloseCoreStressTest, OverseerTest,
LeaderElectionIntegrationTest, FullSolrCloudDistribCmdsTest, TestReplicationHandler, TestRandomFaceting,
LeaderElectionTest, ZkSolrClientTest, TestRandomDVFaceting, TestDistributedSearch, HardAutoCommitTest]
   [junit4] Completed [383/731 (1!)] on J1 in 1.51s, 1 test, 1 error <<< FAILURES!

[...truncated 37741 lines...]

Mime
View raw message