lucene-dev mailing list archives

Site index · List index
Message view « Date » · « Thread »
Top « Date » · « Thread »
From Policeman Jenkins Server <jenk...@thetaphi.de>
Subject [JENKINS] Lucene-Solr-master-Windows (32bit/jdk1.8.0_131) - Build # 6716 - Unstable!
Date Fri, 07 Jul 2017 04:21:03 GMT
Build: https://jenkins.thetaphi.de/job/Lucene-Solr-master-Windows/6716/
Java: 32bit/jdk1.8.0_131 -server -XX:+UseSerialGC

3 tests failed.
FAILED:  org.apache.solr.cloud.ChaosMonkeyNothingIsSafeTest.test

Error Message:
Timeout occured while waiting response from server at: http://127.0.0.1:64059/iv_g/collection1

Stack Trace:
org.apache.solr.client.solrj.SolrServerException: Timeout occured while waiting response from server at: http://127.0.0.1:64059/iv_g/collection1
	at __randomizedtesting.SeedInfo.seed([EA28C3D00741F6D0:627CFC0AA9BD9B28]:0)
	at org.apache.solr.client.solrj.impl.HttpSolrClient.executeMethod(HttpSolrClient.java:637)
	at org.apache.solr.client.solrj.impl.HttpSolrClient.request(HttpSolrClient.java:252)
	at org.apache.solr.client.solrj.impl.HttpSolrClient.request(HttpSolrClient.java:241)
	at org.apache.solr.client.solrj.impl.LBHttpSolrClient.doRequest(LBHttpSolrClient.java:483)
	at org.apache.solr.client.solrj.impl.LBHttpSolrClient.request(LBHttpSolrClient.java:413)
	at org.apache.solr.client.solrj.impl.CloudSolrClient.sendRequest(CloudSolrClient.java:1121)
	at org.apache.solr.client.solrj.impl.CloudSolrClient.requestWithRetryOnStaleState(CloudSolrClient.java:862)
	at org.apache.solr.client.solrj.impl.CloudSolrClient.request(CloudSolrClient.java:793)
	at org.apache.solr.client.solrj.SolrRequest.process(SolrRequest.java:178)
	at org.apache.solr.client.solrj.SolrClient.commit(SolrClient.java:484)
	at org.apache.solr.client.solrj.SolrClient.commit(SolrClient.java:463)
	at org.apache.solr.cloud.AbstractFullDistribZkTestBase.commit(AbstractFullDistribZkTestBase.java:1581)
	at org.apache.solr.cloud.ChaosMonkeyNothingIsSafeTest.test(ChaosMonkeyNothingIsSafeTest.java:213)
	at sun.reflect.NativeMethodAccessorImpl.invoke0(Native Method)
	at sun.reflect.NativeMethodAccessorImpl.invoke(NativeMethodAccessorImpl.java:62)
	at sun.reflect.DelegatingMethodAccessorImpl.invoke(DelegatingMethodAccessorImpl.java:43)
	at java.lang.reflect.Method.invoke(Method.java:498)
	at com.carrotsearch.randomizedtesting.RandomizedRunner.invoke(RandomizedRunner.java:1713)
	at com.carrotsearch.randomizedtesting.RandomizedRunner$8.evaluate(RandomizedRunner.java:907)
	at com.carrotsearch.randomizedtesting.RandomizedRunner$9.evaluate(RandomizedRunner.java:943)
	at com.carrotsearch.randomizedtesting.RandomizedRunner$10.evaluate(RandomizedRunner.java:957)
	at org.apache.solr.BaseDistributedSearchTestCase$ShardsRepeatRule$ShardsFixedStatement.callStatement(BaseDistributedSearchTestCase.java:985)
	at org.apache.solr.BaseDistributedSearchTestCase$ShardsRepeatRule$ShardsStatement.evaluate(BaseDistributedSearchTestCase.java:960)
	at com.carrotsearch.randomizedtesting.rules.SystemPropertiesRestoreRule$1.evaluate(SystemPropertiesRestoreRule.java:57)
	at org.apache.lucene.util.TestRuleSetupTeardownChained$1.evaluate(TestRuleSetupTeardownChained.java:49)
	at org.apache.lucene.util.AbstractBeforeAfterRule$1.evaluate(AbstractBeforeAfterRule.java:45)
	at org.apache.lucene.util.TestRuleThreadAndTestName$1.evaluate(TestRuleThreadAndTestName.java:48)
	at org.apache.lucene.util.TestRuleIgnoreAfterMaxFailures$1.evaluate(TestRuleIgnoreAfterMaxFailures.java:64)
	at org.apache.lucene.util.TestRuleMarkFailure$1.evaluate(TestRuleMarkFailure.java:47)
	at com.carrotsearch.randomizedtesting.rules.StatementAdapter.evaluate(StatementAdapter.java:36)
	at com.carrotsearch.randomizedtesting.ThreadLeakControl$StatementRunner.run(ThreadLeakControl.java:368)
	at com.carrotsearch.randomizedtesting.ThreadLeakControl.forkTimeoutingTask(ThreadLeakControl.java:817)
	at com.carrotsearch.randomizedtesting.ThreadLeakControl$3.evaluate(ThreadLeakControl.java:468)
	at com.carrotsearch.randomizedtesting.RandomizedRunner.runSingleTest(RandomizedRunner.java:916)
	at com.carrotsearch.randomizedtesting.RandomizedRunner$5.evaluate(RandomizedRunner.java:802)
	at com.carrotsearch.randomizedtesting.RandomizedRunner$6.evaluate(RandomizedRunner.java:852)
	at com.carrotsearch.randomizedtesting.RandomizedRunner$7.evaluate(RandomizedRunner.java:863)
	at com.carrotsearch.randomizedtesting.rules.StatementAdapter.evaluate(StatementAdapter.java:36)
	at com.carrotsearch.randomizedtesting.rules.SystemPropertiesRestoreRule$1.evaluate(SystemPropertiesRestoreRule.java:57)
	at org.apache.lucene.util.AbstractBeforeAfterRule$1.evaluate(AbstractBeforeAfterRule.java:45)
	at com.carrotsearch.randomizedtesting.rules.StatementAdapter.evaluate(StatementAdapter.java:36)
	at org.apache.lucene.util.TestRuleStoreClassName$1.evaluate(TestRuleStoreClassName.java:41)
	at com.carrotsearch.randomizedtesting.rules.NoShadowingOrOverridesOnMethodsRule$1.evaluate(NoShadowingOrOverridesOnMethodsRule.java:40)
	at com.carrotsearch.randomizedtesting.rules.NoShadowingOrOverridesOnMethodsRule$1.evaluate(NoShadowingOrOverridesOnMethodsRule.java:40)
	at com.carrotsearch.randomizedtesting.rules.StatementAdapter.evaluate(StatementAdapter.java:36)
	at com.carrotsearch.randomizedtesting.rules.StatementAdapter.evaluate(StatementAdapter.java:36)
	at com.carrotsearch.randomizedtesting.rules.StatementAdapter.evaluate(StatementAdapter.java:36)
	at org.apache.lucene.util.TestRuleAssertionsRequired$1.evaluate(TestRuleAssertionsRequired.java:53)
	at org.apache.lucene.util.TestRuleMarkFailure$1.evaluate(TestRuleMarkFailure.java:47)
	at org.apache.lucene.util.TestRuleIgnoreAfterMaxFailures$1.evaluate(TestRuleIgnoreAfterMaxFailures.java:64)
	at org.apache.lucene.util.TestRuleIgnoreTestSuites$1.evaluate(TestRuleIgnoreTestSuites.java:54)
	at com.carrotsearch.randomizedtesting.rules.StatementAdapter.evaluate(StatementAdapter.java:36)
	at com.carrotsearch.randomizedtesting.ThreadLeakControl$StatementRunner.run(ThreadLeakControl.java:368)
	at java.lang.Thread.run(Thread.java:748)
Caused by: java.net.SocketTimeoutException: Read timed out
	at java.net.SocketInputStream.socketRead0(Native Method)
	at java.net.SocketInputStream.socketRead(SocketInputStream.java:116)
	at java.net.SocketInputStream.read(SocketInputStream.java:171)
	at java.net.SocketInputStream.read(SocketInputStream.java:141)
	at org.apache.http.impl.io.SessionInputBufferImpl.streamRead(SessionInputBufferImpl.java:139)
	at org.apache.http.impl.io.SessionInputBufferImpl.fillBuffer(SessionInputBufferImpl.java:155)
	at org.apache.http.impl.io.SessionInputBufferImpl.readLine(SessionInputBufferImpl.java:284)
	at org.apache.http.impl.conn.DefaultHttpResponseParser.parseHead(DefaultHttpResponseParser.java:140)
	at org.apache.http.impl.conn.DefaultHttpResponseParser.parseHead(DefaultHttpResponseParser.java:57)
	at org.apache.http.impl.io.AbstractMessageParser.parse(AbstractMessageParser.java:261)
	at org.apache.http.impl.DefaultBHttpClientConnection.receiveResponseHeader(DefaultBHttpClientConnection.java:165)
	at org.apache.http.impl.conn.CPoolProxy.receiveResponseHeader(CPoolProxy.java:167)
	at org.apache.http.protocol.HttpRequestExecutor.doReceiveResponse(HttpRequestExecutor.java:272)
	at org.apache.http.protocol.HttpRequestExecutor.execute(HttpRequestExecutor.java:124)
	at org.apache.http.impl.execchain.MainClientExec.execute(MainClientExec.java:271)
	at org.apache.http.impl.execchain.ProtocolExec.execute(ProtocolExec.java:184)
	at org.apache.http.impl.execchain.RetryExec.execute(RetryExec.java:88)
	at org.apache.http.impl.execchain.RedirectExec.execute(RedirectExec.java:110)
	at org.apache.http.impl.client.InternalHttpClient.doExecute(InternalHttpClient.java:184)
	at org.apache.http.impl.client.CloseableHttpClient.execute(CloseableHttpClient.java:82)
	at org.apache.http.impl.client.CloseableHttpClient.execute(CloseableHttpClient.java:55)
	at org.apache.solr.client.solrj.impl.HttpSolrClient.executeMethod(HttpSolrClient.java:523)
	... 53 more


FAILED:  junit.framework.TestSuite.org.apache.solr.cloud.ChaosMonkeyNothingIsSafeTest

Error Message:
9 threads leaked from SUITE scope at org.apache.solr.cloud.ChaosMonkeyNothingIsSafeTest:     1) Thread[id=16970, name=zkCallback-2274-thread-1, state=TIMED_WAITING, group=TGRP-ChaosMonkeyNothingIsSafeTest]         at sun.misc.Unsafe.park(Native Method)         at java.util.concurrent.locks.LockSupport.parkNanos(LockSupport.java:215)         at java.util.concurrent.SynchronousQueue$TransferStack.awaitFulfill(SynchronousQueue.java:460)         at java.util.concurrent.SynchronousQueue$TransferStack.transfer(SynchronousQueue.java:362)         at java.util.concurrent.SynchronousQueue.poll(SynchronousQueue.java:941)         at java.util.concurrent.ThreadPoolExecutor.getTask(ThreadPoolExecutor.java:1066)         at java.util.concurrent.ThreadPoolExecutor.runWorker(ThreadPoolExecutor.java:1127)         at java.util.concurrent.ThreadPoolExecutor$Worker.run(ThreadPoolExecutor.java:617)         at java.lang.Thread.run(Thread.java:748)    2) Thread[id=17106, name=zkCallback-2274-thread-3, state=TIMED_WAITING, group=TGRP-ChaosMonkeyNothingIsSafeTest]         at sun.misc.Unsafe.park(Native Method)         at java.util.concurrent.locks.LockSupport.parkNanos(LockSupport.java:215)         at java.util.concurrent.SynchronousQueue$TransferStack.awaitFulfill(SynchronousQueue.java:460)         at java.util.concurrent.SynchronousQueue$TransferStack.transfer(SynchronousQueue.java:362)         at java.util.concurrent.SynchronousQueue.poll(SynchronousQueue.java:941)         at java.util.concurrent.ThreadPoolExecutor.getTask(ThreadPoolExecutor.java:1066)         at java.util.concurrent.ThreadPoolExecutor.runWorker(ThreadPoolExecutor.java:1127)         at java.util.concurrent.ThreadPoolExecutor$Worker.run(ThreadPoolExecutor.java:617)         at java.lang.Thread.run(Thread.java:748)    3) Thread[id=17109, name=zkCallback-2274-thread-6, state=TIMED_WAITING, group=TGRP-ChaosMonkeyNothingIsSafeTest]         at sun.misc.Unsafe.park(Native Method)         at java.util.concurrent.locks.LockSupport.parkNanos(LockSupport.java:215)         at java.util.concurrent.SynchronousQueue$TransferStack.awaitFulfill(SynchronousQueue.java:460)         at java.util.concurrent.SynchronousQueue$TransferStack.transfer(SynchronousQueue.java:362)         at java.util.concurrent.SynchronousQueue.poll(SynchronousQueue.java:941)         at java.util.concurrent.ThreadPoolExecutor.getTask(ThreadPoolExecutor.java:1066)         at java.util.concurrent.ThreadPoolExecutor.runWorker(ThreadPoolExecutor.java:1127)         at java.util.concurrent.ThreadPoolExecutor$Worker.run(ThreadPoolExecutor.java:617)         at java.lang.Thread.run(Thread.java:748)    4) Thread[id=16967, name=Connection evictor, state=TIMED_WAITING, group=TGRP-ChaosMonkeyNothingIsSafeTest]         at java.lang.Thread.sleep(Native Method)         at org.apache.http.impl.client.IdleConnectionEvictor$1.run(IdleConnectionEvictor.java:66)         at java.lang.Thread.run(Thread.java:748)    5) Thread[id=17105, name=zkCallback-2274-thread-2, state=TIMED_WAITING, group=TGRP-ChaosMonkeyNothingIsSafeTest]         at sun.misc.Unsafe.park(Native Method)         at java.util.concurrent.locks.LockSupport.parkNanos(LockSupport.java:215)         at java.util.concurrent.SynchronousQueue$TransferStack.awaitFulfill(SynchronousQueue.java:460)         at java.util.concurrent.SynchronousQueue$TransferStack.transfer(SynchronousQueue.java:362)         at java.util.concurrent.SynchronousQueue.poll(SynchronousQueue.java:941)         at java.util.concurrent.ThreadPoolExecutor.getTask(ThreadPoolExecutor.java:1066)         at java.util.concurrent.ThreadPoolExecutor.runWorker(ThreadPoolExecutor.java:1127)         at java.util.concurrent.ThreadPoolExecutor$Worker.run(ThreadPoolExecutor.java:617)         at java.lang.Thread.run(Thread.java:748)    6) Thread[id=17108, name=zkCallback-2274-thread-5, state=TIMED_WAITING, group=TGRP-ChaosMonkeyNothingIsSafeTest]         at sun.misc.Unsafe.park(Native Method)         at java.util.concurrent.locks.LockSupport.parkNanos(LockSupport.java:215)         at java.util.concurrent.SynchronousQueue$TransferStack.awaitFulfill(SynchronousQueue.java:460)         at java.util.concurrent.SynchronousQueue$TransferStack.transfer(SynchronousQueue.java:362)         at java.util.concurrent.SynchronousQueue.poll(SynchronousQueue.java:941)         at java.util.concurrent.ThreadPoolExecutor.getTask(ThreadPoolExecutor.java:1066)         at java.util.concurrent.ThreadPoolExecutor.runWorker(ThreadPoolExecutor.java:1127)         at java.util.concurrent.ThreadPoolExecutor$Worker.run(ThreadPoolExecutor.java:617)         at java.lang.Thread.run(Thread.java:748)    7) Thread[id=16968, name=TEST-ChaosMonkeyNothingIsSafeTest.test-seed#[EA28C3D00741F6D0]-SendThread(127.0.0.1:64009), state=RUNNABLE, group=TGRP-ChaosMonkeyNothingIsSafeTest]         at sun.nio.ch.WindowsSelectorImpl$SubSelector.poll0(Native Method)         at sun.nio.ch.WindowsSelectorImpl$SubSelector.poll(WindowsSelectorImpl.java:296)         at sun.nio.ch.WindowsSelectorImpl$SubSelector.access$400(WindowsSelectorImpl.java:278)         at sun.nio.ch.WindowsSelectorImpl.doSelect(WindowsSelectorImpl.java:159)         at sun.nio.ch.SelectorImpl.lockAndDoSelect(SelectorImpl.java:86)         at sun.nio.ch.SelectorImpl.select(SelectorImpl.java:97)         at org.apache.zookeeper.ClientCnxnSocketNIO.doTransport(ClientCnxnSocketNIO.java:349)         at org.apache.zookeeper.ClientCnxn$SendThread.run(ClientCnxn.java:1141)    8) Thread[id=16969, name=TEST-ChaosMonkeyNothingIsSafeTest.test-seed#[EA28C3D00741F6D0]-EventThread, state=WAITING, group=TGRP-ChaosMonkeyNothingIsSafeTest]         at sun.misc.Unsafe.park(Native Method)         at java.util.concurrent.locks.LockSupport.park(LockSupport.java:175)         at java.util.concurrent.locks.AbstractQueuedSynchronizer$ConditionObject.await(AbstractQueuedSynchronizer.java:2039)         at java.util.concurrent.LinkedBlockingQueue.take(LinkedBlockingQueue.java:442)         at org.apache.zookeeper.ClientCnxn$EventThread.run(ClientCnxn.java:501)    9) Thread[id=17107, name=zkCallback-2274-thread-4, state=TIMED_WAITING, group=TGRP-ChaosMonkeyNothingIsSafeTest]         at sun.misc.Unsafe.park(Native Method)         at java.util.concurrent.locks.LockSupport.parkNanos(LockSupport.java:215)         at java.util.concurrent.SynchronousQueue$TransferStack.awaitFulfill(SynchronousQueue.java:460)         at java.util.concurrent.SynchronousQueue$TransferStack.transfer(SynchronousQueue.java:362)         at java.util.concurrent.SynchronousQueue.poll(SynchronousQueue.java:941)         at java.util.concurrent.ThreadPoolExecutor.getTask(ThreadPoolExecutor.java:1066)         at java.util.concurrent.ThreadPoolExecutor.runWorker(ThreadPoolExecutor.java:1127)         at java.util.concurrent.ThreadPoolExecutor$Worker.run(ThreadPoolExecutor.java:617)         at java.lang.Thread.run(Thread.java:748)

Stack Trace:
com.carrotsearch.randomizedtesting.ThreadLeakError: 9 threads leaked from SUITE scope at org.apache.solr.cloud.ChaosMonkeyNothingIsSafeTest: 
   1) Thread[id=16970, name=zkCallback-2274-thread-1, state=TIMED_WAITING, group=TGRP-ChaosMonkeyNothingIsSafeTest]
        at sun.misc.Unsafe.park(Native Method)
        at java.util.concurrent.locks.LockSupport.parkNanos(LockSupport.java:215)
        at java.util.concurrent.SynchronousQueue$TransferStack.awaitFulfill(SynchronousQueue.java:460)
        at java.util.concurrent.SynchronousQueue$TransferStack.transfer(SynchronousQueue.java:362)
        at java.util.concurrent.SynchronousQueue.poll(SynchronousQueue.java:941)
        at java.util.concurrent.ThreadPoolExecutor.getTask(ThreadPoolExecutor.java:1066)
        at java.util.concurrent.ThreadPoolExecutor.runWorker(ThreadPoolExecutor.java:1127)
        at java.util.concurrent.ThreadPoolExecutor$Worker.run(ThreadPoolExecutor.java:617)
        at java.lang.Thread.run(Thread.java:748)
   2) Thread[id=17106, name=zkCallback-2274-thread-3, state=TIMED_WAITING, group=TGRP-ChaosMonkeyNothingIsSafeTest]
        at sun.misc.Unsafe.park(Native Method)
        at java.util.concurrent.locks.LockSupport.parkNanos(LockSupport.java:215)
        at java.util.concurrent.SynchronousQueue$TransferStack.awaitFulfill(SynchronousQueue.java:460)
        at java.util.concurrent.SynchronousQueue$TransferStack.transfer(SynchronousQueue.java:362)
        at java.util.concurrent.SynchronousQueue.poll(SynchronousQueue.java:941)
        at java.util.concurrent.ThreadPoolExecutor.getTask(ThreadPoolExecutor.java:1066)
        at java.util.concurrent.ThreadPoolExecutor.runWorker(ThreadPoolExecutor.java:1127)
        at java.util.concurrent.ThreadPoolExecutor$Worker.run(ThreadPoolExecutor.java:617)
        at java.lang.Thread.run(Thread.java:748)
   3) Thread[id=17109, name=zkCallback-2274-thread-6, state=TIMED_WAITING, group=TGRP-ChaosMonkeyNothingIsSafeTest]
        at sun.misc.Unsafe.park(Native Method)
        at java.util.concurrent.locks.LockSupport.parkNanos(LockSupport.java:215)
        at java.util.concurrent.SynchronousQueue$TransferStack.awaitFulfill(SynchronousQueue.java:460)
        at java.util.concurrent.SynchronousQueue$TransferStack.transfer(SynchronousQueue.java:362)
        at java.util.concurrent.SynchronousQueue.poll(SynchronousQueue.java:941)
        at java.util.concurrent.ThreadPoolExecutor.getTask(ThreadPoolExecutor.java:1066)
        at java.util.concurrent.ThreadPoolExecutor.runWorker(ThreadPoolExecutor.java:1127)
        at java.util.concurrent.ThreadPoolExecutor$Worker.run(ThreadPoolExecutor.java:617)
        at java.lang.Thread.run(Thread.java:748)
   4) Thread[id=16967, name=Connection evictor, state=TIMED_WAITING, group=TGRP-ChaosMonkeyNothingIsSafeTest]
        at java.lang.Thread.sleep(Native Method)
        at org.apache.http.impl.client.IdleConnectionEvictor$1.run(IdleConnectionEvictor.java:66)
        at java.lang.Thread.run(Thread.java:748)
   5) Thread[id=17105, name=zkCallback-2274-thread-2, state=TIMED_WAITING, group=TGRP-ChaosMonkeyNothingIsSafeTest]
        at sun.misc.Unsafe.park(Native Method)
        at java.util.concurrent.locks.LockSupport.parkNanos(LockSupport.java:215)
        at java.util.concurrent.SynchronousQueue$TransferStack.awaitFulfill(SynchronousQueue.java:460)
        at java.util.concurrent.SynchronousQueue$TransferStack.transfer(SynchronousQueue.java:362)
        at java.util.concurrent.SynchronousQueue.poll(SynchronousQueue.java:941)
        at java.util.concurrent.ThreadPoolExecutor.getTask(ThreadPoolExecutor.java:1066)
        at java.util.concurrent.ThreadPoolExecutor.runWorker(ThreadPoolExecutor.java:1127)
        at java.util.concurrent.ThreadPoolExecutor$Worker.run(ThreadPoolExecutor.java:617)
        at java.lang.Thread.run(Thread.java:748)
   6) Thread[id=17108, name=zkCallback-2274-thread-5, state=TIMED_WAITING, group=TGRP-ChaosMonkeyNothingIsSafeTest]
        at sun.misc.Unsafe.park(Native Method)
        at java.util.concurrent.locks.LockSupport.parkNanos(LockSupport.java:215)
        at java.util.concurrent.SynchronousQueue$TransferStack.awaitFulfill(SynchronousQueue.java:460)
        at java.util.concurrent.SynchronousQueue$TransferStack.transfer(SynchronousQueue.java:362)
        at java.util.concurrent.SynchronousQueue.poll(SynchronousQueue.java:941)
        at java.util.concurrent.ThreadPoolExecutor.getTask(ThreadPoolExecutor.java:1066)
        at java.util.concurrent.ThreadPoolExecutor.runWorker(ThreadPoolExecutor.java:1127)
        at java.util.concurrent.ThreadPoolExecutor$Worker.run(ThreadPoolExecutor.java:617)
        at java.lang.Thread.run(Thread.java:748)
   7) Thread[id=16968, name=TEST-ChaosMonkeyNothingIsSafeTest.test-seed#[EA28C3D00741F6D0]-SendThread(127.0.0.1:64009), state=RUNNABLE, group=TGRP-ChaosMonkeyNothingIsSafeTest]
        at sun.nio.ch.WindowsSelectorImpl$SubSelector.poll0(Native Method)
        at sun.nio.ch.WindowsSelectorImpl$SubSelector.poll(WindowsSelectorImpl.java:296)
        at sun.nio.ch.WindowsSelectorImpl$SubSelector.access$400(WindowsSelectorImpl.java:278)
        at sun.nio.ch.WindowsSelectorImpl.doSelect(WindowsSelectorImpl.java:159)
        at sun.nio.ch.SelectorImpl.lockAndDoSelect(SelectorImpl.java:86)
        at sun.nio.ch.SelectorImpl.select(SelectorImpl.java:97)
        at org.apache.zookeeper.ClientCnxnSocketNIO.doTransport(ClientCnxnSocketNIO.java:349)
        at org.apache.zookeeper.ClientCnxn$SendThread.run(ClientCnxn.java:1141)
   8) Thread[id=16969, name=TEST-ChaosMonkeyNothingIsSafeTest.test-seed#[EA28C3D00741F6D0]-EventThread, state=WAITING, group=TGRP-ChaosMonkeyNothingIsSafeTest]
        at sun.misc.Unsafe.park(Native Method)
        at java.util.concurrent.locks.LockSupport.park(LockSupport.java:175)
        at java.util.concurrent.locks.AbstractQueuedSynchronizer$ConditionObject.await(AbstractQueuedSynchronizer.java:2039)
        at java.util.concurrent.LinkedBlockingQueue.take(LinkedBlockingQueue.java:442)
        at org.apache.zookeeper.ClientCnxn$EventThread.run(ClientCnxn.java:501)
   9) Thread[id=17107, name=zkCallback-2274-thread-4, state=TIMED_WAITING, group=TGRP-ChaosMonkeyNothingIsSafeTest]
        at sun.misc.Unsafe.park(Native Method)
        at java.util.concurrent.locks.LockSupport.parkNanos(LockSupport.java:215)
        at java.util.concurrent.SynchronousQueue$TransferStack.awaitFulfill(SynchronousQueue.java:460)
        at java.util.concurrent.SynchronousQueue$TransferStack.transfer(SynchronousQueue.java:362)
        at java.util.concurrent.SynchronousQueue.poll(SynchronousQueue.java:941)
        at java.util.concurrent.ThreadPoolExecutor.getTask(ThreadPoolExecutor.java:1066)
        at java.util.concurrent.ThreadPoolExecutor.runWorker(ThreadPoolExecutor.java:1127)
        at java.util.concurrent.ThreadPoolExecutor$Worker.run(ThreadPoolExecutor.java:617)
        at java.lang.Thread.run(Thread.java:748)
	at __randomizedtesting.SeedInfo.seed([EA28C3D00741F6D0]:0)


FAILED:  junit.framework.TestSuite.org.apache.solr.cloud.ChaosMonkeyNothingIsSafeTest

Error Message:
There are still zombie threads that couldn't be terminated:    1) Thread[id=16970, name=zkCallback-2274-thread-1, state=TIMED_WAITING, group=TGRP-ChaosMonkeyNothingIsSafeTest]         at sun.misc.Unsafe.park(Native Method)         at java.util.concurrent.locks.LockSupport.parkNanos(LockSupport.java:215)         at java.util.concurrent.SynchronousQueue$TransferStack.awaitFulfill(SynchronousQueue.java:460)         at java.util.concurrent.SynchronousQueue$TransferStack.transfer(SynchronousQueue.java:362)         at java.util.concurrent.SynchronousQueue.poll(SynchronousQueue.java:941)         at java.util.concurrent.ThreadPoolExecutor.getTask(ThreadPoolExecutor.java:1066)         at java.util.concurrent.ThreadPoolExecutor.runWorker(ThreadPoolExecutor.java:1127)         at java.util.concurrent.ThreadPoolExecutor$Worker.run(ThreadPoolExecutor.java:617)         at java.lang.Thread.run(Thread.java:748)    2) Thread[id=17106, name=zkCallback-2274-thread-3, state=TIMED_WAITING, group=TGRP-ChaosMonkeyNothingIsSafeTest]         at sun.misc.Unsafe.park(Native Method)         at java.util.concurrent.locks.LockSupport.parkNanos(LockSupport.java:215)         at java.util.concurrent.SynchronousQueue$TransferStack.awaitFulfill(SynchronousQueue.java:460)         at java.util.concurrent.SynchronousQueue$TransferStack.transfer(SynchronousQueue.java:362)         at java.util.concurrent.SynchronousQueue.poll(SynchronousQueue.java:941)         at java.util.concurrent.ThreadPoolExecutor.getTask(ThreadPoolExecutor.java:1066)         at java.util.concurrent.ThreadPoolExecutor.runWorker(ThreadPoolExecutor.java:1127)         at java.util.concurrent.ThreadPoolExecutor$Worker.run(ThreadPoolExecutor.java:617)         at java.lang.Thread.run(Thread.java:748)    3) Thread[id=17109, name=zkCallback-2274-thread-6, state=TIMED_WAITING, group=TGRP-ChaosMonkeyNothingIsSafeTest]         at sun.misc.Unsafe.park(Native Method)         at java.util.concurrent.locks.LockSupport.parkNanos(LockSupport.java:215)         at java.util.concurrent.SynchronousQueue$TransferStack.awaitFulfill(SynchronousQueue.java:460)         at java.util.concurrent.SynchronousQueue$TransferStack.transfer(SynchronousQueue.java:362)         at java.util.concurrent.SynchronousQueue.poll(SynchronousQueue.java:941)         at java.util.concurrent.ThreadPoolExecutor.getTask(ThreadPoolExecutor.java:1066)         at java.util.concurrent.ThreadPoolExecutor.runWorker(ThreadPoolExecutor.java:1127)         at java.util.concurrent.ThreadPoolExecutor$Worker.run(ThreadPoolExecutor.java:617)         at java.lang.Thread.run(Thread.java:748)    4) Thread[id=17105, name=zkCallback-2274-thread-2, state=TIMED_WAITING, group=TGRP-ChaosMonkeyNothingIsSafeTest]         at sun.misc.Unsafe.park(Native Method)         at java.util.concurrent.locks.LockSupport.parkNanos(LockSupport.java:215)         at java.util.concurrent.SynchronousQueue$TransferStack.awaitFulfill(SynchronousQueue.java:460)         at java.util.concurrent.SynchronousQueue$TransferStack.transfer(SynchronousQueue.java:362)         at java.util.concurrent.SynchronousQueue.poll(SynchronousQueue.java:941)         at java.util.concurrent.ThreadPoolExecutor.getTask(ThreadPoolExecutor.java:1066)         at java.util.concurrent.ThreadPoolExecutor.runWorker(ThreadPoolExecutor.java:1127)         at java.util.concurrent.ThreadPoolExecutor$Worker.run(ThreadPoolExecutor.java:617)         at java.lang.Thread.run(Thread.java:748)    5) Thread[id=17108, name=zkCallback-2274-thread-5, state=TIMED_WAITING, group=TGRP-ChaosMonkeyNothingIsSafeTest]         at sun.misc.Unsafe.park(Native Method)         at java.util.concurrent.locks.LockSupport.parkNanos(LockSupport.java:215)         at java.util.concurrent.SynchronousQueue$TransferStack.awaitFulfill(SynchronousQueue.java:460)         at java.util.concurrent.SynchronousQueue$TransferStack.transfer(SynchronousQueue.java:362)         at java.util.concurrent.SynchronousQueue.poll(SynchronousQueue.java:941)         at java.util.concurrent.ThreadPoolExecutor.getTask(ThreadPoolExecutor.java:1066)         at java.util.concurrent.ThreadPoolExecutor.runWorker(ThreadPoolExecutor.java:1127)         at java.util.concurrent.ThreadPoolExecutor$Worker.run(ThreadPoolExecutor.java:617)         at java.lang.Thread.run(Thread.java:748)    6) Thread[id=16968, name=TEST-ChaosMonkeyNothingIsSafeTest.test-seed#[EA28C3D00741F6D0]-SendThread(127.0.0.1:64009), state=RUNNABLE, group=TGRP-ChaosMonkeyNothingIsSafeTest]         at sun.nio.ch.WindowsSelectorImpl$SubSelector.poll0(Native Method)         at sun.nio.ch.WindowsSelectorImpl$SubSelector.poll(WindowsSelectorImpl.java:296)         at sun.nio.ch.WindowsSelectorImpl$SubSelector.access$400(WindowsSelectorImpl.java:278)         at sun.nio.ch.WindowsSelectorImpl.doSelect(WindowsSelectorImpl.java:159)         at sun.nio.ch.SelectorImpl.lockAndDoSelect(SelectorImpl.java:86)         at sun.nio.ch.SelectorImpl.select(SelectorImpl.java:97)         at org.apache.zookeeper.ClientCnxnSocketNIO.doTransport(ClientCnxnSocketNIO.java:349)         at org.apache.zookeeper.ClientCnxn$SendThread.run(ClientCnxn.java:1141)    7) Thread[id=17107, name=zkCallback-2274-thread-4, state=TIMED_WAITING, group=TGRP-ChaosMonkeyNothingIsSafeTest]         at sun.misc.Unsafe.park(Native Method)         at java.util.concurrent.locks.LockSupport.parkNanos(LockSupport.java:215)         at java.util.concurrent.SynchronousQueue$TransferStack.awaitFulfill(SynchronousQueue.java:460)         at java.util.concurrent.SynchronousQueue$TransferStack.transfer(SynchronousQueue.java:362)         at java.util.concurrent.SynchronousQueue.poll(SynchronousQueue.java:941)         at java.util.concurrent.ThreadPoolExecutor.getTask(ThreadPoolExecutor.java:1066)         at java.util.concurrent.ThreadPoolExecutor.runWorker(ThreadPoolExecutor.java:1127)         at java.util.concurrent.ThreadPoolExecutor$Worker.run(ThreadPoolExecutor.java:617)         at java.lang.Thread.run(Thread.java:748)

Stack Trace:
com.carrotsearch.randomizedtesting.ThreadLeakError: There are still zombie threads that couldn't be terminated:
   1) Thread[id=16970, name=zkCallback-2274-thread-1, state=TIMED_WAITING, group=TGRP-ChaosMonkeyNothingIsSafeTest]
        at sun.misc.Unsafe.park(Native Method)
        at java.util.concurrent.locks.LockSupport.parkNanos(LockSupport.java:215)
        at java.util.concurrent.SynchronousQueue$TransferStack.awaitFulfill(SynchronousQueue.java:460)
        at java.util.concurrent.SynchronousQueue$TransferStack.transfer(SynchronousQueue.java:362)
        at java.util.concurrent.SynchronousQueue.poll(SynchronousQueue.java:941)
        at java.util.concurrent.ThreadPoolExecutor.getTask(ThreadPoolExecutor.java:1066)
        at java.util.concurrent.ThreadPoolExecutor.runWorker(ThreadPoolExecutor.java:1127)
        at java.util.concurrent.ThreadPoolExecutor$Worker.run(ThreadPoolExecutor.java:617)
        at java.lang.Thread.run(Thread.java:748)
   2) Thread[id=17106, name=zkCallback-2274-thread-3, state=TIMED_WAITING, group=TGRP-ChaosMonkeyNothingIsSafeTest]
        at sun.misc.Unsafe.park(Native Method)
        at java.util.concurrent.locks.LockSupport.parkNanos(LockSupport.java:215)
        at java.util.concurrent.SynchronousQueue$TransferStack.awaitFulfill(SynchronousQueue.java:460)
        at java.util.concurrent.SynchronousQueue$TransferStack.transfer(SynchronousQueue.java:362)
        at java.util.concurrent.SynchronousQueue.poll(SynchronousQueue.java:941)
        at java.util.concurrent.ThreadPoolExecutor.getTask(ThreadPoolExecutor.java:1066)
        at java.util.concurrent.ThreadPoolExecutor.runWorker(ThreadPoolExecutor.java:1127)
        at java.util.concurrent.ThreadPoolExecutor$Worker.run(ThreadPoolExecutor.java:617)
        at java.lang.Thread.run(Thread.java:748)
   3) Thread[id=17109, name=zkCallback-2274-thread-6, state=TIMED_WAITING, group=TGRP-ChaosMonkeyNothingIsSafeTest]
        at sun.misc.Unsafe.park(Native Method)
        at java.util.concurrent.locks.LockSupport.parkNanos(LockSupport.java:215)
        at java.util.concurrent.SynchronousQueue$TransferStack.awaitFulfill(SynchronousQueue.java:460)
        at java.util.concurrent.SynchronousQueue$TransferStack.transfer(SynchronousQueue.java:362)
        at java.util.concurrent.SynchronousQueue.poll(SynchronousQueue.java:941)
        at java.util.concurrent.ThreadPoolExecutor.getTask(ThreadPoolExecutor.java:1066)
        at java.util.concurrent.ThreadPoolExecutor.runWorker(ThreadPoolExecutor.java:1127)
        at java.util.concurrent.ThreadPoolExecutor$Worker.run(ThreadPoolExecutor.java:617)
        at java.lang.Thread.run(Thread.java:748)
   4) Thread[id=17105, name=zkCallback-2274-thread-2, state=TIMED_WAITING, group=TGRP-ChaosMonkeyNothingIsSafeTest]
        at sun.misc.Unsafe.park(Native Method)
        at java.util.concurrent.locks.LockSupport.parkNanos(LockSupport.java:215)
        at java.util.concurrent.SynchronousQueue$TransferStack.awaitFulfill(SynchronousQueue.java:460)
        at java.util.concurrent.SynchronousQueue$TransferStack.transfer(SynchronousQueue.java:362)
        at java.util.concurrent.SynchronousQueue.poll(SynchronousQueue.java:941)
        at java.util.concurrent.ThreadPoolExecutor.getTask(ThreadPoolExecutor.java:1066)
        at java.util.concurrent.ThreadPoolExecutor.runWorker(ThreadPoolExecutor.java:1127)
        at java.util.concurrent.ThreadPoolExecutor$Worker.run(ThreadPoolExecutor.java:617)
        at java.lang.Thread.run(Thread.java:748)
   5) Thread[id=17108, name=zkCallback-2274-thread-5, state=TIMED_WAITING, group=TGRP-ChaosMonkeyNothingIsSafeTest]
        at sun.misc.Unsafe.park(Native Method)
        at java.util.concurrent.locks.LockSupport.parkNanos(LockSupport.java:215)
        at java.util.concurrent.SynchronousQueue$TransferStack.awaitFulfill(SynchronousQueue.java:460)
        at java.util.concurrent.SynchronousQueue$TransferStack.transfer(SynchronousQueue.java:362)
        at java.util.concurrent.SynchronousQueue.poll(SynchronousQueue.java:941)
        at java.util.concurrent.ThreadPoolExecutor.getTask(ThreadPoolExecutor.java:1066)
        at java.util.concurrent.ThreadPoolExecutor.runWorker(ThreadPoolExecutor.java:1127)
        at java.util.concurrent.ThreadPoolExecutor$Worker.run(ThreadPoolExecutor.java:617)
        at java.lang.Thread.run(Thread.java:748)
   6) Thread[id=16968, name=TEST-ChaosMonkeyNothingIsSafeTest.test-seed#[EA28C3D00741F6D0]-SendThread(127.0.0.1:64009), state=RUNNABLE, group=TGRP-ChaosMonkeyNothingIsSafeTest]
        at sun.nio.ch.WindowsSelectorImpl$SubSelector.poll0(Native Method)
        at sun.nio.ch.WindowsSelectorImpl$SubSelector.poll(WindowsSelectorImpl.java:296)
        at sun.nio.ch.WindowsSelectorImpl$SubSelector.access$400(WindowsSelectorImpl.java:278)
        at sun.nio.ch.WindowsSelectorImpl.doSelect(WindowsSelectorImpl.java:159)
        at sun.nio.ch.SelectorImpl.lockAndDoSelect(SelectorImpl.java:86)
        at sun.nio.ch.SelectorImpl.select(SelectorImpl.java:97)
        at org.apache.zookeeper.ClientCnxnSocketNIO.doTransport(ClientCnxnSocketNIO.java:349)
        at org.apache.zookeeper.ClientCnxn$SendThread.run(ClientCnxn.java:1141)
   7) Thread[id=17107, name=zkCallback-2274-thread-4, state=TIMED_WAITING, group=TGRP-ChaosMonkeyNothingIsSafeTest]
        at sun.misc.Unsafe.park(Native Method)
        at java.util.concurrent.locks.LockSupport.parkNanos(LockSupport.java:215)
        at java.util.concurrent.SynchronousQueue$TransferStack.awaitFulfill(SynchronousQueue.java:460)
        at java.util.concurrent.SynchronousQueue$TransferStack.transfer(SynchronousQueue.java:362)
        at java.util.concurrent.SynchronousQueue.poll(SynchronousQueue.java:941)
        at java.util.concurrent.ThreadPoolExecutor.getTask(ThreadPoolExecutor.java:1066)
        at java.util.concurrent.ThreadPoolExecutor.runWorker(ThreadPoolExecutor.java:1127)
        at java.util.concurrent.ThreadPoolExecutor$Worker.run(ThreadPoolExecutor.java:617)
        at java.lang.Thread.run(Thread.java:748)
	at __randomizedtesting.SeedInfo.seed([EA28C3D00741F6D0]:0)




Build Log:
[...truncated 12378 lines...]
   [junit4] Suite: org.apache.solr.cloud.ChaosMonkeyNothingIsSafeTest
   [junit4]   2> Creating dataDir: C:\Users\jenkins\workspace\Lucene-Solr-master-Windows\solr\build\solr-core\test\J0\temp\solr.cloud.ChaosMonkeyNothingIsSafeTest_EA28C3D00741F6D0-001\init-core-data-001
   [junit4]   2> 2112851 INFO  (SUITE-ChaosMonkeyNothingIsSafeTest-seed#[EA28C3D00741F6D0]-worker) [    ] o.a.s.SolrTestCaseJ4 Using TrieFields (NUMERIC_POINTS_SYSPROP=false) w/NUMERIC_DOCVALUES_SYSPROP=false
   [junit4]   2> 2112853 INFO  (SUITE-ChaosMonkeyNothingIsSafeTest-seed#[EA28C3D00741F6D0]-worker) [    ] o.a.s.SolrTestCaseJ4 Randomized ssl (false) and clientAuth (false) via: @org.apache.solr.SolrTestCaseJ4$SuppressSSL(bugUrl=https://issues.apache.org/jira/browse/SOLR-5776)
   [junit4]   2> 2112853 INFO  (SUITE-ChaosMonkeyNothingIsSafeTest-seed#[EA28C3D00741F6D0]-worker) [    ] o.a.s.BaseDistributedSearchTestCase Setting hostContext system property: /iv_g/
   [junit4]   2> 2112857 INFO  (TEST-ChaosMonkeyNothingIsSafeTest.test-seed#[EA28C3D00741F6D0]) [    ] o.a.s.c.ZkTestServer STARTING ZK TEST SERVER
   [junit4]   2> 2112858 INFO  (Thread-3481) [    ] o.a.s.c.ZkTestServer client port:0.0.0.0/0.0.0.0:0
   [junit4]   2> 2112858 INFO  (Thread-3481) [    ] o.a.s.c.ZkTestServer Starting server
   [junit4]   2> 2112863 ERROR (Thread-3481) [    ] o.a.z.s.ZooKeeperServer ZKShutdownHandler is not registered, so ZooKeeper server won't take any action on ERROR or SHUTDOWN server state changes
   [junit4]   2> 2112959 INFO  (TEST-ChaosMonkeyNothingIsSafeTest.test-seed#[EA28C3D00741F6D0]) [    ] o.a.s.c.ZkTestServer start zk server on port:64009
   [junit4]   2> 2112986 INFO  (TEST-ChaosMonkeyNothingIsSafeTest.test-seed#[EA28C3D00741F6D0]) [    ] o.a.s.c.AbstractZkTestCase put C:\Users\jenkins\workspace\Lucene-Solr-master-Windows\solr\core\src\test-files\solr\collection1\conf\solrconfig-tlog.xml to /configs/conf1/solrconfig.xml
   [junit4]   2> 2112989 INFO  (TEST-ChaosMonkeyNothingIsSafeTest.test-seed#[EA28C3D00741F6D0]) [    ] o.a.s.c.AbstractZkTestCase put C:\Users\jenkins\workspace\Lucene-Solr-master-Windows\solr\core\src\test-files\solr\collection1\conf\schema15.xml to /configs/conf1/schema.xml
   [junit4]   2> 2112992 INFO  (TEST-ChaosMonkeyNothingIsSafeTest.test-seed#[EA28C3D00741F6D0]) [    ] o.a.s.c.AbstractZkTestCase put C:\Users\jenkins\workspace\Lucene-Solr-master-Windows\solr\core\src\test-files\solr\collection1\conf\solrconfig.snippet.randomindexconfig.xml to /configs/conf1/solrconfig.snippet.randomindexconfig.xml
   [junit4]   2> 2112995 INFO  (TEST-ChaosMonkeyNothingIsSafeTest.test-seed#[EA28C3D00741F6D0]) [    ] o.a.s.c.AbstractZkTestCase put C:\Users\jenkins\workspace\Lucene-Solr-master-Windows\solr\core\src\test-files\solr\collection1\conf\stopwords.txt to /configs/conf1/stopwords.txt
   [junit4]   2> 2112995 INFO  (TEST-ChaosMonkeyNothingIsSafeTest.test-seed#[EA28C3D00741F6D0]) [    ] o.a.s.c.AbstractZkTestCase put C:\Users\jenkins\workspace\Lucene-Solr-master-Windows\solr\core\src\test-files\solr\collection1\conf\protwords.txt to /configs/conf1/protwords.txt
   [junit4]   2> 2113000 INFO  (TEST-ChaosMonkeyNothingIsSafeTest.test-seed#[EA28C3D00741F6D0]) [    ] o.a.s.c.AbstractZkTestCase put C:\Users\jenkins\workspace\Lucene-Solr-master-Windows\solr\core\src\test-files\solr\collection1\conf\currency.xml to /configs/conf1/currency.xml
   [junit4]   2> 2113001 INFO  (TEST-ChaosMonkeyNothingIsSafeTest.test-seed#[EA28C3D00741F6D0]) [    ] o.a.s.c.AbstractZkTestCase put C:\Users\jenkins\workspace\Lucene-Solr-master-Windows\solr\core\src\test-files\solr\collection1\conf\enumsConfig.xml to /configs/conf1/enumsConfig.xml
   [junit4]   2> 2113005 INFO  (TEST-ChaosMonkeyNothingIsSafeTest.test-seed#[EA28C3D00741F6D0]) [    ] o.a.s.c.AbstractZkTestCase put C:\Users\jenkins\workspace\Lucene-Solr-master-Windows\solr\core\src\test-files\solr\collection1\conf\open-exchange-rates.json to /configs/conf1/open-exchange-rates.json
   [junit4]   2> 2113016 INFO  (TEST-ChaosMonkeyNothingIsSafeTest.test-seed#[EA28C3D00741F6D0]) [    ] o.a.s.c.AbstractZkTestCase put C:\Users\jenkins\workspace\Lucene-Solr-master-Windows\solr\core\src\test-files\solr\collection1\conf\mapping-ISOLatin1Accent.txt to /configs/conf1/mapping-ISOLatin1Accent.txt
   [junit4]   2> 2113020 INFO  (TEST-ChaosMonkeyNothingIsSafeTest.test-seed#[EA28C3D00741F6D0]) [    ] o.a.s.c.AbstractZkTestCase put C:\Users\jenkins\workspace\Lucene-Solr-master-Windows\solr\core\src\test-files\solr\collection1\conf\old_synonyms.txt to /configs/conf1/old_synonyms.txt
   [junit4]   2> 2113023 INFO  (TEST-ChaosMonkeyNothingIsSafeTest.test-seed#[EA28C3D00741F6D0]) [    ] o.a.s.c.AbstractZkTestCase put C:\Users\jenkins\workspace\Lucene-Solr-master-Windows\solr\core\src\test-files\solr\collection1\conf\synonyms.txt to /configs/conf1/synonyms.txt
   [junit4]   2> 2113026 INFO  (TEST-ChaosMonkeyNothingIsSafeTest.test-seed#[EA28C3D00741F6D0]) [    ] o.a.s.c.AbstractFullDistribZkTestBase Will use TLOG replicas unless explicitly asked otherwise
   [junit4]   2> 2113765 INFO  (TEST-ChaosMonkeyNothingIsSafeTest.test-seed#[EA28C3D00741F6D0]) [    ] o.e.j.s.Server jetty-9.3.14.v20161028
   [junit4]   2> 2113766 INFO  (TEST-ChaosMonkeyNothingIsSafeTest.test-seed#[EA28C3D00741F6D0]) [    ] o.e.j.s.h.ContextHandler Started o.e.j.s.ServletContextHandler@16abb37{/iv_g,null,AVAILABLE}
   [junit4]   2> 2113767 INFO  (TEST-ChaosMonkeyNothingIsSafeTest.test-seed#[EA28C3D00741F6D0]) [    ] o.e.j.s.AbstractConnector Started ServerConnector@b1e4b0{HTTP/1.1,[http/1.1]}{127.0.0.1:64016}
   [junit4]   2> 2113767 INFO  (TEST-ChaosMonkeyNothingIsSafeTest.test-seed#[EA28C3D00741F6D0]) [    ] o.e.j.s.Server Started @2117310ms
   [junit4]   2> 2113767 INFO  (TEST-ChaosMonkeyNothingIsSafeTest.test-seed#[EA28C3D00741F6D0]) [    ] o.a.s.c.s.e.JettySolrRunner Jetty properties: {solr.data.dir=C:\Users\jenkins\workspace\Lucene-Solr-master-Windows\solr\build\solr-core\test\J0\temp\solr.cloud.ChaosMonkeyNothingIsSafeTest_EA28C3D00741F6D0-001\tempDir-001/control/data, hostContext=/iv_g, hostPort=64016, coreRootDirectory=C:\Users\jenkins\workspace\Lucene-Solr-master-Windows\solr\build\solr-core\test\J0\..\..\..\..\..\..\..\..\..\Users\jenkins\workspace\Lucene-Solr-master-Windows\solr\build\solr-core\test\J0\temp\solr.cloud.ChaosMonkeyNothingIsSafeTest_EA28C3D00741F6D0-001\control-001\cores}
   [junit4]   2> 2113768 ERROR (TEST-ChaosMonkeyNothingIsSafeTest.test-seed#[EA28C3D00741F6D0]) [    ] o.a.s.s.StartupLoggingUtils Missing Java Option solr.log.dir. Logging may be missing or incomplete.
   [junit4]   2> 2113769 INFO  (TEST-ChaosMonkeyNothingIsSafeTest.test-seed#[EA28C3D00741F6D0]) [    ] o.a.s.s.SolrDispatchFilter  ___      _       Welcome to Apache Solr™ version 8.0.0
   [junit4]   2> 2113769 INFO  (TEST-ChaosMonkeyNothingIsSafeTest.test-seed#[EA28C3D00741F6D0]) [    ] o.a.s.s.SolrDispatchFilter / __| ___| |_ _   Starting in cloud mode on port null
   [junit4]   2> 2113769 INFO  (TEST-ChaosMonkeyNothingIsSafeTest.test-seed#[EA28C3D00741F6D0]) [    ] o.a.s.s.SolrDispatchFilter \__ \/ _ \ | '_|  Install dir: null, Default config dir: null
   [junit4]   2> 2113769 INFO  (TEST-ChaosMonkeyNothingIsSafeTest.test-seed#[EA28C3D00741F6D0]) [    ] o.a.s.s.SolrDispatchFilter |___/\___/_|_|    Start time: 2017-07-07T04:05:12.872Z
   [junit4]   2> 2113775 WARN  (NIOServerCxn.Factory:0.0.0.0/0.0.0.0:0) [    ] o.a.z.s.NIOServerCnxn caught end of stream exception
   [junit4]   2> EndOfStreamException: Unable to read additional data from client sessionid 0x15d1b39149e0002, likely client has closed socket
   [junit4]   2> 	at org.apache.zookeeper.server.NIOServerCnxn.doIO(NIOServerCnxn.java:239)
   [junit4]   2> 	at org.apache.zookeeper.server.NIOServerCnxnFactory.run(NIOServerCnxnFactory.java:203)
   [junit4]   2> 	at java.lang.Thread.run(Thread.java:748)
   [junit4]   2> 2113775 INFO  (TEST-ChaosMonkeyNothingIsSafeTest.test-seed#[EA28C3D00741F6D0]) [    ] o.a.s.s.SolrDispatchFilter Loading solr.xml from SolrHome (not found in ZooKeeper)
   [junit4]   2> 2113776 INFO  (TEST-ChaosMonkeyNothingIsSafeTest.test-seed#[EA28C3D00741F6D0]) [    ] o.a.s.c.SolrXmlConfig Loading container configuration from C:\Users\jenkins\workspace\Lucene-Solr-master-Windows\solr\build\solr-core\test\J0\temp\solr.cloud.ChaosMonkeyNothingIsSafeTest_EA28C3D00741F6D0-001\control-001\solr.xml
   [junit4]   2> 2113786 INFO  (TEST-ChaosMonkeyNothingIsSafeTest.test-seed#[EA28C3D00741F6D0]) [    ] o.a.s.c.SolrXmlConfig MBean server found: com.sun.jmx.mbeanserver.JmxMBeanServer@790f67, but no JMX reporters were configured - adding default JMX reporter.
   [junit4]   2> 2113794 INFO  (TEST-ChaosMonkeyNothingIsSafeTest.test-seed#[EA28C3D00741F6D0]) [    ] o.a.s.c.ZkContainer Zookeeper client=127.0.0.1:64009/solr
   [junit4]   2> 2113798 WARN  (NIOServerCxn.Factory:0.0.0.0/0.0.0.0:0) [    ] o.a.z.s.NIOServerCnxn caught end of stream exception
   [junit4]   2> EndOfStreamException: Unable to read additional data from client sessionid 0x15d1b39149e0003, likely client has closed socket
   [junit4]   2> 	at org.apache.zookeeper.server.NIOServerCnxn.doIO(NIOServerCnxn.java:239)
   [junit4]   2> 	at org.apache.zookeeper.server.NIOServerCnxnFactory.run(NIOServerCnxnFactory.java:203)
   [junit4]   2> 	at java.lang.Thread.run(Thread.java:748)
   [junit4]   2> 2113913 INFO  (TEST-ChaosMonkeyNothingIsSafeTest.test-seed#[EA28C3D00741F6D0]) [n:127.0.0.1:64016_iv_g    ] o.a.s.c.Overseer Overseer (id=null) closing
   [junit4]   2> 2113914 INFO  (TEST-ChaosMonkeyNothingIsSafeTest.test-seed#[EA28C3D00741F6D0]) [n:127.0.0.1:64016_iv_g    ] o.a.s.c.OverseerElectionContext I am going to be the leader 127.0.0.1:64016_iv_g
   [junit4]   2> 2113915 INFO  (TEST-ChaosMonkeyNothingIsSafeTest.test-seed#[EA28C3D00741F6D0]) [n:127.0.0.1:64016_iv_g    ] o.a.s.c.Overseer Overseer (id=98264698845003780-127.0.0.1:64016_iv_g-n_0000000000) starting
   [junit4]   2> 2113923 INFO  (TEST-ChaosMonkeyNothingIsSafeTest.test-seed#[EA28C3D00741F6D0]) [n:127.0.0.1:64016_iv_g    ] o.a.s.c.ZkController Register node as live in ZooKeeper:/live_nodes/127.0.0.1:64016_iv_g
   [junit4]   2> 2113927 INFO  (zkCallback-2267-thread-1-processing-n:127.0.0.1:64016_iv_g) [n:127.0.0.1:64016_iv_g    ] o.a.s.c.c.ZkStateReader Updated live nodes from ZooKeeper... (0) -> (1)
   [junit4]   2> 2114132 INFO  (TEST-ChaosMonkeyNothingIsSafeTest.test-seed#[EA28C3D00741F6D0]) [n:127.0.0.1:64016_iv_g    ] o.a.s.m.r.SolrJmxReporter JMX monitoring for 'solr.node' (registry 'solr.node') enabled at server: com.sun.jmx.mbeanserver.JmxMBeanServer@790f67
   [junit4]   2> 2114137 INFO  (TEST-ChaosMonkeyNothingIsSafeTest.test-seed#[EA28C3D00741F6D0]) [n:127.0.0.1:64016_iv_g    ] o.a.s.m.r.SolrJmxReporter JMX monitoring for 'solr.jvm' (registry 'solr.jvm') enabled at server: com.sun.jmx.mbeanserver.JmxMBeanServer@790f67
   [junit4]   2> 2114137 INFO  (TEST-ChaosMonkeyNothingIsSafeTest.test-seed#[EA28C3D00741F6D0]) [n:127.0.0.1:64016_iv_g    ] o.a.s.m.r.SolrJmxReporter JMX monitoring for 'solr.jetty' (registry 'solr.jetty') enabled at server: com.sun.jmx.mbeanserver.JmxMBeanServer@790f67
   [junit4]   2> 2114141 INFO  (TEST-ChaosMonkeyNothingIsSafeTest.test-seed#[EA28C3D00741F6D0]) [n:127.0.0.1:64016_iv_g    ] o.a.s.c.CorePropertiesLocator Found 0 core definitions underneath C:\Users\jenkins\workspace\Lucene-Solr-master-Windows\solr\build\solr-core\test\J0\..\..\..\..\..\..\..\..\..\Users\jenkins\workspace\Lucene-Solr-master-Windows\solr\build\solr-core\test\J0\temp\solr.cloud.ChaosMonkeyNothingIsSafeTest_EA28C3D00741F6D0-001\control-001\cores
   [junit4]   2> 2114174 INFO  (TEST-ChaosMonkeyNothingIsSafeTest.test-seed#[EA28C3D00741F6D0]) [    ] o.a.s.c.c.ZkStateReader Updated live nodes from ZooKeeper... (0) -> (1)
   [junit4]   2> 2114175 INFO  (TEST-ChaosMonkeyNothingIsSafeTest.test-seed#[EA28C3D00741F6D0]) [    ] o.a.s.c.s.i.ZkClientClusterStateProvider Cluster at 127.0.0.1:64009/solr ready
   [junit4]   2> 2114177 INFO  (qtp21766735-16937) [n:127.0.0.1:64016_iv_g    ] o.a.s.h.a.CollectionsHandler Invoked Collection Action :create with params replicationFactor=1&collection.configName=conf1&name=control_collection&nrtReplicas=1&action=CREATE&numShards=1&createNodeSet=127.0.0.1:64016_iv_g&wt=javabin&version=2 and sendToOCPQueue=true
   [junit4]   2> 2114181 INFO  (OverseerThreadFactory-7561-thread-1-processing-n:127.0.0.1:64016_iv_g) [n:127.0.0.1:64016_iv_g    ] o.a.s.c.CreateCollectionCmd Create collection control_collection
   [junit4]   2> 2114292 INFO  (qtp21766735-16934) [n:127.0.0.1:64016_iv_g    ] o.a.s.h.a.CoreAdminOperation core create command qt=/admin/cores&collection.configName=conf1&newCollection=true&name=control_collection_shard1_replica_n1&action=CREATE&numShards=1&collection=control_collection&shard=shard1&wt=javabin&version=2&replicaType=NRT
   [junit4]   2> 2114293 INFO  (qtp21766735-16934) [n:127.0.0.1:64016_iv_g    ] o.a.s.c.TransientSolrCoreCacheDefault Allocating transient cache for 4 transient cores
   [junit4]   2> 2114401 INFO  (zkCallback-2267-thread-1-processing-n:127.0.0.1:64016_iv_g) [n:127.0.0.1:64016_iv_g    ] o.a.s.c.c.ZkStateReader A cluster state change: [WatchedEvent state:SyncConnected type:NodeDataChanged path:/collections/control_collection/state.json] for collection [control_collection] has occurred - updating... (live nodes size: [1])
   [junit4]   2> 2115311 INFO  (qtp21766735-16934) [n:127.0.0.1:64016_iv_g c:control_collection s:shard1  x:control_collection_shard1_replica_n1] o.a.s.c.SolrConfig Using Lucene MatchVersion: 8.0.0
   [junit4]   2> 2115321 INFO  (qtp21766735-16934) [n:127.0.0.1:64016_iv_g c:control_collection s:shard1  x:control_collection_shard1_replica_n1] o.a.s.s.IndexSchema [control_collection_shard1_replica_n1] Schema name=test
   [junit4]   2> 2115403 INFO  (qtp21766735-16934) [n:127.0.0.1:64016_iv_g c:control_collection s:shard1  x:control_collection_shard1_replica_n1] o.a.s.s.IndexSchema Loaded schema test/1.6 with uniqueid field id
   [junit4]   2> 2115420 INFO  (qtp21766735-16934) [n:127.0.0.1:64016_iv_g c:control_collection s:shard1  x:control_collection_shard1_replica_n1] o.a.s.c.CoreContainer Creating SolrCore 'control_collection_shard1_replica_n1' using configuration from collection control_collection, trusted=true
   [junit4]   2> 2115421 INFO  (qtp21766735-16934) [n:127.0.0.1:64016_iv_g c:control_collection s:shard1  x:control_collection_shard1_replica_n1] o.a.s.m.r.SolrJmxReporter JMX monitoring for 'solr.core.control_collection.shard1.replica_n1' (registry 'solr.core.control_collection.shard1.replica_n1') enabled at server: com.sun.jmx.mbeanserver.JmxMBeanServer@790f67
   [junit4]   2> 2115421 INFO  (qtp21766735-16934) [n:127.0.0.1:64016_iv_g c:control_collection s:shard1  x:control_collection_shard1_replica_n1] o.a.s.c.SolrCore solr.RecoveryStrategy.Builder
   [junit4]   2> 2115421 INFO  (qtp21766735-16934) [n:127.0.0.1:64016_iv_g c:control_collection s:shard1  x:control_collection_shard1_replica_n1] o.a.s.c.SolrCore [[control_collection_shard1_replica_n1] ] Opening new SolrCore at [C:\Users\jenkins\workspace\Lucene-Solr-master-Windows\solr\build\solr-core\test\J0\temp\solr.cloud.ChaosMonkeyNothingIsSafeTest_EA28C3D00741F6D0-001\control-001\cores\control_collection_shard1_replica_n1], dataDir=[C:\Users\jenkins\workspace\Lucene-Solr-master-Windows\solr\build\solr-core\test\J0\..\..\..\..\..\..\..\..\..\Users\jenkins\workspace\Lucene-Solr-master-Windows\solr\build\solr-core\test\J0\temp\solr.cloud.ChaosMonkeyNothingIsSafeTest_EA28C3D00741F6D0-001\control-001\cores\control_collection_shard1_replica_n1\data\]
   [junit4]   2> 2115431 INFO  (qtp21766735-16934) [n:127.0.0.1:64016_iv_g c:control_collection s:shard1  x:control_collection_shard1_replica_n1] o.a.s.u.RandomMergePolicy RandomMergePolicy wrapping class org.apache.lucene.index.TieredMergePolicy: [TieredMergePolicy: maxMergeAtOnce=24, maxMergeAtOnceExplicit=22, maxMergedSegmentMB=17.369140625, floorSegmentMB=1.8251953125, forceMergeDeletesPctAllowed=20.13915708782, segmentsPerTier=19.0, maxCFSSegmentSizeMB=8.796093022207999E12, noCFSRatio=0.7448544184510806
   [junit4]   2> 2115437 WARN  (qtp21766735-16934) [n:127.0.0.1:64016_iv_g c:control_collection s:shard1  x:control_collection_shard1_replica_n1] o.a.s.c.RequestHandlers INVALID paramSet a in requestHandler {type = requestHandler,name = /dump,class = DumpRequestHandler,attributes = {initParams=a, name=/dump, class=DumpRequestHandler},args = {defaults={a=A,b=B}}}
   [junit4]   2> 2115514 INFO  (qtp21766735-16934) [n:127.0.0.1:64016_iv_g c:control_collection s:shard1  x:control_collection_shard1_replica_n1] o.a.s.u.UpdateHandler Using UpdateLog implementation: org.apache.solr.update.UpdateLog
   [junit4]   2> 2115514 INFO  (qtp21766735-16934) [n:127.0.0.1:64016_iv_g c:control_collection s:shard1  x:control_collection_shard1_replica_n1] o.a.s.u.UpdateLog Initializing UpdateLog: dataDir= defaultSyncLevel=FLUSH numRecordsToKeep=100 maxNumLogsToKeep=10 numVersionBuckets=65536
   [junit4]   2> 2115515 INFO  (qtp21766735-16934) [n:127.0.0.1:64016_iv_g c:control_collection s:shard1  x:control_collection_shard1_replica_n1] o.a.s.u.CommitTracker Hard AutoCommit: if uncommited for 15000ms; 
   [junit4]   2> 2115515 INFO  (qtp21766735-16934) [n:127.0.0.1:64016_iv_g c:control_collection s:shard1  x:control_collection_shard1_replica_n1] o.a.s.u.CommitTracker Soft AutoCommit: disabled
   [junit4]   2> 2115517 INFO  (qtp21766735-16934) [n:127.0.0.1:64016_iv_g c:control_collection s:shard1  x:control_collection_shard1_replica_n1] o.a.s.u.RandomMergePolicy RandomMergePolicy wrapping class org.apache.lucene.index.TieredMergePolicy: [TieredMergePolicy: maxMergeAtOnce=16, maxMergeAtOnceExplicit=40, maxMergedSegmentMB=77.3515625, floorSegmentMB=1.78125, forceMergeDeletesPctAllowed=6.256702834126665, segmentsPerTier=38.0, maxCFSSegmentSizeMB=8.796093022207999E12, noCFSRatio=1.0
   [junit4]   2> 2115517 INFO  (qtp21766735-16934) [n:127.0.0.1:64016_iv_g c:control_collection s:shard1  x:control_collection_shard1_replica_n1] o.a.s.s.SolrIndexSearcher Opening [Searcher@8e7316[control_collection_shard1_replica_n1] main]
   [junit4]   2> 2115519 INFO  (qtp21766735-16934) [n:127.0.0.1:64016_iv_g c:control_collection s:shard1  x:control_collection_shard1_replica_n1] o.a.s.r.ManagedResourceStorage Configured ZooKeeperStorageIO with znodeBase: /configs/conf1
   [junit4]   2> 2115519 INFO  (qtp21766735-16934) [n:127.0.0.1:64016_iv_g c:control_collection s:shard1  x:control_collection_shard1_replica_n1] o.a.s.r.ManagedResourceStorage Loaded null at path _rest_managed.json using ZooKeeperStorageIO:path=/configs/conf1
   [junit4]   2> 2115520 INFO  (qtp21766735-16934) [n:127.0.0.1:64016_iv_g c:control_collection s:shard1  x:control_collection_shard1_replica_n1] o.a.s.h.ReplicationHandler Commits will be reserved for  10000
   [junit4]   2> 2115520 INFO  (qtp21766735-16934) [n:127.0.0.1:64016_iv_g c:control_collection s:shard1  x:control_collection_shard1_replica_n1] o.a.s.u.UpdateLog Could not find max version in index or recent updates, using new clock 1572235184306126848
   [junit4]   2> 2115521 INFO  (searcherExecutor-7564-thread-1-processing-n:127.0.0.1:64016_iv_g x:control_collection_shard1_replica_n1 s:shard1 c:control_collection) [n:127.0.0.1:64016_iv_g c:control_collection s:shard1  x:control_collection_shard1_replica_n1] o.a.s.c.SolrCore [control_collection_shard1_replica_n1] Registered new searcher Searcher@8e7316[control_collection_shard1_replica_n1] main{ExitableDirectoryReader(UninvertingDirectoryReader())}
   [junit4]   2> 2115526 INFO  (qtp21766735-16934) [n:127.0.0.1:64016_iv_g c:control_collection s:shard1  x:control_collection_shard1_replica_n1] o.a.s.c.ShardLeaderElectionContext Enough replicas found to continue.
   [junit4]   2> 2115526 INFO  (qtp21766735-16934) [n:127.0.0.1:64016_iv_g c:control_collection s:shard1  x:control_collection_shard1_replica_n1] o.a.s.c.ShardLeaderElectionContext I may be the new leader - try and sync
   [junit4]   2> 2115527 INFO  (qtp21766735-16934) [n:127.0.0.1:64016_iv_g c:control_collection s:shard1  x:control_collection_shard1_replica_n1] o.a.s.c.SyncStrategy Sync replicas to http://127.0.0.1:64016/iv_g/control_collection_shard1_replica_n1/
   [junit4]   2> 2115527 INFO  (qtp21766735-16934) [n:127.0.0.1:64016_iv_g c:control_collection s:shard1  x:control_collection_shard1_replica_n1] o.a.s.c.SyncStrategy Sync Success - now sync replicas to me
   [junit4]   2> 2115527 INFO  (qtp21766735-16934) [n:127.0.0.1:64016_iv_g c:control_collection s:shard1  x:control_collection_shard1_replica_n1] o.a.s.c.SyncStrategy http://127.0.0.1:64016/iv_g/control_collection_shard1_replica_n1/ has no replicas
   [junit4]   2> 2115527 INFO  (qtp21766735-16934) [n:127.0.0.1:64016_iv_g c:control_collection s:shard1  x:control_collection_shard1_replica_n1] o.a.s.c.ShardLeaderElectionContext Found all replicas participating in election, clear LIR
   [junit4]   2> 2115530 INFO  (qtp21766735-16934) [n:127.0.0.1:64016_iv_g c:control_collection s:shard1  x:control_collection_shard1_replica_n1] o.a.s.c.ShardLeaderElectionContext I am the new leader: http://127.0.0.1:64016/iv_g/control_collection_shard1_replica_n1/ shard1
   [junit4]   2> 2115633 INFO  (zkCallback-2267-thread-1-processing-n:127.0.0.1:64016_iv_g) [n:127.0.0.1:64016_iv_g    ] o.a.s.c.c.ZkStateReader A cluster state change: [WatchedEvent state:SyncConnected type:NodeDataChanged path:/collections/control_collection/state.json] for collection [control_collection] has occurred - updating... (live nodes size: [1])
   [junit4]   2> 2115682 INFO  (qtp21766735-16934) [n:127.0.0.1:64016_iv_g c:control_collection s:shard1  x:control_collection_shard1_replica_n1] o.a.s.c.ZkController I am the leader, no recovery necessary
   [junit4]   2> 2115685 INFO  (qtp21766735-16934) [n:127.0.0.1:64016_iv_g c:control_collection s:shard1  x:control_collection_shard1_replica_n1] o.a.s.s.HttpSolrCall [admin] webapp=null path=/admin/cores params={qt=/admin/cores&collection.configName=conf1&newCollection=true&name=control_collection_shard1_replica_n1&action=CREATE&numShards=1&collection=control_collection&shard=shard1&wt=javabin&version=2&replicaType=NRT} status=0 QTime=1394
   [junit4]   2> 2115688 INFO  (qtp21766735-16937) [n:127.0.0.1:64016_iv_g    ] o.a.s.h.a.CollectionsHandler Wait for new collection to be active for at most 30 seconds. Check all shard replicas
   [junit4]   2> 2115785 INFO  (zkCallback-2267-thread-1-processing-n:127.0.0.1:64016_iv_g) [n:127.0.0.1:64016_iv_g    ] o.a.s.c.c.ZkStateReader A cluster state change: [WatchedEvent state:SyncConnected type:NodeDataChanged path:/collections/control_collection/state.json] for collection [control_collection] has occurred - updating... (live nodes size: [1])
   [junit4]   2> 2116182 INFO  (OverseerCollectionConfigSetProcessor-98264698845003780-127.0.0.1:64016_iv_g-n_0000000000) [n:127.0.0.1:64016_iv_g    ] o.a.s.c.OverseerTaskQueue Response ZK path: /overseer/collection-queue-work/qnr-0000000000 doesn't exist.  Requestor may have disconnected from ZooKeeper
   [junit4]   2> 2116690 INFO  (qtp21766735-16937) [n:127.0.0.1:64016_iv_g    ] o.a.s.s.HttpSolrCall [admin] webapp=null path=/admin/collections params={replicationFactor=1&collection.configName=conf1&name=control_collection&nrtReplicas=1&action=CREATE&numShards=1&createNodeSet=127.0.0.1:64016_iv_g&wt=javabin&version=2} status=0 QTime=2512
   [junit4]   2> 2116697 INFO  (TEST-ChaosMonkeyNothingIsSafeTest.test-seed#[EA28C3D00741F6D0]) [    ] o.a.s.c.c.ZkStateReader Updated live nodes from ZooKeeper... (0) -> (1)
   [junit4]   2> 2116699 INFO  (TEST-ChaosMonkeyNothingIsSafeTest.test-seed#[EA28C3D00741F6D0]) [    ] o.a.s.c.s.i.ZkClientClusterStateProvider Cluster at 127.0.0.1:64009/solr ready
   [junit4]   2> 2116699 INFO  (TEST-ChaosMonkeyNothingIsSafeTest.test-seed#[EA28C3D00741F6D0]) [    ] o.a.s.c.ChaosMonkey monkey: init - expire sessions:false cause connection loss:false
   [junit4]   2> 2116700 INFO  (qtp21766735-16931) [n:127.0.0.1:64016_iv_g    ] o.a.s.h.a.CollectionsHandler Invoked Collection Action :create with params replicationFactor=1&collection.configName=conf1&name=collection1&nrtReplicas=1&action=CREATE&numShards=1&createNodeSet=&stateFormat=2&wt=javabin&version=2 and sendToOCPQueue=true
   [junit4]   2> 2116702 INFO  (OverseerThreadFactory-7561-thread-2-processing-n:127.0.0.1:64016_iv_g) [n:127.0.0.1:64016_iv_g    ] o.a.s.c.CreateCollectionCmd Create collection collection1
   [junit4]   2> 2116702 WARN  (OverseerThreadFactory-7561-thread-2-processing-n:127.0.0.1:64016_iv_g) [n:127.0.0.1:64016_iv_g    ] o.a.s.c.CreateCollectionCmd It is unusual to create a collection (collection1) without cores.
   [junit4]   2> 2116908 INFO  (qtp21766735-16931) [n:127.0.0.1:64016_iv_g    ] o.a.s.h.a.CollectionsHandler Wait for new collection to be active for at most 30 seconds. Check all shard replicas
   [junit4]   2> 2116908 INFO  (qtp21766735-16931) [n:127.0.0.1:64016_iv_g    ] o.a.s.s.HttpSolrCall [admin] webapp=null path=/admin/collections params={replicationFactor=1&collection.configName=conf1&name=collection1&nrtReplicas=1&action=CREATE&numShards=1&createNodeSet=&stateFormat=2&wt=javabin&version=2} status=0 QTime=208
   [junit4]   2> 2116914 INFO  (OverseerCollectionConfigSetProcessor-98264698845003780-127.0.0.1:64016_iv_g-n_0000000000) [n:127.0.0.1:64016_iv_g    ] o.a.s.c.OverseerTaskQueue Response ZK path: /overseer/collection-queue-work/qnr-0000000002 doesn't exist.  Requestor may have disconnected from ZooKeeper
   [junit4]   2> 2117394 INFO  (TEST-ChaosMonkeyNothingIsSafeTest.test-seed#[EA28C3D00741F6D0]) [    ] o.a.s.c.AbstractFullDistribZkTestBase create jetty 1 in directory C:\Users\jenkins\workspace\Lucene-Solr-master-Windows\solr\build\solr-core\test\J0\temp\solr.cloud.ChaosMonkeyNothingIsSafeTest_EA28C3D00741F6D0-001\shard-1-001 of type TLOG
   [junit4]   2> 2117395 INFO  (TEST-ChaosMonkeyNothingIsSafeTest.test-seed#[EA28C3D00741F6D0]) [    ] o.e.j.s.Server jetty-9.3.14.v20161028
   [junit4]   2> 2117396 INFO  (TEST-ChaosMonkeyNothingIsSafeTest.test-seed#[EA28C3D00741F6D0]) [    ] o.e.j.s.h.ContextHandler Started o.e.j.s.ServletContextHandler@9e8921{/iv_g,null,AVAILABLE}
   [junit4]   2> 2117396 INFO  (TEST-ChaosMonkeyNothingIsSafeTest.test-seed#[EA28C3D00741F6D0]) [    ] o.e.j.s.AbstractConnector Started ServerConnector@1cdb9c1{HTTP/1.1,[http/1.1]}{127.0.0.1:64040}
   [junit4]   2> 2117396 INFO  (TEST-ChaosMonkeyNothingIsSafeTest.test-seed#[EA28C3D00741F6D0]) [    ] o.e.j.s.Server Started @2120939ms
   [junit4]   2> 2117396 INFO  (TEST-ChaosMonkeyNothingIsSafeTest.test-seed#[EA28C3D00741F6D0]) [    ] o.a.s.c.s.e.JettySolrRunner Jetty properties: {solr.data.dir=C:\Users\jenkins\workspace\Lucene-Solr-master-Windows\solr\build\solr-core\test\J0\temp\solr.cloud.ChaosMonkeyNothingIsSafeTest_EA28C3D00741F6D0-001\tempDir-001/jetty1, replicaType=TLOG, solrconfig=solrconfig.xml, hostContext=/iv_g, hostPort=64040, coreRootDirectory=C:\Users\jenkins\workspace\Lucene-Solr-master-Windows\solr\build\solr-core\test\J0\..\..\..\..\..\..\..\..\..\Users\jenkins\workspace\Lucene-Solr-master-Windows\solr\build\solr-core\test\J0\temp\solr.cloud.ChaosMonkeyNothingIsSafeTest_EA28C3D00741F6D0-001\shard-1-001\cores}
   [junit4]   2> 2117397 ERROR (TEST-ChaosMonkeyNothingIsSafeTest.test-seed#[EA28C3D00741F6D0]) [    ] o.a.s.s.StartupLoggingUtils Missing Java Option solr.log.dir. Logging may be missing or incomplete.
   [junit4]   2> 2117397 INFO  (TEST-ChaosMonkeyNothingIsSafeTest.test-seed#[EA28C3D00741F6D0]) [    ] o.a.s.s.SolrDispatchFilter  ___      _       Welcome to Apache Solr™ version 8.0.0
   [junit4]   2> 2117397 INFO  (TEST-ChaosMonkeyNothingIsSafeTest.test-seed#[EA28C3D00741F6D0]) [    ] o.a.s.s.SolrDispatchFilter / __| ___| |_ _   Starting in cloud mode on port null
   [junit4]   2> 2117397 INFO  (TEST-ChaosMonkeyNothingIsSafeTest.test-seed#[EA28C3D00741F6D0]) [    ] o.a.s.s.SolrDispatchFilter \__ \/ _ \ | '_|  Install dir: null, Default config dir: null
   [junit4]   2> 2117397 INFO  (TEST-ChaosMonkeyNothingIsSafeTest.test-seed#[EA28C3D00741F6D0]) [    ] o.a.s.s.SolrDispatchFilter |___/\___/_|_|    Start time: 2017-07-07T04:05:16.500Z
   [junit4]   2> 2117402 WARN  (NIOServerCxn.Factory:0.0.0.0/0.0.0.0:0) [    ] o.a.z.s.NIOServerCnxn caught end of stream exception
   [junit4]   2> EndOfStreamException: Unable to read additional data from client sessionid 0x15d1b39149e0007, likely client has closed socket
   [junit4]   2> 	at org.apache.zookeeper.server.NIOServerCnxn.doIO(NIOServerCnxn.java:239)
   [junit4]   2> 	at org.apache.zookeeper.server.NIOServerCnxnFactory.run(NIOServerCnxnFactory.java:203)
   [junit4]   2> 	at java.lang.Thread.run(Thread.java:748)
   [junit4]   2> 2117402 INFO  (TEST-ChaosMonkeyNothingIsSafeTest.test-seed#[EA28C3D00741F6D0]) [    ] o.a.s.s.SolrDispatchFilter Loading solr.xml from SolrHome (not found in ZooKeeper)
   [junit4]   2> 2117402 INFO  (TEST-ChaosMonkeyNothingIsSafeTest.test-seed#[EA28C3D00741F6D0]) [    ] o.a.s.c.SolrXmlConfig Loading container configuration from C:\Users\jenkins\workspace\Lucene-Solr-master-Windows\solr\build\solr-core\test\J0\temp\solr.cloud.ChaosMonkeyNothingIsSafeTest_EA28C3D00741F6D0-001\shard-1-001\solr.xml
   [junit4]   2> 2117410 INFO  (TEST-ChaosMonkeyNothingIsSafeTest.test-seed#[EA28C3D00741F6D0]) [    ] o.a.s.c.SolrXmlConfig MBean server found: com.sun.jmx.mbeanserver.JmxMBeanServer@790f67, but no JMX reporters were configured - adding default JMX reporter.
   [junit4]   2> 2117411 INFO  (TEST-ChaosMonkeyNothingIsSafeTest.test-seed#[EA28C3D00741F6D0]) [    ] o.a.s.c.ZkContainer Zookeeper client=127.0.0.1:64009/solr
   [junit4]   2> 2117426 INFO  (TEST-ChaosMonkeyNothingIsSafeTest.test-seed#[EA28C3D00741F6D0]) [n:127.0.0.1:64040_iv_g    ] o.a.s.c.c.ZkStateReader Updated live nodes from ZooKeeper... (0) -> (1)
   [junit4]   2> 2117428 INFO  (TEST-ChaosMonkeyNothingIsSafeTest.test-seed#[EA28C3D00741F6D0]) [n:127.0.0.1:64040_iv_g    ] o.a.s.c.Overseer Overseer (id=null) closing
   [junit4]   2> 2117430 INFO  (TEST-ChaosMonkeyNothingIsSafeTest.test-seed#[EA28C3D00741F6D0]) [n:127.0.0.1:64040_iv_g    ] o.a.s.c.ZkController Register node as live in ZooKeeper:/live_nodes/127.0.0.1:64040_iv_g
   [junit4]   2> 2117433 INFO  (zkCallback-2274-thread-1) [    ] o.a.s.c.c.ZkStateReader Updated live nodes from ZooKeeper... (1) -> (2)
   [junit4]   2> 2117434 INFO  (zkCallback-2267-thread-1-processing-n:127.0.0.1:64016_iv_g) [n:127.0.0.1:64016_iv_g    ] o.a.s.c.c.ZkStateReader Updated live nodes from ZooKeeper... (1) -> (2)
   [junit4]   2> 2117434 INFO  (zkCallback-2279-thread-1-processing-n:127.0.0.1:64040_iv_g) [n:127.0.0.1:64040_iv_g    ] o.a.s.c.c.ZkStateReader Updated live nodes from ZooKeeper... (1) -> (2)
   [junit4]   2> 2117653 INFO  (TEST-ChaosMonkeyNothingIsSafeTest.test-seed#[EA28C3D00741F6D0]) [n:127.0.0.1:64040_iv_g    ] o.a.s.m.r.SolrJmxReporter JMX monitoring for 'solr.node' (registry 'solr.node') enabled at server: com.sun.jmx.mbeanserver.JmxMBeanServer@790f67
   [junit4]   2> 2117673 INFO  (TEST-ChaosMonkeyNothingIsSafeTest.test-seed#[EA28C3D00741F6D0]) [n:127.0.0.1:64040_iv_g    ] o.a.s.m.r.SolrJmxReporter JMX monitoring for 'solr.jvm' (registry 'solr.jvm') enabled at server: com.sun.jmx.mbeanserver.JmxMBeanServer@790f67
   [junit4]   2> 2117674 INFO  (TEST-ChaosMonkeyNothingIsSafeTest.test-seed#[EA28C3D00741F6D0]) [n:127.0.0.1:64040_iv_g    ] o.a.s.m.r.SolrJmxReporter JMX monitoring for 'solr.jetty' (registry 'solr.jetty') enabled at server: com.sun.jmx.mbeanserver.JmxMBeanServer@790f67
   [junit4]   2> 2117676 INFO  (TEST-ChaosMonkeyNothingIsSafeTest.test-seed#[EA28C3D00741F6D0]) [n:127.0.0.1:64040_iv_g    ] o.a.s.c.CorePropertiesLocator Found 0 core definitions underneath C:\Users\jenkins\workspace\Lucene-Solr-master-Windows\solr\build\solr-core\test\J0\..\..\..\..\..\..\..\..\..\Users\jenkins\workspace\Lucene-Solr-master-Windows\solr\build\solr-core\test\J0\temp\solr.cloud.ChaosMonkeyNothingIsSafeTest_EA28C3D00741F6D0-001\shard-1-001\cores
   [junit4]   2> 2117698 INFO  (qtp21766735-16930) [n:127.0.0.1:64016_iv_g    ] o.a.s.h.a.CollectionsHandler Invoked Collection Action :addreplica with params node=127.0.0.1:64040_iv_g&action=ADDREPLICA&collection=collection1&shard=shard1&type=TLOG&wt=javabin&version=2 and sendToOCPQueue=true
   [junit4]   2> 2117699 INFO  (OverseerThreadFactory-7561-thread-3-processing-n:127.0.0.1:64016_iv_g) [n:127.0.0.1:64016_iv_g    ] o.a.s.c.AddReplicaCmd Node Identified 127.0.0.1:64040_iv_g for creating new replica
   [junit4]   2> 2117699 INFO  (qtp17289738-16972) [n:127.0.0.1:64040_iv_g    ] o.a.s.h.a.CoreAdminOperation core create command qt=/admin/cores&collection.configName=conf1&name=collection1_shard1_replica_t0&action=CREATE&collection=collection1&shard=shard1&wt=javabin&version=2&replicaType=TLOG
   [junit4]   2> 2117704 INFO  (qtp17289738-16972) [n:127.0.0.1:64040_iv_g    ] o.a.s.c.TransientSolrCoreCacheDefault Allocating transient cache for 4 transient cores
   [junit4]   2> 2117808 INFO  (zkCallback-2279-thread-1-processing-n:127.0.0.1:64040_iv_g) [n:127.0.0.1:64040_iv_g    ] o.a.s.c.c.ZkStateReader A cluster state change: [WatchedEvent state:SyncConnected type:NodeDataChanged path:/collections/collection1/state.json] for collection [collection1] has occurred - updating... (live nodes size: [2])
   [junit4]   2> 2118726 INFO  (qtp17289738-16972) [n:127.0.0.1:64040_iv_g c:collection1 s:shard1  x:collection1_shard1_replica_t0] o.a.s.c.SolrConfig Using Lucene MatchVersion: 8.0.0
   [junit4]   2> 2118736 INFO  (qtp17289738-16972) [n:127.0.0.1:64040_iv_g c:collection1 s:shard1  x:collection1_shard1_replica_t0] o.a.s.s.IndexSchema [collection1_shard1_replica_t0] Schema name=test
   [junit4]   2> 2118805 INFO  (qtp17289738-16972) [n:127.0.0.1:64040_iv_g c:collection1 s:shard1  x:collection1_shard1_replica_t0] o.a.s.s.IndexSchema Loaded schema test/1.6 with uniqueid field id
   [junit4]   2> 2118824 INFO  (qtp17289738-16972) [n:127.0.0.1:64040_iv_g c:collection1 s:shard1  x:collection1_shard1_replica_t0] o.a.s.c.CoreContainer Creating SolrCore 'collection1_shard1_replica_t0' using configuration from collection collection1, trusted=true
   [junit4]   2> 2118825 INFO  (qtp17289738-16972) [n:127.0.0.1:64040_iv_g c:collection1 s:shard1  x:collection1_shard1_replica_t0] o.a.s.m.r.SolrJmxReporter JMX monitoring for 'solr.core.collection1.shard1.replica_t0' (registry 'solr.core.collection1.shard1.replica_t0') enabled at server: com.sun.jmx.mbeanserver.JmxMBeanServer@790f67
   [junit4]   2> 2118825 INFO  (qtp17289738-16972) [n:127.0.0.1:64040_iv_g c:collection1 s:shard1  x:collection1_shard1_replica_t0] o.a.s.c.SolrCore solr.RecoveryStrategy.Builder
   [junit4]   2> 2118825 INFO  (qtp17289738-16972) [n:127.0.0.1:64040_iv_g c:collection1 s:shard1  x:collection1_shard1_replica_t0] o.a.s.c.SolrCore [[collection1_shard1_replica_t0] ] Opening new SolrCore at [C:\Users\jenkins\workspace\Lucene-Solr-master-Windows\solr\build\solr-core\test\J0\temp\solr.cloud.ChaosMonkeyNothingIsSafeTest_EA28C3D00741F6D0-001\shard-1-001\cores\collection1_shard1_replica_t0], dataDir=[C:\Users\jenkins\workspace\Lucene-Solr-master-Windows\solr\build\solr-core\test\J0\..\..\..\..\..\..\..\..\..\Users\jenkins\workspace\Lucene-Solr-master-Windows\solr\build\solr-core\test\J0\temp\solr.cloud.ChaosMonkeyNothingIsSafeTest_EA28C3D00741F6D0-001\shard-1-001\cores\collection1_shard1_replica_t0\data\]
   [junit4]   2> 2118832 INFO  (qtp17289738-16972) [n:127.0.0.1:64040_iv_g c:collection1 s:shard1  x:collection1_shard1_replica_t0] o.a.s.u.RandomMergePolicy RandomMergePolicy wrapping class org.apache.lucene.index.TieredMergePolicy: [TieredMergePolicy: maxMergeAtOnce=24, maxMergeAtOnceExplicit=22, maxMergedSegmentMB=17.369140625, floorSegmentMB=1.8251953125, forceMergeDeletesPctAllowed=20.13915708782, segmentsPerTier=19.0, maxCFSSegmentSizeMB=8.796093022207999E12, noCFSRatio=0.7448544184510806
   [junit4]   2> 2118837 WARN  (qtp17289738-16972) [n:127.0.0.1:64040_iv_g c:collection1 s:shard1  x:collection1_shard1_replica_t0] o.a.s.c.RequestHandlers INVALID paramSet a in requestHandler {type = requestHandler,name = /dump,class = DumpRequestHandler,attributes = {initParams=a, name=/dump, class=DumpRequestHandler},args = {defaults={a=A,b=B}}}
   [junit4]   2> 2118913 INFO  (qtp17289738-16972) [n:127.0.0.1:64040_iv_g c:collection1 s:shard1  x:collection1_shard1_replica_t0] o.a.s.u.UpdateHandler Using UpdateLog implementation: org.apache.solr.update.UpdateLog
   [junit4]   2> 2118913 INFO  (qtp17289738-16972) [n:127.0.0.1:64040_iv_g c:collection1 s:shard1  x:collection1_shard1_replica_t0] o.a.s.u.UpdateLog Initializing UpdateLog: dataDir= defaultSyncLevel=FLUSH numRecordsToKeep=100 maxNumLogsToKeep=10 numVersionBuckets=65536
   [junit4]   2> 2118914 INFO  (qtp17289738-16972) [n:127.0.0.1:64040_iv_g c:collection1 s:shard1  x:collection1_shard1_replica_t0] o.a.s.u.CommitTracker Hard AutoCommit: if uncommited for 15000ms; 
   [junit4]   2> 2118914 INFO  (qtp17289738-16972) [n:127.0.0.1:64040_iv_g c:collection1 s:shard1  x:collection1_shard1_replica_t0] o.a.s.u.CommitTracker Soft AutoCommit: disabled
   [junit4]   2> 2118915 INFO  (qtp17289738-16972) [n:127.0.0.1:64040_iv_g c:collection1 s:shard1  x:collection1_shard1_replica_t0] o.a.s.u.RandomMergePolicy RandomMergePolicy wrapping class org.apache.lucene.index.TieredMergePolicy: [TieredMergePolicy: maxMergeAtOnce=16, maxMergeAtOnceExplicit=40, maxMergedSegmentMB=77.3515625, floorSegmentMB=1.78125, forceMergeDeletesPctAllowed=6.256702834126665, segmentsPerTier=38.0, maxCFSSegmentSizeMB=8.796093022207999E12, noCFSRatio=1.0
   [junit4]   2> 2118916 INFO  (qtp17289738-16972) [n:127.0.0.1:64040_iv_g c:collection1 s:shard1  x:collection1_shard1_replica_t0] o.a.s.s.SolrIndexSearcher Opening [Searcher@c2dba4[collection1_shard1_replica_t0] main]
   [junit4]   2> 2118916 INFO  (qtp17289738-16972) [n:127.0.0.1:64040_iv_g c:collection1 s:shard1  x:collection1_shard1_replica_t0] o.a.s.r.ManagedResourceStorage Configured ZooKeeperStorageIO with znodeBase: /configs/conf1
   [junit4]   2> 2118918 INFO  (qtp17289738-16972) [n:127.0.0.1:64040_iv_g c:collection1 s:shard1  x:collection1_shard1_replica_t0] o.a.s.r.ManagedResourceStorage Loaded null at path _rest_managed.json using ZooKeeperStorageIO:path=/configs/conf1
   [junit4]   2> 2118918 INFO  (qtp17289738-16972) [n:127.0.0.1:64040_iv_g c:collection1 s:shard1  x:collection1_shard1_replica_t0] o.a.s.h.ReplicationHandler Commits will be reserved for  10000
   [junit4]   2> 2118918 INFO  (qtp17289738-16972) [n:127.0.0.1:64040_iv_g c:collection1 s:shard1  x:collection1_shard1_replica_t0] o.a.s.u.UpdateLog Could not find max version in index or recent updates, using new clock 1572235187869188096
   [junit4]   2> 2118923 INFO  (searcherExecutor-7575-thread-1-processing-n:127.0.0.1:64040_iv_g x:collection1_shard1_replica_t0 s:shard1 c:collection1) [n:127.0.0.1:64040_iv_g c:collection1 s:shard1  x:collection1_shard1_replica_t0] o.a.s.c.SolrCore [collection1_shard1_replica_t0] Registered new searcher Searcher@c2dba4[collection1_shard1_replica_t0] main{ExitableDirectoryReader(UninvertingDirectoryReader())}
   [junit4]   2> 2118926 INFO  (qtp17289738-16972) [n:127.0.0.1:64040_iv_g c:collection1 s:shard1  x:collection1_shard1_replica_t0] o.a.s.c.ShardLeaderElectionContext Enough replicas found to continue.
   [junit4]   2> 2118926 INFO  (qtp17289738-16972) [n:127.0.0.1:64040_iv_g c:collection1 s:shard1  x:collection1_shard1_replica_t0] o.a.s.c.ShardLeaderElectionContext I may be the new leader - try and sync
   [junit4]   2> 2118926 INFO  (qtp17289738-16972) [n:127.0.0.1:64040_iv_g c:collection1 s:shard1  x:collection1_shard1_replica_t0] o.a.s.c.SyncStrategy Sync replicas to http://127.0.0.1:64040/iv_g/collection1_shard1_replica_t0/
   [junit4]   2> 2118926 INFO  (qtp17289738-16972) [n:127.0.0.1:64040_iv_g c:collection1 s:shard1  x:collection1_shard1_replica_t0] o.a.s.c.SyncStrategy Sync Success - now sync replicas to me
   [junit4]   2> 2118927 INFO  (qtp17289738-16972) [n:127.0.0.1:64040_iv_g c:collection1 s:shard1  x:collection1_shard1_replica_t0] o.a.s.c.SyncStrategy http://127.0.0.1:64040/iv_g/collection1_shard1_replica_t0/ has no replicas
   [junit4]   2> 2118927 INFO  (qtp17289738-16972) [n:127.0.0.1:64040_iv_g c:collection1 s:shard1  x:collection1_shard1_replica_t0] o.a.s.c.ShardLeaderElectionContext Found all replicas participating in election, clear LIR
   [junit4]   2> 2118927 INFO  (qtp17289738-16972) [n:127.0.0.1:64040_iv_g c:collection1 s:shard1  x:collection1_shard1_replica_t0] o.a.s.c.ZkController collection1_shard1_replica_t0 stopping background replication from leader
   [junit4]   2> 2118946 INFO  (qtp17289738-16972) [n:127.0.0.1:64040_iv_g c:collection1 s:shard1  x:collection1_shard1_replica_t0] o.a.s.c.ShardLeaderElectionContext I am the new leader: http://127.0.0.1:64040/iv_g/collection1_shard1_replica_t0/ shard1
   [junit4]   2> 2119050 INFO  (zkCallback-2279-thread-1-processing-n:127.0.0.1:64040_iv_g) [n:127.0.0.1:64040_iv_g    ] o.a.s.c.c.ZkStateReader A cluster state change: [WatchedEvent state:SyncConnected type:NodeDataChanged path:/collections/collection1/state.json] for collection [collection1] has occurred - updating... (live nodes size: [2])
   [junit4]   2> 2119098 INFO  (qtp17289738-16972) [n:127.0.0.1:64040_iv_g c:collection1 s:shard1  x:collection1_shard1_replica_t0] o.a.s.c.ZkController I am the leader, no recovery necessary
   [junit4]   2> 2119102 INFO  (qtp17289738-16972) [n:127.0.0.1:64040_iv_g c:collection1 s:shard1  x:collection1_shard1_replica_t0] o.a.s.s.HttpSolrCall [admin] webapp=null path=/admin/cores params={qt=/admin/cores&collection.configName=conf1&name=collection1_shard1_replica_t0&action=CREATE&collection=collection1&shard=shard1&wt=javabin&version=2&replicaType=TLOG} status=0 QTime=1399
   [junit4]   2> 2119103 INFO  (qtp21766735-16930) [n:127.0.0.1:64016_iv_g    ] o.a.s.s.HttpSolrCall [admin] webapp=null path=/admin/collections params={node=127.0.0.1:64040_iv_g&action=ADDREPLICA&collection=collection1&shard=shard1&type=TLOG&wt=javabin&version=2} status=0 QTime=1406
   [junit4]   2> 2119208 INFO  (zkCallback-2279-thread-1-processing-n:127.0.0.1:64040_iv_g) [n:127.0.0.1:64040_iv_g    ] o.a.s.c.c.ZkStateReader A cluster state change: [WatchedEvent state:SyncConnected type:NodeDataChanged path:/collections/collection1/state.json] for collection [collection1] has occurred - updating... (live nodes size: [2])
   [junit4]   2> 2119705 INFO  (OverseerCollectionConfigSetProcessor-98264698845003780-127.0.0.1:64016_iv_g-n_0000000000) [n:127.0.0.1:64016_iv_g    ] o.a.s.c.OverseerTaskQueue Response ZK path: /overseer/collection-queue-work/qnr-0000000004 doesn't exist.  Requestor may have disconnected from ZooKeeper
   [junit4]   2> 2119853 INFO  (TEST-ChaosMonkeyNothingIsSafeTest.test-seed#[EA28C3D00741F6D0]) [    ] o.a.s.c.AbstractFullDistribZkTestBase create jetty 2 in directory C:\Users\jenkins\workspace\Lucene-Solr-master-Windows\solr\build\solr-core\test\J0\temp\solr.cloud.ChaosMonkeyNothingIsSafeTest_EA28C3D00741F6D0-001\shard-2-001 of type TLOG
   [junit4]   2> 2119853 INFO  (TEST-ChaosMonkeyNothingIsSafeTest.test-seed#[EA28C3D00741F6D0]) [    ] o.e.j.s.Server jetty-9.3.14.v20161028
   [junit4]   2> 2119854 INFO  (TEST-ChaosMonkeyNothingIsSafeTest.test-seed#[EA28C3D00741F6D0]) [    ] o.e.j.s.h.ContextHandler Started o.e.j.s.ServletContextHandler@2e74d6{/iv_g,null,AVAILABLE}
   [junit4]   2> 2119854 INFO  (TEST-ChaosMonkeyNothingIsSafeTest.test-seed#[EA28C3D00741F6D0]) [    ] o.e.j.s.AbstractConnector Started ServerConnector@1094c50{HTTP/1.1,[http/1.1]}{127.0.0.1:64059}
   [junit4]   2> 2119854 INFO  (TEST-ChaosMonkeyNothingIsSafeTest.test-seed#[EA28C3D00741F6D0]) [    ] o.e.j.s.Server Started @2123398ms
   [junit4]   2> 2119854 INFO  (TEST-ChaosMonkeyNothingIsSafeTest.test-seed#[EA28C3D00741F6D0]) [    ] o.a.s.c.s.e.JettySolrRunner Jetty properties: {solr.data.dir=C:\Users\jenkins\workspace\Lucene-Solr-master-Windows\solr\build\solr-core\test\J0\temp\solr.cloud.ChaosMonkeyNothingIsSafeTest_EA28C3D00741F6D0-001\tempDir-001/jetty2, replicaType=TLOG, solrconfig=solrconfig.xml, hostContext=/iv_g, hostPort=64059, coreRootDirectory=C:\Users\jenkins\workspace\Lucene-Solr-master-Windows\solr\build\solr-core\test\J0\temp\solr.cloud.ChaosMonkeyNothingIsSafeTest_EA28C3D00741F6D0-001\shard-2-001\cores}
   [junit4]   2> 2119855 ERROR (TEST-ChaosMonkeyNothingIsSafeTest.test-seed#[EA28C3D00741F6D0]) [    ] o.a.s.s.StartupLoggingUtils Missing Java Option solr.log.dir. Logging may be missing or incomplete.
   [junit4]   2> 2119855 INFO  (TEST-ChaosMonkeyNothingIsSafeTest.test-seed#[EA28C3D00741F6D0]) [    ] o.a.s.s.SolrDispatchFilter  ___      _       Welcome to Apache Solr™ version 8.0.0
   [junit4]   2> 2119855 INFO  (TEST-ChaosMonkeyNothingIsSafeTest.test-seed#[EA28C3D00741F6D0]) [    ] o.a.s.s.SolrDispatchFilter / __| ___| |_ _   Starting in cloud mode on port null
   [junit4]   2> 2119855 INFO  (TEST-ChaosMonkeyNothingIsSafeTest.test-seed#[EA28C3D00741F6D0]) [    ] o.a.s.s.SolrDispatchFilter \__ \/ _ \ | '_|  Install dir: null, Default config dir: null
   [junit4]   2> 2119855 INFO  (TEST-ChaosMonkeyNothingIsSafeTest.test-seed#[EA28C3D00741F6D0]) [    ] o.a.s.s.SolrDispatchFilter |___/\___/_|_|    Start time: 2017-07-07T04:05:18.958Z
   [junit4]   2> 2119870 INFO  (TEST-ChaosMonkeyNothingIsSafeTest.test-seed#[EA28C3D00741F6D0]) [    ] o.a.s.s.SolrDispatchFilter Loading solr.xml from SolrHome (not found in ZooKeeper)
   [junit4]   2> 2119871 INFO  (TEST-ChaosMonkeyNothingIsSafeTest.test-seed#[EA28C3D00741F6D0]) [    ] o.a.s.c.SolrXmlConfig Loading container configuration from C:\Users\jenkins\workspace\Lucene-Solr-master-Windows\solr\build\solr-core\test\J0\temp\solr.cloud.ChaosMonkeyNothingIsSafeTest_EA28C3D00741F6D0-001\shard-2-001\solr.xml
   [junit4]   2> 2119881 INFO  (TEST-ChaosMonkeyNothingIsSafeTest.test-seed#[EA28C3D00741F6D0]) [    ] o.a.s.c.SolrXmlConfig MBean server found: com.sun.jmx.mbeanserver.JmxMBeanServer@790f67, but no JMX reporters were configured - adding default JMX reporter.
   [junit4]   2> 2119888 INFO  (TEST-ChaosMonkeyNothingIsSafeTest.test-seed#[EA28C3D00741F6D0]) [    ] o.a.s.c.ZkContainer Zookeeper client=127.0.0.1:64009/solr
   [junit4]   2> 2119892 WARN  (NIOServerCxn.Factory:0.0.0.0/0.0.0.0:0) [    ] o.a.z.s.NIOServerCnxn caught end of stream exception
   [junit4]   2> EndOfStreamException: Unable to read additional data from client sessionid 0x15d1b39149e000b, likely client has closed socket
   [junit4]   2> 	at org.apache.zookeeper.server.NIOServerCnxn.doIO(NIOServerCnxn.java:239)
   [junit4]   2> 	at org.apache.zookeeper.server.NIOServerCnxnFactory.run(NIOServerCnxnFactory.java:203)
   [junit4]   2> 	at java.lang.Thread.run(Thread.java:748)
   [junit4]   2> 2119906 INFO  (TEST-ChaosMonkeyNothingIsSafeTest.test-seed#[EA28C3D00741F6D0]) [n:127.0.0.1:64059_iv_g    ] o.a.s.c.c.ZkStateReader Updated live nodes from ZooKeeper... (0) -> (2)
   [junit4]   2> 2119909 INFO  (TEST-ChaosMonkeyNothingIsSafeTest.test-seed#[EA28C3D00741F6D0]) [n:127.0.0.1:64059_iv_g    ] o.a.s.c.Overseer Overseer (id=null) closing
   [junit4]   2> 2119913 INFO  (TEST-ChaosMonkeyNothingIsSafeTest.test-seed#[EA28C3D00741F6D0]) [n:127.0.0.1:64059_iv_g    ] o.a.s.c.ZkController Register node as live in ZooKeeper:/live_nodes/127.0.0.1:64059_iv_g
   [junit4]   2> 2119923 INFO  (zkCallback-2274-thread-1) [    ] o.a.s.c.c.ZkStateReader Updated live nodes from ZooKeeper... (2) -> (3)
   [junit4]   2> 2119924 INFO  (zkCallback-2279-thread-1-processing-n:127.0.0.1:64040_iv_g) [n:127.0.0.1:64040_iv_g    ] o.a.s.c.c.ZkStateReader Updated live nodes from ZooKeeper... (2) -> (3)
   [junit4]   2> 2119924 INFO  (zkCallback-2267-thread-1-processing-n:127.0.0.1:64016_iv_g) [n:127.0.0.1:64016_iv_g    ] o.a.s.c.c.ZkStateReader Updated live nodes from ZooKeeper... (2) -> (3)
   [junit4]   2> 2119925 INFO  (zkCallback-2285-thread-1-processing-n:127.0.0.1:64059_iv_g) [n:127.0.0.1:64059_iv_g    ] o.a.s.c.c.ZkStateReader Updated live nodes from ZooKeeper... (2) -> (3)
   [junit4]   2> 2120024 INFO  (TEST-ChaosMonkeyNothingIsSafeTest.test-seed#[EA28C3D00741F6D0]) [n:127.0.0.1:64059_iv_g    ] o.a.s.m.r.SolrJmxReporter JMX monitoring for 'solr.node' (registry 'solr.node') enabled at server: com.sun.jmx.mbeanserver.JmxMBeanServer@790f67
   [junit4]   2> 2120027 INFO  (TEST-ChaosMonkeyNothingIsSafeTest.test-seed#[EA28C3D00741F6D0]) [n:127.0.0.1:64059_iv_g    ] o.a.s.m.r.SolrJmxReporter JMX monitoring for 'solr.jvm' (registry 'solr.jvm') enabled at server: com.sun.jmx.mbeanserver.JmxMBeanServer@790f67
   [junit4]   2> 2120027 INFO  (TEST-ChaosMonkeyNothingIsSafeTest.test-seed#[EA28C3D00741F6D0]) [n:127.0.0.1:64059_iv_g    ] o.a.s.m.r.SolrJmxReporter JMX monitoring for 'solr.jetty' (registry 'solr.jetty') enabled at server: com.sun.jmx.mbeanserver.JmxMBeanServer@790f67
   [junit4]   2> 2120027 INFO  (TEST-ChaosMonkeyNothingIsSafeTest.test-seed#[EA28C3D00741F6D0]) [n:127.0.0.1:64059_iv_g    ] o.a.s.c.CorePropertiesLocator Found 0 core definitions underneath C:\Users\jenkins\workspace\Lucene-Solr-master-Windows\solr\build\solr-core\test\J0\temp\solr.cloud.ChaosMonkeyNothingIsSafeTest_EA28C3D00741F6D0-001\shard-2-001\cores
   [junit4]   2> 2120063 INFO  (qtp8683502-17005) [n:127.0.0.1:64059_iv_g    ] o.a.s.h.a.CollectionsHandler Invoked Collection Action :addreplica with params node=127.0.0.1:64059_iv_g&action=ADDREPLICA&collection=collection1&shard=shard1&type=TLOG&wt=javabin&version=2 and sendToOCPQueue=true
   [junit4]   2> 2120074 INFO  (OverseerThreadFactory-7561-thread-4-processing-n:127.0.0.1:64016_iv_g) [n:127.0.0.1:64016_iv_g    ] o.a.s.c.AddReplicaCmd Node Identified 127.0.0.1:64059_iv_g for creating new replica
   [junit4]   2> 2120076 INFO  (qtp8683502-17016) [n:127.0.0.1:64059_iv_g    ] o.a.s.h.a.CoreAdminOperation core create command qt=/admin/cores&collection.configName=conf1&name=collection1_shard1_replica_t1&action=CREATE&collection=collection1&shard=shard1&wt=javabin&version=2&replicaType=TLOG
   [junit4]   2> 2120076 INFO  (qtp8683502-17016) [n:127.0.0.1:64059_iv_g    ] o.a.s.c.TransientSolrCoreCacheDefault Allocating transient cache for 4 transient cores
   [junit4]   2> 2120182 INFO  (zkCallback-2285-thread-1-processing-n:127.0.0.1:64059_iv_g) [n:127.0.0.1:64059_iv_g    ] o.a.s.c.c.ZkStateReader A cluster state change: [WatchedEvent state:SyncConnected type:NodeDataChanged path:/collections/collection1/state.json] for collection [collection1] has occurred - updating... (live nodes size: [3])
   [junit4]   2> 2120182 INFO  (zkCallback-2279-thread-1-processing-n:127.0.0.1:64040_iv_g) [n:127.0.0.1:64040_iv_g    ] o.a.s.c.c.ZkStateReader A cluster state change: [WatchedEvent state:SyncConnected type:NodeDataChanged path:/collections/collection1/state.json] for collection [collection1] has occurred - updating... (live nodes size: [3])
   [junit4]   2> 2121102 INFO  (qtp8683502-17016) [n:127.0.0.1:64059_iv_g c:collection1 s:shard1  x:collection1_shard1_replica_t1] o.a.s.c.SolrConfig Using Lucene MatchVersion: 8.0.0
   [junit4]   2> 2121115 INFO  (qtp8683502-17016) [n:127.0.0.1:64059_iv_g c:collection1 s:shard1  x:collection1_shard1_replica_t1] o.a.s.s.IndexSchema [collection1_shard1_replica_t1] Schema name=test
   [junit4]   2> 2121192 INFO  (qtp8683502-17016) [n:127.0.0.1:64059_iv_g c:collection1 s:shard1  x:collection1_shard1_replica_t1] o.a.s.s.IndexSchema Loaded schema test/1.6 with uniqueid field id
   [junit4]   2> 2121218 INFO  (qtp8683502-17016) [n:127.0.0.1:64059_iv_g c:collection1 s:shard1  x:collection1_shard1_replica_t1] o.a.s.c.CoreContainer Creating SolrCore 'collection1_shard1_replica_t1' using configuration from collection collection1, trusted=true
   [junit4]   2> 2121219 INFO  (qtp8683502-17016) [n:127.0.0.1:64059_iv_g c:collection1 s:shard1  x:collection1_shard1_replica_t1] o.a.s.m.r.SolrJmxReporter JMX monitoring for 'solr.core.collection1.shard1.replica_t1' (registry 'solr.core.collection1.shard1.replica_t1') enabled at server: com.sun.jmx.mbeanserver.JmxMBeanServer@790f67
   [junit4]   2> 2121219 INFO  (qtp8683502-17016) [n:127.0.0.1:64059_iv_g c:collection1 s:shard1  x:collection1_shard1_replica_t1] o.a.s.c.SolrCore solr.RecoveryStrategy.Builder
   [junit4]   2> 2121219 INFO  (qtp8683502-17016) [n:127.0.0.1:64059_iv_g c:collection1 s:shard1  x:collection1_shard1_replica_t1] o.a.s.c.SolrCore [[collection1_shard1_replica_t1] ] Opening new SolrCore at [C:\Users\jenkins\workspace\Lucene-Solr-master-Windows\solr\build\solr-core\test\J0\temp\solr.cloud.ChaosMonkeyNothingIsSafeTest_EA28C3D00741F6D0-001\shard-2-001\cores\collection1_shard1_replica_t1], dataDir=[C:\Users\jenkins\workspace\Lucene-Solr-master-Windows\solr\build\solr-core\test\J0\temp\solr.cloud.ChaosMonkeyNothingIsSafeTest_EA28C3D00741F6D0-001\shard-2-001\cores\collection1_shard1_replica_t1\data\]
   [junit4]   2> 2121227 INFO  (qtp8683502-17016) [n:127.0.0.1:64059_iv_g c:collection1 s:shard1  x:collection1_shard1_replica_t1] o.a.s.u.RandomMergePolicy RandomMergePolicy wrapping class org.apache.lucene.index.TieredMergePolicy: [TieredMergePolicy: maxMergeAtOnce=24, maxMergeAtOnceExplicit=22, maxMergedSegmentMB=17.369140625, floorSegmentMB=1.8251953125, forceMergeDeletesPctAllowed=20.13915708782, segmentsPerTier=19.0, maxCFSSegmentSizeMB=8.796093022207999E12, noCFSRatio=0.7448544184510806
   [junit4]   2> 2121234 WARN  (qtp8683502-17016) [n:127.0.0.1:64059_iv_g c:collection1 s:shard1  x:collection1_shard1_replica_t1] o.a.s.c.RequestHandlers INVALID paramSet a in requestHandler {type = requestHandler,name = /dump,class = DumpRequestHandler,attributes = {initParams=a, name=/dump, class=DumpRequestHandler},args = {defaults={a=A,b=B}}}
   [junit4]   2> 2121308 INFO  (qtp8683502-17016) [n:127.0.0.1:64059_iv_g c:collection1 s:shard1  x:collection1_shard1_replica_t1] o.a.s.u.UpdateHandler Using UpdateLog implementation: org.apache.solr.update.UpdateLog
   [junit4]   2> 2121309 INFO  (qtp8683502-17016) [n:127.0.0.1:64059_iv_g c:collection1 s:shard1  x:collection1_shard1_replica_t1] o.a.s.u.UpdateLog Initializing UpdateLog: dataDir= defaultSyncLevel=FLUSH numRecordsToKeep=100 maxNumLogsToKeep=10 numVersionBuckets=65536
   [junit4]   2> 2121311 INFO  (qtp8683502-17016) [n:127.0.0.1:64059_iv_g c:collection1 s:shard1  x:collection1_shard1_replica_t1] o.a.s.u.CommitTracker Hard AutoCommit: if uncommited for 15000ms; 
   [junit4]   2> 2121311 INFO  (qtp8683502-17016) [n:127.0.0.1:64059_iv_g c:collection1 s:shard1  x:collection1_shard1_replica_t1] o.a.s.u.CommitTracker Soft AutoCommit: disabled
   [junit4]   2> 2121312 INFO  (qtp8683502-17016) [n:127.0.0.1:64059_iv_g c:collection1 s:shard1  x:collection1_shard1_replica_t1] o.a.s.u.RandomMergePolicy RandomMergePolicy wrapping class org.apache.lucene.index.TieredMergePolicy: [TieredMergePolicy: maxMergeAtOnce=16, maxMergeAtOnceExplicit=40, maxMergedSegmentMB=77.3515625, floorSegmentMB=1.78125, forceMergeDeletesPctAllowed=6.256702834126665, segmentsPerTier=38.0, maxCFSSegmentSizeMB=8.796093022207999E12, noCFSRatio=1.0
   [junit4]   2> 2121312 INFO  (qtp8683502-17016) [n:127.0.0.1:64059_iv_g c:collection1 s:shard1  x:collection1_shard1_replica_t1] o.a.s.s.SolrIndexSearcher Opening [Searcher@14b56c5[collection1_shard1_replica_t1] main]
   [junit4]   2> 2121312 INFO  (qtp8683502-17016) [n:127.0.0.1:64059_iv_g c:collection1 s:shard1  x:collection1_shard1_replica_t1] o.a.s.r.ManagedResourceStorage Configured ZooKeeperStorageIO with znodeBase: /configs/conf1
   [junit4]   2> 2121312 INFO  (qtp8683502-17016) [n:127.0.0.1:64059_iv_g c:collection1 s:shard1  x:collection1_shard1_replica_t1] o.a.s.r.ManagedResourceStorage Loaded null at path _rest_managed.js

[...truncated too long message...]

Selector.poll0(Native Method)
   [junit4]    >         at sun.nio.ch.WindowsSelectorImpl$SubSelector.poll(WindowsSelectorImpl.java:296)
   [junit4]    >         at sun.nio.ch.WindowsSelectorImpl$SubSelector.access$400(WindowsSelectorImpl.java:278)
   [junit4]    >         at sun.nio.ch.WindowsSelectorImpl.doSelect(WindowsSelectorImpl.java:159)
   [junit4]    >         at sun.nio.ch.SelectorImpl.lockAndDoSelect(SelectorImpl.java:86)
   [junit4]    >         at sun.nio.ch.SelectorImpl.select(SelectorImpl.java:97)
   [junit4]    >         at org.apache.zookeeper.ClientCnxnSocketNIO.doTransport(ClientCnxnSocketNIO.java:349)
   [junit4]    >         at org.apache.zookeeper.ClientCnxn$SendThread.run(ClientCnxn.java:1141)
   [junit4]    >    8) Thread[id=16969, name=TEST-ChaosMonkeyNothingIsSafeTest.test-seed#[EA28C3D00741F6D0]-EventThread, state=WAITING, group=TGRP-ChaosMonkeyNothingIsSafeTest]
   [junit4]    >         at sun.misc.Unsafe.park(Native Method)
   [junit4]    >         at java.util.concurrent.locks.LockSupport.park(LockSupport.java:175)
   [junit4]    >         at java.util.concurrent.locks.AbstractQueuedSynchronizer$ConditionObject.await(AbstractQueuedSynchronizer.java:2039)
   [junit4]    >         at java.util.concurrent.LinkedBlockingQueue.take(LinkedBlockingQueue.java:442)
   [junit4]    >         at org.apache.zookeeper.ClientCnxn$EventThread.run(ClientCnxn.java:501)
   [junit4]    >    9) Thread[id=17107, name=zkCallback-2274-thread-4, state=TIMED_WAITING, group=TGRP-ChaosMonkeyNothingIsSafeTest]
   [junit4]    >         at sun.misc.Unsafe.park(Native Method)
   [junit4]    >         at java.util.concurrent.locks.LockSupport.parkNanos(LockSupport.java:215)
   [junit4]    >         at java.util.concurrent.SynchronousQueue$TransferStack.awaitFulfill(SynchronousQueue.java:460)
   [junit4]    >         at java.util.concurrent.SynchronousQueue$TransferStack.transfer(SynchronousQueue.java:362)
   [junit4]    >         at java.util.concurrent.SynchronousQueue.poll(SynchronousQueue.java:941)
   [junit4]    >         at java.util.concurrent.ThreadPoolExecutor.getTask(ThreadPoolExecutor.java:1066)
   [junit4]    >         at java.util.concurrent.ThreadPoolExecutor.runWorker(ThreadPoolExecutor.java:1127)
   [junit4]    >         at java.util.concurrent.ThreadPoolExecutor$Worker.run(ThreadPoolExecutor.java:617)
   [junit4]    >         at java.lang.Thread.run(Thread.java:748)
   [junit4]    > 	at __randomizedtesting.SeedInfo.seed([EA28C3D00741F6D0]:0)Throwable #2: com.carrotsearch.randomizedtesting.ThreadLeakError: There are still zombie threads that couldn't be terminated:
   [junit4]    >    1) Thread[id=16970, name=zkCallback-2274-thread-1, state=TIMED_WAITING, group=TGRP-ChaosMonkeyNothingIsSafeTest]
   [junit4]    >         at sun.misc.Unsafe.park(Native Method)
   [junit4]    >         at java.util.concurrent.locks.LockSupport.parkNanos(LockSupport.java:215)
   [junit4]    >         at java.util.concurrent.SynchronousQueue$TransferStack.awaitFulfill(SynchronousQueue.java:460)
   [junit4]    >         at java.util.concurrent.SynchronousQueue$TransferStack.transfer(SynchronousQueue.java:362)
   [junit4]    >         at java.util.concurrent.SynchronousQueue.poll(SynchronousQueue.java:941)
   [junit4]    >         at java.util.concurrent.ThreadPoolExecutor.getTask(ThreadPoolExecutor.java:1066)
   [junit4]    >         at java.util.concurrent.ThreadPoolExecutor.runWorker(ThreadPoolExecutor.java:1127)
   [junit4]    >         at java.util.concurrent.ThreadPoolExecutor$Worker.run(ThreadPoolExecutor.java:617)
   [junit4]    >         at java.lang.Thread.run(Thread.java:748)
   [junit4]    >    2) Thread[id=17106, name=zkCallback-2274-thread-3, state=TIMED_WAITING, group=TGRP-ChaosMonkeyNothingIsSafeTest]
   [junit4]    >         at sun.misc.Unsafe.park(Native Method)
   [junit4]    >         at java.util.concurrent.locks.LockSupport.parkNanos(LockSupport.java:215)
   [junit4]    >         at java.util.concurrent.SynchronousQueue$TransferStack.awaitFulfill(SynchronousQueue.java:460)
   [junit4]    >         at java.util.concurrent.SynchronousQueue$TransferStack.transfer(SynchronousQueue.java:362)
   [junit4]    >         at java.util.concurrent.SynchronousQueue.poll(SynchronousQueue.java:941)
   [junit4]    >         at java.util.concurrent.ThreadPoolExecutor.getTask(ThreadPoolExecutor.java:1066)
   [junit4]    >         at java.util.concurrent.ThreadPoolExecutor.runWorker(ThreadPoolExecutor.java:1127)
   [junit4]    >         at java.util.concurrent.ThreadPoolExecutor$Worker.run(ThreadPoolExecutor.java:617)
   [junit4]    >         at java.lang.Thread.run(Thread.java:748)
   [junit4]    >    3) Thread[id=17109, name=zkCallback-2274-thread-6, state=TIMED_WAITING, group=TGRP-ChaosMonkeyNothingIsSafeTest]
   [junit4]    >         at sun.misc.Unsafe.park(Native Method)
   [junit4]    >         at java.util.concurrent.locks.LockSupport.parkNanos(LockSupport.java:215)
   [junit4]    >         at java.util.concurrent.SynchronousQueue$TransferStack.awaitFulfill(SynchronousQueue.java:460)
   [junit4]    >         at java.util.concurrent.SynchronousQueue$TransferStack.transfer(SynchronousQueue.java:362)
   [junit4]    >         at java.util.concurrent.SynchronousQueue.poll(SynchronousQueue.java:941)
   [junit4]    >         at java.util.concurrent.ThreadPoolExecutor.getTask(ThreadPoolExecutor.java:1066)
   [junit4]    >         at java.util.concurrent.ThreadPoolExecutor.runWorker(ThreadPoolExecutor.java:1127)
   [junit4]    >         at java.util.concurrent.ThreadPoolExecutor$Worker.run(ThreadPoolExecutor.java:617)
   [junit4]    >         at java.lang.Thread.run(Thread.java:748)
   [junit4]    >    4) Thread[id=17105, name=zkCallback-2274-thread-2, state=TIMED_WAITING, group=TGRP-ChaosMonkeyNothingIsSafeTest]
   [junit4]    >         at sun.misc.Unsafe.park(Native Method)
   [junit4]    >         at java.util.concurrent.locks.LockSupport.parkNanos(LockSupport.java:215)
   [junit4]    >         at java.util.concurrent.SynchronousQueue$TransferStack.awaitFulfill(SynchronousQueue.java:460)
   [junit4]    >         at java.util.concurrent.SynchronousQueue$TransferStack.transfer(SynchronousQueue.java:362)
   [junit4]    >         at java.util.concurrent.SynchronousQueue.poll(SynchronousQueue.java:941)
   [junit4]    >         at java.util.concurrent.ThreadPoolExecutor.getTask(ThreadPoolExecutor.java:1066)
   [junit4]    >         at java.util.concurrent.ThreadPoolExecutor.runWorker(ThreadPoolExecutor.java:1127)
   [junit4]    >         at java.util.concurrent.ThreadPoolExecutor$Worker.run(ThreadPoolExecutor.java:617)
   [junit4]    >         at java.lang.Thread.run(Thread.java:748)
   [junit4]    >    5) Thread[id=17108, name=zkCallback-2274-thread-5, state=TIMED_WAITING, group=TGRP-ChaosMonkeyNothingIsSafeTest]
   [junit4]    >         at sun.misc.Unsafe.park(Native Method)
   [junit4]    >         at java.util.concurrent.locks.LockSupport.parkNanos(LockSupport.java:215)
   [junit4]    >         at java.util.concurrent.SynchronousQueue$TransferStack.awaitFulfill(SynchronousQueue.java:460)
   [junit4]    >         at java.util.concurrent.SynchronousQueue$TransferStack.transfer(SynchronousQueue.java:362)
   [junit4]    >         at java.util.concurrent.SynchronousQueue.poll(SynchronousQueue.java:941)
   [junit4]    >         at java.util.concurrent.ThreadPoolExecutor.getTask(ThreadPoolExecutor.java:1066)
   [junit4]    >         at java.util.concurrent.ThreadPoolExecutor.runWorker(ThreadPoolExecutor.java:1127)
   [junit4]    >         at java.util.concurrent.ThreadPoolExecutor$Worker.run(ThreadPoolExecutor.java:617)
   [junit4]    >         at java.lang.Thread.run(Thread.java:748)
   [junit4]    >    6) Thread[id=16968, name=TEST-ChaosMonkeyNothingIsSafeTest.test-seed#[EA28C3D00741F6D0]-SendThread(127.0.0.1:64009), state=RUNNABLE, group=TGRP-ChaosMonkeyNothingIsSafeTest]
   [junit4]    >         at sun.nio.ch.WindowsSelectorImpl$SubSelector.poll0(Native Method)
   [junit4]    >         at sun.nio.ch.WindowsSelectorImpl$SubSelector.poll(WindowsSelectorImpl.java:296)
   [junit4]    >         at sun.nio.ch.WindowsSelectorImpl$SubSelector.access$400(WindowsSelectorImpl.java:278)
   [junit4]    >         at sun.nio.ch.WindowsSelectorImpl.doSelect(WindowsSelectorImpl.java:159)
   [junit4]    >         at sun.nio.ch.SelectorImpl.lockAndDoSelect(SelectorImpl.java:86)
   [junit4]    >         at sun.nio.ch.SelectorImpl.select(SelectorImpl.java:97)
   [junit4]    >         at org.apache.zookeeper.ClientCnxnSocketNIO.doTransport(ClientCnxnSocketNIO.java:349)
   [junit4]    >         at org.apache.zookeeper.ClientCnxn$SendThread.run(ClientCnxn.java:1141)
   [junit4]    >    7) Thread[id=17107, name=zkCallback-2274-thread-4, state=TIMED_WAITING, group=TGRP-ChaosMonkeyNothingIsSafeTest]
   [junit4]    >         at sun.misc.Unsafe.park(Native Method)
   [junit4]    >         at java.util.concurrent.locks.LockSupport.parkNanos(LockSupport.java:215)
   [junit4]    >         at java.util.concurrent.SynchronousQueue$TransferStack.awaitFulfill(SynchronousQueue.java:460)
   [junit4]    >         at java.util.concurrent.SynchronousQueue$TransferStack.transfer(SynchronousQueue.java:362)
   [junit4]    >         at java.util.concurrent.SynchronousQueue.poll(SynchronousQueue.java:941)
   [junit4]    >         at java.util.concurrent.ThreadPoolExecutor.getTask(ThreadPoolExecutor.java:1066)
   [junit4]    >         at java.util.concurrent.ThreadPoolExecutor.runWorker(ThreadPoolExecutor.java:1127)
   [junit4]    >         at java.util.concurrent.ThreadPoolExecutor$Worker.run(ThreadPoolExecutor.java:617)
   [junit4]    >         at java.lang.Thread.run(Thread.java:748)
   [junit4]    > 	at __randomizedtesting.SeedInfo.seed([EA28C3D00741F6D0]:0)
   [junit4] Completed [491/727 (1!)] on J0 in 69.65s, 1 test, 3 errors <<< FAILURES!

[...truncated 40071 lines...]

Mime
View raw message