lucene-dev mailing list archives

Site index · List index
Message view « Date » · « Thread »
Top « Date » · « Thread »
From Policeman Jenkins Server <jenk...@thetaphi.de>
Subject [JENKINS-EA] Lucene-Solr-master-Linux (32bit/jdk-9-ea+175) - Build # 20136 - Failure!
Date Sat, 15 Jul 2017 17:41:37 GMT
Build: https://jenkins.thetaphi.de/job/Lucene-Solr-master-Linux/20136/
Java: 32bit/jdk-9-ea+175 -server -XX:+UseG1GC --illegal-access=deny

1 tests failed.
FAILED:  org.apache.solr.cloud.ChaosMonkeySafeLeaderWithPullReplicasTest.test

Error Message:
Timed out waiting for replica core_node2 (1500139227759) to replicate from leader core_node1 (1500139243738)

Stack Trace:
java.lang.AssertionError: Timed out waiting for replica core_node2 (1500139227759) to replicate from leader core_node1 (1500139243738)
	at __randomizedtesting.SeedInfo.seed([DD6974B43CA6B012:553D4B6E925ADDEA]:0)
	at org.junit.Assert.fail(Assert.java:93)
	at org.apache.solr.cloud.AbstractFullDistribZkTestBase.waitForReplicationFromReplicas(AbstractFullDistribZkTestBase.java:2133)
	at org.apache.solr.cloud.ChaosMonkeySafeLeaderWithPullReplicasTest.test(ChaosMonkeySafeLeaderWithPullReplicasTest.java:209)
	at java.base/jdk.internal.reflect.NativeMethodAccessorImpl.invoke0(Native Method)
	at java.base/jdk.internal.reflect.NativeMethodAccessorImpl.invoke(NativeMethodAccessorImpl.java:62)
	at java.base/jdk.internal.reflect.DelegatingMethodAccessorImpl.invoke(DelegatingMethodAccessorImpl.java:43)
	at java.base/java.lang.reflect.Method.invoke(Method.java:564)
	at com.carrotsearch.randomizedtesting.RandomizedRunner.invoke(RandomizedRunner.java:1713)
	at com.carrotsearch.randomizedtesting.RandomizedRunner$8.evaluate(RandomizedRunner.java:907)
	at com.carrotsearch.randomizedtesting.RandomizedRunner$9.evaluate(RandomizedRunner.java:943)
	at com.carrotsearch.randomizedtesting.RandomizedRunner$10.evaluate(RandomizedRunner.java:957)
	at org.apache.solr.BaseDistributedSearchTestCase$ShardsRepeatRule$ShardsFixedStatement.callStatement(BaseDistributedSearchTestCase.java:985)
	at org.apache.solr.BaseDistributedSearchTestCase$ShardsRepeatRule$ShardsStatement.evaluate(BaseDistributedSearchTestCase.java:960)
	at com.carrotsearch.randomizedtesting.rules.SystemPropertiesRestoreRule$1.evaluate(SystemPropertiesRestoreRule.java:57)
	at org.apache.lucene.util.TestRuleSetupTeardownChained$1.evaluate(TestRuleSetupTeardownChained.java:49)
	at org.apache.lucene.util.AbstractBeforeAfterRule$1.evaluate(AbstractBeforeAfterRule.java:45)
	at org.apache.lucene.util.TestRuleThreadAndTestName$1.evaluate(TestRuleThreadAndTestName.java:48)
	at org.apache.lucene.util.TestRuleIgnoreAfterMaxFailures$1.evaluate(TestRuleIgnoreAfterMaxFailures.java:64)
	at org.apache.lucene.util.TestRuleMarkFailure$1.evaluate(TestRuleMarkFailure.java:47)
	at com.carrotsearch.randomizedtesting.rules.StatementAdapter.evaluate(StatementAdapter.java:36)
	at com.carrotsearch.randomizedtesting.ThreadLeakControl$StatementRunner.run(ThreadLeakControl.java:368)
	at com.carrotsearch.randomizedtesting.ThreadLeakControl.forkTimeoutingTask(ThreadLeakControl.java:817)
	at com.carrotsearch.randomizedtesting.ThreadLeakControl$3.evaluate(ThreadLeakControl.java:468)
	at com.carrotsearch.randomizedtesting.RandomizedRunner.runSingleTest(RandomizedRunner.java:916)
	at com.carrotsearch.randomizedtesting.RandomizedRunner$5.evaluate(RandomizedRunner.java:802)
	at com.carrotsearch.randomizedtesting.RandomizedRunner$6.evaluate(RandomizedRunner.java:852)
	at com.carrotsearch.randomizedtesting.RandomizedRunner$7.evaluate(RandomizedRunner.java:863)
	at com.carrotsearch.randomizedtesting.rules.StatementAdapter.evaluate(StatementAdapter.java:36)
	at com.carrotsearch.randomizedtesting.rules.SystemPropertiesRestoreRule$1.evaluate(SystemPropertiesRestoreRule.java:57)
	at org.apache.lucene.util.AbstractBeforeAfterRule$1.evaluate(AbstractBeforeAfterRule.java:45)
	at com.carrotsearch.randomizedtesting.rules.StatementAdapter.evaluate(StatementAdapter.java:36)
	at org.apache.lucene.util.TestRuleStoreClassName$1.evaluate(TestRuleStoreClassName.java:41)
	at com.carrotsearch.randomizedtesting.rules.NoShadowingOrOverridesOnMethodsRule$1.evaluate(NoShadowingOrOverridesOnMethodsRule.java:40)
	at com.carrotsearch.randomizedtesting.rules.NoShadowingOrOverridesOnMethodsRule$1.evaluate(NoShadowingOrOverridesOnMethodsRule.java:40)
	at com.carrotsearch.randomizedtesting.rules.StatementAdapter.evaluate(StatementAdapter.java:36)
	at com.carrotsearch.randomizedtesting.rules.StatementAdapter.evaluate(StatementAdapter.java:36)
	at org.apache.lucene.util.TestRuleAssertionsRequired$1.evaluate(TestRuleAssertionsRequired.java:53)
	at org.apache.lucene.util.TestRuleMarkFailure$1.evaluate(TestRuleMarkFailure.java:47)
	at org.apache.lucene.util.TestRuleIgnoreAfterMaxFailures$1.evaluate(TestRuleIgnoreAfterMaxFailures.java:64)
	at org.apache.lucene.util.TestRuleIgnoreTestSuites$1.evaluate(TestRuleIgnoreTestSuites.java:54)
	at com.carrotsearch.randomizedtesting.rules.StatementAdapter.evaluate(StatementAdapter.java:36)
	at com.carrotsearch.randomizedtesting.ThreadLeakControl$StatementRunner.run(ThreadLeakControl.java:368)
	at java.base/java.lang.Thread.run(Thread.java:844)




Build Log:
[...truncated 12456 lines...]
   [junit4] Suite: org.apache.solr.cloud.ChaosMonkeySafeLeaderWithPullReplicasTest
   [junit4]   2> Creating dataDir: /home/jenkins/workspace/Lucene-Solr-master-Linux/solr/build/solr-core/test/J2/temp/solr.cloud.ChaosMonkeySafeLeaderWithPullReplicasTest_DD6974B43CA6B012-001/init-core-data-001
   [junit4]   2> 1587607 WARN  (SUITE-ChaosMonkeySafeLeaderWithPullReplicasTest-seed#[DD6974B43CA6B012]-worker) [    ] o.a.s.SolrTestCaseJ4 startTrackingSearchers: numOpens=1 numCloses=1
   [junit4]   2> 1587607 INFO  (SUITE-ChaosMonkeySafeLeaderWithPullReplicasTest-seed#[DD6974B43CA6B012]-worker) [    ] o.a.s.SolrTestCaseJ4 Using TrieFields (NUMERIC_POINTS_SYSPROP=false) w/NUMERIC_DOCVALUES_SYSPROP=false
   [junit4]   2> 1587608 INFO  (SUITE-ChaosMonkeySafeLeaderWithPullReplicasTest-seed#[DD6974B43CA6B012]-worker) [    ] o.a.s.SolrTestCaseJ4 Randomized ssl (true) and clientAuth (true) via: @org.apache.solr.util.RandomizeSSL(reason="", ssl=0.0/0.0, value=0.0/0.0, clientAuth=0.0/0.0)
   [junit4]   2> 1587609 INFO  (SUITE-ChaosMonkeySafeLeaderWithPullReplicasTest-seed#[DD6974B43CA6B012]-worker) [    ] o.a.s.BaseDistributedSearchTestCase Setting hostContext system property: /se/v
   [junit4]   2> 1587609 INFO  (TEST-ChaosMonkeySafeLeaderWithPullReplicasTest.test-seed#[DD6974B43CA6B012]) [    ] o.a.s.c.ChaosMonkeySafeLeaderWithPullReplicasTest Starting ChaosMonkey test with 1 shards and 3 nodes
   [junit4]   2> 1587611 INFO  (TEST-ChaosMonkeySafeLeaderWithPullReplicasTest.test-seed#[DD6974B43CA6B012]) [    ] o.a.s.c.ZkTestServer STARTING ZK TEST SERVER
   [junit4]   2> 1587611 INFO  (Thread-3469) [    ] o.a.s.c.ZkTestServer client port:0.0.0.0/0.0.0.0:0
   [junit4]   2> 1587611 INFO  (Thread-3469) [    ] o.a.s.c.ZkTestServer Starting server
   [junit4]   2> 1587614 ERROR (Thread-3469) [    ] o.a.z.s.ZooKeeperServer ZKShutdownHandler is not registered, so ZooKeeper server won't take any action on ERROR or SHUTDOWN server state changes
   [junit4]   2> 1587711 INFO  (TEST-ChaosMonkeySafeLeaderWithPullReplicasTest.test-seed#[DD6974B43CA6B012]) [    ] o.a.s.c.ZkTestServer start zk server on port:40583
   [junit4]   2> 1587723 INFO  (TEST-ChaosMonkeySafeLeaderWithPullReplicasTest.test-seed#[DD6974B43CA6B012]) [    ] o.a.s.c.AbstractZkTestCase put /home/jenkins/workspace/Lucene-Solr-master-Linux/solr/core/src/test-files/solr/collection1/conf/solrconfig-tlog.xml to /configs/conf1/solrconfig.xml
   [junit4]   2> 1587724 INFO  (TEST-ChaosMonkeySafeLeaderWithPullReplicasTest.test-seed#[DD6974B43CA6B012]) [    ] o.a.s.c.AbstractZkTestCase put /home/jenkins/workspace/Lucene-Solr-master-Linux/solr/core/src/test-files/solr/collection1/conf/schema15.xml to /configs/conf1/schema.xml
   [junit4]   2> 1587726 INFO  (TEST-ChaosMonkeySafeLeaderWithPullReplicasTest.test-seed#[DD6974B43CA6B012]) [    ] o.a.s.c.AbstractZkTestCase put /home/jenkins/workspace/Lucene-Solr-master-Linux/solr/core/src/test-files/solr/collection1/conf/solrconfig.snippet.randomindexconfig.xml to /configs/conf1/solrconfig.snippet.randomindexconfig.xml
   [junit4]   2> 1587727 INFO  (TEST-ChaosMonkeySafeLeaderWithPullReplicasTest.test-seed#[DD6974B43CA6B012]) [    ] o.a.s.c.AbstractZkTestCase put /home/jenkins/workspace/Lucene-Solr-master-Linux/solr/core/src/test-files/solr/collection1/conf/stopwords.txt to /configs/conf1/stopwords.txt
   [junit4]   2> 1587728 INFO  (TEST-ChaosMonkeySafeLeaderWithPullReplicasTest.test-seed#[DD6974B43CA6B012]) [    ] o.a.s.c.AbstractZkTestCase put /home/jenkins/workspace/Lucene-Solr-master-Linux/solr/core/src/test-files/solr/collection1/conf/protwords.txt to /configs/conf1/protwords.txt
   [junit4]   2> 1587729 INFO  (TEST-ChaosMonkeySafeLeaderWithPullReplicasTest.test-seed#[DD6974B43CA6B012]) [    ] o.a.s.c.AbstractZkTestCase put /home/jenkins/workspace/Lucene-Solr-master-Linux/solr/core/src/test-files/solr/collection1/conf/currency.xml to /configs/conf1/currency.xml
   [junit4]   2> 1587730 INFO  (TEST-ChaosMonkeySafeLeaderWithPullReplicasTest.test-seed#[DD6974B43CA6B012]) [    ] o.a.s.c.AbstractZkTestCase put /home/jenkins/workspace/Lucene-Solr-master-Linux/solr/core/src/test-files/solr/collection1/conf/enumsConfig.xml to /configs/conf1/enumsConfig.xml
   [junit4]   2> 1587737 INFO  (TEST-ChaosMonkeySafeLeaderWithPullReplicasTest.test-seed#[DD6974B43CA6B012]) [    ] o.a.s.c.AbstractZkTestCase put /home/jenkins/workspace/Lucene-Solr-master-Linux/solr/core/src/test-files/solr/collection1/conf/open-exchange-rates.json to /configs/conf1/open-exchange-rates.json
   [junit4]   2> 1587738 INFO  (TEST-ChaosMonkeySafeLeaderWithPullReplicasTest.test-seed#[DD6974B43CA6B012]) [    ] o.a.s.c.AbstractZkTestCase put /home/jenkins/workspace/Lucene-Solr-master-Linux/solr/core/src/test-files/solr/collection1/conf/mapping-ISOLatin1Accent.txt to /configs/conf1/mapping-ISOLatin1Accent.txt
   [junit4]   2> 1587739 INFO  (TEST-ChaosMonkeySafeLeaderWithPullReplicasTest.test-seed#[DD6974B43CA6B012]) [    ] o.a.s.c.AbstractZkTestCase put /home/jenkins/workspace/Lucene-Solr-master-Linux/solr/core/src/test-files/solr/collection1/conf/old_synonyms.txt to /configs/conf1/old_synonyms.txt
   [junit4]   2> 1587740 INFO  (TEST-ChaosMonkeySafeLeaderWithPullReplicasTest.test-seed#[DD6974B43CA6B012]) [    ] o.a.s.c.AbstractZkTestCase put /home/jenkins/workspace/Lucene-Solr-master-Linux/solr/core/src/test-files/solr/collection1/conf/synonyms.txt to /configs/conf1/synonyms.txt
   [junit4]   2> 1587746 INFO  (TEST-ChaosMonkeySafeLeaderWithPullReplicasTest.test-seed#[DD6974B43CA6B012]) [    ] o.a.s.c.AbstractFullDistribZkTestBase Will use TLOG replicas unless explicitly asked otherwise
   [junit4]   2> 1587818 INFO  (TEST-ChaosMonkeySafeLeaderWithPullReplicasTest.test-seed#[DD6974B43CA6B012]) [    ] o.e.j.s.Server jetty-9.3.14.v20161028
   [junit4]   2> 1587819 INFO  (TEST-ChaosMonkeySafeLeaderWithPullReplicasTest.test-seed#[DD6974B43CA6B012]) [    ] o.e.j.s.h.ContextHandler Started o.e.j.s.ServletContextHandler@1df6489{/se/v,null,AVAILABLE}
   [junit4]   2> 1587821 INFO  (TEST-ChaosMonkeySafeLeaderWithPullReplicasTest.test-seed#[DD6974B43CA6B012]) [    ] o.e.j.s.AbstractConnector Started ServerConnector@2cc603{SSL,[ssl, http/1.1]}{127.0.0.1:42709}
   [junit4]   2> 1587821 INFO  (TEST-ChaosMonkeySafeLeaderWithPullReplicasTest.test-seed#[DD6974B43CA6B012]) [    ] o.e.j.s.Server Started @1588797ms
   [junit4]   2> 1587821 INFO  (TEST-ChaosMonkeySafeLeaderWithPullReplicasTest.test-seed#[DD6974B43CA6B012]) [    ] o.a.s.c.s.e.JettySolrRunner Jetty properties: {hostContext=/se/v, solr.data.dir=/home/jenkins/workspace/Lucene-Solr-master-Linux/solr/build/solr-core/test/J2/temp/solr.cloud.ChaosMonkeySafeLeaderWithPullReplicasTest_DD6974B43CA6B012-001/tempDir-001/control/data, hostPort=42709, coreRootDirectory=/home/jenkins/workspace/Lucene-Solr-master-Linux/solr/build/solr-core/test/J2/../../../../../../../../../home/jenkins/workspace/Lucene-Solr-master-Linux/solr/build/solr-core/test/J2/temp/solr.cloud.ChaosMonkeySafeLeaderWithPullReplicasTest_DD6974B43CA6B012-001/control-001/cores}
   [junit4]   2> 1587821 ERROR (TEST-ChaosMonkeySafeLeaderWithPullReplicasTest.test-seed#[DD6974B43CA6B012]) [    ] o.a.s.s.StartupLoggingUtils Missing Java Option solr.log.dir. Logging may be missing or incomplete.
   [junit4]   2> 1587821 INFO  (TEST-ChaosMonkeySafeLeaderWithPullReplicasTest.test-seed#[DD6974B43CA6B012]) [    ] o.a.s.s.SolrDispatchFilter  ___      _       Welcome to Apache Solr™ version 8.0.0
   [junit4]   2> 1587821 INFO  (TEST-ChaosMonkeySafeLeaderWithPullReplicasTest.test-seed#[DD6974B43CA6B012]) [    ] o.a.s.s.SolrDispatchFilter / __| ___| |_ _   Starting in cloud mode on port null
   [junit4]   2> 1587821 INFO  (TEST-ChaosMonkeySafeLeaderWithPullReplicasTest.test-seed#[DD6974B43CA6B012]) [    ] o.a.s.s.SolrDispatchFilter \__ \/ _ \ | '_|  Install dir: null, Default config dir: null
   [junit4]   2> 1587821 INFO  (TEST-ChaosMonkeySafeLeaderWithPullReplicasTest.test-seed#[DD6974B43CA6B012]) [    ] o.a.s.s.SolrDispatchFilter |___/\___/_|_|    Start time: 2017-07-15T17:20:15.727791Z
   [junit4]   2> 1587823 INFO  (TEST-ChaosMonkeySafeLeaderWithPullReplicasTest.test-seed#[DD6974B43CA6B012]) [    ] o.a.s.s.SolrDispatchFilter Loading solr.xml from SolrHome (not found in ZooKeeper)
   [junit4]   2> 1587823 INFO  (TEST-ChaosMonkeySafeLeaderWithPullReplicasTest.test-seed#[DD6974B43CA6B012]) [    ] o.a.s.c.SolrXmlConfig Loading container configuration from /home/jenkins/workspace/Lucene-Solr-master-Linux/solr/build/solr-core/test/J2/temp/solr.cloud.ChaosMonkeySafeLeaderWithPullReplicasTest_DD6974B43CA6B012-001/control-001/solr.xml
   [junit4]   2> 1587824 INFO  (TEST-ChaosMonkeySafeLeaderWithPullReplicasTest.test-seed#[DD6974B43CA6B012]) [    ] o.a.s.c.SolrXmlConfig MBean server found: com.sun.jmx.mbeanserver.JmxMBeanServer@1418a7, but no JMX reporters were configured - adding default JMX reporter.
   [junit4]   2> 1587826 INFO  (TEST-ChaosMonkeySafeLeaderWithPullReplicasTest.test-seed#[DD6974B43CA6B012]) [    ] o.a.s.c.ZkContainer Zookeeper client=127.0.0.1:40583/solr
   [junit4]   2> 1587854 INFO  (TEST-ChaosMonkeySafeLeaderWithPullReplicasTest.test-seed#[DD6974B43CA6B012]) [    ] o.a.s.c.Overseer Overseer (id=null) closing
   [junit4]   2> 1587855 INFO  (TEST-ChaosMonkeySafeLeaderWithPullReplicasTest.test-seed#[DD6974B43CA6B012]) [    ] o.a.s.c.OverseerElectionContext I am going to be the leader 127.0.0.1:42709_se%2Fv
   [junit4]   2> 1587855 INFO  (TEST-ChaosMonkeySafeLeaderWithPullReplicasTest.test-seed#[DD6974B43CA6B012]) [    ] o.a.s.c.Overseer Overseer (id=98313123628187653-127.0.0.1:42709_se%2Fv-n_0000000000) starting
   [junit4]   2> 1587857 INFO  (TEST-ChaosMonkeySafeLeaderWithPullReplicasTest.test-seed#[DD6974B43CA6B012]) [    ] o.a.s.c.ZkController Register node as live in ZooKeeper:/live_nodes/127.0.0.1:42709_se%2Fv
   [junit4]   2> 1587857 INFO  (zkCallback-2418-thread-1) [    ] o.a.s.c.c.ZkStateReader Updated live nodes from ZooKeeper... (0) -> (1)
   [junit4]   2> 1587897 INFO  (TEST-ChaosMonkeySafeLeaderWithPullReplicasTest.test-seed#[DD6974B43CA6B012]) [    ] o.a.s.m.r.SolrJmxReporter JMX monitoring for 'solr.node' (registry 'solr.node') enabled at server: com.sun.jmx.mbeanserver.JmxMBeanServer@1418a7
   [junit4]   2> 1587900 INFO  (TEST-ChaosMonkeySafeLeaderWithPullReplicasTest.test-seed#[DD6974B43CA6B012]) [    ] o.a.s.m.r.SolrJmxReporter JMX monitoring for 'solr.jvm' (registry 'solr.jvm') enabled at server: com.sun.jmx.mbeanserver.JmxMBeanServer@1418a7
   [junit4]   2> 1587900 INFO  (TEST-ChaosMonkeySafeLeaderWithPullReplicasTest.test-seed#[DD6974B43CA6B012]) [    ] o.a.s.m.r.SolrJmxReporter JMX monitoring for 'solr.jetty' (registry 'solr.jetty') enabled at server: com.sun.jmx.mbeanserver.JmxMBeanServer@1418a7
   [junit4]   2> 1587901 INFO  (TEST-ChaosMonkeySafeLeaderWithPullReplicasTest.test-seed#[DD6974B43CA6B012]) [    ] o.a.s.c.CorePropertiesLocator Found 0 core definitions underneath /home/jenkins/workspace/Lucene-Solr-master-Linux/solr/build/solr-core/test/J2/../../../../../../../../../home/jenkins/workspace/Lucene-Solr-master-Linux/solr/build/solr-core/test/J2/temp/solr.cloud.ChaosMonkeySafeLeaderWithPullReplicasTest_DD6974B43CA6B012-001/control-001/cores
   [junit4]   2> 1587911 INFO  (TEST-ChaosMonkeySafeLeaderWithPullReplicasTest.test-seed#[DD6974B43CA6B012]) [    ] o.a.s.c.c.ZkStateReader Updated live nodes from ZooKeeper... (0) -> (1)
   [junit4]   2> 1587911 INFO  (TEST-ChaosMonkeySafeLeaderWithPullReplicasTest.test-seed#[DD6974B43CA6B012]) [    ] o.a.s.c.s.i.ZkClientClusterStateProvider Cluster at 127.0.0.1:40583/solr ready
   [junit4]   2> 1587940 INFO  (qtp1153753-15270) [    ] o.a.s.h.a.CollectionsHandler Invoked Collection Action :create with params replicationFactor=1&collection.configName=conf1&name=control_collection&nrtReplicas=1&action=CREATE&numShards=1&createNodeSet=127.0.0.1:42709_se%252Fv&wt=javabin&version=2 and sendToOCPQueue=true
   [junit4]   2> 1587941 INFO  (OverseerThreadFactory-7483-thread-1) [    ] o.a.s.c.CreateCollectionCmd Create collection control_collection
   [junit4]   2> 1588047 INFO  (qtp1153753-15277) [    ] o.a.s.h.a.CoreAdminOperation core create command qt=/admin/cores&collection.configName=conf1&newCollection=true&name=control_collection_shard1_replica_n1&action=CREATE&numShards=1&collection=control_collection&shard=shard1&wt=javabin&version=2&replicaType=NRT
   [junit4]   2> 1588048 INFO  (qtp1153753-15277) [    ] o.a.s.c.TransientSolrCoreCacheDefault Allocating transient cache for 4 transient cores
   [junit4]   2> 1588151 INFO  (zkCallback-2418-thread-1) [    ] o.a.s.c.c.ZkStateReader A cluster state change: [WatchedEvent state:SyncConnected type:NodeDataChanged path:/collections/control_collection/state.json] for collection [control_collection] has occurred - updating... (live nodes size: [1])
   [junit4]   2> 1589055 INFO  (qtp1153753-15277) [    ] o.a.s.c.SolrConfig Using Lucene MatchVersion: 8.0.0
   [junit4]   2> 1589063 INFO  (qtp1153753-15277) [    ] o.a.s.s.IndexSchema [control_collection_shard1_replica_n1] Schema name=test
   [junit4]   2> 1589106 INFO  (qtp1153753-15277) [    ] o.a.s.s.IndexSchema Loaded schema test/1.6 with uniqueid field id
   [junit4]   2> 1589119 INFO  (qtp1153753-15277) [    ] o.a.s.c.CoreContainer Creating SolrCore 'control_collection_shard1_replica_n1' using configuration from collection control_collection, trusted=true
   [junit4]   2> 1589119 INFO  (qtp1153753-15277) [    ] o.a.s.m.r.SolrJmxReporter JMX monitoring for 'solr.core.control_collection.shard1.replica_n1' (registry 'solr.core.control_collection.shard1.replica_n1') enabled at server: com.sun.jmx.mbeanserver.JmxMBeanServer@1418a7
   [junit4]   2> 1589119 INFO  (qtp1153753-15277) [    ] o.a.s.c.SolrCore solr.RecoveryStrategy.Builder
   [junit4]   2> 1589120 INFO  (qtp1153753-15277) [    ] o.a.s.c.SolrCore [[control_collection_shard1_replica_n1] ] Opening new SolrCore at [/home/jenkins/workspace/Lucene-Solr-master-Linux/solr/build/solr-core/test/J2/temp/solr.cloud.ChaosMonkeySafeLeaderWithPullReplicasTest_DD6974B43CA6B012-001/control-001/cores/control_collection_shard1_replica_n1], dataDir=[/home/jenkins/workspace/Lucene-Solr-master-Linux/solr/build/solr-core/test/J2/../../../../../../../../../home/jenkins/workspace/Lucene-Solr-master-Linux/solr/build/solr-core/test/J2/temp/solr.cloud.ChaosMonkeySafeLeaderWithPullReplicasTest_DD6974B43CA6B012-001/control-001/cores/control_collection_shard1_replica_n1/data/]
   [junit4]   2> 1589122 INFO  (qtp1153753-15277) [    ] o.a.s.u.RandomMergePolicy RandomMergePolicy wrapping class org.apache.lucene.index.TieredMergePolicy: [TieredMergePolicy: maxMergeAtOnce=10, maxMergeAtOnceExplicit=10, maxMergedSegmentMB=2.728515625, floorSegmentMB=1.0537109375, forceMergeDeletesPctAllowed=9.49150832494291, segmentsPerTier=29.0, maxCFSSegmentSizeMB=8.796093022207999E12, noCFSRatio=1.0
   [junit4]   2> 1589157 WARN  (qtp1153753-15277) [    ] o.a.s.c.RequestHandlers INVALID paramSet a in requestHandler {type = requestHandler,name = /dump,class = DumpRequestHandler,attributes = {initParams=a, name=/dump, class=DumpRequestHandler},args = {defaults={a=A,b=B}}}
   [junit4]   2> 1589200 INFO  (qtp1153753-15277) [    ] o.a.s.u.UpdateHandler Using UpdateLog implementation: org.apache.solr.update.UpdateLog
   [junit4]   2> 1589200 INFO  (qtp1153753-15277) [    ] o.a.s.u.UpdateLog Initializing UpdateLog: dataDir= defaultSyncLevel=FLUSH numRecordsToKeep=100 maxNumLogsToKeep=10 numVersionBuckets=65536
   [junit4]   2> 1589201 INFO  (qtp1153753-15277) [    ] o.a.s.u.CommitTracker Hard AutoCommit: if uncommited for 15000ms; 
   [junit4]   2> 1589202 INFO  (qtp1153753-15277) [    ] o.a.s.u.CommitTracker Soft AutoCommit: disabled
   [junit4]   2> 1589203 INFO  (qtp1153753-15277) [    ] o.a.s.u.RandomMergePolicy RandomMergePolicy wrapping class org.apache.lucene.index.TieredMergePolicy: [TieredMergePolicy: maxMergeAtOnce=37, maxMergeAtOnceExplicit=49, maxMergedSegmentMB=39.982421875, floorSegmentMB=0.7265625, forceMergeDeletesPctAllowed=3.977644137257724, segmentsPerTier=33.0, maxCFSSegmentSizeMB=8.796093022207999E12, noCFSRatio=0.5811959463862607
   [junit4]   2> 1589203 INFO  (qtp1153753-15277) [    ] o.a.s.s.SolrIndexSearcher Opening [Searcher@1eea3c1[control_collection_shard1_replica_n1] main]
   [junit4]   2> 1589208 INFO  (qtp1153753-15277) [    ] o.a.s.r.ManagedResourceStorage Configured ZooKeeperStorageIO with znodeBase: /configs/conf1
   [junit4]   2> 1589208 INFO  (qtp1153753-15277) [    ] o.a.s.r.ManagedResourceStorage Loaded null at path _rest_managed.json using ZooKeeperStorageIO:path=/configs/conf1
   [junit4]   2> 1589209 INFO  (qtp1153753-15277) [    ] o.a.s.h.ReplicationHandler Commits will be reserved for  10000
   [junit4]   2> 1589210 INFO  (searcherExecutor-7486-thread-1) [    ] o.a.s.c.SolrCore [control_collection_shard1_replica_n1] Registered new searcher Searcher@1eea3c1[control_collection_shard1_replica_n1] main{ExitableDirectoryReader(UninvertingDirectoryReader())}
   [junit4]   2> 1589210 INFO  (qtp1153753-15277) [    ] o.a.s.u.UpdateLog Could not find max version in index or recent updates, using new clock 1573009979726626816
   [junit4]   2> 1589213 INFO  (qtp1153753-15277) [    ] o.a.s.c.ShardLeaderElectionContext Enough replicas found to continue.
   [junit4]   2> 1589213 INFO  (qtp1153753-15277) [    ] o.a.s.c.ShardLeaderElectionContext I may be the new leader - try and sync
   [junit4]   2> 1589213 INFO  (qtp1153753-15277) [    ] o.a.s.c.SyncStrategy Sync replicas to https://127.0.0.1:42709/se/v/control_collection_shard1_replica_n1/
   [junit4]   2> 1589213 INFO  (qtp1153753-15277) [    ] o.a.s.c.SyncStrategy Sync Success - now sync replicas to me
   [junit4]   2> 1589213 INFO  (qtp1153753-15277) [    ] o.a.s.c.SyncStrategy https://127.0.0.1:42709/se/v/control_collection_shard1_replica_n1/ has no replicas
   [junit4]   2> 1589213 INFO  (qtp1153753-15277) [    ] o.a.s.c.ShardLeaderElectionContext Found all replicas participating in election, clear LIR
   [junit4]   2> 1589214 INFO  (qtp1153753-15277) [    ] o.a.s.c.ShardLeaderElectionContext I am the new leader: https://127.0.0.1:42709/se/v/control_collection_shard1_replica_n1/ shard1
   [junit4]   2> 1589316 INFO  (zkCallback-2418-thread-1) [    ] o.a.s.c.c.ZkStateReader A cluster state change: [WatchedEvent state:SyncConnected type:NodeDataChanged path:/collections/control_collection/state.json] for collection [control_collection] has occurred - updating... (live nodes size: [1])
   [junit4]   2> 1589365 INFO  (qtp1153753-15277) [    ] o.a.s.c.ZkController I am the leader, no recovery necessary
   [junit4]   2> 1589368 INFO  (qtp1153753-15277) [    ] o.a.s.s.HttpSolrCall [admin] webapp=null path=/admin/cores params={qt=/admin/cores&collection.configName=conf1&newCollection=true&name=control_collection_shard1_replica_n1&action=CREATE&numShards=1&collection=control_collection&shard=shard1&wt=javabin&version=2&replicaType=NRT} status=0 QTime=1320
   [junit4]   2> 1589369 INFO  (qtp1153753-15270) [    ] o.a.s.h.a.CollectionsHandler Wait for new collection to be active for at most 30 seconds. Check all shard replicas
   [junit4]   2> 1589467 INFO  (zkCallback-2418-thread-1) [    ] o.a.s.c.c.ZkStateReader A cluster state change: [WatchedEvent state:SyncConnected type:NodeDataChanged path:/collections/control_collection/state.json] for collection [control_collection] has occurred - updating... (live nodes size: [1])
   [junit4]   2> 1589942 INFO  (OverseerCollectionConfigSetProcessor-98313123628187653-127.0.0.1:42709_se%2Fv-n_0000000000) [    ] o.a.s.c.OverseerTaskQueue Response ZK path: /overseer/collection-queue-work/qnr-0000000000 doesn't exist.  Requestor may have disconnected from ZooKeeper
   [junit4]   2> 1590369 INFO  (qtp1153753-15270) [    ] o.a.s.s.HttpSolrCall [admin] webapp=null path=/admin/collections params={replicationFactor=1&collection.configName=conf1&name=control_collection&nrtReplicas=1&action=CREATE&numShards=1&createNodeSet=127.0.0.1:42709_se%252Fv&wt=javabin&version=2} status=0 QTime=2429
   [junit4]   2> 1590376 INFO  (TEST-ChaosMonkeySafeLeaderWithPullReplicasTest.test-seed#[DD6974B43CA6B012]) [    ] o.a.s.c.c.ZkStateReader Updated live nodes from ZooKeeper... (0) -> (1)
   [junit4]   2> 1590377 INFO  (TEST-ChaosMonkeySafeLeaderWithPullReplicasTest.test-seed#[DD6974B43CA6B012]) [    ] o.a.s.c.s.i.ZkClientClusterStateProvider Cluster at 127.0.0.1:40583/solr ready
   [junit4]   2> 1590377 INFO  (TEST-ChaosMonkeySafeLeaderWithPullReplicasTest.test-seed#[DD6974B43CA6B012]) [    ] o.a.s.c.ChaosMonkey monkey: init - expire sessions:false cause connection loss:false
   [junit4]   2> 1590380 INFO  (qtp1153753-15275) [    ] o.a.s.h.a.CollectionsHandler Invoked Collection Action :create with params replicationFactor=1&collection.configName=conf1&name=collection1&nrtReplicas=1&action=CREATE&numShards=1&createNodeSet=&stateFormat=1&wt=javabin&version=2 and sendToOCPQueue=true
   [junit4]   2> 1590382 INFO  (OverseerThreadFactory-7483-thread-2) [    ] o.a.s.c.CreateCollectionCmd Create collection collection1
   [junit4]   2> 1590383 WARN  (OverseerThreadFactory-7483-thread-2) [    ] o.a.s.c.CreateCollectionCmd It is unusual to create a collection (collection1) without cores.
   [junit4]   2> 1590586 INFO  (qtp1153753-15275) [    ] o.a.s.h.a.CollectionsHandler Wait for new collection to be active for at most 30 seconds. Check all shard replicas
   [junit4]   2> 1590586 INFO  (qtp1153753-15275) [    ] o.a.s.s.HttpSolrCall [admin] webapp=null path=/admin/collections params={replicationFactor=1&collection.configName=conf1&name=collection1&nrtReplicas=1&action=CREATE&numShards=1&createNodeSet=&stateFormat=1&wt=javabin&version=2} status=0 QTime=206
   [junit4]   2> 1590673 INFO  (TEST-ChaosMonkeySafeLeaderWithPullReplicasTest.test-seed#[DD6974B43CA6B012]) [    ] o.a.s.c.AbstractFullDistribZkTestBase create jetty 1 in directory /home/jenkins/workspace/Lucene-Solr-master-Linux/solr/build/solr-core/test/J2/temp/solr.cloud.ChaosMonkeySafeLeaderWithPullReplicasTest_DD6974B43CA6B012-001/shard-1-001 of type TLOG
   [junit4]   2> 1590673 INFO  (TEST-ChaosMonkeySafeLeaderWithPullReplicasTest.test-seed#[DD6974B43CA6B012]) [    ] o.e.j.s.Server jetty-9.3.14.v20161028
   [junit4]   2> 1590674 INFO  (TEST-ChaosMonkeySafeLeaderWithPullReplicasTest.test-seed#[DD6974B43CA6B012]) [    ] o.e.j.s.h.ContextHandler Started o.e.j.s.ServletContextHandler@4f59a{/se/v,null,AVAILABLE}
   [junit4]   2> 1590674 INFO  (TEST-ChaosMonkeySafeLeaderWithPullReplicasTest.test-seed#[DD6974B43CA6B012]) [    ] o.e.j.s.AbstractConnector Started ServerConnector@51ab59{SSL,[ssl, http/1.1]}{127.0.0.1:36441}
   [junit4]   2> 1590674 INFO  (TEST-ChaosMonkeySafeLeaderWithPullReplicasTest.test-seed#[DD6974B43CA6B012]) [    ] o.e.j.s.Server Started @1591651ms
   [junit4]   2> 1590675 INFO  (TEST-ChaosMonkeySafeLeaderWithPullReplicasTest.test-seed#[DD6974B43CA6B012]) [    ] o.a.s.c.s.e.JettySolrRunner Jetty properties: {hostContext=/se/v, solrconfig=solrconfig.xml, solr.data.dir=/home/jenkins/workspace/Lucene-Solr-master-Linux/solr/build/solr-core/test/J2/temp/solr.cloud.ChaosMonkeySafeLeaderWithPullReplicasTest_DD6974B43CA6B012-001/tempDir-001/jetty1, hostPort=36441, coreRootDirectory=/home/jenkins/workspace/Lucene-Solr-master-Linux/solr/build/solr-core/test/J2/../../../../../../../../../home/jenkins/workspace/Lucene-Solr-master-Linux/solr/build/solr-core/test/J2/temp/solr.cloud.ChaosMonkeySafeLeaderWithPullReplicasTest_DD6974B43CA6B012-001/shard-1-001/cores, replicaType=TLOG}
   [junit4]   2> 1590675 ERROR (TEST-ChaosMonkeySafeLeaderWithPullReplicasTest.test-seed#[DD6974B43CA6B012]) [    ] o.a.s.s.StartupLoggingUtils Missing Java Option solr.log.dir. Logging may be missing or incomplete.
   [junit4]   2> 1590675 INFO  (TEST-ChaosMonkeySafeLeaderWithPullReplicasTest.test-seed#[DD6974B43CA6B012]) [    ] o.a.s.s.SolrDispatchFilter  ___      _       Welcome to Apache Solr™ version 8.0.0
   [junit4]   2> 1590675 INFO  (TEST-ChaosMonkeySafeLeaderWithPullReplicasTest.test-seed#[DD6974B43CA6B012]) [    ] o.a.s.s.SolrDispatchFilter / __| ___| |_ _   Starting in cloud mode on port null
   [junit4]   2> 1590675 INFO  (TEST-ChaosMonkeySafeLeaderWithPullReplicasTest.test-seed#[DD6974B43CA6B012]) [    ] o.a.s.s.SolrDispatchFilter \__ \/ _ \ | '_|  Install dir: null, Default config dir: null
   [junit4]   2> 1590675 INFO  (TEST-ChaosMonkeySafeLeaderWithPullReplicasTest.test-seed#[DD6974B43CA6B012]) [    ] o.a.s.s.SolrDispatchFilter |___/\___/_|_|    Start time: 2017-07-15T17:20:18.581517Z
   [junit4]   2> 1590677 INFO  (TEST-ChaosMonkeySafeLeaderWithPullReplicasTest.test-seed#[DD6974B43CA6B012]) [    ] o.a.s.s.SolrDispatchFilter Loading solr.xml from SolrHome (not found in ZooKeeper)
   [junit4]   2> 1590677 INFO  (TEST-ChaosMonkeySafeLeaderWithPullReplicasTest.test-seed#[DD6974B43CA6B012]) [    ] o.a.s.c.SolrXmlConfig Loading container configuration from /home/jenkins/workspace/Lucene-Solr-master-Linux/solr/build/solr-core/test/J2/temp/solr.cloud.ChaosMonkeySafeLeaderWithPullReplicasTest_DD6974B43CA6B012-001/shard-1-001/solr.xml
   [junit4]   2> 1590679 INFO  (TEST-ChaosMonkeySafeLeaderWithPullReplicasTest.test-seed#[DD6974B43CA6B012]) [    ] o.a.s.c.SolrXmlConfig MBean server found: com.sun.jmx.mbeanserver.JmxMBeanServer@1418a7, but no JMX reporters were configured - adding default JMX reporter.
   [junit4]   2> 1590681 INFO  (TEST-ChaosMonkeySafeLeaderWithPullReplicasTest.test-seed#[DD6974B43CA6B012]) [    ] o.a.s.c.ZkContainer Zookeeper client=127.0.0.1:40583/solr
   [junit4]   2> 1590685 INFO  (TEST-ChaosMonkeySafeLeaderWithPullReplicasTest.test-seed#[DD6974B43CA6B012]) [    ] o.a.s.c.c.ZkStateReader Updated live nodes from ZooKeeper... (0) -> (1)
   [junit4]   2> 1590685 INFO  (TEST-ChaosMonkeySafeLeaderWithPullReplicasTest.test-seed#[DD6974B43CA6B012]) [    ] o.a.s.c.Overseer Overseer (id=null) closing
   [junit4]   2> 1590686 INFO  (TEST-ChaosMonkeySafeLeaderWithPullReplicasTest.test-seed#[DD6974B43CA6B012]) [    ] o.a.s.c.ZkController Register node as live in ZooKeeper:/live_nodes/127.0.0.1:36441_se%2Fv
   [junit4]   2> 1590686 INFO  (zkCallback-2425-thread-1) [    ] o.a.s.c.c.ZkStateReader Updated live nodes from ZooKeeper... (1) -> (2)
   [junit4]   2> 1590686 INFO  (zkCallback-2418-thread-1) [    ] o.a.s.c.c.ZkStateReader Updated live nodes from ZooKeeper... (1) -> (2)
   [junit4]   2> 1590686 INFO  (zkCallback-2430-thread-1) [    ] o.a.s.c.c.ZkStateReader Updated live nodes from ZooKeeper... (1) -> (2)
   [junit4]   2> 1590789 INFO  (TEST-ChaosMonkeySafeLeaderWithPullReplicasTest.test-seed#[DD6974B43CA6B012]) [    ] o.a.s.m.r.SolrJmxReporter JMX monitoring for 'solr.node' (registry 'solr.node') enabled at server: com.sun.jmx.mbeanserver.JmxMBeanServer@1418a7
   [junit4]   2> 1590793 INFO  (TEST-ChaosMonkeySafeLeaderWithPullReplicasTest.test-seed#[DD6974B43CA6B012]) [    ] o.a.s.m.r.SolrJmxReporter JMX monitoring for 'solr.jvm' (registry 'solr.jvm') enabled at server: com.sun.jmx.mbeanserver.JmxMBeanServer@1418a7
   [junit4]   2> 1590793 INFO  (TEST-ChaosMonkeySafeLeaderWithPullReplicasTest.test-seed#[DD6974B43CA6B012]) [    ] o.a.s.m.r.SolrJmxReporter JMX monitoring for 'solr.jetty' (registry 'solr.jetty') enabled at server: com.sun.jmx.mbeanserver.JmxMBeanServer@1418a7
   [junit4]   2> 1590794 INFO  (TEST-ChaosMonkeySafeLeaderWithPullReplicasTest.test-seed#[DD6974B43CA6B012]) [    ] o.a.s.c.CorePropertiesLocator Found 0 core definitions underneath /home/jenkins/workspace/Lucene-Solr-master-Linux/solr/build/solr-core/test/J2/../../../../../../../../../home/jenkins/workspace/Lucene-Solr-master-Linux/solr/build/solr-core/test/J2/temp/solr.cloud.ChaosMonkeySafeLeaderWithPullReplicasTest_DD6974B43CA6B012-001/shard-1-001/cores
   [junit4]   2> 1590806 INFO  (qtp1153753-15277) [    ] o.a.s.h.a.CollectionsHandler Invoked Collection Action :addreplica with params node=127.0.0.1:36441_se%252Fv&action=ADDREPLICA&collection=collection1&shard=shard1&type=TLOG&wt=javabin&version=2 and sendToOCPQueue=true
   [junit4]   2> 1590808 INFO  (OverseerCollectionConfigSetProcessor-98313123628187653-127.0.0.1:42709_se%2Fv-n_0000000000) [    ] o.a.s.c.OverseerTaskQueue Response ZK path: /overseer/collection-queue-work/qnr-0000000002 doesn't exist.  Requestor may have disconnected from ZooKeeper
   [junit4]   2> 1590808 INFO  (OverseerThreadFactory-7483-thread-3) [    ] o.a.s.c.AddReplicaCmd Node Identified 127.0.0.1:36441_se%2Fv for creating new replica
   [junit4]   2> 1590836 INFO  (qtp19653279-15311) [    ] o.a.s.h.a.CoreAdminOperation core create command qt=/admin/cores&collection.configName=conf1&name=collection1_shard1_replica_t0&action=CREATE&collection=collection1&shard=shard1&wt=javabin&version=2&replicaType=TLOG
   [junit4]   2> 1590836 INFO  (qtp19653279-15311) [    ] o.a.s.c.TransientSolrCoreCacheDefault Allocating transient cache for 4 transient cores
   [junit4]   2> 1591847 INFO  (qtp19653279-15311) [    ] o.a.s.c.SolrConfig Using Lucene MatchVersion: 8.0.0
   [junit4]   2> 1591856 INFO  (qtp19653279-15311) [    ] o.a.s.s.IndexSchema [collection1_shard1_replica_t0] Schema name=test
   [junit4]   2> 1591899 INFO  (qtp19653279-15311) [    ] o.a.s.s.IndexSchema Loaded schema test/1.6 with uniqueid field id
   [junit4]   2> 1591905 INFO  (qtp19653279-15311) [    ] o.a.s.c.CoreContainer Creating SolrCore 'collection1_shard1_replica_t0' using configuration from collection collection1, trusted=true
   [junit4]   2> 1591905 INFO  (qtp19653279-15311) [    ] o.a.s.m.r.SolrJmxReporter JMX monitoring for 'solr.core.collection1.shard1.replica_t0' (registry 'solr.core.collection1.shard1.replica_t0') enabled at server: com.sun.jmx.mbeanserver.JmxMBeanServer@1418a7
   [junit4]   2> 1591905 INFO  (qtp19653279-15311) [    ] o.a.s.c.SolrCore solr.RecoveryStrategy.Builder
   [junit4]   2> 1591905 INFO  (qtp19653279-15311) [    ] o.a.s.c.SolrCore [[collection1_shard1_replica_t0] ] Opening new SolrCore at [/home/jenkins/workspace/Lucene-Solr-master-Linux/solr/build/solr-core/test/J2/temp/solr.cloud.ChaosMonkeySafeLeaderWithPullReplicasTest_DD6974B43CA6B012-001/shard-1-001/cores/collection1_shard1_replica_t0], dataDir=[/home/jenkins/workspace/Lucene-Solr-master-Linux/solr/build/solr-core/test/J2/../../../../../../../../../home/jenkins/workspace/Lucene-Solr-master-Linux/solr/build/solr-core/test/J2/temp/solr.cloud.ChaosMonkeySafeLeaderWithPullReplicasTest_DD6974B43CA6B012-001/shard-1-001/cores/collection1_shard1_replica_t0/data/]
   [junit4]   2> 1591908 INFO  (qtp19653279-15311) [    ] o.a.s.u.RandomMergePolicy RandomMergePolicy wrapping class org.apache.lucene.index.TieredMergePolicy: [TieredMergePolicy: maxMergeAtOnce=10, maxMergeAtOnceExplicit=10, maxMergedSegmentMB=2.728515625, floorSegmentMB=1.0537109375, forceMergeDeletesPctAllowed=9.49150832494291, segmentsPerTier=29.0, maxCFSSegmentSizeMB=8.796093022207999E12, noCFSRatio=1.0
   [junit4]   2> 1591928 WARN  (qtp19653279-15311) [    ] o.a.s.c.RequestHandlers INVALID paramSet a in requestHandler {type = requestHandler,name = /dump,class = DumpRequestHandler,attributes = {initParams=a, name=/dump, class=DumpRequestHandler},args = {defaults={a=A,b=B}}}
   [junit4]   2> 1591965 INFO  (qtp19653279-15311) [    ] o.a.s.u.UpdateHandler Using UpdateLog implementation: org.apache.solr.update.UpdateLog
   [junit4]   2> 1591965 INFO  (qtp19653279-15311) [    ] o.a.s.u.UpdateLog Initializing UpdateLog: dataDir= defaultSyncLevel=FLUSH numRecordsToKeep=100 maxNumLogsToKeep=10 numVersionBuckets=65536
   [junit4]   2> 1591966 INFO  (qtp19653279-15311) [    ] o.a.s.u.CommitTracker Hard AutoCommit: if uncommited for 15000ms; 
   [junit4]   2> 1591966 INFO  (qtp19653279-15311) [    ] o.a.s.u.CommitTracker Soft AutoCommit: disabled
   [junit4]   2> 1591967 INFO  (qtp19653279-15311) [    ] o.a.s.u.RandomMergePolicy RandomMergePolicy wrapping class org.apache.lucene.index.TieredMergePolicy: [TieredMergePolicy: maxMergeAtOnce=37, maxMergeAtOnceExplicit=49, maxMergedSegmentMB=39.982421875, floorSegmentMB=0.7265625, forceMergeDeletesPctAllowed=3.977644137257724, segmentsPerTier=33.0, maxCFSSegmentSizeMB=8.796093022207999E12, noCFSRatio=0.5811959463862607
   [junit4]   2> 1591967 INFO  (qtp19653279-15311) [    ] o.a.s.s.SolrIndexSearcher Opening [Searcher@5aa802[collection1_shard1_replica_t0] main]
   [junit4]   2> 1591968 INFO  (qtp19653279-15311) [    ] o.a.s.r.ManagedResourceStorage Configured ZooKeeperStorageIO with znodeBase: /configs/conf1
   [junit4]   2> 1591968 INFO  (qtp19653279-15311) [    ] o.a.s.r.ManagedResourceStorage Loaded null at path _rest_managed.json using ZooKeeperStorageIO:path=/configs/conf1
   [junit4]   2> 1591969 INFO  (qtp19653279-15311) [    ] o.a.s.h.ReplicationHandler Commits will be reserved for  10000
   [junit4]   2> 1591970 INFO  (searcherExecutor-7497-thread-1) [    ] o.a.s.c.SolrCore [collection1_shard1_replica_t0] Registered new searcher Searcher@5aa802[collection1_shard1_replica_t0] main{ExitableDirectoryReader(UninvertingDirectoryReader())}
   [junit4]   2> 1591970 INFO  (qtp19653279-15311) [    ] o.a.s.u.UpdateLog Could not find max version in index or recent updates, using new clock 1573009982620696576
   [junit4]   2> 1591973 INFO  (qtp19653279-15311) [    ] o.a.s.c.ShardLeaderElectionContext Enough replicas found to continue.
   [junit4]   2> 1591973 INFO  (qtp19653279-15311) [    ] o.a.s.c.ShardLeaderElectionContext I may be the new leader - try and sync
   [junit4]   2> 1591973 INFO  (qtp19653279-15311) [    ] o.a.s.c.SyncStrategy Sync replicas to https://127.0.0.1:36441/se/v/collection1_shard1_replica_t0/
   [junit4]   2> 1591973 INFO  (qtp19653279-15311) [    ] o.a.s.c.SyncStrategy Sync Success - now sync replicas to me
   [junit4]   2> 1591973 INFO  (qtp19653279-15311) [    ] o.a.s.c.SyncStrategy https://127.0.0.1:36441/se/v/collection1_shard1_replica_t0/ has no replicas
   [junit4]   2> 1591973 INFO  (qtp19653279-15311) [    ] o.a.s.c.ShardLeaderElectionContext Found all replicas participating in election, clear LIR
   [junit4]   2> 1591973 INFO  (qtp19653279-15311) [    ] o.a.s.c.ZkController collection1_shard1_replica_t0 stopping background replication from leader
   [junit4]   2> 1591974 INFO  (qtp19653279-15311) [    ] o.a.s.c.ShardLeaderElectionContext I am the new leader: https://127.0.0.1:36441/se/v/collection1_shard1_replica_t0/ shard1
   [junit4]   2> 1592125 INFO  (qtp19653279-15311) [    ] o.a.s.c.ZkController I am the leader, no recovery necessary
   [junit4]   2> 1592126 INFO  (qtp19653279-15311) [    ] o.a.s.s.HttpSolrCall [admin] webapp=null path=/admin/cores params={qt=/admin/cores&collection.configName=conf1&name=collection1_shard1_replica_t0&action=CREATE&collection=collection1&shard=shard1&wt=javabin&version=2&replicaType=TLOG} status=0 QTime=1290
   [junit4]   2> 1592128 INFO  (qtp1153753-15277) [    ] o.a.s.s.HttpSolrCall [admin] webapp=null path=/admin/collections params={node=127.0.0.1:36441_se%252Fv&action=ADDREPLICA&collection=collection1&shard=shard1&type=TLOG&wt=javabin&version=2} status=0 QTime=1321
   [junit4]   2> 1592199 INFO  (TEST-ChaosMonkeySafeLeaderWithPullReplicasTest.test-seed#[DD6974B43CA6B012]) [    ] o.a.s.c.AbstractFullDistribZkTestBase create jetty 2 in directory /home/jenkins/workspace/Lucene-Solr-master-Linux/solr/build/solr-core/test/J2/temp/solr.cloud.ChaosMonkeySafeLeaderWithPullReplicasTest_DD6974B43CA6B012-001/shard-2-001 of type PULL
   [junit4]   2> 1592200 INFO  (TEST-ChaosMonkeySafeLeaderWithPullReplicasTest.test-seed#[DD6974B43CA6B012]) [    ] o.e.j.s.Server jetty-9.3.14.v20161028
   [junit4]   2> 1592201 INFO  (TEST-ChaosMonkeySafeLeaderWithPullReplicasTest.test-seed#[DD6974B43CA6B012]) [    ] o.e.j.s.h.ContextHandler Started o.e.j.s.ServletContextHandler@e92bb{/se/v,null,AVAILABLE}
   [junit4]   2> 1592201 INFO  (TEST-ChaosMonkeySafeLeaderWithPullReplicasTest.test-seed#[DD6974B43CA6B012]) [    ] o.e.j.s.AbstractConnector Started ServerConnector@1e45ba5{SSL,[ssl, http/1.1]}{127.0.0.1:36095}
   [junit4]   2> 1592201 INFO  (TEST-ChaosMonkeySafeLeaderWithPullReplicasTest.test-seed#[DD6974B43CA6B012]) [    ] o.e.j.s.Server Started @1593178ms
   [junit4]   2> 1592201 INFO  (TEST-ChaosMonkeySafeLeaderWithPullReplicasTest.test-seed#[DD6974B43CA6B012]) [    ] o.a.s.c.s.e.JettySolrRunner Jetty properties: {hostContext=/se/v, solrconfig=solrconfig.xml, solr.data.dir=/home/jenkins/workspace/Lucene-Solr-master-Linux/solr/build/solr-core/test/J2/temp/solr.cloud.ChaosMonkeySafeLeaderWithPullReplicasTest_DD6974B43CA6B012-001/tempDir-001/jetty2, hostPort=36095, coreRootDirectory=/home/jenkins/workspace/Lucene-Solr-master-Linux/solr/build/solr-core/test/J2/../../../../../../../../../home/jenkins/workspace/Lucene-Solr-master-Linux/solr/build/solr-core/test/J2/temp/solr.cloud.ChaosMonkeySafeLeaderWithPullReplicasTest_DD6974B43CA6B012-001/shard-2-001/cores, replicaType=PULL}
   [junit4]   2> 1592201 ERROR (TEST-ChaosMonkeySafeLeaderWithPullReplicasTest.test-seed#[DD6974B43CA6B012]) [    ] o.a.s.s.StartupLoggingUtils Missing Java Option solr.log.dir. Logging may be missing or incomplete.
   [junit4]   2> 1592201 INFO  (TEST-ChaosMonkeySafeLeaderWithPullReplicasTest.test-seed#[DD6974B43CA6B012]) [    ] o.a.s.s.SolrDispatchFilter  ___      _       Welcome to Apache Solr™ version 8.0.0
   [junit4]   2> 1592202 INFO  (TEST-ChaosMonkeySafeLeaderWithPullReplicasTest.test-seed#[DD6974B43CA6B012]) [    ] o.a.s.s.SolrDispatchFilter / __| ___| |_ _   Starting in cloud mode on port null
   [junit4]   2> 1592202 INFO  (TEST-ChaosMonkeySafeLeaderWithPullReplicasTest.test-seed#[DD6974B43CA6B012]) [    ] o.a.s.s.SolrDispatchFilter \__ \/ _ \ | '_|  Install dir: null, Default config dir: null
   [junit4]   2> 1592202 INFO  (TEST-ChaosMonkeySafeLeaderWithPullReplicasTest.test-seed#[DD6974B43CA6B012]) [    ] o.a.s.s.SolrDispatchFilter |___/\___/_|_|    Start time: 2017-07-15T17:20:20.108103Z
   [junit4]   2> 1592203 INFO  (TEST-ChaosMonkeySafeLeaderWithPullReplicasTest.test-seed#[DD6974B43CA6B012]) [    ] o.a.s.s.SolrDispatchFilter Loading solr.xml from SolrHome (not found in ZooKeeper)
   [junit4]   2> 1592203 INFO  (TEST-ChaosMonkeySafeLeaderWithPullReplicasTest.test-seed#[DD6974B43CA6B012]) [    ] o.a.s.c.SolrXmlConfig Loading container configuration from /home/jenkins/workspace/Lucene-Solr-master-Linux/solr/build/solr-core/test/J2/temp/solr.cloud.ChaosMonkeySafeLeaderWithPullReplicasTest_DD6974B43CA6B012-001/shard-2-001/solr.xml
   [junit4]   2> 1592205 INFO  (TEST-ChaosMonkeySafeLeaderWithPullReplicasTest.test-seed#[DD6974B43CA6B012]) [    ] o.a.s.c.SolrXmlConfig MBean server found: com.sun.jmx.mbeanserver.JmxMBeanServer@1418a7, but no JMX reporters were configured - adding default JMX reporter.
   [junit4]   2> 1592207 INFO  (TEST-ChaosMonkeySafeLeaderWithPullReplicasTest.test-seed#[DD6974B43CA6B012]) [    ] o.a.s.c.ZkContainer Zookeeper client=127.0.0.1:40583/solr
   [junit4]   2> 1592211 INFO  (TEST-ChaosMonkeySafeLeaderWithPullReplicasTest.test-seed#[DD6974B43CA6B012]) [    ] o.a.s.c.c.ZkStateReader Updated live nodes from ZooKeeper... (0) -> (2)
   [junit4]   2> 1592211 INFO  (TEST-ChaosMonkeySafeLeaderWithPullReplicasTest.test-seed#[DD6974B43CA6B012]) [    ] o.a.s.c.Overseer Overseer (id=null) closing
   [junit4]   2> 1592212 INFO  (TEST-ChaosMonkeySafeLeaderWithPullReplicasTest.test-seed#[DD6974B43CA6B012]) [    ] o.a.s.c.ZkController Register node as live in ZooKeeper:/live_nodes/127.0.0.1:36095_se%2Fv
   [junit4]   2> 1592213 INFO  (zkCallback-2430-thread-1) [    ] o.a.s.c.c.ZkStateReader Updated live nodes from ZooKeeper... (2) -> (3)
   [junit4]   2> 1592213 INFO  (zkCallback-2436-thread-1) [    ] o.a.s.c.c.ZkStateReader Updated live nodes from ZooKeeper... (2) -> (3)
   [junit4]   2> 1592213 INFO  (zkCallback-2425-thread-1) [    ] o.a.s.c.c.ZkStateReader Updated live nodes from ZooKeeper... (2) -> (3)
   [junit4]   2> 1592213 INFO  (zkCallback-2418-thread-1) [    ] o.a.s.c.c.ZkStateReader Updated live nodes from ZooKeeper... (2) -> (3)
   [junit4]   2> 1592357 INFO  (TEST-ChaosMonkeySafeLeaderWithPullReplicasTest.test-seed#[DD6974B43CA6B012]) [    ] o.a.s.m.r.SolrJmxReporter JMX monitoring for 'solr.node' (registry 'solr.node') enabled at server: com.sun.jmx.mbeanserver.JmxMBeanServer@1418a7
   [junit4]   2> 1592361 INFO  (TEST-ChaosMonkeySafeLeaderWithPullReplicasTest.test-seed#[DD6974B43CA6B012]) [    ] o.a.s.m.r.SolrJmxReporter JMX monitoring for 'solr.jvm' (registry 'solr.jvm') enabled at server: com.sun.jmx.mbeanserver.JmxMBeanServer@1418a7
   [junit4]   2> 1592361 INFO  (TEST-ChaosMonkeySafeLeaderWithPullReplicasTest.test-seed#[DD6974B43CA6B012]) [    ] o.a.s.m.r.SolrJmxReporter JMX monitoring for 'solr.jetty' (registry 'solr.jetty') enabled at server: com.sun.jmx.mbeanserver.JmxMBeanServer@1418a7
   [junit4]   2> 1592362 INFO  (TEST-ChaosMonkeySafeLeaderWithPullReplicasTest.test-seed#[DD6974B43CA6B012]) [    ] o.a.s.c.CorePropertiesLocator Found 0 core definitions underneath /home/jenkins/workspace/Lucene-Solr-master-Linux/solr/build/solr-core/test/J2/../../../../../../../../../home/jenkins/workspace/Lucene-Solr-master-Linux/solr/build/solr-core/test/J2/temp/solr.cloud.ChaosMonkeySafeLeaderWithPullReplicasTest_DD6974B43CA6B012-001/shard-2-001/cores
   [junit4]   2> 1592382 INFO  (qtp19653279-15318) [    ] o.a.s.h.a.CollectionsHandler Invoked Collection Action :addreplica with params node=127.0.0.1:36095_se%252Fv&action=ADDREPLICA&collection=collection1&shard=shard1&type=PULL&wt=javabin&version=2 and sendToOCPQueue=true
   [junit4]   2> 1592383 INFO  (OverseerCollectionConfigSetProcessor-98313123628187653-127.0.0.1:42709_se%2Fv-n_0000000000) [    ] o.a.s.c.OverseerTaskQueue Response ZK path: /overseer/collection-queue-work/qnr-0000000004 doesn't exist.  Requestor may have disconnected from ZooKeeper
   [junit4]   2> 1592383 INFO  (OverseerThreadFactory-7483-thread-4) [    ] o.a.s.c.AddReplicaCmd Node Identified 127.0.0.1:36095_se%2Fv for creating new replica
   [junit4]   2> 1592416 INFO  (qtp20591503-15341) [    ] o.a.s.h.a.CoreAdminOperation core create command qt=/admin/cores&collection.configName=conf1&name=collection1_shard1_replica_p1&action=CREATE&collection=collection1&shard=shard1&wt=javabin&version=2&replicaType=PULL
   [junit4]   2> 1592416 INFO  (qtp20591503-15341) [    ] o.a.s.c.TransientSolrCoreCacheDefault Allocating transient cache for 4 transient cores
   [junit4]   2> 1593433 INFO  (qtp20591503-15341) [    ] o.a.s.c.SolrConfig Using Lucene MatchVersion: 8.0.0
   [junit4]   2> 1593449 INFO  (qtp20591503-15341) [    ] o.a.s.s.IndexSchema [collection1_shard1_replica_p1] Schema name=test
   [junit4]   2> 1593498 INFO  (qtp20591503-15341) [    ] o.a.s.s.IndexSchema Loaded schema test/1.6 with uniqueid field id
   [junit4]   2> 1593505 INFO  (qtp20591503-15341) [    ] o.a.s.c.CoreContainer Creating SolrCore 'collection1_shard1_replica_p1' using configuration from collection collection1, trusted=true
   [junit4]   2> 1593506 INFO  (qtp20591503-15341) [    ] o.a.s.m.r.SolrJmxReporter JMX monitoring for 'solr.core.collection1.shard1.replica_p1' (registry 'solr.core.collection1.shard1.replica_p1') enabled at server: com.sun.jmx.mbeanserver.JmxMBeanServer@1418a7
   [junit4]   2> 1593506 INFO  (qtp20591503-15341) [    ] o.a.s.c.SolrCore solr.RecoveryStrategy.Builder
   [junit4]   2> 1593506 INFO  (qtp20591503-15341) [    ] o.a.s.c.SolrCore [[collection1_shard1_replica_p1] ] Opening new SolrCore at [/home/jenkins/workspace/Lucene-Solr-master-Linux/solr/build/solr-core/test/J2/temp/solr.cloud.ChaosMonkeySafeLeaderWithPullReplicasTest_DD6974B43CA6B012-001/shard-2-001/cores/collection1_shard1_replica_p1], dataDir=[/home/jenkins/workspace/Lucene-Solr-master-Linux/solr/build/solr-core/test/J2/../../../../../../../../../home/jenkins/workspace/Lucene-Solr-master-Linux/solr/build/solr-core/test/J2/temp/solr.cloud.ChaosMonkeySafeLeaderWithPullReplicasTest_DD6974B43CA6B012-001/shard-2-001/cores/collection1_shard1_replica_p1/data/]
   [junit4]   2> 1593508 INFO  (qtp20591503-15341) [    ] o.a.s.u.RandomMergePolicy RandomMergePolicy wrapping class org.apache.lucene.index.TieredMergePolicy: [TieredMergePolicy: maxMergeAtOnce=10, maxMergeAtOnceExplicit=10, maxMergedSegmentMB=2.728515625, floorSegmentMB=1.0537109375, forceMergeDeletesPctAllowed=9.49150832494291, segmentsPerTier=29.0, maxCFSSegmentSizeMB=8.796093022207999E12, noCFSRatio=1.0
   [junit4]   2> 1593526 WARN  (qtp20591503-15341) [    ] o.a.s.c.RequestHandlers INVALID paramSet a in requestHandler {type = requestHandler,name = /dump,class = DumpRequestHandler,attributes = {initParams=a, name=/dump, class=DumpRequestHandler},args = {defaults={a=A,b=B}}}
   [junit4]   2> 1593558 INFO  (qtp20591503-15341) [    ] o.a.s.u.CommitTracker Hard AutoCommit: if uncommited for 15000ms; 
   [junit4]   2> 1593558 INFO  (qtp20591503-15341) [    ] o.a.s.u.CommitTracker Soft AutoCommit: disabled
   [junit4]   2> 1593559 INFO  (qtp20591503-15341) [    ] o.a.s.u.RandomMergePolicy RandomMergePolicy wrapping class org.apache.lucene.index.TieredMergePolicy: [TieredMergePolicy: maxMergeAtOnce=37, maxMergeAtOnceExplicit=49, maxMergedSegmentMB=39.982421875, floorSegmentMB=0.7265625, forceMergeDeletesPctAllowed=3.977644137257724, segmentsPerTier=33.0, maxCFSSegmentSizeMB=8.796093022207999E12, noCFSRatio=0.5811959463862607
   [junit4]   2> 1593560 INFO  (qtp20591503-15341) [    ] o.a.s.s.SolrIndexSearcher Opening [Searcher@1449e33[collection1_shard1_replica_p1] main]
   [junit4]   2> 1593561 INFO  (qtp20591503-15341) [    ] o.a.s.r.ManagedResourceStorage Configured ZooKeeperStorageIO with znodeBase: /configs/conf1
   [junit4]   2> 1593575 INFO  (qtp20591503-15341) [    ] o.a.s.r.ManagedResourceStorage Loaded null at path _rest_managed.json using ZooKeeperStorageIO:path=/configs/conf1
   [junit4]   2> 1593576 INFO  (qtp20591503-15341) [    ] o.a.s.h.ReplicationHandler Commits will be reserved for  10000
   [junit4]   2> 1593576 INFO  (qtp20591503-15341) [    ] o.a.s.c.ZkController collection1_shard1_replica_p1 starting background replication from leader
   [junit4]   2> 1593576 INFO  (qtp20591503-15341) [    ] o.a.s.c.ReplicateFromLeader Will start replication from leader with poll interval: 0:0:7
   [junit4]   2> 1593576 INFO  (searcherExecutor-7508-thread-1) [    ] o.a.s.c.SolrCore [collection1_shard1_replica_p1] Registered new searcher Searcher@1449e33[collection1_shard1_replica_p1] main{ExitableDirectoryReader(UninvertingDirectoryReader())}
   [junit4]   2> 1593577 INFO  (qtp20591503-15341) [    ] o.a.s.h.ReplicationHandler Poll scheduled at an interval of 7000ms
   [junit4]   2> 1593577 INFO  (indexFetcher-7513-thread-1) [    ] o.a.s.h.IndexFetcher Updated masterUrl to https://127.0.0.1:36441/se/v/collection1_shard1_replica_t0/
   [junit4]   2> 1593577 INFO  (qtp20591503-15341) [    ] o.a.s.c.ZkController Core needs to recover:collection1_shard1_replica_p1
   [junit4]   2> 1593577 INFO  (updateExecutor-2433-thread-1) [    ] o.a.s.u.DefaultSolrCoreState Running recovery
   [junit4]   2> 1593577 INFO  (recoveryExecutor-2434-thread-1) [    ] o.a.s.c.RecoveryStrategy Starting recovery process. recoveringAfterStartup=true
   [junit4]   2> 1593578 INFO  (recoveryExecutor-2434-thread-1) [    ] o.a.s.c.RecoveryStrategy Publishing state of core [collection1_shard1_replica_p1] as recovering, leader is [https://127.0.0.1:36441/se/v/collection1_shard1_replica_t0/] and I am [https://127.0.0.1:36095/se/v/collection1_shard1_replica_p1/]
   [junit4]   2> 1593578 INFO  (qtp20591503-15341) [    ] o.a.s.s.HttpSolrCall [admin] webapp=null path=/admin/cores params={qt=/admin/cores&collection.configName=conf1&name=collection1_shard1_replica_p1&action=CREATE&collection=collection1&shard=shard1&wt=javabin&version=2&replicaType=PULL} status=0 QTime=1161
   [junit4]   2> 1593578 INFO  (recoveryExecutor-2434-thread-1) [    ] o.a.s.c.RecoveryStrategy Starting Replication Recovery.
   [junit4]   2> 1593578 INFO  (recoveryExecutor-2434-thread-1) [    ] o.a.s.c.RecoveryStrategy Stopping background replicate from leader process
   [junit4]   2> 1593578 INFO  (recoveryExecutor-2434-thread-1) [    ] o.a.s.c.ZkController collection1_shard1_replica_p1 stopping background replication from leader
   [junit4]   2> 1593578 INFO  (recoveryExecutor-2434-thread-1) [    ] o.a.s.c.RecoveryStrategy Attempting to replicate from [https://127.0.0.1:36441/se/v/collection1_shard1_replica_t0/].
   [junit4]   2> 1593580 INFO  (qtp19653279-15317) [    ] o.a.s.c.S.Request [collection1_shard1_replica_t0]  webapp=/se/v path=/replication params={qt=/replication&wt=javabin&version=2&command=indexversion} status=0 QTime=0
   [junit4]   2> 1593580 INFO  (indexFetcher-7513-thread-1) [    ] o.a.s.h.IndexFetcher Master's generation: 1
   [junit4]   2> 1593580 INFO  (indexFetcher-7513-thread-1) [    ] o.a.s.h.IndexFetcher Master's version: 0
   [junit4]   2> 1593580 INFO  (indexFetcher-7513-thread-1) [    ] o.a.s.h.IndexFetcher Slave's generation: 1
   [junit4]   2> 1593580 INFO  (indexFetcher-7513-thread-1) [    ] o.a.s.h.IndexFetcher Slave's version: 0
   [junit4]   2> 1593580 INFO  (qtp19653279-15318) [    ] o.a.s.s.HttpSolrCall [admin] webapp=null path=/admin/collections params={node=127.0.0.1:36095_se%252Fv&action=ADDREPLICA&collection=collection1&shard=shard1&type=PULL&wt=javabin&version=2} status=0 QTime=1198
   [junit4]   2> 1593581 INFO  (qtp19653279-15373) [    ] o.a.s.u.DirectUpdateHandler2 start commit{_version_=1573009984309952512,optimize=false,openSearcher=false,waitSearcher=true,expungeDeletes=false,softCommit=false,prepareCommit=false}
   [junit4]   2> 1593581 INFO  (qtp19653279-15373) [    ] o.a.s.u.DirectUpdateHandler2 No uncommitted changes. Skipping IW.commit.
   [junit4]   2> 1593581 INFO  (qtp19653279-15373) [    ] o.a.s.u.DirectUpdateHandler2 end_commit_flush
   [junit4]   2> 1593582 INFO  (qtp19653279-15373) [    ] o.a.s.u.p.LogUpdateProcessorFactory [collection1_shard1_replica_t0]  webapp=/se/v path=/update params={waitSearcher=true&openSearcher=false&commit=true&softCommit=false&commit_end_point=true&wt=javabin&version=2}{commit=} 0 0
   [junit4]   2> 1593583 INFO  (qtp19653279-15312) [    ] o.a.s.c.S.Request [collection1_shard1_replica_t0]  webapp=/se/v path=/replication params={qt=/replication&wt=javabin&version=2&command=indexversion} status=0 QTime=0
   [junit4]   2> 1593583 INFO  (recoveryExecutor-2434-thread-1) [    ] o.a.s.h.IndexFetcher Master's generation: 1
   [junit4]   2> 1593583 INFO  (recoveryExecutor-2434-thread-1) [    ] o.a.s.h.IndexFetcher Master's version: 0
   [junit4]   2> 1593583 INFO  (recoveryExecutor-2434-thread-1) [    ] o.a.s.h.IndexFetcher Slave's generation: 1
   [junit4]   2> 1593583 INFO  (recoveryExecutor-2434-thread-1) [    ] o.a.s.h.IndexFetcher Slave's version: 0
   [junit4]   2> 1593583 INFO  (recoveryExecutor-2434-thread-1) [    ] o.a.s.c.RecoveryStrategy Replication Recovery was successful.
   [junit4]   2> 1593583 INFO  (recoveryExecutor-2434-thread-1) [    ] o.a.s.c.RecoveryStrategy Restaring background replicate from leader process
   [junit4]   2> 1593583 INFO  (recoveryExecutor-2434-thread-1) [    ] o.a.s.c.ZkController collection1_shard1_replica_p1 starting background replication from leader
   [junit4]   2> 1593583 INFO  (recoveryExecutor-2434-thread-1) [    ] o.a.s.c.ReplicateFromLeader Will start replication from leader with poll interval: 0:0:7
   [junit4]   2> 1593583 INFO  (recoveryExecutor-2434-thread-1) [    ] o.a.s.h.ReplicationHandler Poll scheduled at an interval of 7000ms
   [junit4]   2> 1593584 INFO  (recoveryExecutor-2434-thread-1) [    ] o.a.s.c.RecoveryStrategy Registering as Active after recovery.
   [junit4]   2> 1593584 INFO  (indexFetcher-7515-thread-1) [    ] o.a.s.h.IndexFetcher Updated masterUrl to https://127.0.0.1:36441/se/v/collection1_shard1_replica_t0/
   [junit4]   2> 1593584 INFO  (recoveryExecutor-2434-thread-1) [    ] o.a.s.c.RecoveryStrategy Finished recovery process, successful=[true]
   [junit4]   2> 1593584 INFO  (qtp19653279-15314) [    ] o.a.s.c.S.Request [collection1_shard1_replica_t0]  webapp=/se/v path=/replication params={qt=/replication&wt=javabin&version=2&command=indexversion} status=0 QTime=0
   [junit4]   2> 1593584 INFO  (indexFetcher-7515-thread-1) [    ] o.a.s.h.IndexFetcher Master's generation: 1
   [junit4]   2> 1593584 INFO  (indexFetcher-7515-thread-1) [    ] o.a.s.h.IndexFetcher Master's version: 0
   [junit4]   2> 1593584 INFO  (indexFetcher-7515-thread-1) [    ] o.a.s.h.IndexFetcher Slave's generation: 1
   [junit4]   2> 1593584 INFO  (indexFetcher-7515-thread-1) [    ] o.a.s.h.IndexFetcher Slave's version: 0
   [junit4]   2> 1593655 INFO  (TEST-ChaosMonkeySafeLeaderWithPullReplicasTest.test-seed#[DD6974B43CA6B012]) [    ] o.a.s.c.AbstractFullDistribZkTestBase create jetty 3 in directory /home/jenkins/workspace/Lucene-Solr-master-Linux/solr/build/solr-core/test/J2/temp/solr.cloud.ChaosMonkeySafeLeaderWithPullReplicasTest_DD6974B43CA6B012-001/shard-3-001 of type PULL
   [junit4]   2> 1593656 INFO  (TEST-ChaosMonkeySafeLeaderWithPullReplicasTest.test-seed#[DD6974B43CA6B012]) [    ] o.e.j.s.Server jetty-9.3.14.v20161028
   [junit4]   2> 1593657 INFO  (TEST-ChaosMonkeySafeLeaderWithPullReplicasTest.test-seed#[DD6974B43CA6B012]) [    ] o.e.j.s.h.ContextHandler Started o.e.j.s.ServletContextHandler@8495ed{/se/v,null,AVAILABLE}
   [junit4]   2> 1593657 INFO  (TEST-ChaosMonkeySafeLeaderWithPullReplicasTest.test-seed#[DD6974B43CA6B012]) [    ] o.e.j.s.AbstractConnector Started ServerConnector@a737da{SSL,[ssl, http/1.1]}{127.0.0.1:37743}
   [junit4]   2> 1593657 INFO  (TEST-ChaosMonkeySafeLeaderWithPullReplicasTest.test-seed#[DD6974B43CA6B012]) [    ] o.e.j.s.Server Started @1594634ms
   [junit4]   2> 1593658 INFO  (TEST-ChaosMonkeySafeLeaderWithPullReplicasTest.test-seed#[DD6974B43CA6B012]) [    ] o.a.s.c.s.e.JettySolrRunner Jetty properties: {hostContext=/se/v, solrconfig=solrconfig.xml, solr.data.dir=/home/jenkins/workspace/Lucene-Solr-master-Linux/solr/build/solr-core/test/J2/temp/solr.cloud.ChaosMonkeySafeLeaderWithPullReplicasTest_DD6974B43CA6B012-001/tempDir-001/jetty3, hostPort=37743, coreRootDirectory=/home/jenkins/workspace/Lucene-Solr-master-Linux/solr/build/solr-core/test/J2/../../../../../../../../../home/jenkins/workspace/Lucene-Solr-master-Linux/solr/build/solr-core/test/J2/temp/solr.cloud.ChaosMonkeySafeLeaderWithPullReplicasTest_DD6974B43CA6B012-001/shard-3-001/cores, replicaType=PULL}
   [junit4]   2> 1593658 ERROR (TEST-ChaosMonkeySafeLeaderWithPullReplicasTest.test-seed#[DD6974B43CA6B012]) [    ] o.a.s.s.StartupLoggingUtils Missing Java Option solr.log.dir. Logging may be missing or incomplete.
   [junit4]   2> 1593658 INFO  (TEST-ChaosMonkeySafeLeaderWithPullReplicasTest.test-seed#[DD6974B43CA6B012]) [    ] o.a.s.s.SolrDispatchFilter  ___      _       Welcome to Apache Solr™ version 8.0.0
   [junit4]   2> 1593658 INFO  (TEST-ChaosMonkeySafeLeaderWithPullReplicasTest.test-seed#[DD6974B43CA6B012]) [    ] o.a.s.s.SolrDispatchFilter / __| ___| |_ _   Starting in cloud mode on port null
   [junit4]   2> 1593658 INFO  (TEST-ChaosMonkeySafeLeaderWithPullReplicasTest.test-seed#[DD6974B43CA6B012]) [    ] o.a.s.s.SolrDispatchFilter \__ \/ _ \ | '_|  Install dir: null, Default config dir: null
   [junit4]   2> 1593658 INFO  (TEST-ChaosMonkeySafeLeaderWithPullReplicasTest.test-seed#[DD6974B43CA6B012]) [    ] o.a.s.s.SolrDispatchFilter |___/\___/_|_|    Start time: 2017-07-15T17:20:21.564600Z
   [junit4]   2> 1593660 INFO  (TEST-ChaosMonkeySafeLeaderWithPullReplicasTest.test-seed#[DD6974B43CA6B012]) [    ] o.a.s.s.SolrDispatchFilter Loading solr.xml from SolrHome (not found in ZooKeeper)
   [junit4]   2> 1593660 INFO  (TEST-ChaosMonkeySafeLeaderWithPullReplicasTest.test-seed#[DD6974B43CA6B012]) [    ] o.a.s.c.SolrXmlConfig Loading container configuration from /home/jenkins/workspace/Lucene-Solr-master-Linux/solr/build/solr-core/test/J2/temp/solr.cloud.ChaosMonkeySafeLeaderWithPullReplicasTest_DD6974B43CA6B012-001/shard-3-001/solr.xml
   [junit4]   2> 1593662 INFO  (TEST-ChaosMonkeySafeLeaderWithPullReplicasTest.test-seed#[DD6974B43CA6B012]) [    ] o.a.s.c.SolrXmlConfig MBean server found: com.sun.jmx.mbeanserver.JmxMBeanServer@1418a7, but no JMX reporters were configured - adding default JMX reporter.
   [junit4]   2> 1593664 INFO  (TEST-ChaosMonkeySafeLeaderWithPullReplicasTest.test-seed#[DD6974B43CA6B012]) [    ] o.a.s.c.ZkContainer Zookeeper client=127.0.0.1:40583/solr
   [junit4]   2> 1593665 WARN  (NIOServerCxn.Factory:0.0.0.0/0.0.0.0:0) [    ] o.a.z.s.NIOServerCnxn caught end of stream exception
   [junit4]   2> EndOfStreamException: Unable to read additional data from client sessionid 0x15d4743da9e000f, likely client has closed socket
   [junit4]   2> 	at org.apache.zookeeper.server.NIOServerCnxn.doIO(NIOServerCnxn.java:239)
   [junit4]   2> 	at org.apache.zookeeper.server.NIOServerCnxnFactory.run(NIOServerCnxnFactory.java:203)
   [junit4]   2> 	at java.base/java.lang.Thread.run(Thread.java:844)
   [junit4]   2> 1593668 INFO  (TEST-ChaosMonkeySafeLeaderWithPullReplicasTest.test-seed#[DD6974B43CA6B012]) [    ] o.a.s.c.c.ZkStateReader Updated live nodes from ZooKeeper... (0) -> (3)
   [junit4]   2> 1593668 INFO  (TEST-ChaosMonkeySafeLeaderWithPullReplicasTest.test-seed#[DD6974B43CA6B012]) [    ] o.a.s.c.Overseer Overseer (id=null) closing
   [junit4]   2> 1593669 INFO  (TEST-ChaosMonkeySafeLeaderWithPullReplicasTest.test-seed#[DD6974B43CA6B012]) [    ] o.a.s.c.ZkController Register node as live in ZooKeeper:/live_nodes/127.0.0.1:37743_se%2Fv
   [junit4]   2> 1593669 INFO  (zkCallback-2425-thread-1) [    ] o.a.s.c.c.ZkStateReader Updated live nodes from ZooKeeper... (3) -> (4)
   [junit4]   2> 1593669 INFO  (zkCallback-2418-thread-1) [    ] o.a.s.c.c.ZkStateReader Updated live nodes from ZooKeeper... (3) -> (4)
   [junit4]   2> 1593669 INFO  (zkCallback-2442-thread-1) [    ] o.a.s.c.c.ZkStateReader Updated live nodes from ZooKeeper... (3) -> (4)
   [junit4]   2> 1593669 INFO  (zkCallback-2430-thread-1) [    ] o.a.s.c.c.ZkStateReader Updated live nodes from ZooKeeper... (3) -> (4)
   [junit4]   2> 1593669 INFO  (zkCallback-2436-thread-1) [    ] o.a.s.c.c.ZkStateReader Updated live nodes from ZooKeeper... (3) -> (4)
   [junit4]   2> 1593735 INFO  (TEST-ChaosMonkeySafeLeaderWithPullReplicasTest.test-seed#[DD6974B43CA6B012]) [    ] o.a.s.m.r.SolrJmxReporter JMX monitoring for 'solr.node' (registry 'solr.node') enabled at server: com.sun.jmx.mbeanserver.JmxMBeanServer@1418a7
   [junit4]   2> 1593739 INFO  (TEST-ChaosMonkeySafeLeaderWithPullReplicasTest.test-seed#[DD6974B43CA6B012]) [    ] o.a.s.m.r.SolrJmxReporter JMX monitoring for 'solr.jvm' (registry 'solr.jvm') enabled at server: com.sun.jmx.mbeanserver.JmxMBeanServer@1418a7
   [junit4]   2> 1593739 INFO  (TEST-ChaosMonkeySafeLeaderWithPullReplicasTest.test-seed#[DD6974B43CA6B012]) [    ] o.a.s.m.r.SolrJmxReporter JMX monitoring for 'solr.jetty' (registry 'solr.jetty') enabled at server: com.sun.jmx.mbeanserver.JmxMBeanServer@1418a7
   [junit4]   2> 1593740 INFO  (TEST-ChaosMonkeySafeLeaderWithPullReplicasTest.test-seed#[DD6974B43CA6B012]) [    ] o.a.s.c.CorePropertiesLocator Found 0 core definitions underneath /home/jenkins/workspace/Lucene-Solr-master-Linux/solr/build/solr-core/test/J2/../../../../../../../../../home/jenkins/workspace/Lucene-Solr-master-Linux/solr/build/solr-core/test/J2/temp/solr.cloud.ChaosMonkeySafeLeaderWithPullReplicasTest_DD6974B43CA6B012-001/shard-3-001/cores
   [junit4]   2> 1593764 INFO  (qtp20591503-15348) [    ] o.a.s.h.a.CollectionsHandler Invoked Collection Action :addreplica with params node=127.0.0.1:37743_se%252Fv&action=ADDREPLICA&collection=collection1&shard=shard1&type=PULL&wt=javabin&version=2 and sendToOCPQueue=true
   [junit4]   2> 1593766 INFO  (OverseerThreadFactory-7483-thread-5) [    ] o.a.s.c.AddReplicaCmd Node Identified 127.0.0.1:37743_se%2Fv for creating new replica
   [junit4]   2> 1593766 INFO  (OverseerCollectionConfigSetProcessor-98313123628187653-127.0.0.1:42709_se%2Fv-n_0000000000) [    ] o.a.s.c.OverseerTaskQueue Response ZK path: /overseer/collection-queue-work/qnr-0000000006 doesn't exist.  Requestor may have disconnected from ZooKeeper
   [junit4]   2> 1593795 INFO  (qtp29458321-15377) [    ] o.a.s.h.a.CoreAdminOperation core create command qt=/admin/cores&collection.configName=conf1&name=collection1_shard1_replica_p2&action=CREATE&collection=collection1&shard=shard1&wt=javabin&version=2&replicaType=PULL
   [junit4]   2> 1593795 INFO  (qtp29458321-15377) [    ] o.a.s.c.TransientSolrCoreCacheDefault Allocating transient cache for 4 transient cores
   [junit4]   2> 1594801 INFO  (qtp29458321-15377) [    ] o.a.s.c.SolrConfig Using Lucene MatchVersion: 8.0.0
   [junit4]   2> 1594809 INFO  (qtp29458321-15377) [    ] o.a.s.s.IndexSchema [collection1_shard1_replica_p2] Schema name=test
   [junit4]   2> 1594855 INFO  (qtp29458321-15377) [    ] o.a.s.s.IndexSchema Loaded schema test/1.6 with uniqueid field id
   [junit4]   2> 1594861 INFO  (qtp29458321-15377) [    ] o.a.s.c.CoreContainer Creating SolrCore 'collection1_shard1_replica_p2' using configuration from collection collection1, trusted=true
   [junit4]   2> 1594862 INFO  (qtp29458321-15377) [    ] o.a.s.m.r.SolrJmxReporter JMX monitoring for 'solr.core.collection1.shard1.replica_p2' (registry 'solr.core.collection1.shard1.replica_p2') enabled at server: com.sun.jmx.mbeanserver.JmxMBeanServer@1418a7
   [junit4]   2> 1594862 INFO  (qtp29458321-15377) [    ] o.a.s.c.SolrCore solr.RecoveryStrategy.Builder
   [junit4]   2> 1594862 INFO  (qtp29458321-15377) [    ] o.a.s.c.SolrCore [[collection1_shard1_replica_p2] ] Opening new SolrCore at [/home/jenkins/workspace/Lucene-Solr-master-Linux/solr/build/solr-core/test/J2/temp/solr.cloud.ChaosMonkeySafeLeaderWithPullReplicasTest_DD6974B43CA6B012-001/shard-3-001/cores/collection1_shard1_replica_p2], dataDir=[/home/jenkins/workspace/Lucene-Solr-master-Linux/solr/build/solr-core/test/J2/../../../../../../../../../home/jenkins/workspace/Lucene-Solr-master-Linux/solr/build/solr-core/test/J2/temp/solr.cloud.ChaosMonkeySafeLeaderWithPullReplicasTest_DD6974B43CA6B012-001/shard-3-001/cores/collection1_shard1_replica_p2/data/]
   [junit4]   2> 1594865 INFO  (qtp29458321-15377) [    ] o.a.s.u.RandomMergePolicy RandomMergePolicy wrapping class org.apache.lucene.index.TieredMergePolicy: [TieredMergePolicy: maxMergeAtOnce=10, maxMergeAtOnceExplicit=10, maxMergedSegmentMB=2.728515625, floorSegmentMB=1.0537109375, forceMergeDeletesPctAllowed=9.49150832494291, segmentsPerTier=29.0, maxCFSSegmentSizeMB=8.796093022207999E12, noCFSRatio=1.0
   [junit4]   2> 1594882 WARN  (qtp29458321-15377) [    ] o.a.s.c.RequestHandlers INVALID paramSet a in requestHandler {type = requestHandler,name = /dump,class = DumpRequestHandler,attributes = {initParams=a, name=/dump, class=DumpRequestHandler},args = {defaults={a=A,b=B}}}
   [junit4]   2> 1594911 INFO  (qtp29458321-15377) [    ] o.a.s.u.CommitTracker Hard AutoCommit: if uncommited for 15000ms; 
   [junit4]   2> 1594911 INFO  (qtp29458321-15377) [    ] o.a.s.u.CommitTracker Soft AutoCommit: disabled
   [junit4]   2> 1594912 INFO  (qtp29458321-15377) [    ] o.a.s.u.RandomMergePolicy RandomMergePolicy wrapping class org.apache.lucene.index.TieredMergePolicy: [TieredMergePolicy: maxMergeAtOnce=37, maxMergeAtOnceExplicit=49, maxMergedSegmentMB=39.982421875, floorSegmentMB=0.7265625, forceMergeDeletesPctAllowed=3.977644137257724, segmentsPerTier=33.0, maxCFSSegmentSizeMB=8.796093022207999E12, noCFSRatio=0.5811959463862607
   [junit4]   2> 1594913 INFO  (qtp29458321-15377) [    ] o.a.s.s.SolrIndexSearcher Opening [Searcher@1a5c246[collection1_shard1_replica_p2] main]
   [junit4]   2> 1594913 INFO  (qtp29458321-15377) [    ] o.a.s.r.ManagedResourceStorage Configured ZooKeeperStorageIO with znodeBase: /configs/conf1
   [junit4]   2> 1594914 INFO  (qtp29458321-15377) [    ] o.a.s.r.ManagedResourceStorage Loaded null at path _rest_managed.json using ZooKeeperStorageIO:path=/configs/conf1
   [junit4]   2> 1594914 INFO  (qtp29458321-15377) [    ] o.a.s.h.ReplicationHandler Commits will be reserved for  10000
   [junit4]   2> 1594915 INFO  (qtp29458321-15377) [    ] o.a.s.c.ZkController collection1_shard1_replica_p2 starting background replication from leader
   [junit4]   2> 1594915 INFO  (qtp29458321-15377) [    ] o.a.s.c.ReplicateFromLeader Will start replication from leader with poll interval: 0:0:7
   [junit4]   2> 1594915 INFO  (searcherExecutor-7522-thread-1) [    ] o.a.s.c.SolrCore [collection1_shard1_replica_p2] Registered new searcher Searcher@1a5c246[collection1_shard1_replica_p2] main{ExitableDirectoryReader(UninvertingDirectoryReader())}
   [junit4]   2> 1594915 INFO  (qtp29458321-15377) [    ] o.a.s.h.ReplicationHandler Poll scheduled at an interval of 7000ms
   [junit4]   2> 1594915 INFO  (indexFetcher-7527-thread-1) [    ] o.a.s.h.IndexFetcher Updated masterUrl to https://127.0.0.1:36441/se/v/collection1_shard1_replica_t0/
   [junit4]   2> 1594915 INFO  (qtp29458321-15377) [    ] o.a.s.c.ZkController Core needs to recover:collection1_shard1_replica_p2
   [junit4]   2> 1594915 INFO  (updateExecutor-2439-thread-1) [    ] o.a.s.u.DefaultSolrCoreState Running recovery
   [junit4]   2> 1594916 INFO  (recoveryExecutor-2440-thread-1) [    ] o.a.s.c.RecoveryStrategy Starting recovery process. recoveringAfterStartup=true
   [junit4]   2> 1594916 INFO  (recoveryExecutor-2440-thread-1) [    ] o.a.s.c.RecoveryStrategy Publishing state of core [collection1_shard1_replica_p2] as recovering, leader is [https://127.0.0.1:36441/se/v/collection1_shard1_replica_t0/] and I am [https://127.0.0.1:37743/se/v/collection1_shard1_replica_p2/]
   [junit4]   2> 1594916 INFO  (qtp29458321-15377) [    ] o.a.s.s.HttpSolrCall [admin] webapp=null path=/admin/cores params={qt=/admin/cores&collection.configName=conf1&name=collection1_shard1_replica_p2&action=CREATE&collection=collection1&shard=shard1&wt=javabin&version=2&replicaType=PULL} status=0 QTime=1121
   [junit4]   2> 1594916 INFO  (recoveryExecutor-2440-thread-1) [    ] o.a.s.c.RecoveryStrategy Starting Replication Recovery.
   [junit4]   2> 1594916 INFO  (recoveryExecutor-2440-thread-1) [    ] o.a.s.c.RecoveryStrategy Stopping background replicate from leader process
   [junit4]   2> 1594916 INFO  (recoveryExecutor-2440-thread-1) [    ] o.a.s.c.ZkController collection1_shard1_replica_p2 stopping background replication from leader
   [junit4]   2> 1594916 INFO  (recoveryExecutor-2440-thread-1) [    ] o.a.s.c.RecoveryStrategy Attempting to replicate from [https://127.0.0.1:36441/se/v/collection1_shard1_replica_t0/].
   [junit4]   2> 1594918 INFO  (qtp20591503-15348) [    ] o.a.s.s.HttpSolrCall [admin] webapp=null path=/admin/collections params={node=127.0.0.1:37743_se%252Fv&action=ADDREPLICA&collection=collection1&shard=shard1&type=PULL&wt=javabin&version=2} status=0 QTime=1153
   [junit4]   2> 1594918 INFO  (qtp19653279-15373) [    ] o.a.s.c.S.Request [collection1_shard1_replica_t0]  webapp=/se/v path=/replication params={qt=/replication&wt=javabin&version=2&command=indexversion} status=0 QTime=0
   [junit4]   2> 1594918 INFO  (indexFetcher-7527-thread-1) [    ] o.a.s.h.IndexFetcher Master's generation: 1
   [junit4]   2> 1594919 INFO  (indexFetcher-7527-thread-1) [    ] o.a.s.h.IndexFetcher Master's version: 0
   [junit4]   2> 1594919 INFO  (indexFetcher-7527-thread-1) [    ] o.a.s.h.IndexFetcher Slave's generation: 1
   [junit4]   2> 1594919 INFO  (indexFetcher-7527-thread-1) [    ] o.a.s.h.IndexFetcher Slave's version: 0
   [junit4]   2> 1594919 INFO  (TEST-ChaosMonkeySafeLeaderWithPullReplicasTest.test-seed#[DD6974B43CA6B012]) [    ] o.a.s.SolrTestCaseJ4 ###Starting test
   [junit4]   2> 1594919 INFO  (qtp19653279-15373) [    ] o.a.s.u.DirectUpdateHandler2 start commit{_version_=1573009985712947200,optimize=false,openSearcher=false,waitSearcher=true,expungeDeletes=false,softCommit=false,prepareCommit=false}
   [junit4]   2> 1594920 INFO  (qtp19653279-15373) [    ] o.a.s.u.DirectUpdateHandler2 No uncommitted changes. Skipping IW.commit.
   [junit4]   2> 1594920 INFO  (TEST-ChaosMonkeySafeLeaderWithPullReplicasTest.test-seed#[DD6974B43CA6B012]) [    ] o.a.s.c.AbstractFullDistribZkTestBase Not turning on auto soft commit
   [junit4]   2> 1594920 INFO  (qtp19653279-15373) [    ] o.a.s.u.DirectUpdateHandler2 end_commit_flush
   [junit4]   2> 1594920 INFO  (qtp19653279-15373) [    ] o.a.s.u.p.LogUpdateProcessorFactory [collection1_shard1_replica_t0]  webapp=/se/v path=/update params={waitSearcher=true&openSearcher=false&commit=true&softCommit=false&commit_end_point=true&wt=javabin&version=2}{commit=} 0 0
   [junit4]   2> 1594921 INFO  (qtp19653279-15372) [    ] o.a.s.c.S.Request [collection1_shard1_replica_t0]  webapp=/se/v path=/replication params={qt=/replication&wt=javabin&version=2&command=indexversion} status=0 QTime=0
   [junit4]   2> 1594921 INFO  (recoveryExecutor-2440-thread-1) [    ] o.a.s.h.IndexFetcher Master's generation: 1
   [junit4]   2> 1594921 INFO  (recoveryExecutor-2440-thread-1) [    ] o.a.s.h.IndexFetcher Master's version: 0
   [junit4]   2> 1594921 INFO  (recoveryExecutor-2440-thread-1) [    ] o.a.s.h.IndexFetcher Slave's generation: 1
   [junit4]   2> 1594921 INFO  (recoveryExecutor-2440-thread-1) [    ] o.a.s.h.IndexFetcher Slave's version: 0
   [junit4]   2> 1594922 INFO  (recoveryExecutor-2440-thread-1) [    ] o.a.s.c.RecoveryStrategy Replication Recovery was successful.
   [junit4]   2> 1594922 INFO  (recoveryExecutor-2440-thread-1) [    ] o.a.s.c.RecoveryStrategy Restaring background replicate from leader process
   [junit4]   2> 1594922 INFO  (recoveryExecutor-2440-thread-1) [    ] o.a.s.c.ZkController collection1_shard1_replica_p2 starting background replication from leader
   [junit4]   2> 1594922 INFO  (recoveryExecutor-2440-thread-1) [    ] o.a.s.c.ReplicateFromLeader Will start replication from leader with poll interval: 0:0:7
   [junit4]   2> 1594923 INFO  (recoveryExecutor-2440-thread-1) [    ] o.a.s.h.ReplicationHandler Poll scheduled at an interval of 7000ms
   [junit4]   2> 1594923 INFO  (recoveryExecutor-2440-thread-1) [    ] o.a.s.c.RecoveryStrategy Registering as Active after recovery.
   [junit4]   2> 1594923 INFO  (indexFetcher-7529-thread-1) [    ] o.a.s.h.IndexFetcher Updated masterUrl to https://127.0.0.1:36441/se/v/collection1_shard1_replica_t0/
   [junit4]   2> 1594923 INFO  (qtp1153753-15277) [    ] o.a.s.u.p.LogUpdateProcessorFactory [control_collection_shard1_replica_n1]  webapp=/se/v path=/update params={wt=javabin&version=2}{deleteByQuery=*:* (-1573009985716092928)} 0 1
   [junit4]   2> 1594924 INFO  (qtp19653279-15317) [    ] o.a.s.c.S.Request [collection1_shard1_replica_t0]  webapp=/se/v path=/replication params={qt=/replication&wt=javabin&version=2&command=indexversion} status=0 QTime=0
   [junit4]   2> 1594924 INFO  (indexFetcher-7529-thread-1) [    ] o.a.s.h.IndexFetcher Master's generation: 1
   [junit4]   2> 1594924 INFO  (indexFetcher-7529-thread-1) [    ] o.a.s.h.IndexFetcher Master's version: 0
   [junit4]   2> 1594924 INFO  (indexFetcher-7529-thread-1) [    ] o.a.s.h.IndexFetcher Slave's generation: 1
   [junit4]   2> 1594924 INFO  (indexFetcher-7529-thread-1) [    ] o.a.s.h.IndexFetcher Slave's version: 0
   [junit4]   2> 1594924 INFO  (recoveryExecutor-2440-thread-1) [    ] o.a.s.c.RecoveryStrategy Finished recovery process, successful=[true]
   [junit4]   2> 1594928 INFO  (qtp19653279-15317) [    ] o.a.s.u.p.LogUpdateProcessorFactory [collection1_shard1_replica_t0]  webapp=/se/v path=/update params={wt=javabin&version=2}{deleteByQuery=*:* (-1573009985718190080)} 0 4
   [junit4]   2> 1594929 INFO  (TEST-ChaosMonkeySafeLeaderWithPullReplicasTest.test-seed#[DD6974B43CA6B012]) [    ] o.a.s.c.ChaosMonkey monkey: starting
   [junit4]   2> 1594929 INFO  (TEST-ChaosMonkeySafeLeaderWithPullReplicasTest.test-seed#[DD6974B43CA6B012]) [    ] o.a.s.c.ChaosMonkey monkey: Jetty will not commit on close
   [junit4]   2> 1594930 INFO  (qtp19653279-15373) [    ] o.a.s.u.DirectUpdateHandler2 start commit{_version_=1573009985724481536,optimize=false,openSearcher=true,waitSearcher=false,expungeDeletes=false,softCommit=false,prepareCommit=false}
   [junit4]   2> 1594930 INFO  (qtp19653279-15373) [    ] o.a.s.u.DirectUpdateHandler2 No uncommitted changes. Skipping IW.commit.
   [junit4]   2> 1594930 INFO  (qtp19653279-15373) [    ] o.a.s.u.DirectUpdateHandler2 end_commit_flush
   [junit4]   2> 1594930 INFO  (qtp19653279-15373) [    ] o.a.s.u.p.LogUpdateProcessorFactory [collection1_shard1_replica_t0]  webapp=/se/v path=/update params={waitSearcher=false&commit=true&softCommit=false&wt=javabin&version=2}{commit=} 0 0
   [junit4]   2> 1594931 INFO  (qtp1153753-15273) [    ] o.a.s.u.p.LogUpdateProcessorFactory [control_collection_shard1_replica_n1]  webapp=/se/v path=/update params={wt=javabin&version=2&CONTROL=TRUE}{add=[0-0 (1573009985723432960)]} 0 2
   [junit4]   2> 1594932 INFO  (qtp1153753-15273) [    ] o.a.s.u.p.LogUpdateProcessorFactory [control_collection_shard1_replica_n1]  webapp=/se/v path=/update params={wt=javabin&version=2&CONTROL=TRUE}{add=[1-0 (1573009985726578688)]} 0 0
   [junit4]   2> 1594933 INFO  (qtp19653279-15373) [    ] o.a.s.u.p.LogUpdateProcessorFactory [collection1_shard1_replica_t0]  webapp=/se/v path=/update params={wt=javabin&version=2}{add=[0-0 (1573009985726578688)]} 0 1
   [junit4]   2> 1594934 INFO  (qtp19653279-15373) [    ] o.a.s.u.p.LogUpdateProcessorFactory [collection1_shard1_replica_t0]  webapp=/se/v path=/update params={wt=javabin&version=2}{add=[1-0 (1573009985728675840)]} 0 0
   [junit4]   2> 1594936 INFO  (qtp1153753-15270) [    ] o.a.s.u.p.LogUpdateProcessorFactory [control_collection_shard1_replica_n1]  webapp=/se/v path=/update params={wt=javabin&version=2&CONTROL=TRUE}{add=[1-1 (1573009985729724416)]} 0 0
   [junit4]   2> 1594936 INFO  (qtp19653279-15373) [    ] o.a.s.u.p.LogUpdateProcessorFactory [collection1_shard1_replica_t0]  webapp=/se/v path=/update params={wt=javabin&version=2}{add=[1-1 (1573009985730772992)]} 0 0
   [junit4]   2> 1594937 INFO  (qtp1153753-15275) [    ] o.a.s.u.p.LogUpdateProcessorFactory [control_collection_shard1_replica_n1]  webapp=/se/v path=/update params={wt=javabin&version=2&CONTROL=TRUE}{add=[0-1 (1573009985730772992)]} 0 0
   [junit4]   2> 1594937 INFO  (qtp1153753-15277) [    ] o.a.s.u.p.LogUpdateProcessorFactory [control_collection_shard1_replica_n1]  webapp=/se/v path=/update params={wt=javabin&version=2&CONTROL=TRUE}{add=[1-2 (1573009985731821568)]} 0 0
   [junit4]   2> 1594937 INFO  (qtp19653279-15373) [    ] o.a.s.u.p.LogUpdateProcessorFactory [collection1_shard1_replica_t0]  webapp=/se/v path=/update params={wt=javabin&version=2}{add=[0-1 (1573009985731821568)]} 0 0
   [junit4]   2> 1594938 INFO  (qtp19653279-15311) [    ] o.a.s.u.p.LogUpdateProcessorFactory [collection1_shard1_replica_t0]  webapp=/se/v path=/update params={wt=javabin&version=2}{add=[1-2 (1573009985731821569)]} 0 0
   [junit4]   2> 1594938 INFO  (qtp1153753-15275) [    ] o.a.s.u.p.LogUpdateProcessorFactory [control_collection_shard1_replica_n1]  webapp=/se/v path=/update params={wt=javabin&version=2&CONTROL=TRUE}{delete=[1-0 (-1573009985732870144)]} 0 0
   [junit4]   2> 1594939 INFO  (qtp1153753-15276) [    ] o.a.s.u.p.LogUpdateProcessorFactory [control_collection_shard1_replica_n1]  webapp=/se/v path=/update params={wt=javabin&version=2&CONTROL=TRUE}{add=[0-2 (1573009985732870145)]} 0 0
   [junit4]   2> 1594940 INFO  (qtp19653279-15311) [    ] o.a.s.u.p.LogUpdateProcessorFactory [collection1_shard1_replica_t0]  webapp=/se/v path=/update params={wt=javabin&version=2}{delete=[1-0 (-1573009985734967296)]} 0 0
   [junit4]   2> 1594940 INFO  (qtp1153753-15270) [    ] o.a.s.u.p.LogUpdateProcessorFactory [control_collection_shard1_replica_n1]  webapp=/se/v path=/update params={wt=javabin&version=2&CONTROL=TRUE}{add=[1-3 (1573009985734967296)]} 0 0
   [junit4]   2> 1594940 INFO  (qtp19653279-15372) [    ] o.a.s.u.p.LogUpdateProcessorFactory [collection1_shard1_replica_t0]  webapp=/se/v path=/update params={wt=javabin&version=2}{add=[0-2 (1573009985734967297)]} 0 0
   [junit4]   2> 1594941 INFO  (qtp1153753-15277) [    ] o.a.s.u.p.LogUpdateProcessorFactory [control_collection_shard1_replica_n1]  webapp=/se/v path=/update params={wt=javabin&version=2&CONTROL=TRUE}{delete=[0-0 (-1573009985736015872)]} 0 0
   [junit4]   2> 1594941 INFO  (qtp19653279-15312) [    ] o.a.s.u.p.LogUpdateProcessorFactory [collection1_shard1_replica_t0]  webapp=/se/v path=/update params={wt=javabin&version=2}{delete=[0-0 (-1573009985736015873)]} 0 0
   [junit4]   2> 1594942 INFO  (qtp19653279-15314) [    ] o.a.s.u.p.LogUpdateProcessorFactory [collection1_shard1_replica_t0]  webapp=/se/v path=/update params={wt=javabin&version=2}{add=[1-3 (1573009985736015872)]} 0 0
   [junit4]   2> 1594942 INFO  (qtp1153753-15277) [    ] o.a.s.u.p.LogUpdateProcessorFactory [control_collection_shard1_replica_n1]  webapp=/se/v path=/update params={wt=javabin&version=2&CONTROL=TRUE}{add=[0-3 (1573009985737064448)]} 0 0
   [junit4]   2> 1594942 INFO  (qtp1153753-15276) [    ] o.a.s.u.p.LogUpdateProcessorFactory [control_collection_shard1_replica_n1]  webapp=/se/v path=/update params={wt=javabin&version=2&CONTROL=TRUE}{delete=[1-2 (-1573009985737064449)]} 0 0
   [junit4]   2> 1594942 INFO  (qtp19653279-15314) [    ] o.a.s.u.p.LogUpdateProcessorFactory [collection1_shard1_replica_t0]  webapp=/se/v path=/update params={wt=javabin&version=2}{add=[0-3 (1573009985737064448)]} 0 0
   [junit4]   2> 1594942 INFO  (qtp19653279-15312) [    ] o.a.s.u.p.LogUpdateProcessorFactory [collection1_shard1_replica_t0]  webapp=/se/v path=/update params={wt=javabin&version=2}{delete=[1-2 (-1573009985737064449)]} 0 0
   [junit4]   2> 1594943 INFO  (qtp1153753-15270) [    ] o.a.s.u.p.LogUpdateProcessorFactory [control_collection_shard1_replica_n1]  webapp=/se/v path=/update params={wt=javabin&version=2&CONTROL=TRUE}{delete=[0-2 (-1573009985738113024)]} 0 0
   [junit4]   2> 1594943 INFO  (qtp19653279-15372) [    ] o.a.s.u.p.LogUpdateProcessorFactory [collection1_shard1_replica_t0]  webapp=/se/v path=/update params={wt=javabin&version=2}{delete=[0-2 (-1573009985738113024)]} 0 0
   [junit4]   2> 1594943 INFO  (qtp1153753-15275) [    ] o.a.s.u.p.LogUpdateProcessorFactory [control_collection_shard1_replica_n1]  webapp=/se/v path=/update params={wt=javabin&version=2&CONTROL=TRUE}{add=[0-4 (1573009985738113025)]} 0 0
   [junit4]   2> 1594944 INFO  (qtp19653279-15373) [    ] o.a.s.u.p.LogUpdateProcessorFactory [collection1_shard1_replica_t0]  webapp=/se/v path=/update params={wt=javabin&version=2}{add=[0-4 (1573009985739161600)]} 0 0
   [junit4]   2> 1594945 INFO  (qtp1153753-15275) [    ] o.a.s.u.p.LogUpdateProcessorFactory [control_collection_shard1_replica_n1]  webapp=/se/v path=/update params={wt=javabin&version=2&CONTROL=TRUE}{add=[0-5 (1573009985739161600)]} 0 0
   [junit4]   2> 1594946 INFO  (qtp19653279-15317) [    ] o.a.s.u.p.LogUpdateProcessorFactory [collection1_shard1_replica_t0]  webapp=/se/v path=/update params={wt=javabin&version=2}{add=[0-5 (1573009985740210176)]} 0 0
   [junit4]   2> 1594946 INFO  (qtp1153753-15276) [    ] o.a.s.u.p.LogUpdateProcessorFactory [control_collection_shard1_replica_n1]  webapp=/se/v path=/update params={wt=javabin&version=2&CONTROL=TRUE}{delete=[0-3 (-1573009985741258752)]} 0 0
   [junit4]   2> 1594947 INFO  (qtp19653279-15314) [    ] o.a.s.u.p.LogUpdateProcessorFactory [collection1_shard1_replica_t0]  webapp=/se/v path=/update params={wt=javabin&version=2}{delete=[0-3 (-1573009985742307328)]} 0 0
   [junit4]   2> 1594947 INFO  (qtp1153753-15270) [    ] o.a.s.u.p.LogUpdateProcessorFactory [control_collection_shard1_replica_n1]  webapp=/se/v path=/update params={wt=javabin&version=2&CONTROL=TRUE}{add=[0-6 (1573009985742307328)]} 0 0
   [junit4]   2> 1594948 INFO  (qtp1153753-15273) [    ] o.a.s.u.p.LogUpdateProcessorFactory [control_collection_shard1_replica_n1]  webapp=/se/v path=/update params={wt=javabin&version=2&CONTROL=TRUE}{add=[1-4 (1573009985742307329)]} 0 0
   [junit4]   2> 1594950 INFO  (qtp19653279-15311) [    ] o.a.s.u.p.LogUpdateProcessorFactory [collection1_shard1_replica_t0]  webapp=/se/v path=/update params={wt=javabin&version=2}{add=[0-6 (1573009985743355904)]} 0 1
   [junit4]   2> 1594950 INFO  (qtp19653279-15312) [    ] o.a.s.u.p.LogUpdateProcessorFactory [collection1_shard1_replica_t0]  webapp=/se/v path=/update params={wt=javabin&version=2}{add=[1-4 (1573009985743355905)]} 0 1
   [junit4]   2> 1594950 INFO  (qtp1153753-15277) [    ] o.a.s.u.p.LogUpdateProcessorFactory [control_collection_shard1_replica_n1]  webapp=/se/v path=/update params={wt=javabin&version=2&CONTROL=TRUE}{add=[0-7 (1573009985745453056)]} 0 0
   [junit4]   2> 1594953 INFO  (qtp1153753-15275) [    ] o.a.s.u.p.LogUpdateProcessorFactory [control_collection_shard1_replica_n1]  webapp=/se/v path=/update params={wt=javabin&version=2&CONTROL=TRUE}{add=[1-5 (1573009985747550208)]} 0 0
   [junit4]   2> 1594953 INFO  (qtp19653279-15372) [    ] o.a.s.u.p.LogUpdateProcessorFactory [collection1_shard1_replica_t0]  webapp=/se/v path=/update params={wt=javabin&version=2}{add=[0-7 (1573009985747550208)]} 0 0
   [junit4]   2> 1594953 INFO  (qtp1153753-15276) [    ] o.a.s.u.p.LogUpdateProcessorFactory [control_collection_shard1_replica_n1]  webapp=/se/v path=/update params={wt=javabin&version=2&CONTROL=TRUE}{delete=[0-6 (-1573009985748598784)]} 0 0
   [junit4]   2> 1594954 INFO  (qtp19653279-15317) [    ] o.a.s.u.p.LogUpdateProcessorFactory [collection1_shard1_replica_t0]  webapp=/se/v path=/update params={wt=javabin&version=2}{delete=[0-6 (-1573009985749647360)]} 0 0
   [junit4]   2> 1594955 INFO  (qtp1153753-15276) [    ] o.a.s.u.p.LogUpdateProcessorFactory [control_collection_shard1_replica_n1]  webapp=/se/v path=/update params={wt=javabin&version=2&CONTROL=TRUE}{add=[0-8 (1573009985749647360)]} 0 0
   [junit4]   2> 1594955 INFO  (qtp19653279-15314) [    ] o.a.s.u.p.LogUpdateProcessorFactory [collection1_shard1_replica_t0]  webapp=/se/v path=/update params={wt=javabin&version=2}{add=[0-8 (1573009985750695936)]} 0 0
   [junit4]   2> 1594956 INFO  (qtp1153753-15276) [    ] o.a.s.u.p.LogUpdateProcessorFactory [control_collection_shard1_replica_n1]  webapp=/se/v path=/update params={wt=javabin&version=2&CONTROL=TRUE}{delete=[0-7 (-1573009985751744512)]} 0 0
   [junit4]   2> 1594956 INFO  (qtp19653279-15314) [    ] o.a.s.u.p.LogUpdateProcessorFactory [collection1_shard1_replica_t0]  webapp=/se/v path=/update params={wt=javabin&version=2}{delete=[0-7 (-1573009985751744512)]} 0 0
   [junit4]   2> 1594958 INFO  (qtp19653279-15312) [    ] o.a.s.u.p.LogUpdateProcessorFactory [collection1_shard1_replica_t0]  webapp=/se/v path=/update params={wt=javabin&version=2}{add=[1-5 (1573009985752793088)]} 0 0
   [junit4]   2> 1594958 INFO  (qtp1153753-15270) [    ] o.a.s.u.p.LogUpdateProcessorFactory [control_collection_shard1_replica_n1]  webapp=/se/v path=/update params={wt=javabin&version=2&CONTROL=TRUE}{delete=[1-3 (-1573009985753841664)]} 0 0
   [junit4]   2> 1594958 INFO  (qtp1153753-15276) [    ] o.a.s.u.p.LogUpdateProcessorFactory [control_collection_shard1_replica_n1]  webapp=/se/v path=/update params={wt=javabin&version=2&CONTROL=TRUE}{add=[0-9 (1573009985753841665)]} 0 0
   [junit4]   2> 1594959 INFO  (qtp19653279-15372) [    ] o.a.s.u.p.LogUpdateProcessorFactory [collection1_shard1_replica_t0]  webapp=/se/v path=/update params={wt=javabin&version=2}{delete=[1-3 (-1573009985754890240)]} 0 0
   [junit4]   2> 1594959 INFO  (qtp19653279-15373) [    ] o.a.s.u.p.LogUpdateProcessorFactory [collection1_shard1_replica_t0]  webapp=/se/v path=/update params={wt=javabin&version=2}{add=[0-9 (1573009985754890241)]} 0 0
   [junit4]   2> 1594959 INFO  (qtp1153753-15277) [    ] o.a.s.u.p.LogUpdateProcessorFactory [control_collection_shard1_replica_n1]  webapp=/se/v path=/update params={wt=javabin&version=2&CONTROL=TRUE}{delete=[0-8 (-1573009985754890241)]} 0 0
   [junit4]   2> 1594959 INFO  (qtp1153753-15275) [    ] o.a.s.u.p.LogUpdateProcessorFactory [control_collection_shard1_replica_n1]  webapp=/se/v path=/update params={wt=javabin&version=2&CONTROL=TRUE}{add=[1-6 (1573009985754890240)]} 0 0
   [junit4]   2> 1594960 INFO  (qtp19653279-15317) [    ] o.a.s.u.p.LogUpdateProcessorFactory [collection1_shard1_replica_t0]  webapp=/se/v path=/update params={wt=javabin&version=2}{delete=[0-8 (-1573009985755938816)]} 0 0
   [junit4]   2> 1594961 INFO  (qtp1153753-15275) [    ] o.a.s.u.p.LogUpdateProcessorFactory [control_collection_shard1_replica_n1]  webapp=/se/v path=/update params={wt=javabin&version=2&CONTROL=TRUE}{add=[0-10 (1573009985756987392)]} 0 0
   [junit4]   2> 1594962 INFO  (qtp19653279-15372) [    ] o.a.s.u.p.LogUpdateProcessorFactory [collection1_shard1_replica_t0]  webapp=/se/v path=/update params={wt=javabin&version=2}{add=[1-6 (1573009985758035968)]} 0 0
   [junit4]   2> 1594963 INFO  (qtp19653279-15314) [    ] o.a.s.u.p.LogUpdateProces

[...truncated too long message...]

TEST-ChaosMonkeySafeLeaderWithPullReplicasTest.test-seed#[DD6974B43CA6B012]) [    ] o.e.j.s.AbstractConnector Stopped ServerConnector@a737da{SSL,[ssl, http/1.1]}{127.0.0.1:0}
   [junit4]   2> 1776027 INFO  (TEST-ChaosMonkeySafeLeaderWithPullReplicasTest.test-seed#[DD6974B43CA6B012]) [    ] o.e.j.s.h.ContextHandler Stopped o.e.j.s.ServletContextHandler@8495ed{/se/v,null,UNAVAILABLE}
   [junit4]   2> 1776028 ERROR (TEST-ChaosMonkeySafeLeaderWithPullReplicasTest.test-seed#[DD6974B43CA6B012]) [    ] o.a.z.s.ZooKeeperServer ZKShutdownHandler is not registered, so ZooKeeper server won't take any action on ERROR or SHUTDOWN server state changes
   [junit4]   2> 1776032 INFO  (TEST-ChaosMonkeySafeLeaderWithPullReplicasTest.test-seed#[DD6974B43CA6B012]) [    ] o.a.s.c.ZkTestServer connecting to 127.0.0.1:40583 40583
   [junit4]   2> 1776067 INFO  (Thread-3469) [    ] o.a.s.c.ZkTestServer connecting to 127.0.0.1:40583 40583
   [junit4]   2> 1776067 WARN  (Thread-3469) [    ] o.a.s.c.ZkTestServer Watch limit violations: 
   [junit4]   2> Maximum concurrent create/delete watches above limit:
   [junit4]   2> 
   [junit4]   2> 	6	/solr/aliases.json
   [junit4]   2> 	4	/solr/security.json
   [junit4]   2> 	4	/solr/configs/conf1
   [junit4]   2> 	3	/solr/collections/collection1/state.json
   [junit4]   2> 
   [junit4]   2> Maximum concurrent data watches above limit:
   [junit4]   2> 
   [junit4]   2> 	6	/solr/clusterstate.json
   [junit4]   2> 	6	/solr/clusterprops.json
   [junit4]   2> 
   [junit4]   2> Maximum concurrent children watches above limit:
   [junit4]   2> 
   [junit4]   2> 	6	/solr/live_nodes
   [junit4]   2> 	6	/solr/collections
   [junit4]   2> 	4	/solr/overseer/queue
   [junit4]   2> 	4	/solr/overseer/collection-queue-work
   [junit4]   2> 	4	/solr/overseer/queue-work
   [junit4]   2> 
   [junit4]   2> NOTE: reproduce with: ant test  -Dtestcase=ChaosMonkeySafeLeaderWithPullReplicasTest -Dtests.method=test -Dtests.seed=DD6974B43CA6B012 -Dtests.multiplier=3 -Dtests.slow=true -Dtests.locale=nl-SR -Dtests.timezone=Europe/Kirov -Dtests.asserts=true -Dtests.file.encoding=UTF-8
   [junit4] FAILURE  188s J2 | ChaosMonkeySafeLeaderWithPullReplicasTest.test <<<
   [junit4]    > Throwable #1: java.lang.AssertionError: Timed out waiting for replica core_node2 (1500139227759) to replicate from leader core_node1 (1500139243738)
   [junit4]    > 	at __randomizedtesting.SeedInfo.seed([DD6974B43CA6B012:553D4B6E925ADDEA]:0)
   [junit4]    > 	at org.apache.solr.cloud.AbstractFullDistribZkTestBase.waitForReplicationFromReplicas(AbstractFullDistribZkTestBase.java:2133)
   [junit4]    > 	at org.apache.solr.cloud.ChaosMonkeySafeLeaderWithPullReplicasTest.test(ChaosMonkeySafeLeaderWithPullReplicasTest.java:209)
   [junit4]    > 	at java.base/jdk.internal.reflect.NativeMethodAccessorImpl.invoke0(Native Method)
   [junit4]    > 	at java.base/jdk.internal.reflect.NativeMethodAccessorImpl.invoke(NativeMethodAccessorImpl.java:62)
   [junit4]    > 	at java.base/jdk.internal.reflect.DelegatingMethodAccessorImpl.invoke(DelegatingMethodAccessorImpl.java:43)
   [junit4]    > 	at java.base/java.lang.reflect.Method.invoke(Method.java:564)
   [junit4]    > 	at org.apache.solr.BaseDistributedSearchTestCase$ShardsRepeatRule$ShardsFixedStatement.callStatement(BaseDistributedSearchTestCase.java:985)
   [junit4]    > 	at org.apache.solr.BaseDistributedSearchTestCase$ShardsRepeatRule$ShardsStatement.evaluate(BaseDistributedSearchTestCase.java:960)
   [junit4]    > 	at java.base/java.lang.Thread.run(Thread.java:844)
   [junit4]   2> NOTE: leaving temporary files on disk at: /home/jenkins/workspace/Lucene-Solr-master-Linux/solr/build/solr-core/test/J2/temp/solr.cloud.ChaosMonkeySafeLeaderWithPullReplicasTest_DD6974B43CA6B012-001
   [junit4]   2> Jul 15, 2017 5:23:23 PM com.carrotsearch.randomizedtesting.ThreadLeakControl checkThreadLeaks
   [junit4]   2> WARNING: Will linger awaiting termination of 3 leaked thread(s).
   [junit4]   2> NOTE: test params are: codec=Asserting(Lucene70): {rnd_b=Lucene50(blocksize=128), a_t=FST50, a_i=Lucene50(blocksize=128), id=Lucene50(blocksize=128)}, docValues:{_version_=DocValuesFormat(name=Memory)}, maxPointsInLeafNode=409, maxMBSortInHeap=5.683174111241329, sim=RandomSimilarity(queryNorm=true): {}, locale=nl-SR, timezone=Europe/Kirov
   [junit4]   2> NOTE: Linux 4.10.0-26-generic i386/Oracle Corporation 9 (32-bit)/cpus=8,threads=1,free=134114984,total=536870912
   [junit4]   2> NOTE: All tests run in this JVM: [XsltUpdateRequestHandlerTest, HdfsTlogReplayBufferedWhileIndexingTest, NotRequiredUniqueKeyTest, TriLevelCompositeIdRoutingTest, TestGroupingSearch, BadIndexSchemaTest, TermVectorComponentDistributedTest, MetricsHandlerTest, BasicDistributedZk2Test, TestCollectionAPI, PrimitiveFieldTypeTest, HdfsNNFailoverTest, TestMiniSolrCloudCluster, TestScoreJoinQPScore, TestUniqueKeyFieldResource, TestDistributedStatsComponentCardinality, PreAnalyzedFieldManagedSchemaCloudTest, TestStressInPlaceUpdates, SolrIndexMetricsTest, JSONWriterTest, TestPivotHelperCode, HttpSolrCallGetCoreTest, DirectoryFactoryTest, DateMathParserTest, TestSuggestSpellingConverter, SolrSlf4jReporterTest, UpdateLogTest, TestUninvertingReader, SpellCheckCollatorWithCollapseTest, TestFoldingMultitermQuery, BaseCdcrDistributedZkTest, BasicAuthStandaloneTest, SuggesterFSTTest, CollectionsAPISolrJTest, SearchHandlerTest, RecoveryZkTest, TestZkChroot, TestCloudInspectUtil, QueryResultKeyTest, TestRestoreCore, TestStressReorder, TestSolrDeletionPolicy2, SimplePostToolTest, MultiTermTest, MergeStrategyTest, SimpleMLTQParserTest, TestJmxIntegration, CopyFieldTest, ShardSplitTest, RegexBoostProcessorTest, TestRawResponseWriter, TestIndexSearcher, TestConfigSetsAPIZkFailure, DeleteInactiveReplicaTest, PathHierarchyTokenizerFactoryTest, TestQueryWrapperFilter, TestDistribDocBasedVersion, TestNamedUpdateProcessors, TestSolr4Spatial2, SolrCoreCheckLockOnStartupTest, TestFilteredDocIdSet, TestLegacyTerms, TestFastWriter, TestStandardQParsers, SubstringBytesRefFilterTest, SparseHLLTest, DocExpirationUpdateProcessorFactoryTest, TimeZoneUtilsTest, RollingRestartTest, ResponseLogComponentTest, PingRequestHandlerTest, TestCloudSchemaless, TestRequestStatusCollectionAPI, TestCloudNestedDocsSort, FullHLLTest, TestSolrCoreProperties, HighlighterMaxOffsetTest, TestDefaultStatsCache, TestRTimerTree, TestHdfsCloudBackupRestore, DeleteReplicaTest, TestManagedSchema, TestDelegationWithHadoopAuth, OverseerTest, DateFieldTest, TestRecovery, MinimalSchemaTest, TestNRTOpen, ChangedSchemaMergeTest, UnloadDistributedZkTest, TestOverriddenPrefixQueryForCustomFieldType, TestFieldCacheSortRandom, TestSimpleTextCodec, CdcrReplicationHandlerTest, DocumentBuilderTest, FullSolrCloudDistribCmdsTest, ReplaceNodeTest, TestTrie, LeaderFailoverAfterPartitionTest, TestLMJelinekMercerSimilarityFactory, TestFieldTypeResource, HdfsRestartWhileUpdatingTest, TestDFRSimilarityFactory, TestExactStatsCache, PeerSyncReplicationTest, TestReRankQParserPlugin, TestReload, TestSortByMinMaxFunction, TestFieldCollectionResource, SpellPossibilityIteratorTest, TestSearcherReuse, ChaosMonkeyNothingIsSafeWithPullReplicasTest, CachingDirectoryFactoryTest, TestLeaderInitiatedRecoveryThread, TestPullReplicaErrorHandling, SolrInfoBeanTest, SolrGangliaReporterTest, BasicZkTest, TestRandomFaceting, ZkSolrClientTest, AutoCommitTest, TestDistributedGrouping, TestFaceting, TestHashPartitioner, TestStressVersions, HardAutoCommitTest, TestCoreContainer, SimpleFacetsTest, StatsComponentTest, QueryElevationComponentTest, TestSort, TestFunctionQuery, BasicFunctionalityTest, TestLazyCores, DirectUpdateHandlerTest, TestBadConfig, ShowFileRequestHandlerTest, DistributedQueryElevationComponentTest, SuggesterTest, SpatialFilterTest, SuggesterWFSTTest, TestCSVLoader, PolyFieldTest, NoCacheHeaderTest, SchemaVersionSpecificBehaviorTest, TestPseudoReturnFields, TestUpdate, TestWordDelimiterFilterFactory, DirectUpdateHandlerOptimizeTest, StatelessScriptUpdateProcessorFactoryTest, TestSurroundQueryParser, TestQueryUtils, DirectSolrSpellCheckerTest, TestReversedWildcardFilterFactory, XmlUpdateRequestHandlerTest, TermVectorComponentTest, MoreLikeThisHandlerTest, FieldAnalysisRequestHandlerTest, LoggingHandlerTest, IndexSchemaTest, UpdateRequestProcessorFactoryTest, TestCSVResponseWriter, TestAnalyzedSuggestions, TestPHPSerializedResponseWriter, SearchHandlerTest, SOLR749Test, TestQuerySenderListener, TestSolrIndexConfig, TestQuerySenderNoQuery, SolrIndexConfigTest, TestStressRecovery, TestUtils, FileUtilsTest, TestRTGBase, SolrTestCaseJ4Test, TestDistributedMissingSort, TestTolerantSearch, TestJettySolrRunner, ConnectionReuseTest, CdcrReplicationDistributedZkTest, ChaosMonkeySafeLeaderWithPullReplicasTest]
   [junit4] Completed [502/728 (1!)] on J2 in 188.74s, 1 test, 1 failure <<< FAILURES!

[...truncated 789 lines...]
   [junit4] JVM J2: stdout was not empty, see: /home/jenkins/workspace/Lucene-Solr-master-Linux/solr/build/solr-core/test/temp/junit4-J2-20170715_165346_9065370384945365913649.sysout
   [junit4] >>> JVM J2 emitted unexpected output (verbatim) ----
   [junit4] java.lang.OutOfMemoryError: Java heap space
   [junit4] Dumping heap to /home/jenkins/workspace/Lucene-Solr-master-Linux/heapdumps/java_pid12058.hprof ...
   [junit4] Heap dump file created [334936433 bytes in 0.597 secs]
   [junit4] <<< JVM J2: EOF ----

[...truncated 7532 lines...]
BUILD FAILED
/home/jenkins/workspace/Lucene-Solr-master-Linux/build.xml:810: The following error occurred while executing this line:
/home/jenkins/workspace/Lucene-Solr-master-Linux/build.xml:762: Some of the tests produced a heap dump, but did not fail. Maybe a suppressed OutOfMemoryError? Dumps created:
* java_pid12058.hprof

Total time: 70 minutes 34 seconds
Build step 'Invoke Ant' marked build as failure
Archiving artifacts
[WARNINGS] Skipping publisher since build result is FAILURE
Recording test results
Email was triggered for: Failure - Any
Sending email for trigger: Failure - Any

Mime
View raw message