lucene-dev mailing list archives

Site index · List index
Message view « Date » · « Thread »
Top « Date » · « Thread »
From Policeman Jenkins Server <jenk...@thetaphi.de>
Subject [JENKINS] Lucene-Solr-7.x-Linux (32bit/jdk1.8.0_131) - Build # 38 - Unstable!
Date Sat, 08 Jul 2017 21:54:13 GMT
Build: https://jenkins.thetaphi.de/job/Lucene-Solr-7.x-Linux/38/
Java: 32bit/jdk1.8.0_131 -client -XX:+UseSerialGC

1 tests failed.
FAILED:  junit.framework.TestSuite.org.apache.solr.analytics.facet.QueryFacetCloudTest

Error Message:
org.apache.http.ParseException: Invalid content type: 

Stack Trace:
org.apache.solr.client.solrj.impl.CloudSolrClient$RouteException: org.apache.http.ParseException:
Invalid content type: 
	at __randomizedtesting.SeedInfo.seed([F3E68F7CEEE0C86C]:0)
	at org.apache.solr.client.solrj.impl.CloudSolrClient.directUpdate(CloudSolrClient.java:541)
	at org.apache.solr.client.solrj.impl.CloudSolrClient.sendRequest(CloudSolrClient.java:993)
	at org.apache.solr.client.solrj.impl.CloudSolrClient.requestWithRetryOnStaleState(CloudSolrClient.java:862)
	at org.apache.solr.client.solrj.impl.CloudSolrClient.request(CloudSolrClient.java:793)
	at org.apache.solr.client.solrj.SolrRequest.process(SolrRequest.java:178)
	at org.apache.solr.client.solrj.request.UpdateRequest.commit(UpdateRequest.java:233)
	at org.apache.solr.analytics.facet.QueryFacetCloudTest.beforeClass(QueryFacetCloudTest.java:102)
	at sun.reflect.NativeMethodAccessorImpl.invoke0(Native Method)
	at sun.reflect.NativeMethodAccessorImpl.invoke(NativeMethodAccessorImpl.java:62)
	at sun.reflect.DelegatingMethodAccessorImpl.invoke(DelegatingMethodAccessorImpl.java:43)
	at java.lang.reflect.Method.invoke(Method.java:498)
	at com.carrotsearch.randomizedtesting.RandomizedRunner.invoke(RandomizedRunner.java:1713)
	at com.carrotsearch.randomizedtesting.RandomizedRunner$6.evaluate(RandomizedRunner.java:847)
	at com.carrotsearch.randomizedtesting.RandomizedRunner$7.evaluate(RandomizedRunner.java:863)
	at com.carrotsearch.randomizedtesting.rules.StatementAdapter.evaluate(StatementAdapter.java:36)
	at com.carrotsearch.randomizedtesting.rules.SystemPropertiesRestoreRule$1.evaluate(SystemPropertiesRestoreRule.java:57)
	at org.apache.lucene.util.AbstractBeforeAfterRule$1.evaluate(AbstractBeforeAfterRule.java:45)
	at com.carrotsearch.randomizedtesting.rules.StatementAdapter.evaluate(StatementAdapter.java:36)
	at org.apache.lucene.util.TestRuleStoreClassName$1.evaluate(TestRuleStoreClassName.java:41)
	at com.carrotsearch.randomizedtesting.rules.NoShadowingOrOverridesOnMethodsRule$1.evaluate(NoShadowingOrOverridesOnMethodsRule.java:40)
	at com.carrotsearch.randomizedtesting.rules.NoShadowingOrOverridesOnMethodsRule$1.evaluate(NoShadowingOrOverridesOnMethodsRule.java:40)
	at com.carrotsearch.randomizedtesting.rules.StatementAdapter.evaluate(StatementAdapter.java:36)
	at com.carrotsearch.randomizedtesting.rules.StatementAdapter.evaluate(StatementAdapter.java:36)
	at com.carrotsearch.randomizedtesting.rules.StatementAdapter.evaluate(StatementAdapter.java:36)
	at org.apache.lucene.util.TestRuleAssertionsRequired$1.evaluate(TestRuleAssertionsRequired.java:53)
	at org.apache.lucene.util.TestRuleMarkFailure$1.evaluate(TestRuleMarkFailure.java:47)
	at org.apache.lucene.util.TestRuleIgnoreAfterMaxFailures$1.evaluate(TestRuleIgnoreAfterMaxFailures.java:64)
	at org.apache.lucene.util.TestRuleIgnoreTestSuites$1.evaluate(TestRuleIgnoreTestSuites.java:54)
	at com.carrotsearch.randomizedtesting.rules.StatementAdapter.evaluate(StatementAdapter.java:36)
	at com.carrotsearch.randomizedtesting.ThreadLeakControl$StatementRunner.run(ThreadLeakControl.java:368)
	at java.lang.Thread.run(Thread.java:748)
Caused by: org.apache.solr.client.solrj.SolrServerException: org.apache.http.ParseException:
Invalid content type: 
	at org.apache.solr.client.solrj.impl.LBHttpSolrClient.doRequest(LBHttpSolrClient.java:523)
	at org.apache.solr.client.solrj.impl.LBHttpSolrClient.request(LBHttpSolrClient.java:413)
	at org.apache.solr.client.solrj.impl.CloudSolrClient.lambda$directUpdate$0(CloudSolrClient.java:516)
	at java.util.concurrent.FutureTask.run(FutureTask.java:266)
	at org.apache.solr.common.util.ExecutorUtil$MDCAwareThreadPoolExecutor.lambda$execute$0(ExecutorUtil.java:188)
	at java.util.concurrent.ThreadPoolExecutor.runWorker(ThreadPoolExecutor.java:1142)
	at java.util.concurrent.ThreadPoolExecutor$Worker.run(ThreadPoolExecutor.java:617)
	... 1 more
Caused by: org.apache.http.ParseException: Invalid content type: 
	at org.apache.http.entity.ContentType.parse(ContentType.java:273)
	at org.apache.solr.client.solrj.impl.HttpSolrClient.executeMethod(HttpSolrClient.java:572)
	at org.apache.solr.client.solrj.impl.HttpSolrClient.request(HttpSolrClient.java:252)
	at org.apache.solr.client.solrj.impl.HttpSolrClient.request(HttpSolrClient.java:241)
	at org.apache.solr.client.solrj.impl.LBHttpSolrClient.doRequest(LBHttpSolrClient.java:483)
	... 7 more




Build Log:
[...truncated 15893 lines...]
   [junit4] Suite: org.apache.solr.analytics.facet.QueryFacetCloudTest
   [junit4]   2> Creating dataDir: /home/jenkins/workspace/Lucene-Solr-7.x-Linux/solr/build/contrib/solr-analytics/test/J1/temp/solr.analytics.facet.QueryFacetCloudTest_F3E68F7CEEE0C86C-001/init-core-data-001
   [junit4]   2> Jul 08, 2017 9:50:31 PM com.carrotsearch.randomizedtesting.ThreadLeakControl
checkThreadLeaks
   [junit4]   2> WARNING: Will linger awaiting termination of 1 leaked thread(s).
   [junit4]   2> NOTE: test params are: codec=HighCompressionCompressingStoredFields(storedFieldsFormat=CompressingStoredFieldsFormat(compressionMode=HIGH_COMPRESSION,
chunkSize=6, maxDocsPerChunk=997, blockSize=6), termVectorsFormat=CompressingTermVectorsFormat(compressionMode=HIGH_COMPRESSION,
chunkSize=6, blockSize=6)), sim=RandomSimilarity(queryNorm=false): {}, locale=en-SG, timezone=Etc/GMT-10
   [junit4]   2> NOTE: Linux 4.10.0-21-generic i386/Oracle Corporation 1.8.0_131 (32-bit)/cpus=8,threads=1,free=31874992,total=63266816
   [junit4]   2> NOTE: All tests run in this JVM: [AbstractAnalyticsFacetTest, FieldFacetExtrasCloudTest,
AbstractAnalyticsStatsTest, NoFacetTest, FacetSortingTest, FieldFacetExtrasTest, QueryFacetCloudTest]
   [junit4]   2> NOTE: reproduce with: ant test  -Dtestcase=QueryFacetCloudTest -Dtests.seed=F3E68F7CEEE0C86C
-Dtests.multiplier=3 -Dtests.slow=true -Dtests.locale=en-SG -Dtests.timezone=Etc/GMT-10 -Dtests.asserts=true
-Dtests.file.encoding=US-ASCII
   [junit4] ERROR   0.00s J1 | QueryFacetCloudTest (suite) <<<
   [junit4]    > Throwable #1: org.apache.solr.client.solrj.impl.CloudSolrClient$RouteException:
org.apache.http.ParseException: Invalid content type: 
   [junit4]    > 	at __randomizedtesting.SeedInfo.seed([F3E68F7CEEE0C86C]:0)
   [junit4]    > 	at org.apache.solr.client.solrj.impl.CloudSolrClient.directUpdate(CloudSolrClient.java:541)
   [junit4]    > 	at org.apache.solr.client.solrj.impl.CloudSolrClient.sendRequest(CloudSolrClient.java:993)
   [junit4]    > 	at org.apache.solr.client.solrj.impl.CloudSolrClient.requestWithRetryOnStaleState(CloudSolrClient.java:862)
   [junit4]    > 	at org.apache.solr.client.solrj.impl.CloudSolrClient.request(CloudSolrClient.java:793)
   [junit4]    > 	at org.apache.solr.client.solrj.SolrRequest.process(SolrRequest.java:178)
   [junit4]    > 	at org.apache.solr.client.solrj.request.UpdateRequest.commit(UpdateRequest.java:233)
   [junit4]    > 	at org.apache.solr.analytics.facet.QueryFacetCloudTest.beforeClass(QueryFacetCloudTest.java:102)
   [junit4]    > 	at java.lang.Thread.run(Thread.java:748)
   [junit4]    > Caused by: org.apache.solr.client.solrj.SolrServerException: org.apache.http.ParseException:
Invalid content type: 
   [junit4]    > 	at org.apache.solr.client.solrj.impl.LBHttpSolrClient.doRequest(LBHttpSolrClient.java:523)
   [junit4]    > 	at org.apache.solr.client.solrj.impl.LBHttpSolrClient.request(LBHttpSolrClient.java:413)
   [junit4]    > 	at org.apache.solr.client.solrj.impl.CloudSolrClient.lambda$directUpdate$0(CloudSolrClient.java:516)
   [junit4]    > 	at java.util.concurrent.FutureTask.run(FutureTask.java:266)
   [junit4]    > 	at org.apache.solr.common.util.ExecutorUtil$MDCAwareThreadPoolExecutor.lambda$execute$0(ExecutorUtil.java:188)
   [junit4]    > 	at java.util.concurrent.ThreadPoolExecutor.runWorker(ThreadPoolExecutor.java:1142)
   [junit4]    > 	at java.util.concurrent.ThreadPoolExecutor$Worker.run(ThreadPoolExecutor.java:617)
   [junit4]    > 	... 1 more
   [junit4]    > Caused by: org.apache.http.ParseException: Invalid content type: 
   [junit4]    > 	at org.apache.http.entity.ContentType.parse(ContentType.java:273)
   [junit4]    > 	at org.apache.solr.client.solrj.impl.HttpSolrClient.executeMethod(HttpSolrClient.java:572)
   [junit4]    > 	at org.apache.solr.client.solrj.impl.HttpSolrClient.request(HttpSolrClient.java:252)
   [junit4]    > 	at org.apache.solr.client.solrj.impl.HttpSolrClient.request(HttpSolrClient.java:241)
   [junit4]    > 	at org.apache.solr.client.solrj.impl.LBHttpSolrClient.doRequest(LBHttpSolrClient.java:483)
   [junit4]    > 	... 7 more
   [junit4] Completed [16/17 (1!)] on J1 in 6.56s, 0 tests, 1 error <<< FAILURES!

[...truncated 36753 lines...]

Mime
View raw message